lucene-dev mailing list archives

Site index · List index
Message view « Date » · « Thread »
Top « Date » · « Thread »
From Policeman Jenkins Server <jenk...@thetaphi.de>
Subject [JENKINS-EA] Lucene-Solr-6.x-Linux (32bit/jdk-9-ea+140) - Build # 2322 - Unstable!
Date Fri, 02 Dec 2016 15:15:39 GMT
Build: https://jenkins.thetaphi.de/job/Lucene-Solr-6.x-Linux/2322/
Java: 32bit/jdk-9-ea+140 -server -XX:+UseConcMarkSweepGC

1 tests failed.
FAILED:  org.apache.solr.cloud.TestSolrCloudWithDelegationTokens.testDelegationTokenRenew

Error Message:
expected:<200> but was:<403>

Stack Trace:
java.lang.AssertionError: expected:<200> but was:<403>
	at __randomizedtesting.SeedInfo.seed([474BAEBDDD3D7152:70D05AA3E5F1ACF6]:0)
	at org.junit.Assert.fail(Assert.java:93)
	at org.junit.Assert.failNotEquals(Assert.java:647)
	at org.junit.Assert.assertEquals(Assert.java:128)
	at org.junit.Assert.assertEquals(Assert.java:472)
	at org.junit.Assert.assertEquals(Assert.java:456)
	at org.apache.solr.cloud.TestSolrCloudWithDelegationTokens.renewDelegationToken(TestSolrCloudWithDelegationTokens.java:131)
	at org.apache.solr.cloud.TestSolrCloudWithDelegationTokens.verifyDelegationTokenRenew(TestSolrCloudWithDelegationTokens.java:316)
	at org.apache.solr.cloud.TestSolrCloudWithDelegationTokens.testDelegationTokenRenew(TestSolrCloudWithDelegationTokens.java:333)
	at jdk.internal.reflect.NativeMethodAccessorImpl.invoke0(java.base@9-ea/Native Method)
	at jdk.internal.reflect.NativeMethodAccessorImpl.invoke(java.base@9-ea/NativeMethodAccessorImpl.java:62)
	at jdk.internal.reflect.DelegatingMethodAccessorImpl.invoke(java.base@9-ea/DelegatingMethodAccessorImpl.java:43)
	at java.lang.reflect.Method.invoke(java.base@9-ea/Method.java:535)
	at com.carrotsearch.randomizedtesting.RandomizedRunner.invoke(RandomizedRunner.java:1713)
	at com.carrotsearch.randomizedtesting.RandomizedRunner$8.evaluate(RandomizedRunner.java:907)
	at com.carrotsearch.randomizedtesting.RandomizedRunner$9.evaluate(RandomizedRunner.java:943)
	at com.carrotsearch.randomizedtesting.RandomizedRunner$10.evaluate(RandomizedRunner.java:957)
	at com.carrotsearch.randomizedtesting.rules.SystemPropertiesRestoreRule$1.evaluate(SystemPropertiesRestoreRule.java:57)
	at org.apache.lucene.util.TestRuleSetupTeardownChained$1.evaluate(TestRuleSetupTeardownChained.java:49)
	at org.apache.lucene.util.AbstractBeforeAfterRule$1.evaluate(AbstractBeforeAfterRule.java:45)
	at org.apache.lucene.util.TestRuleThreadAndTestName$1.evaluate(TestRuleThreadAndTestName.java:48)
	at org.apache.lucene.util.TestRuleIgnoreAfterMaxFailures$1.evaluate(TestRuleIgnoreAfterMaxFailures.java:64)
	at org.apache.lucene.util.TestRuleMarkFailure$1.evaluate(TestRuleMarkFailure.java:47)
	at com.carrotsearch.randomizedtesting.rules.StatementAdapter.evaluate(StatementAdapter.java:36)
	at com.carrotsearch.randomizedtesting.ThreadLeakControl$StatementRunner.run(ThreadLeakControl.java:367)
	at com.carrotsearch.randomizedtesting.ThreadLeakControl.forkTimeoutingTask(ThreadLeakControl.java:811)
	at com.carrotsearch.randomizedtesting.ThreadLeakControl$3.evaluate(ThreadLeakControl.java:462)
	at com.carrotsearch.randomizedtesting.RandomizedRunner.runSingleTest(RandomizedRunner.java:916)
	at com.carrotsearch.randomizedtesting.RandomizedRunner$5.evaluate(RandomizedRunner.java:802)
	at com.carrotsearch.randomizedtesting.RandomizedRunner$6.evaluate(RandomizedRunner.java:852)
	at com.carrotsearch.randomizedtesting.RandomizedRunner$7.evaluate(RandomizedRunner.java:863)
	at com.carrotsearch.randomizedtesting.rules.StatementAdapter.evaluate(StatementAdapter.java:36)
	at com.carrotsearch.randomizedtesting.rules.SystemPropertiesRestoreRule$1.evaluate(SystemPropertiesRestoreRule.java:57)
	at org.apache.lucene.util.AbstractBeforeAfterRule$1.evaluate(AbstractBeforeAfterRule.java:45)
	at com.carrotsearch.randomizedtesting.rules.StatementAdapter.evaluate(StatementAdapter.java:36)
	at org.apache.lucene.util.TestRuleStoreClassName$1.evaluate(TestRuleStoreClassName.java:41)
	at com.carrotsearch.randomizedtesting.rules.NoShadowingOrOverridesOnMethodsRule$1.evaluate(NoShadowingOrOverridesOnMethodsRule.java:40)
	at com.carrotsearch.randomizedtesting.rules.NoShadowingOrOverridesOnMethodsRule$1.evaluate(NoShadowingOrOverridesOnMethodsRule.java:40)
	at com.carrotsearch.randomizedtesting.rules.StatementAdapter.evaluate(StatementAdapter.java:36)
	at com.carrotsearch.randomizedtesting.rules.StatementAdapter.evaluate(StatementAdapter.java:36)
	at com.carrotsearch.randomizedtesting.rules.StatementAdapter.evaluate(StatementAdapter.java:36)
	at org.apache.lucene.util.TestRuleAssertionsRequired$1.evaluate(TestRuleAssertionsRequired.java:53)
	at org.apache.lucene.util.TestRuleMarkFailure$1.evaluate(TestRuleMarkFailure.java:47)
	at org.apache.lucene.util.TestRuleIgnoreAfterMaxFailures$1.evaluate(TestRuleIgnoreAfterMaxFailures.java:64)
	at org.apache.lucene.util.TestRuleIgnoreTestSuites$1.evaluate(TestRuleIgnoreTestSuites.java:54)
	at com.carrotsearch.randomizedtesting.rules.StatementAdapter.evaluate(StatementAdapter.java:36)
	at com.carrotsearch.randomizedtesting.ThreadLeakControl$StatementRunner.run(ThreadLeakControl.java:367)
	at java.lang.Thread.run(java.base@9-ea/Thread.java:843)




Build Log:
[...truncated 12078 lines...]
   [junit4] Suite: org.apache.solr.cloud.TestSolrCloudWithDelegationTokens
   [junit4]   2> Creating dataDir: /home/jenkins/workspace/Lucene-Solr-6.x-Linux/solr/build/solr-core/test/J1/temp/solr.cloud.TestSolrCloudWithDelegationTokens_474BAEBDDD3D7152-001/init-core-data-001
   [junit4]   2> 1934329 INFO  (SUITE-TestSolrCloudWithDelegationTokens-seed#[474BAEBDDD3D7152]-worker)
[    ] o.a.s.SolrTestCaseJ4 Randomized ssl (false) and clientAuth (false) via: @org.apache.solr.SolrTestCaseJ4$SuppressSSL(bugUrl="None")
   [junit4]   2> 1934331 INFO  (SUITE-TestSolrCloudWithDelegationTokens-seed#[474BAEBDDD3D7152]-worker)
[    ] o.a.s.c.MiniSolrCloudCluster Starting cluster of 2 servers in /home/jenkins/workspace/Lucene-Solr-6.x-Linux/solr/build/solr-core/test/J1/temp/solr.cloud.TestSolrCloudWithDelegationTokens_474BAEBDDD3D7152-001/tempDir-001
   [junit4]   2> 1934331 INFO  (SUITE-TestSolrCloudWithDelegationTokens-seed#[474BAEBDDD3D7152]-worker)
[    ] o.a.s.c.ZkTestServer STARTING ZK TEST SERVER
   [junit4]   2> 1934331 INFO  (Thread-3273) [    ] o.a.s.c.ZkTestServer client port:0.0.0.0/0.0.0.0:0
   [junit4]   2> 1934331 INFO  (Thread-3273) [    ] o.a.s.c.ZkTestServer Starting server
   [junit4]   2> 1934431 INFO  (SUITE-TestSolrCloudWithDelegationTokens-seed#[474BAEBDDD3D7152]-worker)
[    ] o.a.s.c.ZkTestServer start zk server on port:44420
   [junit4]   2> 1934437 INFO  (jetty-launcher-3042-thread-2) [    ] o.e.j.s.Server jetty-9.3.14.v20161028
   [junit4]   2> 1934437 INFO  (jetty-launcher-3042-thread-1) [    ] o.e.j.s.Server jetty-9.3.14.v20161028
   [junit4]   2> 1934440 INFO  (jetty-launcher-3042-thread-2) [    ] o.e.j.s.h.ContextHandler
Started o.e.j.s.ServletContextHandler@1c531c5{/solr,null,AVAILABLE}
   [junit4]   2> 1934440 INFO  (jetty-launcher-3042-thread-2) [    ] o.e.j.s.AbstractConnector
Started ServerConnector@2e9660{HTTP/1.1,[http/1.1]}{127.0.0.1:45839}
   [junit4]   2> 1934440 INFO  (jetty-launcher-3042-thread-2) [    ] o.e.j.s.Server Started
@1937195ms
   [junit4]   2> 1934440 INFO  (jetty-launcher-3042-thread-2) [    ] o.a.s.c.s.e.JettySolrRunner
Jetty properties: {hostContext=/solr, hostPort=45839}
   [junit4]   2> 1934441 ERROR (jetty-launcher-3042-thread-2) [    ] o.a.s.s.StartupLoggingUtils
Missing Java Option solr.log.dir. Logging may be missing or incomplete.
   [junit4]   2> 1934441 INFO  (jetty-launcher-3042-thread-2) [    ] o.a.s.s.SolrDispatchFilter
 ___      _       Welcome to Apache Solr™ version 6.4.0
   [junit4]   2> 1934441 INFO  (jetty-launcher-3042-thread-2) [    ] o.a.s.s.SolrDispatchFilter
/ __| ___| |_ _   Starting in cloud mode on port null
   [junit4]   2> 1934441 INFO  (jetty-launcher-3042-thread-2) [    ] o.a.s.s.SolrDispatchFilter
\__ \/ _ \ | '_|  Install dir: null
   [junit4]   2> 1934441 INFO  (jetty-launcher-3042-thread-2) [    ] o.a.s.s.SolrDispatchFilter
|___/\___/_|_|    Start time: 2016-12-02T14:45:49.425520Z
   [junit4]   2> 1934443 INFO  (jetty-launcher-3042-thread-1) [    ] o.e.j.s.h.ContextHandler
Started o.e.j.s.ServletContextHandler@cbcc4c{/solr,null,AVAILABLE}
   [junit4]   2> 1934443 INFO  (jetty-launcher-3042-thread-1) [    ] o.e.j.s.AbstractConnector
Started ServerConnector@b7b483{HTTP/1.1,[http/1.1]}{127.0.0.1:39060}
   [junit4]   2> 1934444 INFO  (jetty-launcher-3042-thread-1) [    ] o.e.j.s.Server Started
@1937198ms
   [junit4]   2> 1934444 INFO  (jetty-launcher-3042-thread-1) [    ] o.a.s.c.s.e.JettySolrRunner
Jetty properties: {hostContext=/solr, hostPort=39060}
   [junit4]   2> 1934444 ERROR (jetty-launcher-3042-thread-1) [    ] o.a.s.s.StartupLoggingUtils
Missing Java Option solr.log.dir. Logging may be missing or incomplete.
   [junit4]   2> 1934444 INFO  (jetty-launcher-3042-thread-1) [    ] o.a.s.s.SolrDispatchFilter
 ___      _       Welcome to Apache Solr™ version 6.4.0
   [junit4]   2> 1934444 INFO  (jetty-launcher-3042-thread-1) [    ] o.a.s.s.SolrDispatchFilter
/ __| ___| |_ _   Starting in cloud mode on port null
   [junit4]   2> 1934444 INFO  (jetty-launcher-3042-thread-1) [    ] o.a.s.s.SolrDispatchFilter
\__ \/ _ \ | '_|  Install dir: null
   [junit4]   2> 1934444 INFO  (jetty-launcher-3042-thread-1) [    ] o.a.s.s.SolrDispatchFilter
|___/\___/_|_|    Start time: 2016-12-02T14:45:49.428738Z
   [junit4]   2> 1934449 INFO  (jetty-launcher-3042-thread-1) [    ] o.a.s.s.SolrDispatchFilter
solr.xml found in ZooKeeper. Loading...
   [junit4]   2> 1934449 INFO  (jetty-launcher-3042-thread-2) [    ] o.a.s.s.SolrDispatchFilter
solr.xml found in ZooKeeper. Loading...
   [junit4]   2> 1934459 INFO  (jetty-launcher-3042-thread-2) [    ] o.a.s.u.UpdateShardHandler
Creating UpdateShardHandler HTTP client with params: socketTimeout=340000&connTimeout=45000&retry=true
   [junit4]   2> 1934462 INFO  (jetty-launcher-3042-thread-1) [    ] o.a.s.u.UpdateShardHandler
Creating UpdateShardHandler HTTP client with params: socketTimeout=340000&connTimeout=45000&retry=true
   [junit4]   2> 1934495 INFO  (jetty-launcher-3042-thread-2) [    ] o.a.s.c.ZkContainer
Zookeeper client=127.0.0.1:44420/solr
   [junit4]   2> 1934498 INFO  (jetty-launcher-3042-thread-1) [    ] o.a.s.c.ZkContainer
Zookeeper client=127.0.0.1:44420/solr
   [junit4]   2> 1934513 INFO  (jetty-launcher-3042-thread-2) [    ] o.a.s.c.OverseerElectionContext
I am going to be the leader 127.0.0.1:45839_solr
   [junit4]   2> 1934513 INFO  (jetty-launcher-3042-thread-1) [    ] o.a.s.c.ZkController
Register node as live in ZooKeeper:/live_nodes/127.0.0.1:39060_solr
   [junit4]   2> 1934514 INFO  (jetty-launcher-3042-thread-2) [    ] o.a.s.c.Overseer Overseer
(id=97038496518635525-127.0.0.1:45839_solr-n_0000000000) starting
   [junit4]   2> 1934514 INFO  (zkCallback-3052-thread-1) [    ] o.a.s.c.c.ZkStateReader
Updated live nodes from ZooKeeper... (0) -> (1)
   [junit4]   2> 1934519 INFO  (zkCallback-3053-thread-1) [    ] o.a.s.c.c.ZkStateReader
Updated live nodes from ZooKeeper... (0) -> (1)
   [junit4]   2> 1934524 INFO  (jetty-launcher-3042-thread-2) [    ] o.a.s.c.ZkController
Register node as live in ZooKeeper:/live_nodes/127.0.0.1:45839_solr
   [junit4]   2> 1934526 INFO  (zkCallback-3052-thread-1) [    ] o.a.s.c.c.ZkStateReader
Updated live nodes from ZooKeeper... (1) -> (2)
   [junit4]   2> 1934534 INFO  (zkCallback-3053-thread-1) [    ] o.a.s.c.c.ZkStateReader
Updated live nodes from ZooKeeper... (1) -> (2)
   [junit4]   2> 1934742 INFO  (jetty-launcher-3042-thread-1) [    ] o.a.s.c.CoreContainer
Authentication plugin class obtained from system property 'authenticationPlugin': org.apache.solr.security.HttpParamDelegationTokenPlugin
   [junit4]   2> 1934757 INFO  (jetty-launcher-3042-thread-1) [    ] o.a.s.s.KerberosPlugin
Params: {token.valid=30, delegation-token.token-kind=solr-dt, cookie.domain=127.0.0.1, cookie.path=/,
zk-dt-secret-manager.znodeWorkingPath=solr/security/zkdtsm, token.validity=36000, signer.secret.provider.zookeeper.path=/token,
type=kerberos, zk-dt-secret-manager.enable=true, kerberos.name.rules=DEFAULT, signer.secret.provider=zookeeper}
   [junit4]   2> 1934779 INFO  (jetty-launcher-3042-thread-2) [    ] o.a.s.c.CoreContainer
Authentication plugin class obtained from system property 'authenticationPlugin': org.apache.solr.security.HttpParamDelegationTokenPlugin
   [junit4]   2> 1934780 INFO  (jetty-launcher-3042-thread-2) [    ] o.a.s.s.KerberosPlugin
Params: {token.valid=30, delegation-token.token-kind=solr-dt, cookie.domain=127.0.0.1, cookie.path=/,
zk-dt-secret-manager.znodeWorkingPath=solr/security/zkdtsm, token.validity=36000, signer.secret.provider.zookeeper.path=/token,
type=kerberos, zk-dt-secret-manager.enable=true, kerberos.name.rules=DEFAULT, signer.secret.provider=zookeeper}
   [junit4]   2> 1934817 INFO  (jetty-launcher-3042-thread-2) [    ] o.a.c.f.i.CuratorFrameworkImpl
Starting
   [junit4]   2> 1934817 INFO  (jetty-launcher-3042-thread-1) [    ] o.a.c.f.i.CuratorFrameworkImpl
Starting
   [junit4]   2> 1934828 INFO  (jetty-launcher-3042-thread-1-EventThread) [    ] o.a.c.f.s.ConnectionStateManager
State change: CONNECTED
   [junit4]   2> 1934828 INFO  (jetty-launcher-3042-thread-2-EventThread) [    ] o.a.c.f.s.ConnectionStateManager
State change: CONNECTED
   [junit4]   2> 1934954 INFO  (jetty-launcher-3042-thread-1) [    ] o.a.s.h.c.HttpShardHandlerFactory
Reconfiguring the default client with: org.apache.solr.security.HttpParamDelegationTokenPlugin$2@392f7d
   [junit4]   2> 1934954 INFO  (jetty-launcher-3042-thread-1) [    ] o.a.s.u.UpdateShardHandler
Reconfiguring the default client with: org.apache.solr.security.HttpParamDelegationTokenPlugin$2@392f7d
   [junit4]   2> 1934956 INFO  (jetty-launcher-3042-thread-1) [    ] o.a.s.c.CorePropertiesLocator
Found 0 core definitions underneath /home/jenkins/workspace/Lucene-Solr-6.x-Linux/solr/build/solr-core/test/J1/temp/solr.cloud.TestSolrCloudWithDelegationTokens_474BAEBDDD3D7152-001/tempDir-001/node1/.
   [junit4]   2> 1934956 INFO  (jetty-launcher-3042-thread-2) [    ] o.a.s.h.c.HttpShardHandlerFactory
Reconfiguring the default client with: org.apache.solr.security.HttpParamDelegationTokenPlugin$2@1a37ae
   [junit4]   2> 1934956 INFO  (jetty-launcher-3042-thread-2) [    ] o.a.s.u.UpdateShardHandler
Reconfiguring the default client with: org.apache.solr.security.HttpParamDelegationTokenPlugin$2@1a37ae
   [junit4]   2> 1934958 INFO  (jetty-launcher-3042-thread-2) [    ] o.a.s.c.CorePropertiesLocator
Found 0 core definitions underneath /home/jenkins/workspace/Lucene-Solr-6.x-Linux/solr/build/solr-core/test/J1/temp/solr.cloud.TestSolrCloudWithDelegationTokens_474BAEBDDD3D7152-001/tempDir-001/node2/.
   [junit4]   2> 1934981 INFO  (TEST-TestSolrCloudWithDelegationTokens.testDelegationTokenCancelFail-seed#[474BAEBDDD3D7152])
[    ] o.a.s.SolrTestCaseJ4 ###Starting testDelegationTokenCancelFail
   [junit4]   2> 1935386 ERROR (qtp29941842-15717) [    ] o.a.h.s.t.d.ZKDelegationTokenSecretManager
No node in path [/ZKDTSMTokensRoot/DT_1]
   [junit4]   2> 1935390 ERROR (qtp25345684-15709) [    ] o.a.h.s.t.d.ZKDelegationTokenSecretManager
No node in path [/ZKDTSMTokensRoot/DT_1]
   [junit4]   2> 1935406 ERROR (qtp29941842-15716) [    ] o.a.h.s.t.d.ZKDelegationTokenSecretManager
No node in path [/ZKDTSMTokensRoot/DT_2]
   [junit4]   2> 1935409 ERROR (qtp25345684-15726) [    ] o.a.h.s.t.d.ZKDelegationTokenSecretManager
No node in path [/ZKDTSMTokensRoot/DT_2]
   [junit4]   2> 1935410 INFO  (TEST-TestSolrCloudWithDelegationTokens.testDelegationTokenCancelFail-seed#[474BAEBDDD3D7152])
[    ] o.a.s.SolrTestCaseJ4 ###Ending testDelegationTokenCancelFail
   [junit4]   2> 1935427 INFO  (TEST-TestSolrCloudWithDelegationTokens.testDelegationTokenCancel-seed#[474BAEBDDD3D7152])
[    ] o.a.s.SolrTestCaseJ4 ###Starting testDelegationTokenCancel
   [junit4]   2> 1935451 ERROR (qtp25345684-15711) [    ] o.a.h.s.t.d.ZKDelegationTokenSecretManager
No node in path [/ZKDTSMTokensRoot/DT_3]
   [junit4]   2> 1935482 INFO  (TEST-TestSolrCloudWithDelegationTokens.testDelegationTokenCancel-seed#[474BAEBDDD3D7152])
[    ] o.a.s.c.c.ZkStateReader Updated live nodes from ZooKeeper... (0) -> (2)
   [junit4]   2> 1935482 INFO  (TEST-TestSolrCloudWithDelegationTokens.testDelegationTokenCancel-seed#[474BAEBDDD3D7152])
[    ] o.a.s.c.s.i.ZkClientClusterStateProvider Cluster at 127.0.0.1:44420/solr ready
   [junit4]   2> 1935494 WARN  (TEST-TestSolrCloudWithDelegationTokens.testDelegationTokenCancel-seed#[474BAEBDDD3D7152])
[    ] o.a.h.c.p.ResponseProcessCookies Invalid cookie header: "Set-Cookie: hadoop.auth=;
Path=/; Domain=127.0.0.1; Expires=Jue, 01-Qul-1970 00:00:00 GMT; HttpOnly". Invalid 'expires'
attribute: Jue, 01-Qul-1970 00:00:00 GMT
   [junit4]   2> 1935499 WARN  (TEST-TestSolrCloudWithDelegationTokens.testDelegationTokenCancel-seed#[474BAEBDDD3D7152])
[    ] o.a.h.c.p.ResponseProcessCookies Invalid cookie header: "Set-Cookie: hadoop.auth=;
Path=/; Domain=127.0.0.1; Expires=Jue, 01-Qul-1970 00:00:00 GMT; HttpOnly". Invalid 'expires'
attribute: Jue, 01-Qul-1970 00:00:00 GMT
   [junit4]   2> 1935514 ERROR (qtp29941842-15714) [    ] o.a.h.s.t.d.ZKDelegationTokenSecretManager
No node in path [/ZKDTSMTokensRoot/DT_4]
   [junit4]   2> 1935530 WARN  (TEST-TestSolrCloudWithDelegationTokens.testDelegationTokenCancel-seed#[474BAEBDDD3D7152])
[    ] o.a.h.c.p.ResponseProcessCookies Invalid cookie header: "Set-Cookie: hadoop.auth=;
Path=/; Domain=127.0.0.1; Expires=Jue, 01-Qul-1970 00:00:00 GMT; HttpOnly". Invalid 'expires'
attribute: Jue, 01-Qul-1970 00:00:00 GMT
   [junit4]   2> 1935534 INFO  (TEST-TestSolrCloudWithDelegationTokens.testDelegationTokenCancel-seed#[474BAEBDDD3D7152])
[    ] o.a.s.c.c.ZkStateReader Updated live nodes from ZooKeeper... (0) -> (2)
   [junit4]   2> 1935534 INFO  (TEST-TestSolrCloudWithDelegationTokens.testDelegationTokenCancel-seed#[474BAEBDDD3D7152])
[    ] o.a.s.c.s.i.ZkClientClusterStateProvider Cluster at 127.0.0.1:44420/solr ready
   [junit4]   2> 1935538 WARN  (TEST-TestSolrCloudWithDelegationTokens.testDelegationTokenCancel-seed#[474BAEBDDD3D7152])
[    ] o.a.h.c.p.ResponseProcessCookies Invalid cookie header: "Set-Cookie: hadoop.auth=;
Path=/; Domain=127.0.0.1; Expires=Jue, 01-Qul-1970 00:00:00 GMT; HttpOnly". Invalid 'expires'
attribute: Jue, 01-Qul-1970 00:00:00 GMT
   [junit4]   2> 1935539 INFO  (TEST-TestSolrCloudWithDelegationTokens.testDelegationTokenCancel-seed#[474BAEBDDD3D7152])
[    ] o.a.s.SolrTestCaseJ4 ###Ending testDelegationTokenCancel
   [junit4]   2> 1935559 INFO  (TEST-TestSolrCloudWithDelegationTokens.testDelegationTokenRenew-seed#[474BAEBDDD3D7152])
[    ] o.a.s.SolrTestCaseJ4 ###Starting testDelegationTokenRenew
   [junit4]   2> 1935571 WARN  (qtp25345684-15713) [    ] o.a.h.s.a.s.AuthenticationFilter
Authentication exception: org.apache.hadoop.security.AccessControlException: bar is trying
to renew a token with wrong password
   [junit4]   2> 1935571 WARN  (qtp25345684-15713) [    ] o.a.s.s.KerberosPlugin Could
not find org.apache.solr.security.kerberosplugin.requestcontinues
   [junit4]   2> 1935572 WARN  (TEST-TestSolrCloudWithDelegationTokens.testDelegationTokenRenew-seed#[474BAEBDDD3D7152])
[    ] o.a.h.c.p.ResponseProcessCookies Invalid cookie header: "Set-Cookie: hadoop.auth=;
Path=/; Domain=127.0.0.1; Expires=Jue, 01-Qul-1970 00:00:00 GMT; HttpOnly". Invalid 'expires'
attribute: Jue, 01-Qul-1970 00:00:00 GMT
   [junit4]   2> 1935572 INFO  (TEST-TestSolrCloudWithDelegationTokens.testDelegationTokenRenew-seed#[474BAEBDDD3D7152])
[    ] o.a.s.SolrTestCaseJ4 ###Ending testDelegationTokenRenew
   [junit4]   2> NOTE: reproduce with: ant test  -Dtestcase=TestSolrCloudWithDelegationTokens
-Dtests.method=testDelegationTokenRenew -Dtests.seed=474BAEBDDD3D7152 -Dtests.multiplier=3
-Dtests.slow=true -Dtests.locale=qu-EC -Dtests.timezone=America/Santarem -Dtests.asserts=true
-Dtests.file.encoding=UTF-8
   [junit4] FAILURE 0.04s J1 | TestSolrCloudWithDelegationTokens.testDelegationTokenRenew
<<<
   [junit4]    > Throwable #1: java.lang.AssertionError: expected:<200> but was:<403>
   [junit4]    > 	at __randomizedtesting.SeedInfo.seed([474BAEBDDD3D7152:70D05AA3E5F1ACF6]:0)
   [junit4]    > 	at org.apache.solr.cloud.TestSolrCloudWithDelegationTokens.renewDelegationToken(TestSolrCloudWithDelegationTokens.java:131)
   [junit4]    > 	at org.apache.solr.cloud.TestSolrCloudWithDelegationTokens.verifyDelegationTokenRenew(TestSolrCloudWithDelegationTokens.java:316)
   [junit4]    > 	at org.apache.solr.cloud.TestSolrCloudWithDelegationTokens.testDelegationTokenRenew(TestSolrCloudWithDelegationTokens.java:333)
   [junit4]    > 	at jdk.internal.reflect.NativeMethodAccessorImpl.invoke0(java.base@9-ea/Native
Method)
   [junit4]    > 	at jdk.internal.reflect.NativeMethodAccessorImpl.invoke(java.base@9-ea/NativeMethodAccessorImpl.java:62)
   [junit4]    > 	at jdk.internal.reflect.DelegatingMethodAccessorImpl.invoke(java.base@9-ea/DelegatingMethodAccessorImpl.java:43)
   [junit4]    > 	at java.lang.Thread.run(java.base@9-ea/Thread.java:843)
   [junit4]   2> 1935607 INFO  (TEST-TestSolrCloudWithDelegationTokens.testDelegationTokenVerify-seed#[474BAEBDDD3D7152])
[    ] o.a.s.SolrTestCaseJ4 ###Starting testDelegationTokenVerify
   [junit4]   2> 1935634 INFO  (TEST-TestSolrCloudWithDelegationTokens.testDelegationTokenVerify-seed#[474BAEBDDD3D7152])
[    ] o.a.s.c.c.ZkStateReader Updated live nodes from ZooKeeper... (0) -> (2)
   [junit4]   2> 1935636 INFO  (TEST-TestSolrCloudWithDelegationTokens.testDelegationTokenVerify-seed#[474BAEBDDD3D7152])
[    ] o.a.s.c.s.i.ZkClientClusterStateProvider Cluster at 127.0.0.1:44420/solr ready
   [junit4]   2> 1935642 INFO  (qtp29941842-15714) [    ] o.a.s.h.a.CollectionsHandler
Invoked Collection Action :list with params action=LIST&delegation=GgADYmFyA2JhcgCKAVi__5-BigFY5AwjgQYEFM6v-3E_R5w3ggsYuY5tggV_ZSScB3NvbHItZHQA&wt=javabin&version=2
and sendToOCPQueue=true
   [junit4]   2> 1935642 INFO  (qtp29941842-15714) [    ] o.a.s.s.HttpSolrCall [admin]
webapp=null path=/admin/collections params={action=LIST&delegation=GgADYmFyA2JhcgCKAVi__5-BigFY5AwjgQYEFM6v-3E_R5w3ggsYuY5tggV_ZSScB3NvbHItZHQA&wt=javabin&version=2}
status=0 QTime=0
   [junit4]   2> 1935647 WARN  (TEST-TestSolrCloudWithDelegationTokens.testDelegationTokenVerify-seed#[474BAEBDDD3D7152])
[    ] o.a.h.c.p.ResponseProcessCookies Invalid cookie header: "Set-Cookie: hadoop.auth=;
Path=/; Domain=127.0.0.1; Expires=Jue, 01-Qul-1970 00:00:00 GMT; HttpOnly". Invalid 'expires'
attribute: Jue, 01-Qul-1970 00:00:00 GMT
   [junit4]   2> 1935651 INFO  (TEST-TestSolrCloudWithDelegationTokens.testDelegationTokenVerify-seed#[474BAEBDDD3D7152])
[    ] o.a.s.c.c.ZkStateReader Updated live nodes from ZooKeeper... (0) -> (2)
   [junit4]   2> 1935651 INFO  (TEST-TestSolrCloudWithDelegationTokens.testDelegationTokenVerify-seed#[474BAEBDDD3D7152])
[    ] o.a.s.c.s.i.ZkClientClusterStateProvider Cluster at 127.0.0.1:44420/solr ready
   [junit4]   2> 1935654 INFO  (qtp29941842-15717) [    ] o.a.s.h.a.CollectionsHandler
Invoked Collection Action :list with params action=LIST&delegation=GgADYmFyA2JhcgCKAVi__5-BigFY5AwjgQYEFM6v-3E_R5w3ggsYuY5tggV_ZSScB3NvbHItZHQA&wt=javabin&version=2
and sendToOCPQueue=true
   [junit4]   2> 1935655 INFO  (qtp29941842-15717) [    ] o.a.s.s.HttpSolrCall [admin]
webapp=null path=/admin/collections params={action=LIST&delegation=GgADYmFyA2JhcgCKAVi__5-BigFY5AwjgQYEFM6v-3E_R5w3ggsYuY5tggV_ZSScB3NvbHItZHQA&wt=javabin&version=2}
status=0 QTime=0
   [junit4]   2> 1935659 WARN  (TEST-TestSolrCloudWithDelegationTokens.testDelegationTokenVerify-seed#[474BAEBDDD3D7152])
[    ] o.a.h.c.p.ResponseProcessCookies Invalid cookie header: "Set-Cookie: hadoop.auth=;
Path=/; Domain=127.0.0.1; Expires=Jue, 01-Qul-1970 00:00:00 GMT; HttpOnly". Invalid 'expires'
attribute: Jue, 01-Qul-1970 00:00:00 GMT
   [junit4]   2> 1935659 INFO  (TEST-TestSolrCloudWithDelegationTokens.testDelegationTokenVerify-seed#[474BAEBDDD3D7152])
[    ] o.a.s.SolrTestCaseJ4 ###Ending testDelegationTokenVerify
   [junit4]   2> 1935680 INFO  (TEST-TestSolrCloudWithDelegationTokens.testDelegationTokenRenewFail-seed#[474BAEBDDD3D7152])
[    ] o.a.s.SolrTestCaseJ4 ###Starting testDelegationTokenRenewFail
   [junit4]   2> 1935689 WARN  (qtp25345684-15723) [    ] o.a.h.s.a.s.AuthenticationFilter
Authentication exception: org.apache.hadoop.security.AccessControlException: foo tries to
renew a token with renewer bar
   [junit4]   2> 1935698 WARN  (qtp25345684-15723) [    ] o.a.s.s.KerberosPlugin Could
not find org.apache.solr.security.kerberosplugin.requestcontinues
   [junit4]   2> 1935698 WARN  (TEST-TestSolrCloudWithDelegationTokens.testDelegationTokenRenewFail-seed#[474BAEBDDD3D7152])
[    ] o.a.h.c.p.ResponseProcessCookies Invalid cookie header: "Set-Cookie: hadoop.auth=;
Path=/; Domain=127.0.0.1; Expires=Jue, 01-Qul-1970 00:00:00 GMT; HttpOnly". Invalid 'expires'
attribute: Jue, 01-Qul-1970 00:00:00 GMT
   [junit4]   2> 1935701 WARN  (qtp29941842-15718) [    ] o.a.h.s.a.s.AuthenticationFilter
Authentication exception: org.apache.hadoop.security.AccessControlException: foo tries to
renew a token with renewer bar
   [junit4]   2> 1935701 WARN  (qtp29941842-15718) [    ] o.a.s.s.KerberosPlugin Could
not find org.apache.solr.security.kerberosplugin.requestcontinues
   [junit4]   2> 1935701 WARN  (TEST-TestSolrCloudWithDelegationTokens.testDelegationTokenRenewFail-seed#[474BAEBDDD3D7152])
[    ] o.a.h.c.p.ResponseProcessCookies Invalid cookie header: "Set-Cookie: hadoop.auth=;
Path=/; Domain=127.0.0.1; Expires=Jue, 01-Qul-1970 00:00:00 GMT; HttpOnly". Invalid 'expires'
attribute: Jue, 01-Qul-1970 00:00:00 GMT
   [junit4]   2> 1935710 WARN  (qtp25345684-15713) [    ] o.a.h.s.a.s.AuthenticationFilter
Authentication exception: org.apache.hadoop.security.AccessControlException: notRenewUser
tries to renew a token with renewer renewUser
   [junit4]   2> 1935711 WARN  (qtp25345684-15713) [    ] o.a.s.s.KerberosPlugin Could
not find org.apache.solr.security.kerberosplugin.requestcontinues
   [junit4]   2> 1935711 WARN  (TEST-TestSolrCloudWithDelegationTokens.testDelegationTokenRenewFail-seed#[474BAEBDDD3D7152])
[    ] o.a.h.c.p.ResponseProcessCookies Invalid cookie header: "Set-Cookie: hadoop.auth=;
Path=/; Domain=127.0.0.1; Expires=Jue, 01-Qul-1970 00:00:00 GMT; HttpOnly". Invalid 'expires'
attribute: Jue, 01-Qul-1970 00:00:00 GMT
   [junit4]   2> 1935713 WARN  (qtp29941842-15716) [    ] o.a.h.s.a.s.AuthenticationFilter
Authentication exception: org.apache.hadoop.security.AccessControlException: notRenewUser
tries to renew a token with renewer renewUser
   [junit4]   2> 1935713 WARN  (qtp29941842-15716) [    ] o.a.s.s.KerberosPlugin Could
not find org.apache.solr.security.kerberosplugin.requestcontinues
   [junit4]   2> 1935714 WARN  (TEST-TestSolrCloudWithDelegationTokens.testDelegationTokenRenewFail-seed#[474BAEBDDD3D7152])
[    ] o.a.h.c.p.ResponseProcessCookies Invalid cookie header: "Set-Cookie: hadoop.auth=;
Path=/; Domain=127.0.0.1; Expires=Jue, 01-Qul-1970 00:00:00 GMT; HttpOnly". Invalid 'expires'
attribute: Jue, 01-Qul-1970 00:00:00 GMT
   [junit4]   2> 1935714 INFO  (TEST-TestSolrCloudWithDelegationTokens.testDelegationTokenRenewFail-seed#[474BAEBDDD3D7152])
[    ] o.a.s.SolrTestCaseJ4 ###Ending testDelegationTokenRenewFail
   [junit4]   2> 1935736 INFO  (TEST-TestSolrCloudWithDelegationTokens.testDelegationOtherOp-seed#[474BAEBDDD3D7152])
[    ] o.a.s.SolrTestCaseJ4 ###Starting testDelegationOtherOp
   [junit4]   2> 1935740 INFO  (qtp25345684-15726) [    ] o.a.s.h.a.CollectionsHandler
Invoked Collection Action :list with params op=someSolrOperation&action=LIST&wt=javabin&version=2
and sendToOCPQueue=true
   [junit4]   2> 1935740 INFO  (qtp25345684-15726) [    ] o.a.s.s.HttpSolrCall [admin]
webapp=null path=/admin/collections params={op=someSolrOperation&action=LIST&wt=javabin&version=2}
status=0 QTime=0
   [junit4]   2> 1935740 WARN  (TEST-TestSolrCloudWithDelegationTokens.testDelegationOtherOp-seed#[474BAEBDDD3D7152])
[    ] o.a.h.c.p.ResponseProcessCookies Invalid cookie header: "Set-Cookie: hadoop.auth="u=bar&p=bar&t=test&e=1480725950723&s=sTLgHFWXFKEpKG/CeuD7SQWrv08=";
Path=/; Domain=127.0.0.1; Expires=Sab, 03-Kap-2016 00:45:50 GMT; HttpOnly". Invalid 'expires'
attribute: Sab, 03-Kap-2016 00:45:50 GMT
   [junit4]   2> 1935741 INFO  (TEST-TestSolrCloudWithDelegationTokens.testDelegationOtherOp-seed#[474BAEBDDD3D7152])
[    ] o.a.s.SolrTestCaseJ4 ###Ending testDelegationOtherOp
   [junit4]   2> 1935763 INFO  (TEST-TestSolrCloudWithDelegationTokens.testDelegationTokenSolrClient-seed#[474BAEBDDD3D7152])
[    ] o.a.s.SolrTestCaseJ4 ###Starting testDelegationTokenSolrClient
   [junit4]   2> 1935774 WARN  (TEST-TestSolrCloudWithDelegationTokens.testDelegationTokenSolrClient-seed#[474BAEBDDD3D7152])
[    ] o.a.h.c.p.ResponseProcessCookies Invalid cookie header: "Set-Cookie: hadoop.auth=;
Path=/; Domain=127.0.0.1; Expires=Jue, 01-Qul-1970 00:00:00 GMT; HttpOnly". Invalid 'expires'
attribute: Jue, 01-Qul-1970 00:00:00 GMT
   [junit4]   2> 1935778 INFO  (qtp25345684-15711) [    ] o.a.s.h.a.CollectionsHandler
Invoked Collection Action :list with params action=LIST&delegation=GgADYmFyA2JhcgCKAVi__6AdigFY5AwkHQkEFNH20bHChGy7C2u6bLpZCyFoH5rMB3NvbHItZHQA&wt=javabin&version=2
and sendToOCPQueue=true
   [junit4]   2> 1935778 INFO  (qtp25345684-15711) [    ] o.a.s.s.HttpSolrCall [admin]
webapp=null path=/admin/collections params={action=LIST&delegation=GgADYmFyA2JhcgCKAVi__6AdigFY5AwkHQkEFNH20bHChGy7C2u6bLpZCyFoH5rMB3NvbHItZHQA&wt=javabin&version=2}
status=0 QTime=0
   [junit4]   2> 1935779 INFO  (TEST-TestSolrCloudWithDelegationTokens.testDelegationTokenSolrClient-seed#[474BAEBDDD3D7152])
[    ] o.a.s.SolrTestCaseJ4 ###Ending testDelegationTokenSolrClient
   [junit4]   2> 1935798 INFO  (TEST-TestSolrCloudWithDelegationTokens.testZNodePaths-seed#[474BAEBDDD3D7152])
[    ] o.a.s.SolrTestCaseJ4 ###Starting testZNodePaths
   [junit4]   2> 1935810 INFO  (TEST-TestSolrCloudWithDelegationTokens.testZNodePaths-seed#[474BAEBDDD3D7152])
[    ] o.a.s.SolrTestCaseJ4 ###Ending testZNodePaths
   [junit4]   2> 1935810 WARN  (NIOServerCxn.Factory:0.0.0.0/0.0.0.0:0) [    ] o.a.z.s.NIOServerCnxn
caught end of stream exception
   [junit4]   2> EndOfStreamException: Unable to read additional data from client sessionid
0x158bfff9a88000e, likely client has closed socket
   [junit4]   2> 	at org.apache.zookeeper.server.NIOServerCnxn.doIO(NIOServerCnxn.java:228)
   [junit4]   2> 	at org.apache.zookeeper.server.NIOServerCnxnFactory.run(NIOServerCnxnFactory.java:208)
   [junit4]   2> 	at java.lang.Thread.run(java.base@9-ea/Thread.java:843)
   [junit4]   2> 1935811 INFO  (jetty-launcher-3042-thread-1) [    ] o.e.j.s.AbstractConnector
Stopped ServerConnector@2e9660{HTTP/1.1,[http/1.1]}{127.0.0.1:0}
   [junit4]   2> 1935812 INFO  (jetty-launcher-3042-thread-1) [    ] o.a.s.c.CoreContainer
Shutting down CoreContainer instance=5962487
   [junit4]   2> 1935813 INFO  (jetty-launcher-3042-thread-2) [    ] o.e.j.s.AbstractConnector
Stopped ServerConnector@b7b483{HTTP/1.1,[http/1.1]}{127.0.0.1:0}
   [junit4]   2> 1935813 INFO  (jetty-launcher-3042-thread-2) [    ] o.a.s.c.CoreContainer
Shutting down CoreContainer instance=6710825
   [junit4]   2> 1935818 INFO  (jetty-launcher-3042-thread-1) [    ] o.a.s.c.Overseer Overseer
(id=97038496518635525-127.0.0.1:45839_solr-n_0000000000) closing
   [junit4]   2> 1935818 INFO  (OverseerStateUpdate-97038496518635525-127.0.0.1:45839_solr-n_0000000000)
[    ] o.a.s.c.Overseer Overseer Loop exiting : 127.0.0.1:45839_solr
   [junit4]   2> 1935820 INFO  (zkCallback-3053-thread-1) [    ] o.a.s.c.c.ZkStateReader
Updated live nodes from ZooKeeper... (2) -> (1)
   [junit4]   2> 1935821 WARN  (zkCallback-3052-thread-2) [    ] o.a.s.c.c.ZkStateReader
ZooKeeper watch triggered, but Solr cannot talk to ZK: [KeeperErrorCode = Session expired
for /live_nodes]
   [junit4]   2> 1935821 INFO  (zkCallback-3053-thread-2) [    ] o.a.s.c.OverseerElectionContext
I am going to be the leader 127.0.0.1:39060_solr
   [junit4]   2> 1935821 ERROR (Thread[Thread-3293,5,TGRP-TestSolrCloudWithDelegationTokens])
[    ] o.a.h.s.t.d.AbstractDelegationTokenSecretManager ExpiredTokenRemover received java.lang.InterruptedException:
sleep interrupted
   [junit4]   2> 1935826 INFO  (jetty-launcher-3042-thread-1) [    ] o.e.j.s.h.ContextHandler
Stopped o.e.j.s.ServletContextHandler@1c531c5{/solr,null,UNAVAILABLE}
   [junit4]   2> 1937322 WARN  (zkCallback-3053-thread-1) [    ] o.a.s.c.c.ZkStateReader
ZooKeeper watch triggered, but Solr cannot talk to ZK: [KeeperErrorCode = Session expired
for /live_nodes]
   [junit4]   2> 1937322 ERROR (Thread[Thread-3291,5,TGRP-TestSolrCloudWithDelegationTokens])
[    ] o.a.h.s.t.d.AbstractDelegationTokenSecretManager ExpiredTokenRemover received java.lang.InterruptedException:
sleep interrupted
   [junit4]   2> 1937323 INFO  (jetty-launcher-3042-thread-2) [    ] o.e.j.s.h.ContextHandler
Stopped o.e.j.s.ServletContextHandler@cbcc4c{/solr,null,UNAVAILABLE}
   [junit4]   2> 1937324 INFO  (SUITE-TestSolrCloudWithDelegationTokens-seed#[474BAEBDDD3D7152]-worker)
[    ] o.a.s.c.ZkTestServer connecting to 127.0.0.1:44420 44420
   [junit4]   2> 1937337 INFO  (Thread-3273) [    ] o.a.s.c.ZkTestServer connecting to
127.0.0.1:44420 44420
   [junit4]   2> 1937337 WARN  (Thread-3273) [    ] o.a.s.c.ZkTestServer Watch limit violations:

   [junit4]   2> Maximum concurrent create/delete watches above limit:
   [junit4]   2> 
   [junit4]   2> 	6	/solr/aliases.json
   [junit4]   2> 	6	/solr/clusterprops.json
   [junit4]   2> 	2	/solr/security.json
   [junit4]   2> 
   [junit4]   2> Maximum concurrent data watches above limit:
   [junit4]   2> 
   [junit4]   2> 	6	/solr/clusterstate.json
   [junit4]   2> 	3	/solr/security/zkdtsm/ZKDTSMRoot/ZKDTSMKeyIdRoot
   [junit4]   2> 	2	/solr/security/zkdtsm/ZKDTSMRoot/ZKDTSMTokensRoot/DT_7
   [junit4]   2> 	2	/solr/security/zkdtsm/ZKDTSMRoot/ZKDTSMTokensRoot/DT_6
   [junit4]   2> 	2	/solr/security/zkdtsm/ZKDTSMRoot/ZKDTSMTokensRoot/DT_9
   [junit4]   2> 	2	/solr/security/zkdtsm/ZKDTSMRoot/ZKDTSMTokensRoot/DT_8
   [junit4]   2> 	2	/solr/security/zkdtsm/ZKDTSMRoot/ZKDTSMMasterKeyRoot/DK_1
   [junit4]   2> 	2	/solr/security/zkdtsm/ZKDTSMRoot/ZKDTSMTokensRoot/DT_1
   [junit4]   2> 	2	/solr/security/zkdtsm/ZKDTSMRoot/ZKDTSMTokensRoot/DT_3
   [junit4]   2> 	2	/solr/security/zkdtsm/ZKDTSMRoot/ZKDTSMMasterKeyRoot/DK_2
   [junit4]   2> 	2	/solr/security/zkdtsm/ZKDTSMRoot/ZKDTSMTokensRoot/DT_2
   [junit4]   2> 	2	/solr/security/zkdtsm/ZKDTSMRoot/ZKDTSMTokensRoot/DT_5
   [junit4]   2> 	2	/solr/security/zkdtsm/ZKDTSMRoot/ZKDTSMMasterKeyRoot/DK_4
   [junit4]   2> 	2	/solr/security/zkdtsm/ZKDTSMRoot/ZKDTSMTokensRoot/DT_4
   [junit4]   2> 	2	/solr/security/zkdtsm/ZKDTSMRoot/ZKDTSMSeqNumRoot
   [junit4]   2> 	2	/solr/security/zkdtsm/ZKDTSMRoot/ZKDTSMTokensRoot/DT_10
   [junit4]   2> 
   [junit4]   2> Maximum concurrent children watches above limit:
   [junit4]   2> 
   [junit4]   2> 	6	/solr/live_nodes
   [junit4]   2> 	6	/solr/collections
   [junit4]   2> 	3	/solr/overseer/queue
   [junit4]   2> 	2	/solr/security/zkdtsm/ZKDTSMRoot/ZKDTSMMasterKeyRoot
   [junit4]   2> 	2	/solr/overseer/queue-work
   [junit4]   2> 	2	/solr/security/zkdtsm/ZKDTSMRoot/ZKDTSMTokensRoot
   [junit4]   2> 
   [junit4]   2> 1937338 INFO  (SUITE-TestSolrCloudWithDelegationTokens-seed#[474BAEBDDD3D7152]-worker)
[    ] o.a.s.SolrTestCaseJ4 ###deleteCore
   [junit4]   2> NOTE: leaving temporary files on disk at: /home/jenkins/workspace/Lucene-Solr-6.x-Linux/solr/build/solr-core/test/J1/temp/solr.cloud.TestSolrCloudWithDelegationTokens_474BAEBDDD3D7152-001
   [junit4]   2> Dec 02, 2016 2:45:52 PM com.carrotsearch.randomizedtesting.ThreadLeakControl
checkThreadLeaks
   [junit4]   2> WARNING: Will linger awaiting termination of 2 leaked thread(s).
   [junit4]   2> NOTE: test params are: codec=Asserting(Lucene62): {}, docValues:{}, maxPointsInLeafNode=715,
maxMBSortInHeap=6.63142877187628, sim=RandomSimilarity(queryNorm=false,coord=yes): {}, locale=qu-EC,
timezone=America/Santarem
   [junit4]   2> NOTE: Linux 4.4.0-47-generic i386/Oracle Corporation 9-ea (32-bit)/cpus=12,threads=1,free=223507904,total=518979584
   [junit4]   2> NOTE: All tests run in this JVM: [TestUninvertingReader, TestSolrConfigHandlerCloud,
TestTrie, ClusterStateUpdateTest, TestFreeTextSuggestions, LeaderInitiatedRecoveryOnCommitTest,
BasicFunctionalityTest, TestRequestForwarding, HdfsUnloadDistributedZkTest, CoreSorterTest,
TestDistributedGrouping, TestLMDirichletSimilarityFactory, ConvertedLegacyTest, TestMinMaxOnMultiValuedField,
OverseerStatusTest, TestHashPartitioner, WordBreakSolrSpellCheckerTest, DistributedTermsComponentTest,
DocValuesNotIndexedTest, TestSolr4Spatial2, BlobRepositoryCloudTest, ChaosMonkeySafeLeaderTest,
SliceStateTest, CopyFieldTest, TestMiniSolrCloudClusterSSL, TestExpandComponent, TestManagedSchemaThreadSafety,
SpellCheckComponentTest, VersionInfoTest, TestSweetSpotSimilarityFactory, TestQueryWrapperFilter,
UpdateRequestProcessorFactoryTest, TestSearcherReuse, SpatialFilterTest, JSONWriterTest, SystemInfoHandlerTest,
SoftAutoCommitTest, TestXmlQParserPlugin, TestWordDelimiterFilterFactory, TestConfigOverlay,
SecurityConfHandlerTest, DistributedQueryComponentOptimizationTest, TestQueryUtils, TestRTGBase,
TestLRUCache, TestNonDefinedSimilarityFactory, SortByFunctionTest, DateRangeFieldTest, TestExactSharedStatsCache,
TestAuthenticationFramework, TestQuerySenderListener, HdfsLockFactoryTest, DistributedFacetPivotLargeTest,
DistributedFacetPivotSmallTest, TestSurroundQueryParser, SampleTest, JsonLoaderTest, UUIDUpdateProcessorFallbackTest,
TestCursorMarkWithoutUniqueKey, MultiTermTest, BasicAuthIntegrationTest, ShardRoutingTest,
TestFiltering, TestQueryTypes, IndexBasedSpellCheckerTest, TestPartialUpdateDeduplication,
TestAnalyzeInfixSuggestions, UtilsToolTest, TermVectorComponentTest, BJQParserTest, HttpSolrCallGetCoreTest,
DistanceFunctionTest, TestRawResponseWriter, TestStressUserVersions, DirectSolrConnectionTest,
TestFieldTypeCollectionResource, TestConfigSetsAPIExclusivity, TestFieldSortValues, HdfsDirectoryFactoryTest,
TestCollationFieldDocValues, BaseCdcrDistributedZkTest, ZkSolrClientTest, TestCoreContainer,
ZkControllerTest, TestHashQParserPlugin, TestScoreJoinQPScore, TestCloudPivotFacet, TestLockTree,
DirectSolrSpellCheckerTest, TestRandomRequestDistribution, CollectionsAPIAsyncDistributedZkTest,
DeleteStatusTest, TestElisionMultitermQuery, SolrCLIZkUtilsTest, SuggestComponentContextFilterQueryTest,
RAMDirectoryFactoryTest, TestReRankQParserPlugin, TlogReplayBufferedWhileIndexingTest, TestMissingGroups,
LeaderElectionContextKeyTest, RecoveryAfterSoftCommitTest, SimpleMLTQParserTest, DistribJoinFromCollectionTest,
TestSchemaResource, TestDocBasedVersionConstraints, ClassificationUpdateProcessorFactoryTest,
TestJettySolrRunner, BasicDistributedZk2Test, UnloadDistributedZkTest, CollectionsAPIDistributedZkTest,
SyncSliceTest, OpenCloseCoreStressTest, FullSolrCloudDistribCmdsTest, TestRandomDVFaceting,
ZkCLITest, TestFaceting, TestRealTimeGet, TestStressReorder, TestJoin, TestRangeQuery, TestGroupingSearch,
QueryElevationComponentTest, BadIndexSchemaTest, TestBadConfig, HighlighterTest, SolrIndexSplitterTest,
SpellCheckCollatorTest, SolrRequestParserTest, DocValuesTest, DirectUpdateHandlerOptimizeTest,
TestRemoteStreaming, DebugComponentTest, CacheHeaderTest, DisMaxRequestHandlerTest, StandardRequestHandlerTest,
TestOmitPositions, TermsComponentTest, DocumentBuilderTest, MoreLikeThisHandlerTest, FieldAnalysisRequestHandlerTest,
IndexSchemaRuntimeFieldTest, IndexSchemaTest, JSONWriterTest, QueryParsingTest, UniqFieldsUpdateProcessorFactoryTest,
TestPHPSerializedResponseWriter, SearchHandlerTest, TestMergePolicyConfig, TestDocSet, TestSearchPerf,
NumericFieldsTest, MinimalSchemaTest, TestConfig, OutputWriterTest, TestFuzzyAnalyzedSuggestions,
TestSolrCoreProperties, NotRequiredUniqueKeyTest, TestLuceneMatchVersion, TestPhraseSuggestions,
SpellPossibilityIteratorTest, TestCharFilters, TestCodecSupport, EchoParamsTest, TestFastOutputStream,
URLClassifyProcessorTest, TestFastLRUCache, ChaosMonkeyNothingIsSafeTest, TestCrossCoreJoin,
TestDistributedMissingSort, TestEmbeddedSolrServerConstructors, ConnectionReuseTest, AliasIntegrationTest,
CollectionReloadTest, CollectionStateFormat2Test, CustomCollectionTest, LeaderFailoverAfterPartitionTest,
OutOfBoxZkACLAndCredentialsProvidersTest, OverseerCollectionConfigSetProcessorTest, OverseerModifyCollectionTest,
OverseerTaskQueueTest, RemoteQueryErrorTest, ReplaceNodeTest, ReplicationFactorTest, SSLMigrationTest,
SharedFSAutoReplicaFailoverTest, SharedFSAutoReplicaFailoverUtilsTest, SolrCloudExampleTest,
TestConfigSetsAPIZkFailure, TestCryptoKeys, TestDeleteCollectionOnDownNodes, TestHdfsCloudBackupRestore,
TestLeaderElectionWithEmptyReplica, TestLocalFSCloudBackupRestore, TestRebalanceLeaders, TestReplicaProperties,
TestSSLRandomization, TestSizeLimitedDistributedMap, TestSolrCloudWithDelegationTokens]
   [junit4] Completed [445/658 (1!)] on J1 in 3.78s, 8 tests, 1 failure <<< FAILURES!

[...truncated 50758 lines...]


Mime
View raw message