lucene-dev mailing list archives

Site index · List index
Message view « Date » · « Thread »
Top « Date » · « Thread »
From Policeman Jenkins Server <jenk...@thetaphi.de>
Subject [JENKINS] Lucene-Solr-6.x-Windows (64bit/jdk1.8.0_112) - Build # 623 - Unstable!
Date Wed, 14 Dec 2016 16:23:07 GMT
Build: https://jenkins.thetaphi.de/job/Lucene-Solr-6.x-Windows/623/
Java: 64bit/jdk1.8.0_112 -XX:+UseCompressedOops -XX:+UseG1GC

1 tests failed.
FAILED:  org.apache.solr.cloud.TestSolrCloudWithDelegationTokens.testDelegationTokenCancelFail

Error Message:
expected:<200> but was:<404>

Stack Trace:
java.lang.AssertionError: expected:<200> but was:<404>
	at __randomizedtesting.SeedInfo.seed([D059C6A258985E37:B8E6F38888024CDB]:0)
	at org.junit.Assert.fail(Assert.java:93)
	at org.junit.Assert.failNotEquals(Assert.java:647)
	at org.junit.Assert.assertEquals(Assert.java:128)
	at org.junit.Assert.assertEquals(Assert.java:472)
	at org.junit.Assert.assertEquals(Assert.java:456)
	at org.apache.solr.cloud.TestSolrCloudWithDelegationTokens.cancelDelegationToken(TestSolrCloudWithDelegationTokens.java:141)
	at org.apache.solr.cloud.TestSolrCloudWithDelegationTokens.testDelegationTokenCancelFail(TestSolrCloudWithDelegationTokens.java:295)
	at sun.reflect.NativeMethodAccessorImpl.invoke0(Native Method)
	at sun.reflect.NativeMethodAccessorImpl.invoke(NativeMethodAccessorImpl.java:62)
	at sun.reflect.DelegatingMethodAccessorImpl.invoke(DelegatingMethodAccessorImpl.java:43)
	at java.lang.reflect.Method.invoke(Method.java:498)
	at com.carrotsearch.randomizedtesting.RandomizedRunner.invoke(RandomizedRunner.java:1713)
	at com.carrotsearch.randomizedtesting.RandomizedRunner$8.evaluate(RandomizedRunner.java:907)
	at com.carrotsearch.randomizedtesting.RandomizedRunner$9.evaluate(RandomizedRunner.java:943)
	at com.carrotsearch.randomizedtesting.RandomizedRunner$10.evaluate(RandomizedRunner.java:957)
	at com.carrotsearch.randomizedtesting.rules.SystemPropertiesRestoreRule$1.evaluate(SystemPropertiesRestoreRule.java:57)
	at org.apache.lucene.util.TestRuleSetupTeardownChained$1.evaluate(TestRuleSetupTeardownChained.java:49)
	at org.apache.lucene.util.AbstractBeforeAfterRule$1.evaluate(AbstractBeforeAfterRule.java:45)
	at org.apache.lucene.util.TestRuleThreadAndTestName$1.evaluate(TestRuleThreadAndTestName.java:48)
	at org.apache.lucene.util.TestRuleIgnoreAfterMaxFailures$1.evaluate(TestRuleIgnoreAfterMaxFailures.java:64)
	at org.apache.lucene.util.TestRuleMarkFailure$1.evaluate(TestRuleMarkFailure.java:47)
	at com.carrotsearch.randomizedtesting.rules.StatementAdapter.evaluate(StatementAdapter.java:36)
	at com.carrotsearch.randomizedtesting.ThreadLeakControl$StatementRunner.run(ThreadLeakControl.java:367)
	at com.carrotsearch.randomizedtesting.ThreadLeakControl.forkTimeoutingTask(ThreadLeakControl.java:811)
	at com.carrotsearch.randomizedtesting.ThreadLeakControl$3.evaluate(ThreadLeakControl.java:462)
	at com.carrotsearch.randomizedtesting.RandomizedRunner.runSingleTest(RandomizedRunner.java:916)
	at com.carrotsearch.randomizedtesting.RandomizedRunner$5.evaluate(RandomizedRunner.java:802)
	at com.carrotsearch.randomizedtesting.RandomizedRunner$6.evaluate(RandomizedRunner.java:852)
	at com.carrotsearch.randomizedtesting.RandomizedRunner$7.evaluate(RandomizedRunner.java:863)
	at com.carrotsearch.randomizedtesting.rules.StatementAdapter.evaluate(StatementAdapter.java:36)
	at com.carrotsearch.randomizedtesting.rules.SystemPropertiesRestoreRule$1.evaluate(SystemPropertiesRestoreRule.java:57)
	at org.apache.lucene.util.AbstractBeforeAfterRule$1.evaluate(AbstractBeforeAfterRule.java:45)
	at com.carrotsearch.randomizedtesting.rules.StatementAdapter.evaluate(StatementAdapter.java:36)
	at org.apache.lucene.util.TestRuleStoreClassName$1.evaluate(TestRuleStoreClassName.java:41)
	at com.carrotsearch.randomizedtesting.rules.NoShadowingOrOverridesOnMethodsRule$1.evaluate(NoShadowingOrOverridesOnMethodsRule.java:40)
	at com.carrotsearch.randomizedtesting.rules.NoShadowingOrOverridesOnMethodsRule$1.evaluate(NoShadowingOrOverridesOnMethodsRule.java:40)
	at com.carrotsearch.randomizedtesting.rules.StatementAdapter.evaluate(StatementAdapter.java:36)
	at com.carrotsearch.randomizedtesting.rules.StatementAdapter.evaluate(StatementAdapter.java:36)
	at com.carrotsearch.randomizedtesting.rules.StatementAdapter.evaluate(StatementAdapter.java:36)
	at org.apache.lucene.util.TestRuleAssertionsRequired$1.evaluate(TestRuleAssertionsRequired.java:53)
	at org.apache.lucene.util.TestRuleMarkFailure$1.evaluate(TestRuleMarkFailure.java:47)
	at org.apache.lucene.util.TestRuleIgnoreAfterMaxFailures$1.evaluate(TestRuleIgnoreAfterMaxFailures.java:64)
	at org.apache.lucene.util.TestRuleIgnoreTestSuites$1.evaluate(TestRuleIgnoreTestSuites.java:54)
	at com.carrotsearch.randomizedtesting.rules.StatementAdapter.evaluate(StatementAdapter.java:36)
	at com.carrotsearch.randomizedtesting.ThreadLeakControl$StatementRunner.run(ThreadLeakControl.java:367)
	at java.lang.Thread.run(Thread.java:745)




Build Log:
[...truncated 10783 lines...]
   [junit4] Suite: org.apache.solr.cloud.TestSolrCloudWithDelegationTokens
   [junit4]   2> Creating dataDir: C:\Users\jenkins\workspace\Lucene-Solr-6.x-Windows\solr\build\solr-core\test\J0\temp\solr.cloud.TestSolrCloudWithDelegationTokens_D059C6A258985E37-001\init-core-data-001
   [junit4]   2> 85782 INFO  (SUITE-TestSolrCloudWithDelegationTokens-seed#[D059C6A258985E37]-worker) [    ] o.a.s.SolrTestCaseJ4 Randomized ssl (false) and clientAuth (false) via: @org.apache.solr.SolrTestCaseJ4$SuppressSSL(bugUrl=None)
   [junit4]   2> 85787 INFO  (SUITE-TestSolrCloudWithDelegationTokens-seed#[D059C6A258985E37]-worker) [    ] o.a.s.c.MiniSolrCloudCluster Starting cluster of 2 servers in C:\Users\jenkins\workspace\Lucene-Solr-6.x-Windows\solr\build\solr-core\test\J0\temp\solr.cloud.TestSolrCloudWithDelegationTokens_D059C6A258985E37-001\tempDir-001
   [junit4]   2> 85787 INFO  (SUITE-TestSolrCloudWithDelegationTokens-seed#[D059C6A258985E37]-worker) [    ] o.a.s.c.ZkTestServer STARTING ZK TEST SERVER
   [junit4]   2> 85787 INFO  (Thread-238) [    ] o.a.s.c.ZkTestServer client port:0.0.0.0/0.0.0.0:0
   [junit4]   2> 85787 INFO  (Thread-238) [    ] o.a.s.c.ZkTestServer Starting server
   [junit4]   2> 85888 INFO  (SUITE-TestSolrCloudWithDelegationTokens-seed#[D059C6A258985E37]-worker) [    ] o.a.s.c.ZkTestServer start zk server on port:54421
   [junit4]   2> 85908 INFO  (jetty-launcher-163-thread-2) [    ] o.e.j.s.Server jetty-9.3.14.v20161028
   [junit4]   2> 85909 INFO  (jetty-launcher-163-thread-2) [    ] o.e.j.s.h.ContextHandler Started o.e.j.s.ServletContextHandler@78825262{/solr,null,AVAILABLE}
   [junit4]   2> 85911 INFO  (jetty-launcher-163-thread-1) [    ] o.e.j.s.Server jetty-9.3.14.v20161028
   [junit4]   2> 85911 INFO  (jetty-launcher-163-thread-2) [    ] o.e.j.s.AbstractConnector Started ServerConnector@2e0622bf{HTTP/1.1,[http/1.1]}{127.0.0.1:54425}
   [junit4]   2> 85911 INFO  (jetty-launcher-163-thread-2) [    ] o.e.j.s.Server Started @90364ms
   [junit4]   2> 85911 INFO  (jetty-launcher-163-thread-2) [    ] o.a.s.c.s.e.JettySolrRunner Jetty properties: {hostContext=/solr, hostPort=54425}
   [junit4]   2> 85912 ERROR (jetty-launcher-163-thread-2) [    ] o.a.s.s.StartupLoggingUtils Missing Java Option solr.log.dir. Logging may be missing or incomplete.
   [junit4]   2> 85914 INFO  (jetty-launcher-163-thread-2) [    ] o.a.s.s.SolrDispatchFilter  ___      _       Welcome to Apache Solr™ version 6.4.0
   [junit4]   2> 85914 INFO  (jetty-launcher-163-thread-2) [    ] o.a.s.s.SolrDispatchFilter / __| ___| |_ _   Starting in cloud mode on port null
   [junit4]   2> 85914 INFO  (jetty-launcher-163-thread-2) [    ] o.a.s.s.SolrDispatchFilter \__ \/ _ \ | '_|  Install dir: null
   [junit4]   2> 85914 INFO  (jetty-launcher-163-thread-2) [    ] o.a.s.s.SolrDispatchFilter |___/\___/_|_|    Start time: 2016-12-14T15:09:02.021Z
   [junit4]   2> 85914 INFO  (jetty-launcher-163-thread-1) [    ] o.e.j.s.h.ContextHandler Started o.e.j.s.ServletContextHandler@7d5b07f1{/solr,null,AVAILABLE}
   [junit4]   2> 85915 INFO  (jetty-launcher-163-thread-1) [    ] o.e.j.s.AbstractConnector Started ServerConnector@149f7f61{HTTP/1.1,[http/1.1]}{127.0.0.1:54428}
   [junit4]   2> 85915 INFO  (jetty-launcher-163-thread-1) [    ] o.e.j.s.Server Started @90367ms
   [junit4]   2> 85915 INFO  (jetty-launcher-163-thread-1) [    ] o.a.s.c.s.e.JettySolrRunner Jetty properties: {hostContext=/solr, hostPort=54428}
   [junit4]   2> 85916 ERROR (jetty-launcher-163-thread-1) [    ] o.a.s.s.StartupLoggingUtils Missing Java Option solr.log.dir. Logging may be missing or incomplete.
   [junit4]   2> 85916 INFO  (jetty-launcher-163-thread-1) [    ] o.a.s.s.SolrDispatchFilter  ___      _       Welcome to Apache Solr™ version 6.4.0
   [junit4]   2> 85916 INFO  (jetty-launcher-163-thread-1) [    ] o.a.s.s.SolrDispatchFilter / __| ___| |_ _   Starting in cloud mode on port null
   [junit4]   2> 85916 INFO  (jetty-launcher-163-thread-1) [    ] o.a.s.s.SolrDispatchFilter \__ \/ _ \ | '_|  Install dir: null
   [junit4]   2> 85916 INFO  (jetty-launcher-163-thread-1) [    ] o.a.s.s.SolrDispatchFilter |___/\___/_|_|    Start time: 2016-12-14T15:09:02.023Z
   [junit4]   2> 85920 INFO  (jetty-launcher-163-thread-2) [    ] o.a.s.s.SolrDispatchFilter solr.xml found in ZooKeeper. Loading...
   [junit4]   2> 85923 INFO  (jetty-launcher-163-thread-1) [    ] o.a.s.s.SolrDispatchFilter solr.xml found in ZooKeeper. Loading...
   [junit4]   2> 85932 WARN  (NIOServerCxn.Factory:0.0.0.0/0.0.0.0:0) [    ] o.a.z.s.NIOServerCnxn caught end of stream exception
   [junit4]   2> EndOfStreamException: Unable to read additional data from client sessionid 0x158fde12a4a0002, likely client has closed socket
   [junit4]   2> 	at org.apache.zookeeper.server.NIOServerCnxn.doIO(NIOServerCnxn.java:228)
   [junit4]   2> 	at org.apache.zookeeper.server.NIOServerCnxnFactory.run(NIOServerCnxnFactory.java:208)
   [junit4]   2> 	at java.lang.Thread.run(Thread.java:745)
   [junit4]   2> 85937 INFO  (jetty-launcher-163-thread-2) [    ] o.a.s.u.UpdateShardHandler Creating UpdateShardHandler HTTP client with params: socketTimeout=340000&connTimeout=45000&retry=true
   [junit4]   2> 85938 INFO  (jetty-launcher-163-thread-1) [    ] o.a.s.u.UpdateShardHandler Creating UpdateShardHandler HTTP client with params: socketTimeout=340000&connTimeout=45000&retry=true
   [junit4]   2> 85938 INFO  (jetty-launcher-163-thread-2) [    ] o.a.s.c.ZkContainer Zookeeper client=127.0.0.1:54421/solr
   [junit4]   2> 85939 INFO  (jetty-launcher-163-thread-1) [    ] o.a.s.c.ZkContainer Zookeeper client=127.0.0.1:54421/solr
   [junit4]   2> 85943 WARN  (NIOServerCxn.Factory:0.0.0.0/0.0.0.0:0) [    ] o.a.z.s.NIOServerCnxn caught end of stream exception
   [junit4]   2> EndOfStreamException: Unable to read additional data from client sessionid 0x158fde12a4a0003, likely client has closed socket
   [junit4]   2> 	at org.apache.zookeeper.server.NIOServerCnxn.doIO(NIOServerCnxn.java:228)
   [junit4]   2> 	at org.apache.zookeeper.server.NIOServerCnxnFactory.run(NIOServerCnxnFactory.java:208)
   [junit4]   2> 	at java.lang.Thread.run(Thread.java:745)
   [junit4]   2> 85944 WARN  (NIOServerCxn.Factory:0.0.0.0/0.0.0.0:0) [    ] o.a.z.s.NIOServerCnxn caught end of stream exception
   [junit4]   2> EndOfStreamException: Unable to read additional data from client sessionid 0x158fde12a4a0004, likely client has closed socket
   [junit4]   2> 	at org.apache.zookeeper.server.NIOServerCnxn.doIO(NIOServerCnxn.java:228)
   [junit4]   2> 	at org.apache.zookeeper.server.NIOServerCnxnFactory.run(NIOServerCnxnFactory.java:208)
   [junit4]   2> 	at java.lang.Thread.run(Thread.java:745)
   [junit4]   2> 85987 INFO  (jetty-launcher-163-thread-2) [n:127.0.0.1:54425_solr    ] o.a.s.c.OverseerElectionContext I am going to be the leader 127.0.0.1:54425_solr
   [junit4]   2> 85988 INFO  (jetty-launcher-163-thread-1) [n:127.0.0.1:54428_solr    ] o.a.s.c.ZkController Register node as live in ZooKeeper:/live_nodes/127.0.0.1:54428_solr
   [junit4]   2> 85990 INFO  (jetty-launcher-163-thread-2) [n:127.0.0.1:54425_solr    ] o.a.s.c.Overseer Overseer (id=97106535507427333-127.0.0.1:54425_solr-n_0000000000) starting
   [junit4]   2> 85992 INFO  (zkCallback-173-thread-1-processing-n:127.0.0.1:54425_solr) [n:127.0.0.1:54425_solr    ] o.a.s.c.c.ZkStateReader Updated live nodes from ZooKeeper... (0) -> (1)
   [junit4]   2> 85995 INFO  (zkCallback-174-thread-1-processing-n:127.0.0.1:54428_solr) [n:127.0.0.1:54428_solr    ] o.a.s.c.c.ZkStateReader Updated live nodes from ZooKeeper... (0) -> (1)
   [junit4]   2> 86009 INFO  (jetty-launcher-163-thread-2) [n:127.0.0.1:54425_solr    ] o.a.s.c.ZkController Register node as live in ZooKeeper:/live_nodes/127.0.0.1:54425_solr
   [junit4]   2> 86018 INFO  (jetty-launcher-163-thread-1) [n:127.0.0.1:54428_solr    ] o.a.s.c.CoreContainer Authentication plugin class obtained from system property 'authenticationPlugin': org.apache.solr.security.HttpParamDelegationTokenPlugin
   [junit4]   2> 86020 INFO  (zkCallback-173-thread-1-processing-n:127.0.0.1:54425_solr) [n:127.0.0.1:54425_solr    ] o.a.s.c.c.ZkStateReader Updated live nodes from ZooKeeper... (1) -> (2)
   [junit4]   2> 86021 INFO  (zkCallback-174-thread-1-processing-n:127.0.0.1:54428_solr) [n:127.0.0.1:54428_solr    ] o.a.s.c.c.ZkStateReader Updated live nodes from ZooKeeper... (1) -> (2)
   [junit4]   2> 86050 INFO  (jetty-launcher-163-thread-2) [n:127.0.0.1:54425_solr    ] o.a.s.c.CoreContainer Authentication plugin class obtained from system property 'authenticationPlugin': org.apache.solr.security.HttpParamDelegationTokenPlugin
   [junit4]   2> 86079 INFO  (jetty-launcher-163-thread-1) [n:127.0.0.1:54428_solr    ] o.a.s.s.KerberosPlugin Params: {token.valid=30, delegation-token.token-kind=solr-dt, cookie.domain=127.0.0.1, cookie.path=/, zk-dt-secret-manager.znodeWorkingPath=solr/security/zkdtsm, token.validity=36000, signer.secret.provider.zookeeper.path=/token, type=kerberos, zk-dt-secret-manager.enable=true, kerberos.name.rules=DEFAULT, signer.secret.provider=zookeeper}
   [junit4]   2> 86080 INFO  (jetty-launcher-163-thread-2) [n:127.0.0.1:54425_solr    ] o.a.s.s.KerberosPlugin Params: {token.valid=30, delegation-token.token-kind=solr-dt, cookie.domain=127.0.0.1, cookie.path=/, zk-dt-secret-manager.znodeWorkingPath=solr/security/zkdtsm, token.validity=36000, signer.secret.provider.zookeeper.path=/token, type=kerberos, zk-dt-secret-manager.enable=true, kerberos.name.rules=DEFAULT, signer.secret.provider=zookeeper}
   [junit4]   2> 86410 INFO  (jetty-launcher-163-thread-2) [n:127.0.0.1:54425_solr    ] o.a.c.f.i.CuratorFrameworkImpl Starting
   [junit4]   2> 86410 INFO  (jetty-launcher-163-thread-1) [n:127.0.0.1:54428_solr    ] o.a.c.f.i.CuratorFrameworkImpl Starting
   [junit4]   2> 86530 INFO  (jetty-launcher-163-thread-1-EventThread) [n:127.0.0.1:54428_solr    ] o.a.c.f.s.ConnectionStateManager State change: CONNECTED
   [junit4]   2> 86544 INFO  (jetty-launcher-163-thread-2-EventThread) [n:127.0.0.1:54425_solr    ] o.a.c.f.s.ConnectionStateManager State change: CONNECTED
   [junit4]   2> 86739 ERROR (jetty-launcher-163-thread-1) [n:127.0.0.1:54428_solr    ] o.a.h.u.Shell Failed to locate the winutils binary in the hadoop binary path
   [junit4]   2> java.io.IOException: Could not locate executable null\bin\winutils.exe in the Hadoop binaries.
   [junit4]   2> 	at org.apache.hadoop.util.Shell.getQualifiedBinPath(Shell.java:356)
   [junit4]   2> 	at org.apache.hadoop.util.Shell.getWinUtilsPath(Shell.java:371)
   [junit4]   2> 	at org.apache.hadoop.util.Shell.<clinit>(Shell.java:364)
   [junit4]   2> 	at org.apache.hadoop.util.StringUtils.<clinit>(StringUtils.java:80)
   [junit4]   2> 	at org.apache.hadoop.conf.Configuration.getBoolean(Configuration.java:1437)
   [junit4]   2> 	at org.apache.hadoop.security.token.delegation.web.DelegationTokenManager.<init>(DelegationTokenManager.java:115)
   [junit4]   2> 	at org.apache.hadoop.security.token.delegation.web.DelegationTokenAuthenticationHandler.initTokenManager(DelegationTokenAuthenticationHandler.java:148)
   [junit4]   2> 	at org.apache.hadoop.security.token.delegation.web.DelegationTokenAuthenticationHandler.init(DelegationTokenAuthenticationHandler.java:118)
   [junit4]   2> 	at org.apache.solr.security.HttpParamDelegationTokenPlugin$HttpParamDelegationTokenAuthenticationHandler.init(HttpParamDelegationTokenPlugin.java:185)
   [junit4]   2> 	at org.apache.hadoop.security.authentication.server.AuthenticationFilter.initializeAuthHandler(AuthenticationFilter.java:238)
   [junit4]   2> 	at org.apache.hadoop.security.token.delegation.web.DelegationTokenAuthenticationFilter.initializeAuthHandler(DelegationTokenAuthenticationFilter.java:209)
   [junit4]   2> 	at org.apache.solr.security.DelegationTokenKerberosFilter.initializeAuthHandler(DelegationTokenKerberosFilter.java:142)
   [junit4]   2> 	at org.apache.hadoop.security.authentication.server.AuthenticationFilter.init(AuthenticationFilter.java:227)
   [junit4]   2> 	at org.apache.hadoop.security.token.delegation.web.DelegationTokenAuthenticationFilter.init(DelegationTokenAuthenticationFilter.java:175)
   [junit4]   2> 	at org.apache.solr.security.DelegationTokenKerberosFilter.init(DelegationTokenKerberosFilter.java:71)
   [junit4]   2> 	at org.apache.solr.security.HttpParamDelegationTokenPlugin.init(HttpParamDelegationTokenPlugin.java:142)
   [junit4]   2> 	at org.apache.solr.core.CoreContainer.initializeAuthenticationPlugin(CoreContainer.java:316)
   [junit4]   2> 	at org.apache.solr.core.CoreContainer.load(CoreContainer.java:446)
   [junit4]   2> 	at org.apache.solr.servlet.SolrDispatchFilter.createCoreContainer(SolrDispatchFilter.java:204)
   [junit4]   2> 	at org.apache.solr.servlet.SolrDispatchFilter.init(SolrDispatchFilter.java:153)
   [junit4]   2> 	at org.eclipse.jetty.servlet.FilterHolder.initialize(FilterHolder.java:137)
   [junit4]   2> 	at org.eclipse.jetty.servlet.ServletHandler.initialize(ServletHandler.java:873)
   [junit4]   2> 	at org.eclipse.jetty.servlet.ServletHandler.updateMappings(ServletHandler.java:1565)
   [junit4]   2> 	at org.eclipse.jetty.servlet.ServletHandler.setFilterMappings(ServletHandler.java:1599)
   [junit4]   2> 	at org.eclipse.jetty.servlet.ServletHandler.addFilterMapping(ServletHandler.java:1285)
   [junit4]   2> 	at org.eclipse.jetty.servlet.ServletHandler.addFilterWithMapping(ServletHandler.java:1130)
   [junit4]   2> 	at org.eclipse.jetty.servlet.ServletContextHandler.addFilter(ServletContextHandler.java:448)
   [junit4]   2> 	at org.apache.solr.client.solrj.embedded.JettySolrRunner$1.lifeCycleStarted(JettySolrRunner.java:260)
   [junit4]   2> 	at org.eclipse.jetty.util.component.AbstractLifeCycle.setStarted(AbstractLifeCycle.java:179)
   [junit4]   2> 	at org.eclipse.jetty.util.component.AbstractLifeCycle.start(AbstractLifeCycle.java:69)
   [junit4]   2> 	at org.apache.solr.client.solrj.embedded.JettySolrRunner.start(JettySolrRunner.java:348)
   [junit4]   2> 	at org.apache.solr.client.solrj.embedded.JettySolrRunner.start(JettySolrRunner.java:321)
   [junit4]   2> 	at org.apache.solr.cloud.MiniSolrCloudCluster.startJettySolrRunner(MiniSolrCloudCluster.java:358)
   [junit4]   2> 	at org.apache.solr.cloud.MiniSolrCloudCluster.lambda$new$0(MiniSolrCloudCluster.java:221)
   [junit4]   2> 	at java.util.concurrent.FutureTask.run(FutureTask.java:266)
   [junit4]   2> 	at org.apache.solr.common.util.ExecutorUtil$MDCAwareThreadPoolExecutor.lambda$execute$0(ExecutorUtil.java:229)
   [junit4]   2> 	at java.util.concurrent.ThreadPoolExecutor.runWorker(ThreadPoolExecutor.java:1142)
   [junit4]   2> 	at java.util.concurrent.ThreadPoolExecutor$Worker.run(ThreadPoolExecutor.java:617)
   [junit4]   2> 	at java.lang.Thread.run(Thread.java:745)
   [junit4]   2> 86993 INFO  (jetty-launcher-163-thread-1) [n:127.0.0.1:54428_solr    ] o.a.s.h.c.HttpShardHandlerFactory Reconfiguring the default client with: org.apache.solr.security.HttpParamDelegationTokenPlugin$2@33606430
   [junit4]   2> 86993 INFO  (jetty-launcher-163-thread-1) [n:127.0.0.1:54428_solr    ] o.a.s.u.UpdateShardHandler Reconfiguring the default client with: org.apache.solr.security.HttpParamDelegationTokenPlugin$2@33606430
   [junit4]   2> 86995 INFO  (jetty-launcher-163-thread-1) [n:127.0.0.1:54428_solr    ] o.a.s.c.CorePropertiesLocator Found 0 core definitions underneath C:\Users\jenkins\workspace\Lucene-Solr-6.x-Windows\solr\build\solr-core\test\J0\temp\solr.cloud.TestSolrCloudWithDelegationTokens_D059C6A258985E37-001\tempDir-001\node1\.
   [junit4]   2> 87564 INFO  (jetty-launcher-163-thread-2) [n:127.0.0.1:54425_solr    ] o.a.s.h.c.HttpShardHandlerFactory Reconfiguring the default client with: org.apache.solr.security.HttpParamDelegationTokenPlugin$2@1d4d825e
   [junit4]   2> 87564 INFO  (jetty-launcher-163-thread-2) [n:127.0.0.1:54425_solr    ] o.a.s.u.UpdateShardHandler Reconfiguring the default client with: org.apache.solr.security.HttpParamDelegationTokenPlugin$2@1d4d825e
   [junit4]   2> 87565 INFO  (jetty-launcher-163-thread-2) [n:127.0.0.1:54425_solr    ] o.a.s.c.CorePropertiesLocator Found 0 core definitions underneath C:\Users\jenkins\workspace\Lucene-Solr-6.x-Windows\solr\build\solr-core\test\J0\temp\solr.cloud.TestSolrCloudWithDelegationTokens_D059C6A258985E37-001\tempDir-001\node2\.
   [junit4]   2> 87574 WARN  (NIOServerCxn.Factory:0.0.0.0/0.0.0.0:0) [    ] o.a.z.s.NIOServerCnxn caught end of stream exception
   [junit4]   2> EndOfStreamException: Unable to read additional data from client sessionid 0x158fde12a4a0009, likely client has closed socket
   [junit4]   2> 	at org.apache.zookeeper.server.NIOServerCnxn.doIO(NIOServerCnxn.java:228)
   [junit4]   2> 	at org.apache.zookeeper.server.NIOServerCnxnFactory.run(NIOServerCnxnFactory.java:208)
   [junit4]   2> 	at java.lang.Thread.run(Thread.java:745)
   [junit4]   2> 87596 INFO  (TEST-TestSolrCloudWithDelegationTokens.testDelegationTokenCancel-seed#[D059C6A258985E37]) [    ] o.a.s.SolrTestCaseJ4 ###Starting testDelegationTokenCancel
   [junit4]   2> 88757 ERROR (qtp1499289447-1048) [    ] o.a.h.s.t.d.ZKDelegationTokenSecretManager No node in path [/ZKDTSMTokensRoot/DT_1]
   [junit4]   2> 88787 INFO  (TEST-TestSolrCloudWithDelegationTokens.testDelegationTokenCancel-seed#[D059C6A258985E37]) [    ] o.a.s.c.c.ZkStateReader Updated live nodes from ZooKeeper... (0) -> (2)
   [junit4]   2> 88789 INFO  (TEST-TestSolrCloudWithDelegationTokens.testDelegationTokenCancel-seed#[D059C6A258985E37]) [    ] o.a.s.c.s.i.ZkClientClusterStateProvider Cluster at 127.0.0.1:54421/solr ready
   [junit4]   2> 88818 WARN  (TEST-TestSolrCloudWithDelegationTokens.testDelegationTokenCancel-seed#[D059C6A258985E37]) [    ] o.a.h.c.p.ResponseProcessCookies Invalid cookie header: "Set-Cookie: hadoop.auth=; Path=/; Domain=127.0.0.1; Expires= et, 01-jan-1970 00:00:00 GMT; HttpOnly". Invalid 'expires' attribute: et, 01-jan-1970 00:00:00 GMT
   [junit4]   2> 88819 WARN  (NIOServerCxn.Factory:0.0.0.0/0.0.0.0:0) [    ] o.a.z.s.NIOServerCnxn caught end of stream exception
   [junit4]   2> EndOfStreamException: Unable to read additional data from client sessionid 0x158fde12a4a000a, likely client has closed socket
   [junit4]   2> 	at org.apache.zookeeper.server.NIOServerCnxn.doIO(NIOServerCnxn.java:228)
   [junit4]   2> 	at org.apache.zookeeper.server.NIOServerCnxnFactory.run(NIOServerCnxnFactory.java:208)
   [junit4]   2> 	at java.lang.Thread.run(Thread.java:745)
   [junit4]   2> 88824 WARN  (TEST-TestSolrCloudWithDelegationTokens.testDelegationTokenCancel-seed#[D059C6A258985E37]) [    ] o.a.h.c.p.ResponseProcessCookies Invalid cookie header: "Set-Cookie: hadoop.auth=; Path=/; Domain=127.0.0.1; Expires= et, 01-jan-1970 00:00:00 GMT; HttpOnly". Invalid 'expires' attribute: et, 01-jan-1970 00:00:00 GMT
   [junit4]   2> 88840 ERROR (qtp140566223-1060) [    ] o.a.h.s.t.d.ZKDelegationTokenSecretManager No node in path [/ZKDTSMTokensRoot/DT_2]
   [junit4]   2> 88847 INFO  (TEST-TestSolrCloudWithDelegationTokens.testDelegationTokenCancel-seed#[D059C6A258985E37]) [    ] o.a.s.c.c.ZkStateReader Updated live nodes from ZooKeeper... (0) -> (2)
   [junit4]   2> 88849 INFO  (TEST-TestSolrCloudWithDelegationTokens.testDelegationTokenCancel-seed#[D059C6A258985E37]) [    ] o.a.s.c.s.i.ZkClientClusterStateProvider Cluster at 127.0.0.1:54421/solr ready
   [junit4]   2> 88851 WARN  (TEST-TestSolrCloudWithDelegationTokens.testDelegationTokenCancel-seed#[D059C6A258985E37]) [    ] o.a.h.c.p.ResponseProcessCookies Invalid cookie header: "Set-Cookie: hadoop.auth=; Path=/; Domain=127.0.0.1; Expires= et, 01-jan-1970 00:00:00 GMT; HttpOnly". Invalid 'expires' attribute: et, 01-jan-1970 00:00:00 GMT
   [junit4]   2> 88852 WARN  (NIOServerCxn.Factory:0.0.0.0/0.0.0.0:0) [    ] o.a.z.s.NIOServerCnxn caught end of stream exception
   [junit4]   2> EndOfStreamException: Unable to read additional data from client sessionid 0x158fde12a4a000b, likely client has closed socket
   [junit4]   2> 	at org.apache.zookeeper.server.NIOServerCnxn.doIO(NIOServerCnxn.java:228)
   [junit4]   2> 	at org.apache.zookeeper.server.NIOServerCnxnFactory.run(NIOServerCnxnFactory.java:208)
   [junit4]   2> 	at java.lang.Thread.run(Thread.java:745)
   [junit4]   2> 88855 WARN  (TEST-TestSolrCloudWithDelegationTokens.testDelegationTokenCancel-seed#[D059C6A258985E37]) [    ] o.a.h.c.p.ResponseProcessCookies Invalid cookie header: "Set-Cookie: hadoop.auth=; Path=/; Domain=127.0.0.1; Expires= et, 01-jan-1970 00:00:00 GMT; HttpOnly". Invalid 'expires' attribute: et, 01-jan-1970 00:00:00 GMT
   [junit4]   2> 88855 INFO  (TEST-TestSolrCloudWithDelegationTokens.testDelegationTokenCancel-seed#[D059C6A258985E37]) [    ] o.a.s.SolrTestCaseJ4 ###Ending testDelegationTokenCancel
   [junit4]   2> 88874 INFO  (TEST-TestSolrCloudWithDelegationTokens.testDelegationTokenRenew-seed#[D059C6A258985E37]) [    ] o.a.s.SolrTestCaseJ4 ###Starting testDelegationTokenRenew
   [junit4]   2> 88905 INFO  (TEST-TestSolrCloudWithDelegationTokens.testDelegationTokenRenew-seed#[D059C6A258985E37]) [    ] o.a.s.c.c.ZkStateReader Updated live nodes from ZooKeeper... (0) -> (2)
   [junit4]   2> 88906 INFO  (TEST-TestSolrCloudWithDelegationTokens.testDelegationTokenRenew-seed#[D059C6A258985E37]) [    ] o.a.s.c.s.i.ZkClientClusterStateProvider Cluster at 127.0.0.1:54421/solr ready
   [junit4]   2> 88921 INFO  (qtp1499289447-1050) [n:127.0.0.1:54428_solr    ] o.a.s.h.a.CollectionsHandler Invoked Collection Action :list with params action=LIST&delegation=GgADYmFyA2JhcgCKAVj94TZXigFZIe26VwMCFCAhDGO1WcZKRbdpRTcBZZKkYbBCB3NvbHItZHQA&wt=javabin&version=2 and sendToOCPQueue=true
   [junit4]   2> 88921 INFO  (qtp1499289447-1050) [n:127.0.0.1:54428_solr    ] o.a.s.s.HttpSolrCall [admin] webapp=null path=/admin/collections params={action=LIST&delegation=GgADYmFyA2JhcgCKAVj94TZXigFZIe26VwMCFCAhDGO1WcZKRbdpRTcBZZKkYbBCB3NvbHItZHQA&wt=javabin&version=2} status=0 QTime=0
   [junit4]   2> 88926 INFO  (TEST-TestSolrCloudWithDelegationTokens.testDelegationTokenRenew-seed#[D059C6A258985E37]) [    ] o.a.s.c.c.ZkStateReader Updated live nodes from ZooKeeper... (0) -> (2)
   [junit4]   2> 88927 INFO  (TEST-TestSolrCloudWithDelegationTokens.testDelegationTokenRenew-seed#[D059C6A258985E37]) [    ] o.a.s.c.s.i.ZkClientClusterStateProvider Cluster at 127.0.0.1:54421/solr ready
   [junit4]   2> 88930 WARN  (TEST-TestSolrCloudWithDelegationTokens.testDelegationTokenRenew-seed#[D059C6A258985E37]) [    ] o.a.h.c.p.ResponseProcessCookies Invalid cookie header: "Set-Cookie: hadoop.auth=; Path=/; Domain=127.0.0.1; Expires= et, 01-jan-1970 00:00:00 GMT; HttpOnly". Invalid 'expires' attribute: et, 01-jan-1970 00:00:00 GMT
   [junit4]   2> 88930 WARN  (NIOServerCxn.Factory:0.0.0.0/0.0.0.0:0) [    ] o.a.z.s.NIOServerCnxn caught end of stream exception
   [junit4]   2> EndOfStreamException: Unable to read additional data from client sessionid 0x158fde12a4a000d, likely client has closed socket
   [junit4]   2> 	at org.apache.zookeeper.server.NIOServerCnxn.doIO(NIOServerCnxn.java:228)
   [junit4]   2> 	at org.apache.zookeeper.server.NIOServerCnxnFactory.run(NIOServerCnxnFactory.java:208)
   [junit4]   2> 	at java.lang.Thread.run(Thread.java:745)
   [junit4]   2> 88935 INFO  (qtp140566223-1038) [n:127.0.0.1:54425_solr    ] o.a.s.h.a.CollectionsHandler Invoked Collection Action :list with params action=LIST&delegation=GgADYmFyA2JhcgCKAVj94TZXigFZIe26VwMCFCAhDGO1WcZKRbdpRTcBZZKkYbBCB3NvbHItZHQA&wt=javabin&version=2 and sendToOCPQueue=true
   [junit4]   2> 88935 INFO  (qtp140566223-1038) [n:127.0.0.1:54425_solr    ] o.a.s.s.HttpSolrCall [admin] webapp=null path=/admin/collections params={action=LIST&delegation=GgADYmFyA2JhcgCKAVj94TZXigFZIe26VwMCFCAhDGO1WcZKRbdpRTcBZZKkYbBCB3NvbHItZHQA&wt=javabin&version=2} status=0 QTime=0
   [junit4]   2> 88937 WARN  (TEST-TestSolrCloudWithDelegationTokens.testDelegationTokenRenew-seed#[D059C6A258985E37]) [    ] o.a.h.c.p.ResponseProcessCookies Invalid cookie header: "Set-Cookie: hadoop.auth=; Path=/; Domain=127.0.0.1; Expires= et, 01-jan-1970 00:00:00 GMT; HttpOnly". Invalid 'expires' attribute: et, 01-jan-1970 00:00:00 GMT
   [junit4]   2> 88954 INFO  (TEST-TestSolrCloudWithDelegationTokens.testDelegationTokenRenew-seed#[D059C6A258985E37]) [    ] o.a.s.c.c.ZkStateReader Updated live nodes from ZooKeeper... (0) -> (2)
   [junit4]   2> 88956 INFO  (TEST-TestSolrCloudWithDelegationTokens.testDelegationTokenRenew-seed#[D059C6A258985E37]) [    ] o.a.s.c.s.i.ZkClientClusterStateProvider Cluster at 127.0.0.1:54421/solr ready
   [junit4]   2> 88959 INFO  (qtp1499289447-1050) [n:127.0.0.1:54428_solr    ] o.a.s.h.a.CollectionsHandler Invoked Collection Action :list with params action=LIST&delegation=GgADYmFyA2JhcgCKAVj94TaWigFZIe26lgQCFK5CAXVNNYTMmJy3vAieKk84_C0qB3NvbHItZHQA&wt=javabin&version=2 and sendToOCPQueue=true
   [junit4]   2> 88959 INFO  (qtp1499289447-1050) [n:127.0.0.1:54428_solr    ] o.a.s.s.HttpSolrCall [admin] webapp=null path=/admin/collections params={action=LIST&delegation=GgADYmFyA2JhcgCKAVj94TaWigFZIe26lgQCFK5CAXVNNYTMmJy3vAieKk84_C0qB3NvbHItZHQA&wt=javabin&version=2} status=0 QTime=0
   [junit4]   2> 88965 INFO  (TEST-TestSolrCloudWithDelegationTokens.testDelegationTokenRenew-seed#[D059C6A258985E37]) [    ] o.a.s.c.c.ZkStateReader Updated live nodes from ZooKeeper... (0) -> (2)
   [junit4]   2> 88967 INFO  (TEST-TestSolrCloudWithDelegationTokens.testDelegationTokenRenew-seed#[D059C6A258985E37]) [    ] o.a.s.c.s.i.ZkClientClusterStateProvider Cluster at 127.0.0.1:54421/solr ready
   [junit4]   2> 88969 WARN  (TEST-TestSolrCloudWithDelegationTokens.testDelegationTokenRenew-seed#[D059C6A258985E37]) [    ] o.a.h.c.p.ResponseProcessCookies Invalid cookie header: "Set-Cookie: hadoop.auth=; Path=/; Domain=127.0.0.1; Expires= et, 01-jan-1970 00:00:00 GMT; HttpOnly". Invalid 'expires' attribute: et, 01-jan-1970 00:00:00 GMT
   [junit4]   2> 88970 WARN  (NIOServerCxn.Factory:0.0.0.0/0.0.0.0:0) [    ] o.a.z.s.NIOServerCnxn caught end of stream exception
   [junit4]   2> EndOfStreamException: Unable to read additional data from client sessionid 0x158fde12a4a000f, likely client has closed socket
   [junit4]   2> 	at org.apache.zookeeper.server.NIOServerCnxn.doIO(NIOServerCnxn.java:228)
   [junit4]   2> 	at org.apache.zookeeper.server.NIOServerCnxnFactory.run(NIOServerCnxnFactory.java:208)
   [junit4]   2> 	at java.lang.Thread.run(Thread.java:745)
   [junit4]   2> 88973 INFO  (qtp140566223-1036) [n:127.0.0.1:54425_solr    ] o.a.s.h.a.CollectionsHandler Invoked Collection Action :list with params action=LIST&delegation=GgADYmFyA2JhcgCKAVj94TaWigFZIe26lgQCFK5CAXVNNYTMmJy3vAieKk84_C0qB3NvbHItZHQA&wt=javabin&version=2 and sendToOCPQueue=true
   [junit4]   2> 88973 INFO  (qtp140566223-1036) [n:127.0.0.1:54425_solr    ] o.a.s.s.HttpSolrCall [admin] webapp=null path=/admin/collections params={action=LIST&delegation=GgADYmFyA2JhcgCKAVj94TaWigFZIe26lgQCFK5CAXVNNYTMmJy3vAieKk84_C0qB3NvbHItZHQA&wt=javabin&version=2} status=0 QTime=0
   [junit4]   2> 88978 INFO  (TEST-TestSolrCloudWithDelegationTokens.testDelegationTokenRenew-seed#[D059C6A258985E37]) [    ] o.a.s.c.c.ZkStateReader Updated live nodes from ZooKeeper... (0) -> (2)
   [junit4]   2> 88980 INFO  (TEST-TestSolrCloudWithDelegationTokens.testDelegationTokenRenew-seed#[D059C6A258985E37]) [    ] o.a.s.c.s.i.ZkClientClusterStateProvider Cluster at 127.0.0.1:54421/solr ready
   [junit4]   2> 88982 WARN  (TEST-TestSolrCloudWithDelegationTokens.testDelegationTokenRenew-seed#[D059C6A258985E37]) [    ] o.a.h.c.p.ResponseProcessCookies Invalid cookie header: "Set-Cookie: hadoop.auth=; Path=/; Domain=127.0.0.1; Expires= et, 01-jan-1970 00:00:00 GMT; HttpOnly". Invalid 'expires' attribute: et, 01-jan-1970 00:00:00 GMT
   [junit4]   2> 88997 INFO  (TEST-TestSolrCloudWithDelegationTokens.testDelegationTokenRenew-seed#[D059C6A258985E37]) [    ] o.a.s.c.c.ZkStateReader Updated live nodes from ZooKeeper... (0) -> (2)
   [junit4]   2> 88999 INFO  (TEST-TestSolrCloudWithDelegationTokens.testDelegationTokenRenew-seed#[D059C6A258985E37]) [    ] o.a.s.c.s.i.ZkClientClusterStateProvider Cluster at 127.0.0.1:54421/solr ready
   [junit4]   2> 89001 INFO  (qtp1499289447-1053) [n:127.0.0.1:54428_solr    ] o.a.s.h.a.CollectionsHandler Invoked Collection Action :list with params action=LIST&delegation=GgADYmFyA2JhcgCKAVj94TbEigFZIe26xAUCFENjSDDPUcXAWU61FBQdWN_73Ri3B3NvbHItZHQA&wt=javabin&version=2 and sendToOCPQueue=true
   [junit4]   2> 89001 INFO  (qtp1499289447-1053) [n:127.0.0.1:54428_solr    ] o.a.s.s.HttpSolrCall [admin] webapp=null path=/admin/collections params={action=LIST&delegation=GgADYmFyA2JhcgCKAVj94TbEigFZIe26xAUCFENjSDDPUcXAWU61FBQdWN_73Ri3B3NvbHItZHQA&wt=javabin&version=2} status=0 QTime=0
   [junit4]   2> 89002 WARN  (NIOServerCxn.Factory:0.0.0.0/0.0.0.0:0) [    ] o.a.z.s.NIOServerCnxn caught end of stream exception
   [junit4]   2> EndOfStreamException: Unable to read additional data from client sessionid 0x158fde12a4a0011, likely client has closed socket
   [junit4]   2> 	at org.apache.zookeeper.server.NIOServerCnxn.doIO(NIOServerCnxn.java:228)
   [junit4]   2> 	at org.apache.zookeeper.server.NIOServerCnxnFactory.run(NIOServerCnxnFactory.java:208)
   [junit4]   2> 	at java.lang.Thread.run(Thread.java:745)
   [junit4]   2> 89007 WARN  (TEST-TestSolrCloudWithDelegationTokens.testDelegationTokenRenew-seed#[D059C6A258985E37]) [    ] o.a.h.c.p.ResponseProcessCookies Invalid cookie header: "Set-Cookie: hadoop.auth=; Path=/; Domain=127.0.0.1; Expires= et, 01-jan-1970 00:00:00 GMT; HttpOnly". Invalid 'expires' attribute: et, 01-jan-1970 00:00:00 GMT
   [junit4]   2> 89009 INFO  (qtp140566223-1037) [n:127.0.0.1:54425_solr    ] o.a.s.h.a.CollectionsHandler Invoked Collection Action :list with params action=LIST&delegation=GgADYmFyA2JhcgCKAVj94TbEigFZIe26xAUCFENjSDDPUcXAWU61FBQdWN_73Ri3B3NvbHItZHQA&wt=javabin&version=2 and sendToOCPQueue=true
   [junit4]   2> 89009 INFO  (qtp140566223-1037) [n:127.0.0.1:54425_solr    ] o.a.s.s.HttpSolrCall [admin] webapp=null path=/admin/collections params={action=LIST&delegation=GgADYmFyA2JhcgCKAVj94TbEigFZIe26xAUCFENjSDDPUcXAWU61FBQdWN_73Ri3B3NvbHItZHQA&wt=javabin&version=2} status=0 QTime=0
   [junit4]   2> 89012 WARN  (TEST-TestSolrCloudWithDelegationTokens.testDelegationTokenRenew-seed#[D059C6A258985E37]) [    ] o.a.h.c.p.ResponseProcessCookies Invalid cookie header: "Set-Cookie: hadoop.auth=; Path=/; Domain=127.0.0.1; Expires= et, 01-jan-1970 00:00:00 GMT; HttpOnly". Invalid 'expires' attribute: et, 01-jan-1970 00:00:00 GMT
   [junit4]   2> 89027 INFO  (qtp1499289447-1046) [n:127.0.0.1:54428_solr    ] o.a.s.h.a.CollectionsHandler Invoked Collection Action :list with params action=LIST&delegation=GgADYmFyA2JhcgCKAVj94TbgigFZIe264AYCFLDOD_wgf6Iuk3XZZAIDq68sssAxB3NvbHItZHQA&wt=javabin&version=2 and sendToOCPQueue=true
   [junit4]   2> 89027 INFO  (qtp1499289447-1046) [n:127.0.0.1:54428_solr    ] o.a.s.s.HttpSolrCall [admin] webapp=null path=/admin/collections params={action=LIST&delegation=GgADYmFyA2JhcgCKAVj94TbgigFZIe264AYCFLDOD_wgf6Iuk3XZZAIDq68sssAxB3NvbHItZHQA&wt=javabin&version=2} status=0 QTime=0
   [junit4]   2> 89030 WARN  (TEST-TestSolrCloudWithDelegationTokens.testDelegationTokenRenew-seed#[D059C6A258985E37]) [    ] o.a.h.c.p.ResponseProcessCookies Invalid cookie header: "Set-Cookie: hadoop.auth=; Path=/; Domain=127.0.0.1; Expires= et, 01-jan-1970 00:00:00 GMT; HttpOnly". Invalid 'expires' attribute: et, 01-jan-1970 00:00:00 GMT
   [junit4]   2> 89036 INFO  (TEST-TestSolrCloudWithDelegationTokens.testDelegationTokenRenew-seed#[D059C6A258985E37]) [    ] o.a.s.c.c.ZkStateReader Updated live nodes from ZooKeeper... (0) -> (2)
   [junit4]   2> 89037 INFO  (TEST-TestSolrCloudWithDelegationTokens.testDelegationTokenRenew-seed#[D059C6A258985E37]) [    ] o.a.s.c.s.i.ZkClientClusterStateProvider Cluster at 127.0.0.1:54421/solr ready
   [junit4]   2> 89039 INFO  (qtp1499289447-1046) [n:127.0.0.1:54428_solr    ] o.a.s.h.a.CollectionsHandler Invoked Collection Action :list with params action=LIST&delegation=GgADYmFyA2JhcgCKAVj94TbgigFZIe264AYCFLDOD_wgf6Iuk3XZZAIDq68sssAxB3NvbHItZHQA&wt=javabin&version=2 and sendToOCPQueue=true
   [junit4]   2> 89039 INFO  (qtp1499289447-1046) [n:127.0.0.1:54428_solr    ] o.a.s.s.HttpSolrCall [admin] webapp=null path=/admin/collections params={action=LIST&delegation=GgADYmFyA2JhcgCKAVj94TbgigFZIe264AYCFLDOD_wgf6Iuk3XZZAIDq68sssAxB3NvbHItZHQA&wt=javabin&version=2} status=0 QTime=0
   [junit4]   2> 89040 WARN  (NIOServerCxn.Factory:0.0.0.0/0.0.0.0:0) [    ] o.a.z.s.NIOServerCnxn caught end of stream exception
   [junit4]   2> EndOfStreamException: Unable to read additional data from client sessionid 0x158fde12a4a0012, likely client has closed socket
   [junit4]   2> 	at org.apache.zookeeper.server.NIOServerCnxn.doIO(NIOServerCnxn.java:228)
   [junit4]   2> 	at org.apache.zookeeper.server.NIOServerCnxnFactory.run(NIOServerCnxnFactory.java:208)
   [junit4]   2> 	at java.lang.Thread.run(Thread.java:745)
   [junit4]   2> 89045 INFO  (TEST-TestSolrCloudWithDelegationTokens.testDelegationTokenRenew-seed#[D059C6A258985E37]) [    ] o.a.s.c.c.ZkStateReader Updated live nodes from ZooKeeper... (0) -> (2)
   [junit4]   2> 89046 INFO  (TEST-TestSolrCloudWithDelegationTokens.testDelegationTokenRenew-seed#[D059C6A258985E37]) [    ] o.a.s.c.s.i.ZkClientClusterStateProvider Cluster at 127.0.0.1:54421/solr ready
   [junit4]   2> 89050 WARN  (TEST-TestSolrCloudWithDelegationTokens.testDelegationTokenRenew-seed#[D059C6A258985E37]) [    ] o.a.h.c.p.ResponseProcessCookies Invalid cookie header: "Set-Cookie: hadoop.auth=; Path=/; Domain=127.0.0.1; Expires= et, 01-jan-1970 00:00:00 GMT; HttpOnly". Invalid 'expires' attribute: et, 01-jan-1970 00:00:00 GMT
   [junit4]   2> 89051 WARN  (NIOServerCxn.Factory:0.0.0.0/0.0.0.0:0) [    ] o.a.z.s.NIOServerCnxn caught end of stream exception
   [junit4]   2> EndOfStreamException: Unable to read additional data from client sessionid 0x158fde12a4a0013, likely client has closed socket
   [junit4]   2> 	at org.apache.zookeeper.server.NIOServerCnxn.doIO(NIOServerCnxn.java:228)
   [junit4]   2> 	at org.apache.zookeeper.server.NIOServerCnxnFactory.run(NIOServerCnxnFactory.java:208)
   [junit4]   2> 	at java.lang.Thread.run(Thread.java:745)
   [junit4]   2> 89051 INFO  (TEST-TestSolrCloudWithDelegationTokens.testDelegationTokenRenew-seed#[D059C6A258985E37]) [    ] o.a.s.SolrTestCaseJ4 ###Ending testDelegationTokenRenew
   [junit4]   2> 89070 INFO  (TEST-TestSolrCloudWithDelegationTokens.testDelegationTokenSolrClient-seed#[D059C6A258985E37]) [    ] o.a.s.SolrTestCaseJ4 ###Starting testDelegationTokenSolrClient
   [junit4]   2> 89078 WARN  (TEST-TestSolrCloudWithDelegationTokens.testDelegationTokenSolrClient-seed#[D059C6A258985E37]) [    ] o.a.h.c.p.ResponseProcessCookies Invalid cookie header: "Set-Cookie: hadoop.auth=; Path=/; Domain=127.0.0.1; Expires= et, 01-jan-1970 00:00:00 GMT; HttpOnly". Invalid 'expires' attribute: et, 01-jan-1970 00:00:00 GMT
   [junit4]   2> 89082 INFO  (qtp1499289447-1050) [n:127.0.0.1:54428_solr    ] o.a.s.h.a.CollectionsHandler Invoked Collection Action :list with params action=LIST&delegation=GgADYmFyA2JhcgCKAVj94TcaigFZIe27GgcCFGcmw-FlhzN_ODHzREkVaLVLZmRWB3NvbHItZHQA&wt=javabin&version=2 and sendToOCPQueue=true
   [junit4]   2> 89082 INFO  (qtp1499289447-1050) [n:127.0.0.1:54428_solr    ] o.a.s.s.HttpSolrCall [admin] webapp=null path=/admin/collections params={action=LIST&delegation=GgADYmFyA2JhcgCKAVj94TcaigFZIe27GgcCFGcmw-FlhzN_ODHzREkVaLVLZmRWB3NvbHItZHQA&wt=javabin&version=2} status=0 QTime=0
   [junit4]   2> 89083 INFO  (TEST-TestSolrCloudWithDelegationTokens.testDelegationTokenSolrClient-seed#[D059C6A258985E37]) [    ] o.a.s.SolrTestCaseJ4 ###Ending testDelegationTokenSolrClient
   [junit4]   2> 89104 INFO  (TEST-TestSolrCloudWithDelegationTokens.testDelegationTokenCancelFail-seed#[D059C6A258985E37]) [    ] o.a.s.SolrTestCaseJ4 ###Starting testDelegationTokenCancelFail
   [junit4]   2> 89120 INFO  (TEST-TestSolrCloudWithDelegationTokens.testDelegationTokenCancelFail-seed#[D059C6A258985E37]) [    ] o.a.s.SolrTestCaseJ4 ###Ending testDelegationTokenCancelFail
   [junit4]   2> NOTE: reproduce with: ant test  -Dtestcase=TestSolrCloudWithDelegationTokens -Dtests.method=testDelegationTokenCancelFail -Dtests.seed=D059C6A258985E37 -Dtests.slow=true -Dtests.locale=sr-Latn-BA -Dtests.timezone=Australia/Brisbane -Dtests.asserts=true -Dtests.file.encoding=UTF-8
   [junit4] FAILURE 0.05s J0 | TestSolrCloudWithDelegationTokens.testDelegationTokenCancelFail <<<
   [junit4]    > Throwable #1: java.lang.AssertionError: expected:<200> but was:<404>
   [junit4]    > 	at __randomizedtesting.SeedInfo.seed([D059C6A258985E37:B8E6F38888024CDB]:0)
   [junit4]    > 	at org.apache.solr.cloud.TestSolrCloudWithDelegationTokens.cancelDelegationToken(TestSolrCloudWithDelegationTokens.java:141)
   [junit4]    > 	at org.apache.solr.cloud.TestSolrCloudWithDelegationTokens.testDelegationTokenCancelFail(TestSolrCloudWithDelegationTokens.java:295)
   [junit4]    > 	at java.lang.Thread.run(Thread.java:745)
   [junit4]   2> 89144 INFO  (TEST-TestSolrCloudWithDelegationTokens.testDelegationOtherOp-seed#[D059C6A258985E37]) [    ] o.a.s.SolrTestCaseJ4 ###Starting testDelegationOtherOp
   [junit4]   2> 89163 INFO  (TEST-TestSolrCloudWithDelegationTokens.testDelegationOtherOp-seed#[D059C6A258985E37]) [    ] o.a.s.c.c.ZkStateReader Updated live nodes from ZooKeeper... (0) -> (2)
   [junit4]   2> 89165 INFO  (TEST-TestSolrCloudWithDelegationTokens.testDelegationOtherOp-seed#[D059C6A258985E37]) [    ] o.a.s.c.s.i.ZkClientClusterStateProvider Cluster at 127.0.0.1:54421/solr ready
   [junit4]   2> 89169 INFO  (qtp1499289447-1046) [n:127.0.0.1:54428_solr    ] o.a.s.h.a.CollectionsHandler Invoked Collection Action :list with params op=someSolrOperation&action=LIST&wt=javabin&version=2 and sendToOCPQueue=true
   [junit4]   2> 89169 INFO  (qtp1499289447-1046) [n:127.0.0.1:54428_solr    ] o.a.s.s.HttpSolrCall [admin] webapp=null path=/admin/collections params={op=someSolrOperation&action=LIST&wt=javabin&version=2} status=0 QTime=0
   [junit4]   2> 89169 WARN  (TEST-TestSolrCloudWithDelegationTokens.testDelegationOtherOp-seed#[D059C6A258985E37]) [    ] o.a.h.c.p.ResponseProcessCookies Invalid cookie header: "Set-Cookie: hadoop.auth="u=bar&p=bar&t=test&e=1481764145275&s=zR5Wcf1uszw3v3R6kAwfBw6t71U="; Path=/; Domain=127.0.0.1; Expires= et, 15-dec-2016 01:09:05 GMT; HttpOnly". Invalid 'expires' attribute: et, 15-dec-2016 01:09:05 GMT
   [junit4]   2> 89170 WARN  (NIOServerCxn.Factory:0.0.0.0/0.0.0.0:0) [    ] o.a.z.s.NIOServerCnxn caught end of stream exception
   [junit4]   2> EndOfStreamException: Unable to read additional data from client sessionid 0x158fde12a4a0014, likely client has closed socket
   [junit4]   2> 	at org.apache.zookeeper.server.NIOServerCnxn.doIO(NIOServerCnxn.java:228)
   [junit4]   2> 	at org.apache.zookeeper.server.NIOServerCnxnFactory.run(NIOServerCnxnFactory.java:208)
   [junit4]   2> 	at java.lang.Thread.run(Thread.java:745)
   [junit4]   2> 89171 INFO  (TEST-TestSolrCloudWithDelegationTokens.testDelegationOtherOp-seed#[D059C6A258985E37]) [    ] o.a.s.SolrTestCaseJ4 ###Ending testDelegationOtherOp
   [junit4]   2> 89191 INFO  (TEST-TestSolrCloudWithDelegationTokens.testDelegationTokenRenewFail-seed#[D059C6A258985E37]) [    ] o.a.s.SolrTestCaseJ4 ###Starting testDelegationTokenRenewFail
   [junit4]   2> 89208 WARN  (qtp1499289447-1051) [    ] o.a.h.s.a.s.AuthenticationFilter Authentication exception: org.apache.hadoop.security.AccessControlException: foo tries to renew a token with renewer bar
   [junit4]   2> 89211 WARN  (qtp1499289447-1051) [    ] o.a.s.s.KerberosPlugin Could not find org.apache.solr.security.kerberosplugin.requestcontinues
   [junit4]   2> 89213 WARN  (TEST-TestSolrCloudWithDelegationTokens.testDelegationTokenRenewFail-seed#[D059C6A258985E37]) [    ] o.a.h.c.p.ResponseProcessCookies Invalid cookie header: "Set-Cookie: hadoop.auth=; Path=/; Domain=127.0.0.1; Expires= et, 01-jan-1970 00:00:00 GMT; HttpOnly". Invalid 'expires' attribute: et, 01-jan-1970 00:00:00 GMT
   [junit4]   2> 89216 WARN  (qtp140566223-1038) [n:127.0.0.1:54425_solr    ] o.a.h.s.a.s.AuthenticationFilter Authentication exception: org.apache.hadoop.security.AccessControlException: foo tries to renew a token with renewer bar
   [junit4]   2> 89217 WARN  (qtp140566223-1038) [n:127.0.0.1:54425_solr    ] o.a.s.s.KerberosPlugin Could not find org.apache.solr.security.kerberosplugin.requestcontinues
   [junit4]   2> 89217 WARN  (TEST-TestSolrCloudWithDelegationTokens.testDelegationTokenRenewFail-seed#[D059C6A258985E37]) [    ] o.a.h.c.p.ResponseProcessCookies Invalid cookie header: "Set-Cookie: hadoop.auth=; Path=/; Domain=127.0.0.1; Expires= et, 01-jan-1970 00:00:00 GMT; HttpOnly". Invalid 'expires' attribute: et, 01-jan-1970 00:00:00 GMT
   [junit4]   2> 89225 WARN  (qtp1499289447-1047) [    ] o.a.h.s.a.s.AuthenticationFilter Authentication exception: org.apache.hadoop.security.AccessControlException: notRenewUser tries to renew a token with renewer renewUser
   [junit4]   2> 89225 WARN  (qtp1499289447-1047) [    ] o.a.s.s.KerberosPlugin Could not find org.apache.solr.security.kerberosplugin.requestcontinues
   [junit4]   2> 89227 WARN  (TEST-TestSolrCloudWithDelegationTokens.testDelegationTokenRenewFail-seed#[D059C6A258985E37]) [    ] o.a.h.c.p.ResponseProcessCookies Invalid cookie header: "Set-Cookie: hadoop.auth=; Path=/; Domain=127.0.0.1; Expires= et, 01-jan-1970 00:00:00 GMT; HttpOnly". Invalid 'expires' attribute: et, 01-jan-1970 00:00:00 GMT
   [junit4]   2> 89228 WARN  (qtp140566223-1038) [n:127.0.0.1:54425_solr    ] o.a.h.s.a.s.AuthenticationFilter Authentication exception: org.apache.hadoop.security.AccessControlException: notRenewUser tries to renew a token with renewer renewUser
   [junit4]   2> 89228 WARN  (qtp140566223-1038) [n:127.0.0.1:54425_solr    ] o.a.s.s.KerberosPlugin Could not find org.apache.solr.security.kerberosplugin.requestcontinues
   [junit4]   2> 89229 WARN  (TEST-TestSolrCloudWithDelegationTokens.testDelegationTokenRenewFail-seed#[D059C6A258985E37]) [    ] o.a.h.c.p.ResponseProcessCookies Invalid cookie header: "Set-Cookie: hadoop.auth=; Path=/; Domain=127.0.0.1; Expires= et, 01-jan-1970 00:00:00 GMT; HttpOnly". Invalid 'expires' attribute: et, 01-jan-1970 00:00:00 GMT
   [junit4]   2> 89229 INFO  (TEST-TestSolrCloudWithDelegationTokens.testDelegationTokenRenewFail-seed#[D059C6A258985E37]) [    ] o.a.s.SolrTestCaseJ4 ###Ending testDelegationTokenRenewFail
   [junit4]   2> 89250 INFO  (TEST-TestSolrCloudWithDelegationTokens.testZNodePaths-seed#[D059C6A258985E37]) [    ] o.a.s.SolrTestCaseJ4 ###Starting testZNodePaths
   [junit4]   2> 89277 WARN  (NIOServerCxn.Factory:0.0.0.0/0.0.0.0:0) [    ] o.a.z.s.NIOServerCnxn caught end of stream exception
   [junit4]   2> EndOfStreamException: Unable to read additional data from client sessionid 0x158fde12a4a0015, likely client has closed socket
   [junit4]   2> 	at org.apache.zookeeper.server.NIOServerCnxn.doIO(NIOServerCnxn.java:228)
   [junit4]   2> 	at org.apache.zookeeper.server.NIOServerCnxnFactory.run(NIOServerCnxnFactory.java:208)
   [junit4]   2> 	at java.lang.Thread.run(Thread.java:745)
   [junit4]   2> 89278 INFO  (TEST-TestSolrCloudWithDelegationTokens.testZNodePaths-seed#[D059C6A258985E37]) [    ] o.a.s.SolrTestCaseJ4 ###Ending testZNodePaths
   [junit4]   2> 89297 INFO  (TEST-TestSolrCloudWithDelegationTokens.testDelegationTokenVerify-seed#[D059C6A258985E37]) [    ] o.a.s.SolrTestCaseJ4 ###Starting testDelegationTokenVerify
   [junit4]   2> 89319 INFO  (TEST-TestSolrCloudWithDelegationTokens.testDelegationTokenVerify-seed#[D059C6A258985E37]) [    ] o.a.s.c.c.ZkStateReader Updated live nodes from ZooKeeper... (0) -> (2)
   [junit4]   2> 89320 INFO  (TEST-TestSolrCloudWithDelegationTokens.testDelegationTokenVerify-seed#[D059C6A258985E37]) [    ] o.a.s.c.s.i.ZkClientClusterStateProvider Cluster at 127.0.0.1:54421/solr ready
   [junit4]   2> 89325 INFO  (qtp1499289447-1050) [n:127.0.0.1:54428_solr    ] o.a.s.h.a.CollectionsHandler Invoked Collection Action :list with params action=LIST&delegation=GgADYmFyA2JhcgCKAVj94Tf-igFZIe27_gwCFL1GCW2Sh-yZfvwlEnUOgBUdLQm_B3NvbHItZHQA&wt=javabin&version=2 and sendToOCPQueue=true
   [junit4]   2> 89325 INFO  (qtp1499289447-1050) [n:127.0.0.1:54428_solr    ] o.a.s.s.HttpSolrCall [admin] webapp=null path=/admin/collections params={action=LIST&delegation=GgADYmFyA2JhcgCKAVj94Tf-igFZIe27_gwCFL1GCW2Sh-yZfvwlEnUOgBUdLQm_B3NvbHItZHQA&wt=javabin&version=2} status=0 QTime=0
   [junit4]   2> 89328 WARN  (NIOServerCxn.Factory:0.0.0.0/0.0.0.0:0) [    ] o.a.z.s.NIOServerCnxn caught end of stream exception
   [junit4]   2> EndOfStreamException: Unable to read additional data from client sessionid 0x158fde12a4a0016, likely client has closed socket
   [junit4]   2> 	at org.apache.zookeeper.server.NIOServerCnxn.doIO(NIOServerCnxn.java:228)
   [junit4]   2> 	at org.apache.zookeeper.server.NIOServerCnxnFactory.run(NIOServerCnxnFactory.java:208)
   [junit4]   2> 	at java.lang.Thread.run(Thread.java:745)
   [junit4]   2> 89335 WARN  (TEST-TestSolrCloudWithDelegationTokens.testDelegationTokenVerify-seed#[D059C6A258985E37]) [    ] o.a.h.c.p.ResponseProcessCookies Invalid cookie header: "Set-Cookie: hadoop.auth=; Path=/; Domain=127.0.0.1; Expires= et, 01-jan-1970 00:00:00 GMT; HttpOnly". Invalid 'expires' attribute: et, 01-jan-1970 00:00:00 GMT
   [junit4]   2> 89342 INFO  (TEST-TestSolrCloudWithDelegationTokens.testDelegationTokenVerify-seed#[D059C6A258985E37]) [    ] o.a.s.c.c.ZkStateReader Updated live nodes from ZooKeeper... (0) -> (2)
   [junit4]   2> 89342 INFO  (TEST-TestSolrCloudWithDelegationTokens.testDelegationTokenVerify-seed#[D059C6A258985E37]) [    ] o.a.s.c.s.i.ZkClientClusterStateProvider Cluster at 127.0.0.1:54421/solr ready
   [junit4]   2> 89346 INFO  (qtp1499289447-1051) [n:127.0.0.1:54428_solr    ] o.a.s.h.a.CollectionsHandler Invoked Collection Action :list with params action=LIST&delegation=GgADYmFyA2JhcgCKAVj94Tf-igFZIe27_gwCFL1GCW2Sh-yZfvwlEnUOgBUdLQm_B3NvbHItZHQA&wt=javabin&version=2 and sendToOCPQueue=true
   [junit4]   2> 89346 INFO  (qtp1499289447-1051) [n:127.0.0.1:54428_solr    ] o.a.s.s.HttpSolrCall [admin] webapp=null path=/admin/collections params={action=LIST&delegation=GgADYmFyA2JhcgCKAVj94Tf-igFZIe27_gwCFL1GCW2Sh-yZfvwlEnUOgBUdLQm_B3NvbHItZHQA&wt=javabin&version=2} status=0 QTime=0
   [junit4]   2> 89347 WARN  (NIOServerCxn.Factory:0.0.0.0/0.0.0.0:0) [    ] o.a.z.s.NIOServerCnxn caught end of stream exception
   [junit4]   2> EndOfStreamException: Unable to read additional data from client sessionid 0x158fde12a4a0017, likely client has closed socket
   [junit4]   2> 	at org.apache.zookeeper.server.NIOServerCnxn.doIO(NIOServerCnxn.java:228)
   [junit4]   2> 	at org.apache.zookeeper.server.NIOServerCnxnFactory.run(NIOServerCnxnFactory.java:208)
   [junit4]   2> 	at java.lang.Thread.run(Thread.java:745)
   [junit4]   2> 89351 WARN  (TEST-TestSolrCloudWithDelegationTokens.testDelegationTokenVerify-seed#[D059C6A258985E37]) [    ] o.a.h.c.p.ResponseProcessCookies Invalid cookie header: "Set-Cookie: hadoop.auth=; Path=/; Domain=127.0.0.1; Expires= et, 01-jan-1970 00:00:00 GMT; HttpOnly". Invalid 'expires' attribute: et, 01-jan-1970 00:00:00 GMT
   [junit4]   2> 89352 INFO  (TEST-TestSolrCloudWithDelegationTokens.testDelegationTokenVerify-seed#[D059C6A258985E37]) [    ] o.a.s.SolrTestCaseJ4 ###Ending testDelegationTokenVerify
   [junit4]   2> 89358 INFO  (jetty-launcher-163-thread-2) [    ] o.e.j.s.AbstractConnector Stopped ServerConnector@149f7f61{HTTP/1.1,[http/1.1]}{127.0.0.1:0}
   [junit4]   2> 89361 INFO  (jetty-launcher-163-thread-2) [    ] o.a.s.c.CoreContainer Shutting down CoreContainer instance=766833308
   [junit4]   2> 89363 INFO  (jetty-launcher-163-thread-1) [    ] o.e.j.s.AbstractConnector Stopped ServerConnector@2e0622bf{HTTP/1.1,[http/1.1]}{127.0.0.1:0}
   [junit4]   2> 89364 INFO  (jetty-launcher-163-thread-1) [    ] o.a.s.c.CoreContainer Shutting down CoreContainer instance=1440360092
   [junit4]   2> 89374 INFO  (jetty-launcher-163-thread-1) [    ] o.a.s.c.Overseer Overseer (id=97106535507427333-127.0.0.1:54425_solr-n_0000000000) closing
   [junit4]   2> 89375 INFO  (OverseerStateUpdate-97106535507427333-127.0.0.1:54425_solr-n_0000000000) [n:127.0.0.1:54425_solr    ] o.a.s.c.Overseer Overseer Loop exiting : 127.0.0.1:54425_solr
   [junit4]   2> 89379 WARN  (zkCallback-174-thread-1-processing-n:127.0.0.1:54428_solr) [n:127.0.0.1:54428_solr    ] o.a.s.c.c.ZkStateReader ZooKeeper watch triggered, but Solr cannot talk to ZK: [KeeperErrorCode = Session expired for /live_nodes]
   [junit4]   2> 89379 INFO  (zkCallback-173-thread-4-processing-n:127.0.0.1:54425_solr) [n:127.0.0.1:54425_solr    ] o.a.s.c.c.ZkStateReader Updated live nodes from ZooKeeper... (2) -> (1)
   [junit4]   2> 89380 ERROR (Thread[Thread-258,5,TGRP-TestSolrCloudWithDelegationTokens]) [n:127.0.0.1:54428_solr    ] o.a.h.s.t.d.AbstractDelegationTokenSecretManager ExpiredTokenRemover received java.lang.InterruptedException: sleep interrupted
   [junit4]   2> 89383 WARN  (zkCallback-173-thread-1-processing-n:127.0.0.1:54425_solr) [n:127.0.0.1:54425_solr    ] o.a.s.c.c.ZkStateReader ZooKeeper watch triggered, but Solr cannot talk to ZK: [KeeperErrorCode = Session expired for /live_nodes]
   [junit4]   2> 89383 ERROR (Thread[Thread-261,5,TGRP-TestSolrCloudWithDelegationTokens]) [n:127.0.0.1:54425_solr    ] o.a.h.s.t.d.AbstractDelegationTokenSecretManager ExpiredTokenRemover received java.lang.InterruptedException: sleep interrupted
   [junit4]   2> 89417 WARN  (NIOServerCxn.Factory:0.0.0.0/0.0.0.0:0) [    ] o.a.z.s.NIOServerCnxn caught end of stream exception
   [junit4]   2> EndOfStreamException: Unable to read additional data from client sessionid 0x158fde12a4a0007, likely client has closed socket
   [junit4]   2> 	at org.apache.zookeeper.server.NIOServerCnxn.doIO(NIOServerCnxn.java:228)
   [junit4]   2> 	at org.apache.zookeeper.server.NIOServerCnxnFactory.run(NIOServerCnxnFactory.java:208)
   [junit4]   2> 	at java.lang.Thread.run(Thread.java:745)
   [junit4]   2> 89417 INFO  (jetty-launcher-163-thread-1) [    ] o.e.j.s.h.ContextHandler Stopped o.e.j.s.ServletContextHandler@78825262{/solr,null,UNAVAILABLE}
   [junit4]   2> 89418 INFO  (jetty-launcher-163-thread-2) [    ] o.e.j.s.h.ContextHandler Stopped o.e.j.s.ServletContextHandler@7d5b07f1{/solr,null,UNAVAILABLE}
   [junit4]   2> 89422 INFO  (SUITE-TestSolrCloudWithDelegationTokens-seed#[D059C6A258985E37]-worker) [    ] o.a.s.c.ZkTestServer connecting to 127.0.0.1:54421 54421
   [junit4]   2> 89423 INFO  (Thread-238) [    ] o.a.s.c.ZkTestServer connecting to 127.0.0.1:54421 54421
   [junit4]   2> 89426 WARN  (Thread-238) [    ] o.a.s.c.ZkTestServer Watch limit violations: 
   [junit4]   2> Maximum concurrent create/delete watches above limit:
   [junit4]   2> 
   [junit4]   2> 	15	/solr/aliases.json
   [junit4]   2> 	15	/solr/clusterprops.json
   [junit4]   2> 	2	/solr/security.json
   [junit4]   2> 
   [junit4]   2> Maximum concurrent data watches above limit:
   [junit4]   2> 
   [junit4]   2> 	15	/solr/clusterstate.json
   [junit4]   2> 	2	/solr/security/zkdtsm/ZKDTSMRoot/ZKDTSMTokensRoot/DT_7
   [junit4]   2> 	2	/solr/security/zkdtsm/ZKDTSMRoot/ZKDTSMTokensRoot/DT_6
   [junit4]   2> 	2	/solr/security/zkdtsm/ZKDTSMRoot/ZKDTSMTokensRoot/DT_9
   [junit4]   2> 	2	/solr/security/zkdtsm/ZKDTSMRoot/ZKDTSMTokensRoot/DT_8
   [junit4]   2> 	2	/solr/security/zkdtsm/ZKDTSMRoot/ZKDTSMKeyIdRoot
   [junit4]   2> 	2	/solr/security/zkdtsm/ZKDTSMRoot/ZKDTSMMasterKeyRoot/DK_1
   [junit4]   2> 	2	/solr/security/zkdtsm/ZKDTSMRoot/ZKDTSMTokensRoot/DT_1
   [junit4]   2> 	2	/solr/security/zkdtsm/ZKDTSMRoot/ZKDTSMMasterKeyRoot/DK_3
   [junit4]   2> 	2	/solr/security/zkdtsm/ZKDTSMRoot/ZKDTSMTokensRoot/DT_3
   [junit4]   2> 	2	/solr/security/zkdtsm/ZKDTSMRoot/ZKDTSMMasterKeyRoot/DK_2
   [junit4]   2> 	2	/solr/security/zkdtsm/ZKDTSMRoot/ZKDTSMTokensRoot/DT_2
   [junit4]   2> 	2	/solr/security/zkdtsm/ZKDTSMRoot/ZKDTSMTokensRoot/DT_5
   [junit4]   2> 	2	/solr/security/zkdtsm/ZKDTSMRoot/ZKDTSMMasterKeyRoot/DK_4
   [junit4]   2> 	2	/solr/security/zkdtsm/ZKDTSMRoot/ZKDTSMTokensRoot/DT_4
   [junit4]   2> 	2	/solr/security/zkdtsm/ZKDTSMRoot/ZKDTSMTokensRoot/DT_12
   [junit4]   2> 	2	/solr/security/zkdtsm/ZKDTSMRoot/ZKDTSMSeqNumRoot
   [junit4]   2> 	2	/solr/security/zkdtsm/ZKDTSMRoot/ZKDTSMTokensRoot/DT_11
   [junit4]   2> 	2	/solr/security/zkdtsm/ZKDTSMRoot/ZKDTSMTokensRoot/DT_10
   [junit4]   2> 
   [junit4]   2> Maximum concurrent children watches above limit:
   [junit4]   2> 
   [junit4]   2> 	15	/solr/live_nodes
   [junit4]   2> 	15	/solr/collections
   [junit4]   2> 	3	/solr/overseer/queue
   [junit4]   2> 	3	/solr/overseer/collection-queue-work
   [junit4]   2> 	2	/solr/security/zkdtsm/ZKDTSMRoot/ZKDTSMMasterKeyRoot
   [junit4]   2> 	2	/solr/overseer/queue-work
   [junit4]   2> 	2	/solr/security/zkdtsm/ZKDTSMRoot/ZKDTSMTokensRoot
   [junit4]   2> 
   [junit4]   2> 89427 INFO  (SUITE-TestSolrCloudWithDelegationTokens-seed#[D059C6A258985E37]-worker) [    ] o.a.s.SolrTestCaseJ4 ###deleteCore
   [junit4]   2> NOTE: leaving temporary files on disk at: C:\Users\jenkins\workspace\Lucene-Solr-6.x-Windows\solr\build\solr-core\test\J0\temp\solr.cloud.TestSolrCloudWithDelegationTokens_D059C6A258985E37-001
   [junit4]   2> Dec 14, 2016 3:09:05 PM com.carrotsearch.randomizedtesting.ThreadLeakControl checkThreadLeaks
   [junit4]   2> WARNING: Will linger awaiting termination of 6 leaked thread(s).
   [junit4]   2> NOTE: test params are: codec=Asserting(Lucene62): {}, docValues:{}, maxPointsInLeafNode=1056, maxMBSortInHeap=6.205901499366857, sim=RandomSimilarity(queryNorm=false,coord=no): {}, locale=sr-Latn-BA, timezone=Australia/Brisbane
   [junit4]   2> NOTE: Windows 10 10.0 amd64/Oracle Corporation 1.8.0_112 (64-bit)/cpus=3,threads=1,free=43192080,total=214958080
   [junit4]   2> NOTE: All tests run in this JVM: [TestCSVResponseWriter, TestTestInjection, ZkCLITest, AnalysisAfterCoreReloadTest, RequestLoggingTest, TestShardHandlerFactory, TestRestoreCore, DataDrivenBlockJoinTest, TestRTimerTree, SmileWriterTest, TestShortCircuitedRequests, TestFreeTextSuggestions, HighlighterMaxOffsetTest, MultiTermTest, TestSubQueryTransformerDistrib, TestAddFieldRealTimeGet, DistributedMLTComponentTest, TestSQLHandlerNonCloud, SuggesterFSTTest, TestSolrCloudWithDelegationTokens]
   [junit4] Completed [34/661 (1!)] on J0 in 4.17s, 8 tests, 1 failure <<< FAILURES!

[...truncated 64504 lines...]


Mime
View raw message