lucene-dev mailing list archives

Site index · List index
Message view « Date » · « Thread »
Top « Date » · « Thread »
From Policeman Jenkins Server <jenk...@thetaphi.de>
Subject [JENKINS] Lucene-Solr-master-Solaris (64bit/jdk1.8.0) - Build # 990 - Unstable!
Date Sun, 04 Dec 2016 16:17:59 GMT
Build: https://jenkins.thetaphi.de/job/Lucene-Solr-master-Solaris/990/
Java: 64bit/jdk1.8.0 -XX:-UseCompressedOops -XX:+UseConcMarkSweepGC

2 tests failed.
FAILED:  org.apache.solr.cloud.TestSolrCloudWithDelegationTokens.testDelegationTokenCancelFail

Error Message:
expected:<200> but was:<404>

Stack Trace:
java.lang.AssertionError: expected:<200> but was:<404>
	at __randomizedtesting.SeedInfo.seed([C3ED2B1DFB256FD6:AB521E372BBF7D3A]:0)
	at org.junit.Assert.fail(Assert.java:93)
	at org.junit.Assert.failNotEquals(Assert.java:647)
	at org.junit.Assert.assertEquals(Assert.java:128)
	at org.junit.Assert.assertEquals(Assert.java:472)
	at org.junit.Assert.assertEquals(Assert.java:456)
	at org.apache.solr.cloud.TestSolrCloudWithDelegationTokens.cancelDelegationToken(TestSolrCloudWithDelegationTokens.java:140)
	at org.apache.solr.cloud.TestSolrCloudWithDelegationTokens.testDelegationTokenCancelFail(TestSolrCloudWithDelegationTokens.java:294)
	at sun.reflect.NativeMethodAccessorImpl.invoke0(Native Method)
	at sun.reflect.NativeMethodAccessorImpl.invoke(NativeMethodAccessorImpl.java:62)
	at sun.reflect.DelegatingMethodAccessorImpl.invoke(DelegatingMethodAccessorImpl.java:43)
	at java.lang.reflect.Method.invoke(Method.java:498)
	at com.carrotsearch.randomizedtesting.RandomizedRunner.invoke(RandomizedRunner.java:1713)
	at com.carrotsearch.randomizedtesting.RandomizedRunner$8.evaluate(RandomizedRunner.java:907)
	at com.carrotsearch.randomizedtesting.RandomizedRunner$9.evaluate(RandomizedRunner.java:943)
	at com.carrotsearch.randomizedtesting.RandomizedRunner$10.evaluate(RandomizedRunner.java:957)
	at com.carrotsearch.randomizedtesting.rules.SystemPropertiesRestoreRule$1.evaluate(SystemPropertiesRestoreRule.java:57)
	at org.apache.lucene.util.TestRuleSetupTeardownChained$1.evaluate(TestRuleSetupTeardownChained.java:49)
	at org.apache.lucene.util.AbstractBeforeAfterRule$1.evaluate(AbstractBeforeAfterRule.java:45)
	at org.apache.lucene.util.TestRuleThreadAndTestName$1.evaluate(TestRuleThreadAndTestName.java:48)
	at org.apache.lucene.util.TestRuleIgnoreAfterMaxFailures$1.evaluate(TestRuleIgnoreAfterMaxFailures.java:64)
	at org.apache.lucene.util.TestRuleMarkFailure$1.evaluate(TestRuleMarkFailure.java:47)
	at com.carrotsearch.randomizedtesting.rules.StatementAdapter.evaluate(StatementAdapter.java:36)
	at com.carrotsearch.randomizedtesting.ThreadLeakControl$StatementRunner.run(ThreadLeakControl.java:367)
	at com.carrotsearch.randomizedtesting.ThreadLeakControl.forkTimeoutingTask(ThreadLeakControl.java:811)
	at com.carrotsearch.randomizedtesting.ThreadLeakControl$3.evaluate(ThreadLeakControl.java:462)
	at com.carrotsearch.randomizedtesting.RandomizedRunner.runSingleTest(RandomizedRunner.java:916)
	at com.carrotsearch.randomizedtesting.RandomizedRunner$5.evaluate(RandomizedRunner.java:802)
	at com.carrotsearch.randomizedtesting.RandomizedRunner$6.evaluate(RandomizedRunner.java:852)
	at com.carrotsearch.randomizedtesting.RandomizedRunner$7.evaluate(RandomizedRunner.java:863)
	at com.carrotsearch.randomizedtesting.rules.StatementAdapter.evaluate(StatementAdapter.java:36)
	at com.carrotsearch.randomizedtesting.rules.SystemPropertiesRestoreRule$1.evaluate(SystemPropertiesRestoreRule.java:57)
	at org.apache.lucene.util.AbstractBeforeAfterRule$1.evaluate(AbstractBeforeAfterRule.java:45)
	at com.carrotsearch.randomizedtesting.rules.StatementAdapter.evaluate(StatementAdapter.java:36)
	at org.apache.lucene.util.TestRuleStoreClassName$1.evaluate(TestRuleStoreClassName.java:41)
	at com.carrotsearch.randomizedtesting.rules.NoShadowingOrOverridesOnMethodsRule$1.evaluate(NoShadowingOrOverridesOnMethodsRule.java:40)
	at com.carrotsearch.randomizedtesting.rules.NoShadowingOrOverridesOnMethodsRule$1.evaluate(NoShadowingOrOverridesOnMethodsRule.java:40)
	at com.carrotsearch.randomizedtesting.rules.StatementAdapter.evaluate(StatementAdapter.java:36)
	at com.carrotsearch.randomizedtesting.rules.StatementAdapter.evaluate(StatementAdapter.java:36)
	at com.carrotsearch.randomizedtesting.rules.StatementAdapter.evaluate(StatementAdapter.java:36)
	at org.apache.lucene.util.TestRuleAssertionsRequired$1.evaluate(TestRuleAssertionsRequired.java:53)
	at org.apache.lucene.util.TestRuleMarkFailure$1.evaluate(TestRuleMarkFailure.java:47)
	at org.apache.lucene.util.TestRuleIgnoreAfterMaxFailures$1.evaluate(TestRuleIgnoreAfterMaxFailures.java:64)
	at org.apache.lucene.util.TestRuleIgnoreTestSuites$1.evaluate(TestRuleIgnoreTestSuites.java:54)
	at com.carrotsearch.randomizedtesting.rules.StatementAdapter.evaluate(StatementAdapter.java:36)
	at com.carrotsearch.randomizedtesting.ThreadLeakControl$StatementRunner.run(ThreadLeakControl.java:367)
	at java.lang.Thread.run(Thread.java:745)


FAILED:  org.apache.solr.core.TestCustomStream.testDynamicLoadingCustomStream

Error Message:
java.util.concurrent.TimeoutException: Could not connect to ZooKeeper 127.0.0.1:42384/solr within 10000 ms

Stack Trace:
org.apache.solr.common.SolrException: java.util.concurrent.TimeoutException: Could not connect to ZooKeeper 127.0.0.1:42384/solr within 10000 ms
	at __randomizedtesting.SeedInfo.seed([C3ED2B1DFB256FD6:B358223F01DF2461]:0)
	at org.apache.solr.common.cloud.SolrZkClient.<init>(SolrZkClient.java:182)
	at org.apache.solr.common.cloud.SolrZkClient.<init>(SolrZkClient.java:116)
	at org.apache.solr.common.cloud.SolrZkClient.<init>(SolrZkClient.java:106)
	at org.apache.solr.common.cloud.ZkStateReader.<init>(ZkStateReader.java:226)
	at org.apache.solr.client.solrj.impl.ZkClientClusterStateProvider.connect(ZkClientClusterStateProvider.java:121)
	at org.apache.solr.client.solrj.impl.CloudSolrClient.connect(CloudSolrClient.java:610)
	at org.apache.solr.cloud.AbstractFullDistribZkTestBase.initCloud(AbstractFullDistribZkTestBase.java:268)
	at org.apache.solr.cloud.AbstractFullDistribZkTestBase.createServers(AbstractFullDistribZkTestBase.java:330)
	at org.apache.solr.BaseDistributedSearchTestCase$ShardsRepeatRule$ShardsFixedStatement.callStatement(BaseDistributedSearchTestCase.java:983)
	at org.apache.solr.BaseDistributedSearchTestCase$ShardsRepeatRule$ShardsStatement.evaluate(BaseDistributedSearchTestCase.java:960)
	at com.carrotsearch.randomizedtesting.rules.SystemPropertiesRestoreRule$1.evaluate(SystemPropertiesRestoreRule.java:57)
	at org.apache.lucene.util.TestRuleSetupTeardownChained$1.evaluate(TestRuleSetupTeardownChained.java:49)
	at org.apache.lucene.util.AbstractBeforeAfterRule$1.evaluate(AbstractBeforeAfterRule.java:45)
	at org.apache.lucene.util.TestRuleThreadAndTestName$1.evaluate(TestRuleThreadAndTestName.java:48)
	at org.apache.lucene.util.TestRuleIgnoreAfterMaxFailures$1.evaluate(TestRuleIgnoreAfterMaxFailures.java:64)
	at org.apache.lucene.util.TestRuleMarkFailure$1.evaluate(TestRuleMarkFailure.java:47)
	at com.carrotsearch.randomizedtesting.rules.StatementAdapter.evaluate(StatementAdapter.java:36)
	at com.carrotsearch.randomizedtesting.ThreadLeakControl$StatementRunner.run(ThreadLeakControl.java:367)
	at com.carrotsearch.randomizedtesting.ThreadLeakControl.forkTimeoutingTask(ThreadLeakControl.java:811)
	at com.carrotsearch.randomizedtesting.ThreadLeakControl$3.evaluate(ThreadLeakControl.java:462)
	at com.carrotsearch.randomizedtesting.RandomizedRunner.runSingleTest(RandomizedRunner.java:916)
	at com.carrotsearch.randomizedtesting.RandomizedRunner$5.evaluate(RandomizedRunner.java:802)
	at com.carrotsearch.randomizedtesting.RandomizedRunner$6.evaluate(RandomizedRunner.java:852)
	at com.carrotsearch.randomizedtesting.RandomizedRunner$7.evaluate(RandomizedRunner.java:863)
	at com.carrotsearch.randomizedtesting.rules.StatementAdapter.evaluate(StatementAdapter.java:36)
	at com.carrotsearch.randomizedtesting.rules.SystemPropertiesRestoreRule$1.evaluate(SystemPropertiesRestoreRule.java:57)
	at org.apache.lucene.util.AbstractBeforeAfterRule$1.evaluate(AbstractBeforeAfterRule.java:45)
	at com.carrotsearch.randomizedtesting.rules.StatementAdapter.evaluate(StatementAdapter.java:36)
	at org.apache.lucene.util.TestRuleStoreClassName$1.evaluate(TestRuleStoreClassName.java:41)
	at com.carrotsearch.randomizedtesting.rules.NoShadowingOrOverridesOnMethodsRule$1.evaluate(NoShadowingOrOverridesOnMethodsRule.java:40)
	at com.carrotsearch.randomizedtesting.rules.NoShadowingOrOverridesOnMethodsRule$1.evaluate(NoShadowingOrOverridesOnMethodsRule.java:40)
	at com.carrotsearch.randomizedtesting.rules.StatementAdapter.evaluate(StatementAdapter.java:36)
	at com.carrotsearch.randomizedtesting.rules.StatementAdapter.evaluate(StatementAdapter.java:36)
	at com.carrotsearch.randomizedtesting.rules.StatementAdapter.evaluate(StatementAdapter.java:36)
	at org.apache.lucene.util.TestRuleAssertionsRequired$1.evaluate(TestRuleAssertionsRequired.java:53)
	at org.apache.lucene.util.TestRuleMarkFailure$1.evaluate(TestRuleMarkFailure.java:47)
	at org.apache.lucene.util.TestRuleIgnoreAfterMaxFailures$1.evaluate(TestRuleIgnoreAfterMaxFailures.java:64)
	at org.apache.lucene.util.TestRuleIgnoreTestSuites$1.evaluate(TestRuleIgnoreTestSuites.java:54)
	at com.carrotsearch.randomizedtesting.rules.StatementAdapter.evaluate(StatementAdapter.java:36)
	at com.carrotsearch.randomizedtesting.ThreadLeakControl$StatementRunner.run(ThreadLeakControl.java:367)
	at java.lang.Thread.run(Thread.java:745)
Caused by: java.util.concurrent.TimeoutException: Could not connect to ZooKeeper 127.0.0.1:42384/solr within 10000 ms
	at org.apache.solr.common.cloud.ConnectionManager.waitForConnected(ConnectionManager.java:233)
	at org.apache.solr.common.cloud.SolrZkClient.<init>(SolrZkClient.java:174)
	... 40 more




Build Log:
[...truncated 11320 lines...]
   [junit4] Suite: org.apache.solr.core.TestCustomStream
   [junit4]   2> Creating dataDir: /export/home/jenkins/workspace/Lucene-Solr-master-Solaris/solr/build/solr-core/test/J1/temp/solr.core.TestCustomStream_C3ED2B1DFB256FD6-001/init-core-data-001
   [junit4]   2> 1013613 INFO  (SUITE-TestCustomStream-seed#[C3ED2B1DFB256FD6]-worker) [    ] o.a.s.SolrTestCaseJ4 Randomized ssl (false) and clientAuth (false) via: @org.apache.solr.util.RandomizeSSL(reason=, value=NaN, ssl=NaN, clientAuth=NaN)
   [junit4]   2> 1013613 INFO  (SUITE-TestCustomStream-seed#[C3ED2B1DFB256FD6]-worker) [    ] o.a.s.BaseDistributedSearchTestCase Setting hostContext system property: /ne/
   [junit4]   2> 1013616 INFO  (TEST-TestCustomStream.testDynamicLoadingCustomStream-seed#[C3ED2B1DFB256FD6]) [    ] o.a.s.c.ZkTestServer STARTING ZK TEST SERVER
   [junit4]   2> 1013616 INFO  (Thread-1461) [    ] o.a.s.c.ZkTestServer client port:0.0.0.0/0.0.0.0:0
   [junit4]   2> 1013616 INFO  (Thread-1461) [    ] o.a.s.c.ZkTestServer Starting server
   [junit4]   2> 1013716 INFO  (TEST-TestCustomStream.testDynamicLoadingCustomStream-seed#[C3ED2B1DFB256FD6]) [    ] o.a.s.c.ZkTestServer start zk server on port:42384
   [junit4]   2> 1013733 INFO  (TEST-TestCustomStream.testDynamicLoadingCustomStream-seed#[C3ED2B1DFB256FD6]) [    ] o.a.s.c.AbstractZkTestCase put /export/home/jenkins/workspace/Lucene-Solr-master-Solaris/solr/core/src/test-files/solr/collection1/conf/solrconfig-tlog.xml to /configs/conf1/solrconfig.xml
   [junit4]   2> 1013740 INFO  (TEST-TestCustomStream.testDynamicLoadingCustomStream-seed#[C3ED2B1DFB256FD6]) [    ] o.a.s.c.AbstractZkTestCase put /export/home/jenkins/workspace/Lucene-Solr-master-Solaris/solr/core/src/test-files/solr/collection1/conf/schema.xml to /configs/conf1/schema.xml
   [junit4]   2> 1013742 INFO  (TEST-TestCustomStream.testDynamicLoadingCustomStream-seed#[C3ED2B1DFB256FD6]) [    ] o.a.s.c.AbstractZkTestCase put /export/home/jenkins/workspace/Lucene-Solr-master-Solaris/solr/core/src/test-files/solr/collection1/conf/solrconfig.snippet.randomindexconfig.xml to /configs/conf1/solrconfig.snippet.randomindexconfig.xml
   [junit4]   2> 1013744 INFO  (TEST-TestCustomStream.testDynamicLoadingCustomStream-seed#[C3ED2B1DFB256FD6]) [    ] o.a.s.c.AbstractZkTestCase put /export/home/jenkins/workspace/Lucene-Solr-master-Solaris/solr/core/src/test-files/solr/collection1/conf/stopwords.txt to /configs/conf1/stopwords.txt
   [junit4]   2> 1013745 INFO  (TEST-TestCustomStream.testDynamicLoadingCustomStream-seed#[C3ED2B1DFB256FD6]) [    ] o.a.s.c.AbstractZkTestCase put /export/home/jenkins/workspace/Lucene-Solr-master-Solaris/solr/core/src/test-files/solr/collection1/conf/protwords.txt to /configs/conf1/protwords.txt
   [junit4]   2> 1013764 INFO  (TEST-TestCustomStream.testDynamicLoadingCustomStream-seed#[C3ED2B1DFB256FD6]) [    ] o.a.s.c.AbstractZkTestCase put /export/home/jenkins/workspace/Lucene-Solr-master-Solaris/solr/core/src/test-files/solr/collection1/conf/currency.xml to /configs/conf1/currency.xml
   [junit4]   2> 1013766 INFO  (TEST-TestCustomStream.testDynamicLoadingCustomStream-seed#[C3ED2B1DFB256FD6]) [    ] o.a.s.c.AbstractZkTestCase put /export/home/jenkins/workspace/Lucene-Solr-master-Solaris/solr/core/src/test-files/solr/collection1/conf/enumsConfig.xml to /configs/conf1/enumsConfig.xml
   [junit4]   2> 1013767 INFO  (TEST-TestCustomStream.testDynamicLoadingCustomStream-seed#[C3ED2B1DFB256FD6]) [    ] o.a.s.c.AbstractZkTestCase put /export/home/jenkins/workspace/Lucene-Solr-master-Solaris/solr/core/src/test-files/solr/collection1/conf/open-exchange-rates.json to /configs/conf1/open-exchange-rates.json
   [junit4]   2> 1013769 INFO  (TEST-TestCustomStream.testDynamicLoadingCustomStream-seed#[C3ED2B1DFB256FD6]) [    ] o.a.s.c.AbstractZkTestCase put /export/home/jenkins/workspace/Lucene-Solr-master-Solaris/solr/core/src/test-files/solr/collection1/conf/mapping-ISOLatin1Accent.txt to /configs/conf1/mapping-ISOLatin1Accent.txt
   [junit4]   2> 1013770 INFO  (TEST-TestCustomStream.testDynamicLoadingCustomStream-seed#[C3ED2B1DFB256FD6]) [    ] o.a.s.c.AbstractZkTestCase put /export/home/jenkins/workspace/Lucene-Solr-master-Solaris/solr/core/src/test-files/solr/collection1/conf/old_synonyms.txt to /configs/conf1/old_synonyms.txt
   [junit4]   2> 1013772 INFO  (TEST-TestCustomStream.testDynamicLoadingCustomStream-seed#[C3ED2B1DFB256FD6]) [    ] o.a.s.c.AbstractZkTestCase put /export/home/jenkins/workspace/Lucene-Solr-master-Solaris/solr/core/src/test-files/solr/collection1/conf/synonyms.txt to /configs/conf1/synonyms.txt
   [junit4]   2> 1013928 INFO  (TEST-TestCustomStream.testDynamicLoadingCustomStream-seed#[C3ED2B1DFB256FD6]) [    ] o.a.s.SolrTestCaseJ4 Writing core.properties file to /export/home/jenkins/workspace/Lucene-Solr-master-Solaris/solr/build/solr-core/test/J1/temp/solr.core.TestCustomStream_C3ED2B1DFB256FD6-001/control-001/cores/collection1
   [junit4]   2> 1013930 INFO  (TEST-TestCustomStream.testDynamicLoadingCustomStream-seed#[C3ED2B1DFB256FD6]) [    ] o.e.j.s.Server jetty-9.3.14.v20161028
   [junit4]   2> 1013931 INFO  (TEST-TestCustomStream.testDynamicLoadingCustomStream-seed#[C3ED2B1DFB256FD6]) [    ] o.e.j.s.h.ContextHandler Started o.e.j.s.ServletContextHandler@731a2b0f{/ne,null,AVAILABLE}
   [junit4]   2> 1013933 INFO  (TEST-TestCustomStream.testDynamicLoadingCustomStream-seed#[C3ED2B1DFB256FD6]) [    ] o.e.j.s.AbstractConnector Started ServerConnector@6d07d20f{HTTP/1.1,[http/1.1]}{127.0.0.1:42384}
   [junit4]   2> 1013934 INFO  (TEST-TestCustomStream.testDynamicLoadingCustomStream-seed#[C3ED2B1DFB256FD6]) [    ] o.e.j.s.Server Started @1017308ms
   [junit4]   2> 1013934 INFO  (TEST-TestCustomStream.testDynamicLoadingCustomStream-seed#[C3ED2B1DFB256FD6]) [    ] o.a.s.c.s.e.JettySolrRunner Jetty properties: {solr.data.dir=/export/home/jenkins/workspace/Lucene-Solr-master-Solaris/solr/build/solr-core/test/J1/temp/solr.core.TestCustomStream_C3ED2B1DFB256FD6-001/tempDir-001/control/data, hostContext=/ne, hostPort=42384, coreRootDirectory=/export/home/jenkins/workspace/Lucene-Solr-master-Solaris/solr/build/solr-core/test/J1/temp/solr.core.TestCustomStream_C3ED2B1DFB256FD6-001/control-001/cores}
   [junit4]   2> 1013934 ERROR (TEST-TestCustomStream.testDynamicLoadingCustomStream-seed#[C3ED2B1DFB256FD6]) [    ] o.a.s.s.StartupLoggingUtils Missing Java Option solr.log.dir. Logging may be missing or incomplete.
   [junit4]   2> 1013934 INFO  (TEST-TestCustomStream.testDynamicLoadingCustomStream-seed#[C3ED2B1DFB256FD6]) [    ] o.a.s.s.SolrDispatchFilter  ___      _       Welcome to Apache Solr™ version 7.0.0
   [junit4]   2> 1013934 INFO  (TEST-TestCustomStream.testDynamicLoadingCustomStream-seed#[C3ED2B1DFB256FD6]) [    ] o.a.s.s.SolrDispatchFilter / __| ___| |_ _   Starting in cloud mode on port null
   [junit4]   2> 1013934 INFO  (TEST-TestCustomStream.testDynamicLoadingCustomStream-seed#[C3ED2B1DFB256FD6]) [    ] o.a.s.s.SolrDispatchFilter \__ \/ _ \ | '_|  Install dir: null
   [junit4]   2> 1013934 INFO  (TEST-TestCustomStream.testDynamicLoadingCustomStream-seed#[C3ED2B1DFB256FD6]) [    ] o.a.s.s.SolrDispatchFilter |___/\___/_|_|    Start time: 2016-12-04T15:26:33.826Z
   [junit4]   2> 1013936 WARN  (qtp2100679294-5457) [    ] o.e.j.h.HttpParser Illegal character 0x0 in state=START for buffer HeapByteBuffer@778c0741[p=1,l=49,c=8192,r=48]={\x00<<<\x00\x00-\x00\x00\x00\x00\x00\x00\x00\x00\x00\x00\x00\x00\x00\x00...\x00\x00\x00\x00\x00\x00\x00\x00\x00\x00\x00\x00\x00\x00\x00>>>\x00\x00\x00\x00\x00\x00\x00\x00\x00\x00\x00\x00\x00\x00\x00\x00\x00...\x00\x00\x00\x00\x00\x00\x00\x00\x00\x00\x00\x00\x00\x00\x00}
   [junit4]   2> 1013937 WARN  (qtp2100679294-5457) [    ] o.e.j.h.HttpParser bad HTTP parsed: 400 Illegal character 0x0 for HttpChannelOverHttp@794bf7c0{r=0,c=false,a=IDLE,uri=null}
   [junit4]   2> 1013937 WARN  (TEST-TestCustomStream.testDynamicLoadingCustomStream-seed#[C3ED2B1DFB256FD6]-SendThread(127.0.0.1:42384)) [    ] o.a.z.ClientCnxn Session 0x0 for server 127.0.0.1/127.0.0.1:42384, unexpected error, closing socket connection and attempting reconnect
   [junit4]   2> java.io.IOException: Packet len1213486160 is out of range!
   [junit4]   2> 	at org.apache.zookeeper.ClientCnxnSocket.readLength(ClientCnxnSocket.java:112)
   [junit4]   2> 	at org.apache.zookeeper.ClientCnxnSocketNIO.doIO(ClientCnxnSocketNIO.java:79)
   [junit4]   2> 	at org.apache.zookeeper.ClientCnxnSocketNIO.doTransport(ClientCnxnSocketNIO.java:366)
   [junit4]   2> 	at org.apache.zookeeper.ClientCnxn$SendThread.run(ClientCnxn.java:1081)
   [junit4]   2> 1015859 WARN  (qtp2100679294-5460) [    ] o.e.j.h.HttpParser Illegal character 0x0 in state=START for buffer HeapByteBuffer@364c5753[p=1,l=49,c=8192,r=48]={\x00<<<\x00\x00-\x00\x00\x00\x00\x00\x00\x00\x00\x00\x00\x00\x00\x00\x00...\x00\x00\x00\x00\x00\x00\x00\x00\x00\x00\x00\x00\x00\x00\x00>>>h: 0\r\nConnection:...\x00\x00\x00\x00\x00\x00\x00\x00\x00\x00\x00\x00\x00\x00\x00}
   [junit4]   2> 1015859 WARN  (qtp2100679294-5460) [    ] o.e.j.h.HttpParser bad HTTP parsed: 400 Illegal character 0x0 for HttpChannelOverHttp@388bafea{r=0,c=false,a=IDLE,uri=null}
   [junit4]   2> 1015859 WARN  (TEST-TestCustomStream.testDynamicLoadingCustomStream-seed#[C3ED2B1DFB256FD6]-SendThread(127.0.0.1:42384)) [    ] o.a.z.ClientCnxn Session 0x0 for server 127.0.0.1/127.0.0.1:42384, unexpected error, closing socket connection and attempting reconnect
   [junit4]   2> java.io.IOException: Packet len1213486160 is out of range!
   [junit4]   2> 	at org.apache.zookeeper.ClientCnxnSocket.readLength(ClientCnxnSocket.java:112)
   [junit4]   2> 	at org.apache.zookeeper.ClientCnxnSocketNIO.doIO(ClientCnxnSocketNIO.java:79)
   [junit4]   2> 	at org.apache.zookeeper.ClientCnxnSocketNIO.doTransport(ClientCnxnSocketNIO.java:366)
   [junit4]   2> 	at org.apache.zookeeper.ClientCnxn$SendThread.run(ClientCnxn.java:1081)
   [junit4]   2> 1017768 WARN  (qtp2100679294-5455) [    ] o.e.j.h.HttpParser Illegal character 0x0 in state=START for buffer HeapByteBuffer@778c0741[p=1,l=49,c=8192,r=48]={\x00<<<\x00\x00-\x00\x00\x00\x00\x00\x00\x00\x00\x00\x00\x00\x00\x00\x00...\x00\x00\x00\x00\x00\x00\x00\x00\x00\x00\x00\x00\x00\x00\x00>>>h: 0\r\nConnection:...\x00\x00\x00\x00\x00\x00\x00\x00\x00\x00\x00\x00\x00\x00\x00}
   [junit4]   2> 1017768 WARN  (qtp2100679294-5455) [    ] o.e.j.h.HttpParser bad HTTP parsed: 400 Illegal character 0x0 for HttpChannelOverHttp@74da198b{r=0,c=false,a=IDLE,uri=null}
   [junit4]   2> 1017768 WARN  (TEST-TestCustomStream.testDynamicLoadingCustomStream-seed#[C3ED2B1DFB256FD6]-SendThread(127.0.0.1:42384)) [    ] o.a.z.ClientCnxn Session 0x0 for server 127.0.0.1/127.0.0.1:42384, unexpected error, closing socket connection and attempting reconnect
   [junit4]   2> java.io.IOException: Packet len1213486160 is out of range!
   [junit4]   2> 	at org.apache.zookeeper.ClientCnxnSocket.readLength(ClientCnxnSocket.java:112)
   [junit4]   2> 	at org.apache.zookeeper.ClientCnxnSocketNIO.doIO(ClientCnxnSocketNIO.java:79)
   [junit4]   2> 	at org.apache.zookeeper.ClientCnxnSocketNIO.doTransport(ClientCnxnSocketNIO.java:366)
   [junit4]   2> 	at org.apache.zookeeper.ClientCnxn$SendThread.run(ClientCnxn.java:1081)
   [junit4]   2> 1019109 WARN  (qtp2100679294-5459) [    ] o.e.j.h.HttpParser Illegal character 0x0 in state=START for buffer HeapByteBuffer@364c5753[p=1,l=49,c=8192,r=48]={\x00<<<\x00\x00-\x00\x00\x00\x00\x00\x00\x00\x00\x00\x00\x00\x00\x00\x00...\x00\x00\x00\x00\x00\x00\x00\x00\x00\x00\x00\x00\x00\x00\x00>>>h: 0\r\nConnection:...\x00\x00\x00\x00\x00\x00\x00\x00\x00\x00\x00\x00\x00\x00\x00}
   [junit4]   2> 1019109 WARN  (qtp2100679294-5459) [    ] o.e.j.h.HttpParser bad HTTP parsed: 400 Illegal character 0x0 for HttpChannelOverHttp@5dc12106{r=0,c=false,a=IDLE,uri=null}
   [junit4]   2> 1019109 WARN  (TEST-TestCustomStream.testDynamicLoadingCustomStream-seed#[C3ED2B1DFB256FD6]-SendThread(127.0.0.1:42384)) [    ] o.a.z.ClientCnxn Session 0x0 for server 127.0.0.1/127.0.0.1:42384, unexpected error, closing socket connection and attempting reconnect
   [junit4]   2> java.io.IOException: Packet len1213486160 is out of range!
   [junit4]   2> 	at org.apache.zookeeper.ClientCnxnSocket.readLength(ClientCnxnSocket.java:112)
   [junit4]   2> 	at org.apache.zookeeper.ClientCnxnSocketNIO.doIO(ClientCnxnSocketNIO.java:79)
   [junit4]   2> 	at org.apache.zookeeper.ClientCnxnSocketNIO.doTransport(ClientCnxnSocketNIO.java:366)
   [junit4]   2> 	at org.apache.zookeeper.ClientCnxn$SendThread.run(ClientCnxn.java:1081)
   [junit4]   2> 1020461 WARN  (qtp2100679294-5462) [    ] o.e.j.h.HttpParser Illegal character 0x0 in state=START for buffer HeapByteBuffer@778c0741[p=1,l=49,c=8192,r=48]={\x00<<<\x00\x00-\x00\x00\x00\x00\x00\x00\x00\x00\x00\x00\x00\x00\x00\x00...\x00\x00\x00\x00\x00\x00\x00\x00\x00\x00\x00\x00\x00\x00\x00>>>h: 0\r\nConnection:...\x00\x00\x00\x00\x00\x00\x00\x00\x00\x00\x00\x00\x00\x00\x00}
   [junit4]   2> 1020461 WARN  (qtp2100679294-5462) [    ] o.e.j.h.HttpParser bad HTTP parsed: 400 Illegal character 0x0 for HttpChannelOverHttp@4d811003{r=0,c=false,a=IDLE,uri=null}
   [junit4]   2> 1020462 WARN  (TEST-TestCustomStream.testDynamicLoadingCustomStream-seed#[C3ED2B1DFB256FD6]-SendThread(127.0.0.1:42384)) [    ] o.a.z.ClientCnxn Session 0x0 for server 127.0.0.1/127.0.0.1:42384, unexpected error, closing socket connection and attempting reconnect
   [junit4]   2> java.io.IOException: Packet len1213486160 is out of range!
   [junit4]   2> 	at org.apache.zookeeper.ClientCnxnSocket.readLength(ClientCnxnSocket.java:112)
   [junit4]   2> 	at org.apache.zookeeper.ClientCnxnSocketNIO.doIO(ClientCnxnSocketNIO.java:79)
   [junit4]   2> 	at org.apache.zookeeper.ClientCnxnSocketNIO.doTransport(ClientCnxnSocketNIO.java:366)
   [junit4]   2> 	at org.apache.zookeeper.ClientCnxn$SendThread.run(ClientCnxn.java:1081)
   [junit4]   2> 1022401 WARN  (qtp2100679294-5455) [    ] o.e.j.h.HttpParser Illegal character 0x0 in state=START for buffer HeapByteBuffer@364c5753[p=1,l=49,c=8192,r=48]={\x00<<<\x00\x00-\x00\x00\x00\x00\x00\x00\x00\x00\x00\x00\x00\x00\x00\x00...\x00\x00\x00\x00\x00\x00\x00\x00\x00\x00\x00\x00\x00\x00\x00>>>h: 0\r\nConnection:...\x00\x00\x00\x00\x00\x00\x00\x00\x00\x00\x00\x00\x00\x00\x00}
   [junit4]   2> 1022401 WARN  (qtp2100679294-5455) [    ] o.e.j.h.HttpParser bad HTTP parsed: 400 Illegal character 0x0 for HttpChannelOverHttp@30c7b716{r=0,c=false,a=IDLE,uri=null}
   [junit4]   2> 1022401 WARN  (TEST-TestCustomStream.testDynamicLoadingCustomStream-seed#[C3ED2B1DFB256FD6]-SendThread(127.0.0.1:42384)) [    ] o.a.z.ClientCnxn Session 0x0 for server 127.0.0.1/127.0.0.1:42384, unexpected error, closing socket connection and attempting reconnect
   [junit4]   2> java.io.IOException: Packet len1213486160 is out of range!
   [junit4]   2> 	at org.apache.zookeeper.ClientCnxnSocket.readLength(ClientCnxnSocket.java:112)
   [junit4]   2> 	at org.apache.zookeeper.ClientCnxnSocketNIO.doIO(ClientCnxnSocketNIO.java:79)
   [junit4]   2> 	at org.apache.zookeeper.ClientCnxnSocketNIO.doTransport(ClientCnxnSocketNIO.java:366)
   [junit4]   2> 	at org.apache.zookeeper.ClientCnxn$SendThread.run(ClientCnxn.java:1081)
   [junit4]   2> 1024401 WARN  (qtp2100679294-5458) [    ] o.e.j.h.HttpParser Illegal character 0x0 in state=START for buffer HeapByteBuffer@778c0741[p=1,l=49,c=8192,r=48]={\x00<<<\x00\x00-\x00\x00\x00\x00\x00\x00\x00\x00\x00\x00\x00\x00\x00\x00...\x00\x00\x00\x00\x00\x00\x00\x00\x00\x00\x00\x00\x00\x00\x00>>>h: 0\r\nConnection:...\x00\x00\x00\x00\x00\x00\x00\x00\x00\x00\x00\x00\x00\x00\x00}
   [junit4]   2> 1024401 WARN  (qtp2100679294-5458) [    ] o.e.j.h.HttpParser bad HTTP parsed: 400 Illegal character 0x0 for HttpChannelOverHttp@504131d4{r=0,c=false,a=IDLE,uri=null}
   [junit4]   2> 1024402 WARN  (TEST-TestCustomStream.testDynamicLoadingCustomStream-seed#[C3ED2B1DFB256FD6]-SendThread(127.0.0.1:42384)) [    ] o.a.z.ClientCnxn Session 0x0 for server 127.0.0.1/127.0.0.1:42384, unexpected error, closing socket connection and attempting reconnect
   [junit4]   2> java.io.IOException: Packet len1213486160 is out of range!
   [junit4]   2> 	at org.apache.zookeeper.ClientCnxnSocket.readLength(ClientCnxnSocket.java:112)
   [junit4]   2> 	at org.apache.zookeeper.ClientCnxnSocketNIO.doIO(ClientCnxnSocketNIO.java:79)
   [junit4]   2> 	at org.apache.zookeeper.ClientCnxnSocketNIO.doTransport(ClientCnxnSocketNIO.java:366)
   [junit4]   2> 	at org.apache.zookeeper.ClientCnxn$SendThread.run(ClientCnxn.java:1081)
   [junit4]   2> 1025659 WARN  (qtp2100679294-5461) [    ] o.e.j.h.HttpParser Illegal character 0x0 in state=START for buffer HeapByteBuffer@364c5753[p=1,l=49,c=8192,r=48]={\x00<<<\x00\x00-\x00\x00\x00\x00\x00\x00\x00\x00\x00\x00\x00\x00\x00\x00...\x00\x00\x00\x00\x00\x00\x00\x00\x00\x00\x00\x00\x00\x00\x00>>>h: 0\r\nConnection:...\x00\x00\x00\x00\x00\x00\x00\x00\x00\x00\x00\x00\x00\x00\x00}
   [junit4]   2> 1025659 WARN  (qtp2100679294-5461) [    ] o.e.j.h.HttpParser bad HTTP parsed: 400 Illegal character 0x0 for HttpChannelOverHttp@7bb97257{r=0,c=false,a=IDLE,uri=null}
   [junit4]   2> 1025660 WARN  (TEST-TestCustomStream.testDynamicLoadingCustomStream-seed#[C3ED2B1DFB256FD6]-SendThread(127.0.0.1:42384)) [    ] o.a.z.ClientCnxn Session 0x0 for server 127.0.0.1/127.0.0.1:42384, unexpected error, closing socket connection and attempting reconnect
   [junit4]   2> java.io.IOException: Packet len1213486160 is out of range!
   [junit4]   2> 	at org.apache.zookeeper.ClientCnxnSocket.readLength(ClientCnxnSocket.java:112)
   [junit4]   2> 	at org.apache.zookeeper.ClientCnxnSocketNIO.doIO(ClientCnxnSocketNIO.java:79)
   [junit4]   2> 	at org.apache.zookeeper.ClientCnxnSocketNIO.doTransport(ClientCnxnSocketNIO.java:366)
   [junit4]   2> 	at org.apache.zookeeper.ClientCnxn$SendThread.run(ClientCnxn.java:1081)
   [junit4]   2> 1027692 WARN  (qtp2100679294-5459) [    ] o.e.j.h.HttpParser Illegal character 0x0 in state=START for buffer HeapByteBuffer@778c0741[p=1,l=49,c=8192,r=48]={\x00<<<\x00\x00-\x00\x00\x00\x00\x00\x00\x00\x00\x00\x00\x00\x00\x00\x00...\x00\x00\x00\x00\x00\x00\x00\x00\x00\x00\x00\x00\x00\x00\x00>>>h: 0\r\nConnection:...\x00\x00\x00\x00\x00\x00\x00\x00\x00\x00\x00\x00\x00\x00\x00}
   [junit4]   2> 1027693 WARN  (qtp2100679294-5459) [    ] o.e.j.h.HttpParser bad HTTP parsed: 400 Illegal character 0x0 for HttpChannelOverHttp@123bdef5{r=0,c=false,a=IDLE,uri=null}
   [junit4]   2> 1027693 WARN  (TEST-TestCustomStream.testDynamicLoadingCustomStream-seed#[C3ED2B1DFB256FD6]-SendThread(127.0.0.1:42384)) [    ] o.a.z.ClientCnxn Session 0x0 for server 127.0.0.1/127.0.0.1:42384, unexpected error, closing socket connection and attempting reconnect
   [junit4]   2> java.io.IOException: Packet len1213486160 is out of range!
   [junit4]   2> 	at org.apache.zookeeper.ClientCnxnSocket.readLength(ClientCnxnSocket.java:112)
   [junit4]   2> 	at org.apache.zookeeper.ClientCnxnSocketNIO.doIO(ClientCnxnSocketNIO.java:79)
   [junit4]   2> 	at org.apache.zookeeper.ClientCnxnSocketNIO.doTransport(ClientCnxnSocketNIO.java:366)
   [junit4]   2> 	at org.apache.zookeeper.ClientCnxn$SendThread.run(ClientCnxn.java:1081)
   [junit4]   2> 1029791 WARN  (qtp2100679294-5462) [    ] o.e.j.h.HttpParser Illegal character 0x0 in state=START for buffer HeapByteBuffer@364c5753[p=1,l=49,c=8192,r=48]={\x00<<<\x00\x00-\x00\x00\x00\x00\x00\x00\x00\x00\x00\x00\x00\x00\x00\x00...\x00\x00\x00\x00\x00\x00\x00\x00\x00\x00\x00\x00\x00\x00\x00>>>h: 0\r\nConnection:...\x00\x00\x00\x00\x00\x00\x00\x00\x00\x00\x00\x00\x00\x00\x00}
   [junit4]   2> 1029791 WARN  (qtp2100679294-5462) [    ] o.e.j.h.HttpParser bad HTTP parsed: 400 Illegal character 0x0 for HttpChannelOverHttp@27bfdf8{r=0,c=false,a=IDLE,uri=null}
   [junit4]   2> 1029792 WARN  (TEST-TestCustomStream.testDynamicLoadingCustomStream-seed#[C3ED2B1DFB256FD6]-SendThread(127.0.0.1:42384)) [    ] o.a.z.ClientCnxn Session 0x0 for server 127.0.0.1/127.0.0.1:42384, unexpected error, closing socket connection and attempting reconnect
   [junit4]   2> java.io.IOException: Packet len1213486160 is out of range!
   [junit4]   2> 	at org.apache.zookeeper.ClientCnxnSocket.readLength(ClientCnxnSocket.java:112)
   [junit4]   2> 	at org.apache.zookeeper.ClientCnxnSocketNIO.doIO(ClientCnxnSocketNIO.java:79)
   [junit4]   2> 	at org.apache.zookeeper.ClientCnxnSocketNIO.doTransport(ClientCnxnSocketNIO.java:366)
   [junit4]   2> 	at org.apache.zookeeper.ClientCnxn$SendThread.run(ClientCnxn.java:1081)
   [junit4]   2> 1030954 WARN  (qtp2100679294-5455) [    ] o.e.j.h.HttpParser Illegal character 0x0 in state=START for buffer HeapByteBuffer@778c0741[p=1,l=49,c=8192,r=48]={\x00<<<\x00\x00-\x00\x00\x00\x00\x00\x00\x00\x00\x00\x00\x00\x00\x00\x00...\x00\x00\x00\x00\x00\x00\x00\x00\x00\x00\x00\x00\x00\x00\x00>>>h: 0\r\nConnection:...\x00\x00\x00\x00\x00\x00\x00\x00\x00\x00\x00\x00\x00\x00\x00}
   [junit4]   2> 1030954 WARN  (qtp2100679294-5455) [    ] o.e.j.h.HttpParser bad HTTP parsed: 400 Illegal character 0x0 for HttpChannelOverHttp@26b1e22d{r=0,c=false,a=IDLE,uri=null}
   [junit4]   2> 1030955 WARN  (TEST-TestCustomStream.testDynamicLoadingCustomStream-seed#[C3ED2B1DFB256FD6]-SendThread(127.0.0.1:42384)) [    ] o.a.z.ClientCnxn Session 0x0 for server 127.0.0.1/127.0.0.1:42384, unexpected error, closing socket connection and attempting reconnect
   [junit4]   2> java.io.IOException: Packet len1213486160 is out of range!
   [junit4]   2> 	at org.apache.zookeeper.ClientCnxnSocket.readLength(ClientCnxnSocket.java:112)
   [junit4]   2> 	at org.apache.zookeeper.ClientCnxnSocketNIO.doIO(ClientCnxnSocketNIO.java:79)
   [junit4]   2> 	at org.apache.zookeeper.ClientCnxnSocketNIO.doTransport(ClientCnxnSocketNIO.java:366)
   [junit4]   2> 	at org.apache.zookeeper.ClientCnxn$SendThread.run(ClientCnxn.java:1081)
   [junit4]   2> 1032109 WARN  (qtp2100679294-5458) [    ] o.e.j.h.HttpParser Illegal character 0x0 in state=START for buffer HeapByteBuffer@364c5753[p=1,l=49,c=8192,r=48]={\x00<<<\x00\x00-\x00\x00\x00\x00\x00\x00\x00\x00\x00\x00\x00\x00\x00\x00...\x00\x00\x00\x00\x00\x00\x00\x00\x00\x00\x00\x00\x00\x00\x00>>>h: 0\r\nConnection:...\x00\x00\x00\x00\x00\x00\x00\x00\x00\x00\x00\x00\x00\x00\x00}
   [junit4]   2> 1032109 WARN  (qtp2100679294-5458) [    ] o.e.j.h.HttpParser bad HTTP parsed: 400 Illegal character 0x0 for HttpChannelOverHttp@4cc6ef97{r=0,c=false,a=IDLE,uri=null}
   [junit4]   2> 1032109 WARN  (TEST-TestCustomStream.testDynamicLoadingCustomStream-seed#[C3ED2B1DFB256FD6]-SendThread(127.0.0.1:42384)) [    ] o.a.z.ClientCnxn Session 0x0 for server 127.0.0.1/127.0.0.1:42384, unexpected error, closing socket connection and attempting reconnect
   [junit4]   2> java.io.IOException: Packet len1213486160 is out of range!
   [junit4]   2> 	at org.apache.zookeeper.ClientCnxnSocket.readLength(ClientCnxnSocket.java:112)
   [junit4]   2> 	at org.apache.zookeeper.ClientCnxnSocketNIO.doIO(ClientCnxnSocketNIO.java:79)
   [junit4]   2> 	at org.apache.zookeeper.ClientCnxnSocketNIO.doTransport(ClientCnxnSocketNIO.java:366)
   [junit4]   2> 	at org.apache.zookeeper.ClientCnxn$SendThread.run(ClientCnxn.java:1081)
   [junit4]   2> 1033487 WARN  (qtp2100679294-5461) [    ] o.e.j.h.HttpParser Illegal character 0x0 in state=START for buffer HeapByteBuffer@778c0741[p=1,l=49,c=8192,r=48]={\x00<<<\x00\x00-\x00\x00\x00\x00\x00\x00\x00\x00\x00\x00\x00\x00\x00\x00...\x00\x00\x00\x00\x00\x00\x00\x00\x00\x00\x00\x00\x00\x00\x00>>>h: 0\r\nConnection:...\x00\x00\x00\x00\x00\x00\x00\x00\x00\x00\x00\x00\x00\x00\x00}
   [junit4]   2> 1033487 WARN  (qtp2100679294-5461) [    ] o.e.j.h.HttpParser bad HTTP parsed: 400 Illegal character 0x0 for HttpChannelOverHttp@413385f4{r=0,c=false,a=IDLE,uri=null}
   [junit4]   2> 1033488 WARN  (TEST-TestCustomStream.testDynamicLoadingCustomStream-seed#[C3ED2B1DFB256FD6]-SendThread(127.0.0.1:42384)) [    ] o.a.z.ClientCnxn Session 0x0 for server 127.0.0.1/127.0.0.1:42384, unexpected error, closing socket connection and attempting reconnect
   [junit4]   2> java.io.IOException: Packet len1213486160 is out of range!
   [junit4]   2> 	at org.apache.zookeeper.ClientCnxnSocket.readLength(ClientCnxnSocket.java:112)
   [junit4]   2> 	at org.apache.zookeeper.ClientCnxnSocketNIO.doIO(ClientCnxnSocketNIO.java:79)
   [junit4]   2> 	at org.apache.zookeeper.ClientCnxnSocketNIO.doTransport(ClientCnxnSocketNIO.java:366)
   [junit4]   2> 	at org.apache.zookeeper.ClientCnxn$SendThread.run(ClientCnxn.java:1081)
   [junit4]   2> 1035355 WARN  (qtp2100679294-5459) [    ] o.e.j.h.HttpParser Illegal character 0x0 in state=START for buffer HeapByteBuffer@364c5753[p=1,l=49,c=8192,r=48]={\x00<<<\x00\x00-\x00\x00\x00\x00\x00\x00\x00\x00\x00\x00\x00\x00\x00\x00...\x00\x00\x00\x00\x00\x00\x00\x00\x00\x00\x00\x00\x00\x00\x00>>>h: 0\r\nConnection:...\x00\x00\x00\x00\x00\x00\x00\x00\x00\x00\x00\x00\x00\x00\x00}
   [junit4]   2> 1035355 WARN  (qtp2100679294-5459) [    ] o.e.j.h.HttpParser bad HTTP parsed: 400 Illegal character 0x0 for HttpChannelOverHttp@3e949ceb{r=0,c=false,a=IDLE,uri=null}
   [junit4]   2> 1035356 WARN  (TEST-TestCustomStream.testDynamicLoadingCustomStream-seed#[C3ED2B1DFB256FD6]-SendThread(127.0.0.1:42384)) [    ] o.a.z.ClientCnxn Session 0x0 for server 127.0.0.1/127.0.0.1:42384, unexpected error, closing socket connection and attempting reconnect
   [junit4]   2> java.io.IOException: Packet len1213486160 is out of range!
   [junit4]   2> 	at org.apache.zookeeper.ClientCnxnSocket.readLength(ClientCnxnSocket.java:112)
   [junit4]   2> 	at org.apache.zookeeper.ClientCnxnSocketNIO.doIO(ClientCnxnSocketNIO.java:79)
   [junit4]   2> 	at org.apache.zookeeper.ClientCnxnSocketNIO.doTransport(ClientCnxnSocketNIO.java:366)
   [junit4]   2> 	at org.apache.zookeeper.ClientCnxn$SendThread.run(ClientCnxn.java:1081)
   [junit4]   2> 1036939 WARN  (qtp2100679294-5462) [    ] o.e.j.h.HttpParser Illegal character 0x0 in state=START for buffer HeapByteBuffer@778c0741[p=1,l=49,c=8192,r=48]={\x00<<<\x00\x00-\x00\x00\x00\x00\x00\x00\x00\x00\x00\x00\x00\x00\x00\x00...\x00\x00\x00\x00\x00\x00\x00\x00\x00\x00\x00\x00\x00\x00\x00>>>h: 0\r\nConnection:...\x00\x00\x00\x00\x00\x00\x00\x00\x00\x00\x00\x00\x00\x00\x00}
   [junit4]   2> 1036939 WARN  (qtp2100679294-5462) [    ] o.e.j.h.HttpParser bad HTTP parsed: 400 Illegal character 0x0 for HttpChannelOverHttp@3f1dac91{r=0,c=false,a=IDLE,uri=null}
   [junit4]   2> 1036940 WARN  (TEST-TestCustomStream.testDynamicLoadingCustomStream-seed#[C3ED2B1DFB256FD6]-SendThread(127.0.0.1:42384)) [    ] o.a.z.ClientCnxn Session 0x0 for server 127.0.0.1/127.0.0.1:42384, unexpected error, closing socket connection and attempting reconnect
   [junit4]   2> java.io.IOException: Packet len1213486160 is out of range!
   [junit4]   2> 	at org.apache.zookeeper.ClientCnxnSocket.readLength(ClientCnxnSocket.java:112)
   [junit4]   2> 	at org.apache.zookeeper.ClientCnxnSocketNIO.doIO(ClientCnxnSocketNIO.java:79)
   [junit4]   2> 	at org.apache.zookeeper.ClientCnxnSocketNIO.doTransport(ClientCnxnSocketNIO.java:366)
   [junit4]   2> 	at org.apache.zookeeper.ClientCnxn$SendThread.run(ClientCnxn.java:1081)
   [junit4]   2> 1038569 WARN  (qtp2100679294-5455) [    ] o.e.j.h.HttpParser Illegal character 0x0 in state=START for buffer HeapByteBuffer@364c5753[p=1,l=49,c=8192,r=48]={\x00<<<\x00\x00-\x00\x00\x00\x00\x00\x00\x00\x00\x00\x00\x00\x00\x00\x00...\x00\x00\x00\x00\x00\x00\x00\x00\x00\x00\x00\x00\x00\x00\x00>>>h: 0\r\nConnection:...\x00\x00\x00\x00\x00\x00\x00\x00\x00\x00\x00\x00\x00\x00\x00}
   [junit4]   2> 1038569 WARN  (qtp2100679294-5455) [    ] o.e.j.h.HttpParser bad HTTP parsed: 400 Illegal character 0x0 for HttpChannelOverHttp@566e0377{r=0,c=false,a=IDLE,uri=null}
   [junit4]   2> 1038569 WARN  (TEST-TestCustomStream.testDynamicLoadingCustomStream-seed#[C3ED2B1DFB256FD6]-SendThread(127.0.0.1:42384)) [    ] o.a.z.ClientCnxn Session 0x0 for server 127.0.0.1/127.0.0.1:42384, unexpected error, closing socket connection and attempting reconnect
   [junit4]   2> java.io.IOException: Packet len1213486160 is out of range!
   [junit4]   2> 	at org.apache.zookeeper.ClientCnxnSocket.readLength(ClientCnxnSocket.java:112)
   [junit4]   2> 	at org.apache.zookeeper.ClientCnxnSocketNIO.doIO(ClientCnxnSocketNIO.java:79)
   [junit4]   2> 	at org.apache.zookeeper.ClientCnxnSocketNIO.doTransport(ClientCnxnSocketNIO.java:366)
   [junit4]   2> 	at org.apache.zookeeper.ClientCnxn$SendThread.run(ClientCnxn.java:1081)
   [junit4]   2> 1040523 WARN  (qtp2100679294-5458) [    ] o.e.j.h.HttpParser Illegal character 0x0 in state=START for buffer HeapByteBuffer@778c0741[p=1,l=49,c=8192,r=48]={\x00<<<\x00\x00-\x00\x00\x00\x00\x00\x00\x00\x00\x00\x00\x00\x00\x00\x00...\x00\x00\x00\x00\x00\x00\x00\x00\x00\x00\x00\x00\x00\x00\x00>>>h: 0\r\nConnection:...\x00\x00\x00\x00\x00\x00\x00\x00\x00\x00\x00\x00\x00\x00\x00}
   [junit4]   2> 1040524 WARN  (qtp2100679294-5458) [    ] o.e.j.h.HttpParser bad HTTP parsed: 400 Illegal character 0x0 for HttpChannelOverHttp@33492c51{r=0,c=false,a=IDLE,uri=null}
   [junit4]   2> 1040524 WARN  (TEST-TestCustomStream.testDynamicLoadingCustomStream-seed#[C3ED2B1DFB256FD6]-SendThread(127.0.0.1:42384)) [    ] o.a.z.ClientCnxn Session 0x0 for server 127.0.0.1/127.0.0.1:42384, unexpected error, closing socket connection and attempting reconnect
   [junit4]   2> java.io.IOException: Packet len1213486160 is out of range!
   [junit4]   2> 	at org.apache.zookeeper.ClientCnxnSocket.readLength(ClientCnxnSocket.java:112)
   [junit4]   2> 	at org.apache.zookeeper.ClientCnxnSocketNIO.doIO(ClientCnxnSocketNIO.java:79)
   [junit4]   2> 	at org.apache.zookeeper.ClientCnxnSocketNIO.doTransport(ClientCnxnSocketNIO.java:366)
   [junit4]   2> 	at org.apache.zookeeper.ClientCnxn$SendThread.run(ClientCnxn.java:1081)
   [junit4]   2> 1041867 WARN  (qtp2100679294-5461) [    ] o.e.j.h.HttpParser Illegal character 0x0 in state=START for buffer HeapByteBuffer@364c5753[p=1,l=49,c=8192,r=48]={\x00<<<\x00\x00-\x00\x00\x00\x00\x00\x00\x00\x00\x00\x00\x00\x00\x00\x00...\x00\x00\x00\x00\x00\x00\x00\x00\x00\x00\x00\x00\x00\x00\x00>>>h: 0\r\nConnection:...\x00\x00\x00\x00\x00\x00\x00\x00\x00\x00\x00\x00\x00\x00\x00}
   [junit4]   2> 1041867 WARN  (qtp2100679294-5461) [    ] o.e.j.h.HttpParser bad HTTP parsed: 400 Illegal character 0x0 for HttpChannelOverHttp@18bc82b0{r=0,c=false,a=IDLE,uri=null}
   [junit4]   2> 1041868 WARN  (TEST-TestCustomStream.testDynamicLoadingCustomStream-seed#[C3ED2B1DFB256FD6]-SendThread(127.0.0.1:42384)) [    ] o.a.z.ClientCnxn Session 0x0 for server 127.0.0.1/127.0.0.1:42384, unexpected error, closing socket connection and attempting reconnect
   [junit4]   2> java.io.IOException: Packet len1213486160 is out of range!
   [junit4]   2> 	at org.apache.zookeeper.ClientCnxnSocket.readLength(ClientCnxnSocket.java:112)
   [junit4]   2> 	at org.apache.zookeeper.ClientCnxnSocketNIO.doIO(ClientCnxnSocketNIO.java:79)
   [junit4]   2> 	at org.apache.zookeeper.ClientCnxnSocketNIO.doTransport(ClientCnxnSocketNIO.java:366)
   [junit4]   2> 	at org.apache.zookeeper.ClientCnxn$SendThread.run(ClientCnxn.java:1081)
   [junit4]   2> 1043510 WARN  (qtp2100679294-5459) [    ] o.e.j.h.HttpParser Illegal character 0x0 in state=START for buffer HeapByteBuffer@778c0741[p=1,l=49,c=8192,r=48]={\x00<<<\x00\x00-\x00\x00\x00\x00\x00\x00\x00\x00\x00\x00\x00\x00\x00\x00...\x00\x00\x00\x00\x00\x00\x00\x00\x00\x00\x00\x00\x00\x00\x00>>>h: 0\r\nConnection:...\x00\x00\x00\x00\x00\x00\x00\x00\x00\x00\x00\x00\x00\x00\x00}
   [junit4]   2> 1043511 WARN  (qtp2100679294-5459) [    ] o.e.j.h.HttpParser bad HTTP parsed: 400 Illegal character 0x0 for HttpChannelOverHttp@3f797336{r=0,c=false,a=IDLE,uri=null}
   [junit4]   2> 1043511 WARN  (TEST-TestCustomStream.testDynamicLoadingCustomStream-seed#[C3ED2B1DFB256FD6]-SendThread(127.0.0.1:42384)) [    ] o.a.z.ClientCnxn Session 0x0 for server 127.0.0.1/127.0.0.1:42384, unexpected error, closing socket connection and attempting reconnect
   [junit4]   2> java.io.IOException: Packet len1213486160 is out of range!
   [junit4]   2> 	at org.apache.zookeeper.ClientCnxnSocket.readLength(ClientCnxnSocket.java:112)
   [junit4]   2> 	at org.apache.zookeeper.ClientCnxnSocketNIO.doIO(ClientCnxnSocketNIO.java:79)
   [junit4]   2> 	at org.apache.zookeeper.ClientCnxnSocketNIO.doTransport(ClientCnxnSocketNIO.java:366)
   [junit4]   2> 	at org.apache.zookeeper.ClientCnxn$SendThread.run(ClientCnxn.java:1081)
   [junit4]   2> 1044370 ERROR (TEST-TestCustomStream.testDynamicLoadingCustomStream-seed#[C3ED2B1DFB256FD6]) [    ] o.a.s.s.SolrDispatchFilter Could not start Solr. Check solr/home property and the logs
   [junit4]   2> 1044370 ERROR (TEST-TestCustomStream.testDynamicLoadingCustomStream-seed#[C3ED2B1DFB256FD6]) [    ] o.a.s.c.SolrCore null:org.apache.solr.common.SolrException: Error occurred while loading solr.xml from zookeeper
   [junit4]   2> 	at org.apache.solr.servlet.SolrDispatchFilter.loadNodeConfig(SolrDispatchFilter.java:230)
   [junit4]   2> 	at org.apache.solr.servlet.SolrDispatchFilter.createCoreContainer(SolrDispatchFilter.java:202)
   [junit4]   2> 	at org.apache.solr.servlet.SolrDispatchFilter.init(SolrDispatchFilter.java:153)
   [junit4]   2> 	at org.eclipse.jetty.servlet.FilterHolder.initialize(FilterHolder.java:137)
   [junit4]   2> 	at org.eclipse.jetty.servlet.ServletHandler.initialize(ServletHandler.java:873)
   [junit4]   2> 	at org.eclipse.jetty.servlet.ServletHandler.updateMappings(ServletHandler.java:1565)
   [junit4]   2> 	at org.eclipse.jetty.servlet.ServletHandler.setFilterMappings(ServletHandler.java:1599)
   [junit4]   2> 	at org.eclipse.jetty.servlet.ServletHandler.addFilterMapping(ServletHandler.java:1285)
   [junit4]   2> 	at org.eclipse.jetty.servlet.ServletHandler.addFilterWithMapping(ServletHandler.java:1130)
   [junit4]   2> 	at org.eclipse.jetty.servlet.ServletContextHandler.addFilter(ServletContextHandler.java:448)
   [junit4]   2> 	at org.apache.solr.client.solrj.embedded.JettySolrRunner$1.lifeCycleStarted(JettySolrRunner.java:260)
   [junit4]   2> 	at org.eclipse.jetty.util.component.AbstractLifeCycle.setStarted(AbstractLifeCycle.java:179)
   [junit4]   2> 	at org.eclipse.jetty.util.component.AbstractLifeCycle.start(AbstractLifeCycle.java:69)
   [junit4]   2> 	at org.apache.solr.client.solrj.embedded.JettySolrRunner.start(JettySolrRunner.java:348)
   [junit4]   2> 	at org.apache.solr.client.solrj.embedded.JettySolrRunner.start(JettySolrRunner.java:321)
   [junit4]   2> 	at org.apache.solr.cloud.AbstractFullDistribZkTestBase.createJetty(AbstractFullDistribZkTestBase.java:510)
   [junit4]   2> 	at org.apache.solr.BaseDistributedSearchTestCase.createJetty(BaseDistributedSearchTestCase.java:388)
   [junit4]   2> 	at org.apache.solr.cloud.AbstractFullDistribZkTestBase.createServers(AbstractFullDistribZkTestBase.java:299)
   [junit4]   2> 	at org.apache.solr.BaseDistributedSearchTestCase$ShardsRepeatRule$ShardsFixedStatement.callStatement(BaseDistributedSearchTestCase.java:983)
   [junit4]   2> 	at org.apache.solr.BaseDistributedSearchTestCase$ShardsRepeatRule$ShardsStatement.evaluate(BaseDistributedSearchTestCase.java:960)
   [junit4]   2> 	at com.carrotsearch.randomizedtesting.rules.SystemPropertiesRestoreRule$1.evaluate(SystemPropertiesRestoreRule.java:57)
   [junit4]   2> 	at org.apache.lucene.util.TestRuleSetupTeardownChained$1.evaluate(TestRuleSetupTeardownChained.java:49)
   [junit4]   2> 	at org.apache.lucene.util.AbstractBeforeAfterRule$1.evaluate(AbstractBeforeAfterRule.java:45)
   [junit4]   2> 	at org.apache.lucene.util.TestRuleThreadAndTestName$1.evaluate(TestRuleThreadAndTestName.java:48)
   [junit4]   2> 	at org.apache.lucene.util.TestRuleIgnoreAfterMaxFailures$1.evaluate(TestRuleIgnoreAfterMaxFailures.java:64)
   [junit4]   2> 	at org.apache.lucene.util.TestRuleMarkFailure$1.evaluate(TestRuleMarkFailure.java:47)
   [junit4]   2> 	at com.carrotsearch.randomizedtesting.rules.StatementAdapter.evaluate(StatementAdapter.java:36)
   [junit4]   2> 	at com.carrotsearch.randomizedtesting.ThreadLeakControl$StatementRunner.run(ThreadLeakControl.java:367)
   [junit4]   2> 	at com.carrotsearch.randomizedtesting.ThreadLeakControl.forkTimeoutingTask(ThreadLeakControl.java:811)
   [junit4]   2> 	at com.carrotsearch.randomizedtesting.ThreadLeakControl$3.evaluate(ThreadLeakControl.java:462)
   [junit4]   2> 	at com.carrotsearch.randomizedtesting.RandomizedRunner.runSingleTest(RandomizedRunner.java:916)
   [junit4]   2> 	at com.carrotsearch.randomizedtesting.RandomizedRunner$5.evaluate(RandomizedRunner.java:802)
   [junit4]   2> 	at com.carrotsearch.randomizedtesting.RandomizedRunner$6.evaluate(RandomizedRunner.java:852)
   [junit4]   2> 	at com.carrotsearch.randomizedtesting.RandomizedRunner$7.evaluate(RandomizedRunner.java:863)
   [junit4]   2> 	at com.carrotsearch.randomizedtesting.rules.StatementAdapter.evaluate(StatementAdapter.java:36)
   [junit4]   2> 	at com.carrotsearch.randomizedtesting.rules.SystemPropertiesRestoreRule$1.evaluate(SystemPropertiesRestoreRule.java:57)
   [junit4]   2> 	at org.apache.lucene.util.AbstractBeforeAfterRule$1.evaluate(AbstractBeforeAfterRule.java:45)
   [junit4]   2> 	at com.carrotsearch.randomizedtesting.rules.StatementAdapter.evaluate(StatementAdapter.java:36)
   [junit4]   2> 	at org.apache.lucene.util.TestRuleStoreClassName$1.evaluate(TestRuleStoreClassName.java:41)
   [junit4]   2> 	at com.carrotsearch.randomizedtesting.rules.NoShadowingOrOverridesOnMethodsRule$1.evaluate(NoShadowingOrOverridesOnMethodsRule.java:40)
   [junit4]   2> 	at com.carrotsearch.randomizedtesting.rules.NoShadowingOrOverridesOnMethodsRule$1.evaluate(NoShadowingOrOverridesOnMethodsRule.java:40)
   [junit4]   2> 	at com.carrotsearch.randomizedtesting.rules.StatementAdapter.evaluate(StatementAdapter.java:36)
   [junit4]   2> 	at com.carrotsearch.randomizedtesting.rules.StatementAdapter.evaluate(StatementAdapter.java:36)
   [junit4]   2> 	at com.carrotsearch.randomizedtesting.rules.StatementAdapter.evaluate(StatementAdapter.java:36)
   [junit4]   2> 	at org.apache.lucene.util.TestRuleAssertionsRequired$1.evaluate(TestRuleAssertionsRequired.java:53)
   [junit4]   2> 	at org.apache.lucene.util.TestRuleMarkFailure$1.evaluate(TestRuleMarkFailure.java:47)
   [junit4]   2> 	at org.apache.lucene.util.TestRuleIgnoreAfterMaxFailures$1.evaluate(TestRuleIgnoreAfterMaxFailures.java:64)
   [junit4]   2> 	at org.apache.lucene.util.TestRuleIgnoreTestSuites$1.evaluate(TestRuleIgnoreTestSuites.java:54)
   [junit4]   2> 	at com.carrotsearch.randomizedtesting.rules.StatementAdapter.evaluate(StatementAdapter.java:36)
   [junit4]   2> 	at com.carrotsearch.randomizedtesting.ThreadLeakControl$StatementRunner.run(ThreadLeakControl.java:367)
   [junit4]   2> 	at java.lang.Thread.run(Thread.java:745)
   [junit4]   2> Caused by: org.apache.solr.common.SolrException: java.util.concurrent.TimeoutException: Could not connect to ZooKeeper 127.0.0.1:42384/solr within 30000 ms
   [junit4]   2> 	at org.apache.solr.common.cloud.SolrZkClient.<init>(SolrZkClient.java:182)
   [junit4]   2> 	at org.apache.solr.common.cloud.SolrZkClient.<init>(SolrZkClient.java:116)
   [junit4]   2> 	at org.apache.solr.common.cloud.SolrZkClient.<init>(SolrZkClient.java:111)
   [junit4]   2> 	at org.apache.solr.common.cloud.SolrZkClient.<init>(SolrZkClient.java:98)
   [junit4]   2> 	at org.apache.solr.servlet.SolrDispatchFilter.loadNodeConfig(SolrDispatchFilter.java:223)
   [junit4]   2> 	... 50 more
   [junit4]   2> Caused by: java.util.concurrent.TimeoutException: Could not connect to ZooKeeper 127.0.0.1:42384/solr within 30000 ms
   [junit4]   2> 	at org.apache.solr.common.cloud.ConnectionManager.waitForConnected(ConnectionManager.java:233)
   [junit4]   2> 	at org.apache.solr.common.cloud.SolrZkClient.<init>(SolrZkClient.java:174)
   [junit4]   2> 	... 54 more
   [junit4]   2> 
   [junit4]   2> 1044374 WARN  (qtp2100679294-5462) [    ] o.e.j.h.HttpParser Illegal character 0x0 in state=START for buffer HeapByteBuffer@364c5753[p=1,l=49,c=8192,r=48]={\x00<<<\x00\x00-\x00\x00\x00\x00\x00\x00\x00\x00\x00\x00\x00\x00\x00\x00...\x00\x00\x00\x00\x00\x00\x00\x00\x00\x00\x00\x00\x00\x00\x00>>>h: 0\r\nConnection:...\x00\x00\x00\x00\x00\x00\x00\x00\x00\x00\x00\x00\x00\x00\x00}
   [junit4]   2> 1044374 WARN  (qtp2100679294-5462) [    ] o.e.j.h.HttpParser bad HTTP parsed: 400 Illegal character 0x0 for HttpChannelOverHttp@76b220bf{r=0,c=false,a=IDLE,uri=null}
   [junit4]   2> 1044374 WARN  (TEST-TestCustomStream.testDynamicLoadingCustomStream-seed#[C3ED2B1DFB256FD6]-SendThread(127.0.0.1:42384)) [    ] o.a.z.ClientCnxn Session 0x0 for server 127.0.0.1/127.0.0.1:42384, unexpected error, closing socket connection and attempting reconnect
   [junit4]   2> java.io.IOException: Packet len1213486160 is out of range!
   [junit4]   2> 	at org.apache.zookeeper.ClientCnxnSocket.readLength(ClientCnxnSocket.java:112)
   [junit4]   2> 	at org.apache.zookeeper.ClientCnxnSocketNIO.doIO(ClientCnxnSocketNIO.java:79)
   [junit4]   2> 	at org.apache.zookeeper.ClientCnxnSocketNIO.doTransport(ClientCnxnSocketNIO.java:366)
   [junit4]   2> 	at org.apache.zookeeper.ClientCnxn$SendThread.run(ClientCnxn.java:1081)
   [junit4]   2> 1045541 WARN  (qtp2100679294-5455) [    ] o.e.j.h.HttpParser Illegal character 0x0 in state=START for buffer HeapByteBuffer@778c0741[p=1,l=49,c=8192,r=48]={\x00<<<\x00\x00-\x00\x00\x00\x00\x00\x00\x00\x00\x00\x00\x00\x00\x00\x00...\x00\x00\x00\x00\x00\x00\x00\x00\x00\x00\x00\x00\x00\x00\x00>>>h: 0\r\nConnection:...\x00\x00\x00\x00\x00\x00\x00\x00\x00\x00\x00\x00\x00\x00\x00}
   [junit4]   2> 1045542 WARN  (qtp2100679294-5455) [    ] o.e.j.h.HttpParser bad HTTP parsed: 400 Illegal character 0x0 for HttpChannelOverHttp@4678e57{r=0,c=false,a=IDLE,uri=null}
   [junit4]   2> 1045542 WARN  (TEST-TestCustomStream.testDynamicLoadingCustomStream-seed#[C3ED2B1DFB256FD6]-SendThread(127.0.0.1:42384)) [    ] o.a.z.ClientCnxn Session 0x0 for server 127.0.0.1/127.0.0.1:42384, unexpected error, closing socket connection and attempting reconnect
   [junit4]   2> java.io.IOException: Packet len1213486160 is out of range!
   [junit4]   2> 	at org.apache.zookeeper.ClientCnxnSocket.readLength(ClientCnxnSocket.java:112)
   [junit4]   2> 	at org.apache.zookeeper.ClientCnxnSocketNIO.doIO(ClientCnxnSocketNIO.java:79)
   [junit4]   2> 	at org.apache.zookeeper.ClientCnxnSocketNIO.doTransport(ClientCnxnSocketNIO.java:366)
   [junit4]   2> 	at org.apache.zookeeper.ClientCnxn$SendThread.run(ClientCnxn.java:1081)
   [junit4]   2> 1047539 WARN  (qtp2100679294-5458) [    ] o.e.j.h.HttpParser Illegal character 0x0 in state=START for buffer HeapByteBuffer@364c5753[p=1,l=49,c=8192,r=48]={\x00<<<\x00\x00-\x00\x00\x00\x00\x00\x00\x00\x00\x00\x00\x00\x00\x00\x00...\x00\x00\x00\x00\x00\x00\x00\x00\x00\x00\x00\x00\x00\x00\x00>>>h: 0\r\nConnection:...\x00\x00\x00\x00\x00\x00\x00\x00\x00\x00\x00\x00\x00\x00\x00}
   [junit4]   2> 1047539 WARN  (qtp2100679294-5458) [    ] o.e.j.h.HttpParser bad HTTP parsed: 400 Illegal character 0x0 for HttpChannelOverHttp@7cf42b9b{r=0,c=false,a=IDLE,uri=null}
   [junit4]   2> 1047539 WARN  (TEST-TestCustomStream.testDynamicLoadingCustomStream-seed#[C3ED2B1DFB256FD6]-SendThread(127.0.0.1:42384)) [    ] o.a.z.ClientCnxn Session 0x0 for server 127.0.0.1/127.0.0.1:42384, unexpected error, closing socket connection and attempting reconnect
   [junit4]   2> java.io.IOException: Packet len1213486160 is out of range!
   [junit4]   2> 	at org.apache.zookeeper.ClientCnxnSocket.readLength(ClientCnxnSocket.java:112)
   [junit4]   2> 	at org.apache.zookeeper.ClientCnxnSocketNIO.doIO(ClientCnxnSocketNIO.java:79)
   [junit4]   2> 	at org.apache.zookeeper.ClientCnxnSocketNIO.doTransport(ClientCnxnSocketNIO.java:366)
   [junit4]   2> 	at org.apache.zookeeper.ClientCnxn$SendThread.run(ClientCnxn.java:1081)
   [junit4]   2> 1048910 WARN  (qtp2100679294-5461) [    ] o.e.j.h.HttpParser Illegal character 0x0 in state=START for buffer HeapByteBuffer@778c0741[p=1,l=49,c=8192,r=48]={\x00<<<\x00\x00-\x00\x00\x00\x00\x00\x00\x00\x00\x00\x00\x00\x00\x00\x00...\x00\x00\x00\x00\x00\x00\x00\x00\x00\x00\x00\x00\x00\x00\x00>>>h: 0\r\nConnection:...\x00\x00\x00\x00\x00\x00\x00\x00\x00\x00\x00\x00\x00\x00\x00}
   [junit4]   2> 1048910 WARN  (qtp2100679294-5461) [    ] o.e.j.h.HttpParser bad HTTP parsed: 400 Illegal character 0x0 for HttpChannelOverHttp@892739b{r=0,c=false,a=IDLE,uri=null}
   [junit4]   2> 1048911 WARN  (TEST-TestCustomStream.testDynamicLoadingCustomStream-seed#[C3ED2B1DFB256FD6]-SendThread(127.0.0.1:42384)) [    ] o.a.z.ClientCnxn Session 0x0 for server 127.0.0.1/127.0.0.1:42384, unexpected error, closing socket connection and attempting reconnect
   [junit4]   2> java.io.IOException: Packet len1213486160 is out of range!
   [junit4]   2> 	at org.apache.zookeeper.ClientCnxnSocket.readLength(ClientCnxnSocket.java:112)
   [junit4]   2> 	at org.apache.zookeeper.ClientCnxnSocketNIO.doIO(ClientCnxnSocketNIO.java:79)
   [junit4]   2> 	at org.apache.zookeeper.ClientCnxnSocketNIO.doTransport(ClientCnxnSocketNIO.java:366)
   [junit4]   2> 	at org.apache.zookeeper.ClientCnxn$SendThread.run(ClientCnxn.java:1081)
   [junit4]   2> 1050326 WARN  (qtp2100679294-5459) [    ] o.e.j.h.HttpParser Illegal character 0x0 in state=START for buffer HeapByteBuffer@364c5753[p=1,l=49,c=8192,r=48]={\x00<<<\x00\x00-\x00\x00\x00\x00\x00\x00\x00\x00\x00\x00\x00\x00\x00\x00...\x00\x00\x00\x00\x00\x00\x00\x00\x00\x00\x00\x00\x00\x00\x00>>>h: 0\r\nConnection:...\x00\x00\x00\x00\x00\x00\x00\x00\x00\x00\x00\x00\x00\x00\x00}
   [junit4]   2> 1050326 WARN  (qtp2100679294-5459) [    ] o.e.j.h.HttpParser bad HTTP parsed: 400 Illegal character 0x0 for HttpChannelOverHttp@7ab45bbd{r=0,c=false,a=IDLE,uri=null}
   [junit4]   2> 1050327 WARN  (TEST-TestCustomStream.testDynamicLoadingCustomStream-seed#[C3ED2B1DFB256FD6]-SendThread(127.0.0.1:42384)) [    ] o.a.z.ClientCnxn Session 0x0 for server 127.0.0.1/127.0.0.1:42384, unexpected error, closing socket connection and attempting reconnect
   [junit4]   2> java.io.IOException: Packet len1213486160 is out of range!
   [junit4]   2> 	at org.apache.zookeeper.ClientCnxnSocket.readLength(ClientCnxnSocket.java:112)
   [junit4]   2> 	at org.apache.zookeeper.ClientCnxnSocketNIO.doIO(ClientCnxnSocketNIO.java:79)
   [junit4]   2> 	at org.apache.zookeeper.ClientCnxnSocketNIO.doTransport(ClientCnxnSocketNIO.java:366)
   [junit4]   2> 	at org.apache.zookeeper.ClientCnxn$SendThread.run(ClientCnxn.java:1081)
   [junit4]   2> 1051534 WARN  (qtp2100679294-5462) [    ] o.e.j.h.HttpParser Illegal character 0x0 in state=START for buffer HeapByteBuffer@778c0741[p=1,l=49,c=8192,r=48]={\x00<<<\x00\x00-\x00\x00\x00\x00\x00\x00\x00\x00\x00\x00\x00\x00\x00\x00...\x00\x00\x00\x00\x00\x00\x00\x00\x00\x00\x00\x00\x00\x00\x00>>>h: 0\r\nConnection:...\x00\x00\x00\x00\x00\x00\x00\x00\x00\x00\x00\x00\x00\x00\x00}
   [junit4]   2> 1051534 WARN  (qtp2100679294-5462) [    ] o.e.j.h.HttpParser bad HTTP parsed: 400 Illegal character 0x0 for HttpChannelOverHttp@c84dc7c{r=0,c=false,a=IDLE,uri=null}
   [junit4]   2> 1051534 WARN  (TEST-TestCustomStream.testDynamicLoadingCustomStream-seed#[C3ED2B1DFB256FD6]-SendThread(127.0.0.1:42384)) [    ] o.a.z.ClientCnxn Session 0x0 for server 127.0.0.1/127.0.0.1:42384, unexpected error, closing socket connection and attempting reconnect
   [junit4]   2> java.io.IOException: Packet len1213486160 is out of range!
   [junit4]   2> 	at org.apache.zookeeper.ClientCnxnSocket.readLength(ClientCnxnSocket.java:112)
   [junit4]   2> 	at org.apache.zookeeper.ClientCnxnSocketNIO.doIO(ClientCnxnSocketNIO.java:79)
   [junit4]   2> 	at org.apache.zookeeper.ClientCnxnSocketNIO.doTransport(ClientCnxnSocketNIO.java:366)
   [junit4]   2> 	at org.apache.zookeeper.ClientCnxn$SendThread.run(ClientCnxn.java:1081)
   [junit4]   2> 1053416 WARN  (qtp2100679294-5455) [    ] o.e.j.h.HttpParser Illegal character 0x0 in state=START for buffer HeapByteBuffer@364c5753[p=1,l=49,c=8192,r=48]={\x00<<<\x00\x00-\x00\x00\x00\x00\x00\x00\x00\x00\x00\x00\x00\x00\x00\x00...\x00\x00\x00\x00\x00\x00\x00\x00\x00\x00\x00\x00\x00\x00\x00>>>h: 0\r\nConnection:...\x00\x00\x00\x00\x00\x00\x00\x00\x00\x00\x00\x00\x00\x00\x00}
   [junit4]   2> 1053416 WARN  (qtp2100679294-5455) [    ] o.e.j.h.HttpParser bad HTTP parsed: 400 Illegal character 0x0 for HttpChannelOverHttp@a31c0ad{r=0,c=false,a=IDLE,uri=null}
   [junit4]   2> 1053417 WARN  (TEST-TestCustomStream.testDynamicLoadingCustomStream-seed#[C3ED2B1DFB256FD6]-SendThread(127.0.0.1:42384)) [    ] o.a.z.ClientCnxn Session 0x0 for server 127.0.0.1/127.0.0.1:42384, unexpected error, closing socket connection and attempting reconnect
   [junit4]   2> java.io.IOException: Packet len1213486160 is out of range!
   [junit4]   2> 	at org.apache.zookeeper.ClientCnxnSocket.readLength(ClientCnxnSocket.java:112)
   [junit4]   2> 	at org.apache.zookeeper.ClientCnxnSocketNIO.doIO(ClientCnxnSocketNIO.java:79)
   [junit4]   2> 	at org.apache.zookeeper.ClientCnxnSocketNIO.doTransport(ClientCnxnSocketNIO.java:366)
   [junit4]   2> 	at org.apache.zookeeper.ClientCnxn$SendThread.run(ClientCnxn.java:1081)
   [junit4]   2> 1055097 WARN  (qtp2100679294-5458) [    ] o.e.j.h.HttpParser Illegal character 0x0 in state=START for buffer HeapByteBuffer@778c0741[p=1,l=49,c=8192,r=48]={\x00<<<\x00\x00-\x00\x00\x00\x00\x00\x00\x00\x00\x00\x00\x00\x00\x00\x00...\x00\x00\x00\x00\x00\x00\x00\x00\x00\x00\x00\x00\x00\x00\x00>>>h: 0\r\nConnection:...\x00\x00\x00\x00\x00\x00\x00\x00\x00\x00\x00\x00\x00\x00\x00}
   [junit4]   2> 1055098 WARN  (qtp2100679294-5458) [    ] o.e.j.h.HttpParser bad HTTP parsed: 400 Illegal character 0x0 for HttpChannelOverHttp@5b95e6f{r=0,c=false,a=IDLE,uri=null}
   [junit4]   2> 1055198 INFO  (TEST-TestCustomStream.testDynamicLoadingCustomStream-seed#[C3ED2B1DFB256FD6]) [    ] o.a.s.c.ChaosMonkey monkey: stop shard! 42384
   [junit4]   2> 1055199 INFO  (TEST-TestCustomStream.testDynamicLoadingCustomStream-seed#[C3ED2B1DFB256FD6]) [    ] o.e.j.s.AbstractConnector Stopped ServerConnector@6d07d20f{HTTP/1.1,[http/1.1]}{127.0.0.1:0}
   [junit4]   2> 1055199 INFO  (TEST-TestCustomStream.testDynamicLoadingCustomStream-seed#[C3ED2B1DFB256FD6]) [    ] o.e.j.s.h.ContextHandler Stopped o.e.j.s.ServletContextHandler@731a2b0f{/ne,null,UNAVAILABLE}
   [junit4]   2> 1055202 INFO  (TEST-TestCustomStream.testDynamicLoadingCustomStream-seed#[C3ED2B1DFB256FD6]) [    ] o.a.s.c.ZkTestServer connecting to 127.0.0.1:42384 42384
   [junit4]   2> 1055221 INFO  (Thread-1461) [    ] o.a.s.c.ZkTestServer connecting to 127.0.0.1:42384 42384
   [junit4]   2> NOTE: reproduce with: ant test  -Dtestcase=TestCustomStream -Dtests.method=testDynamicLoadingCustomStream -Dtests.seed=C3ED2B1DFB256FD6 -Dtests.slow=true -Dtests.locale=id -Dtests.timezone=America/Paramaribo -Dtests.asserts=true -Dtests.file.encoding=UTF-8
   [junit4] ERROR   41.6s J1 | TestCustomStream.testDynamicLoadingCustomStream <<<
   [junit4]    > Throwable #1: org.apache.solr.common.SolrException: java.util.concurrent.TimeoutException: Could not connect to ZooKeeper 127.0.0.1:42384/solr within 10000 ms
   [junit4]    > 	at __randomizedtesting.SeedInfo.seed([C3ED2B1DFB256FD6:B358223F01DF2461]:0)
   [junit4]    > 	at org.apache.solr.common.cloud.SolrZkClient.<init>(SolrZkClient.java:182)
   [junit4]    > 	at org.apache.solr.common.cloud.SolrZkClient.<init>(SolrZkClient.java:116)
   [junit4]    > 	at org.apache.solr.common.cloud.SolrZkClient.<init>(SolrZkClient.java:106)
   [junit4]    > 	at org.apache.solr.common.cloud.ZkStateReader.<init>(ZkStateReader.java:226)
   [junit4]    > 	at org.apache.solr.client.solrj.impl.ZkClientClusterStateProvider.connect(ZkClientClusterStateProvider.java:121)
   [junit4]    > 	at org.apache.solr.client.solrj.impl.CloudSolrClient.connect(CloudSolrClient.java:610)
   [junit4]    > 	at org.apache.solr.cloud.AbstractFullDistribZkTestBase.initCloud(AbstractFullDistribZkTestBase.java:268)
   [junit4]    > 	at org.apache.solr.cloud.AbstractFullDistribZkTestBase.createServers(AbstractFullDistribZkTestBase.java:330)
   [junit4]    > 	at org.apache.solr.BaseDistributedSearchTestCase$ShardsRepeatRule$ShardsFixedStatement.callStatement(BaseDistributedSearchTestCase.java:983)
   [junit4]    > 	at org.apache.solr.BaseDistributedSearchTestCase$ShardsRepeatRule$ShardsStatement.evaluate(BaseDistributedSearchTestCase.java:960)
   [junit4]    > 	at java.lang.Thread.run(Thread.java:745)
   [junit4]    > Caused by: java.util.concurrent.TimeoutException: Could not connect to ZooKeeper 127.0.0.1:42384/solr within 10000 ms
   [junit4]    > 	at org.apache.solr.common.cloud.ConnectionManager.waitForConnected(ConnectionManager.java:233)
   [junit4]    > 	at org.apache.solr.common.cloud.SolrZkClient.<init>(SolrZkClient.java:174)
   [junit4]    > 	... 40 more
   [junit4]   2> 1055225 INFO  (SUITE-TestCustomStream-seed#[C3ED2B1DFB256FD6]-worker) [    ] o.a.s.SolrTestCaseJ4 ###deleteCore
   [junit4]   2> NOTE: leaving temporary files on disk at: /export/home/jenkins/workspace/Lucene-Solr-master-Solaris/solr/build/solr-core/test/J1/temp/solr.core.TestCustomStream_C3ED2B1DFB256FD6-001
   [junit4]   2> Dec 04, 2016 3:27:15 PM com.carrotsearch.randomizedtesting.ThreadLeakControl checkThreadLeaks
   [junit4]   2> WARNING: Will linger awaiting termination of 1 leaked thread(s).
   [junit4]   2> NOTE: test params are: codec=Asserting(Lucene70): {}, docValues:{}, maxPointsInLeafNode=564, maxMBSortInHeap=7.680887744352118, sim=RandomSimilarity(queryNorm=false): {}, locale=id, timezone=America/Paramaribo
   [junit4]   2> NOTE: SunOS 5.11 amd64/Oracle Corporation 1.8.0_102 (64-bit)/cpus=3,threads=1,free=33050888,total=307388416
   [junit4]   2> NOTE: All tests run in this JVM: [CSVRequestHandlerTest, TestComplexPhraseQParserPlugin, TestMiniSolrCloudClusterSSL, TestBlendedInfixSuggestions, TestLMJelinekMercerSimilarityFactory, SharedFSAutoReplicaFailoverTest, SortSpecParsingTest, UpdateRequestProcessorFactoryTest, TestQuerySenderListener, TestConfigSetsAPI, SortByFunctionTest, CleanupOldIndexTest, ClassificationUpdateProcessorFactoryTest, LeaderElectionContextKeyTest, AddSchemaFieldsUpdateProcessorFactoryTest, WordBreakSolrSpellCheckerTest, ParsingFieldUpdateProcessorsTest, AliasIntegrationTest, UUIDFieldTest, TestAtomicUpdateErrorCases, JavabinLoaderTest, TestCloudInspectUtil, SuggesterTSTTest, TestNumericTerms32, TestHdfsBackupRestoreCore, TestDefaultStatsCache, TestJsonRequest, AsyncCallRequestStatusResponseTest, SecurityConfHandlerTest, TestJsonFacetRefinement, TestRealTimeGet, CircularListTest, TestCustomDocTransformer, TestReload, TestBulkSchemaConcurrent, DistribJoinFromCollectionTest, DirectUpdateHandlerOptimizeTest, TestFreeTextSuggestions, RemoteQueryErrorTest, TestSolrConfigHandler, BlockCacheTest, SuggestComponentContextFilterQueryTest, DistributedTermsComponentTest, ZkStateWriterTest, HighlighterConfigTest, TestLRUStatsCache, CoreAdminHandlerTest, TestScoreJoinQPNoScore, TestLuceneMatchVersion, DeleteNodeTest, CacheHeaderTest, TestRandomFaceting, DistributedFacetPivotLargeTest, DateMathParserTest, TestTolerantUpdateProcessorCloud, TestCodecSupport, FieldMutatingUpdateProcessorTest, LoggingHandlerTest, TestManagedResourceStorage, OverseerModifyCollectionTest, TestManagedStopFilterFactory, SolrCmdDistributorTest, TestXmlQParser, TestZkChroot, BlobRepositoryCloudTest, LeaderElectionIntegrationTest, OpenCloseCoreStressTest, TestCoreDiscovery, TestCustomStream]
   [junit4] Completed [218/658 (1!)] on J1 in 42.71s, 1 test, 1 error <<< FAILURES!

[...truncated 882 lines...]
   [junit4] Suite: org.apache.solr.cloud.TestSolrCloudWithDelegationTokens
   [junit4]   2> Creating dataDir: /export/home/jenkins/workspace/Lucene-Solr-master-Solaris/solr/build/solr-core/test/J1/temp/solr.cloud.TestSolrCloudWithDelegationTokens_C3ED2B1DFB256FD6-001/init-core-data-001
   [junit4]   2> 2523348 INFO  (SUITE-TestSolrCloudWithDelegationTokens-seed#[C3ED2B1DFB256FD6]-worker) [    ] o.a.s.SolrTestCaseJ4 Randomized ssl (false) and clientAuth (false) via: @org.apache.solr.util.RandomizeSSL(reason=, value=NaN, ssl=NaN, clientAuth=NaN)
   [junit4]   2> 2523350 INFO  (SUITE-TestSolrCloudWithDelegationTokens-seed#[C3ED2B1DFB256FD6]-worker) [    ] o.a.s.c.MiniSolrCloudCluster Starting cluster of 2 servers in /export/home/jenkins/workspace/Lucene-Solr-master-Solaris/solr/build/solr-core/test/J1/temp/solr.cloud.TestSolrCloudWithDelegationTokens_C3ED2B1DFB256FD6-001/tempDir-001
   [junit4]   2> 2523350 INFO  (SUITE-TestSolrCloudWithDelegationTokens-seed#[C3ED2B1DFB256FD6]-worker) [    ] o.a.s.c.ZkTestServer STARTING ZK TEST SERVER
   [junit4]   2> 2523351 INFO  (Thread-5109) [    ] o.a.s.c.ZkTestServer client port:0.0.0.0/0.0.0.0:0
   [junit4]   2> 2523351 INFO  (Thread-5109) [    ] o.a.s.c.ZkTestServer Starting server
   [junit4]   2> 2523451 INFO  (SUITE-TestSolrCloudWithDelegationTokens-seed#[C3ED2B1DFB256FD6]-worker) [    ] o.a.s.c.ZkTestServer start zk server on port:54404
   [junit4]   2> 2523457 INFO  (jetty-launcher-2642-thread-2) [    ] o.e.j.s.Server jetty-9.3.14.v20161028
   [junit4]   2> 2523457 INFO  (jetty-launcher-2642-thread-1) [    ] o.e.j.s.Server jetty-9.3.14.v20161028
   [junit4]   2> 2523461 INFO  (jetty-launcher-2642-thread-1) [    ] o.e.j.s.h.ContextHandler Started o.e.j.s.ServletContextHandler@b5527b9{/solr,null,AVAILABLE}
   [junit4]   2> 2523461 INFO  (jetty-launcher-2642-thread-2) [    ] o.e.j.s.h.ContextHandler Started o.e.j.s.ServletContextHandler@4daf900{/solr,null,AVAILABLE}
   [junit4]   2> 2523461 INFO  (jetty-launcher-2642-thread-2) [    ] o.e.j.s.AbstractConnector Started ServerConnector@e637fba{HTTP/1.1,[http/1.1]}{127.0.0.1:63084}
   [junit4]   2> 2523461 INFO  (jetty-launcher-2642-thread-2) [    ] o.e.j.s.Server Started @2527171ms
   [junit4]   2> 2523461 INFO  (jetty-launcher-2642-thread-2) [    ] o.a.s.c.s.e.JettySolrRunner Jetty properties: {hostContext=/solr, hostPort=63084}
   [junit4]   2> 2523462 INFO  (jetty-launcher-2642-thread-1) [    ] o.e.j.s.AbstractConnector Started ServerConnector@77100b9{HTTP/1.1,[http/1.1]}{127.0.0.1:60923}
   [junit4]   2> 2523462 ERROR (jetty-launcher-2642-thread-2) [    ] o.a.s.s.StartupLoggingUtils Missing Java Option solr.log.dir. Logging may be missing or incomplete.
   [junit4]   2> 2523462 INFO  (jetty-launcher-2642-thread-2) [    ] o.a.s.s.SolrDispatchFilter  ___      _       Welcome to Apache Solr™ version 7.0.0
   [junit4]   2> 2523462 INFO  (jetty-launcher-2642-thread-2) [    ] o.a.s.s.SolrDispatchFilter / __| ___| |_ _   Starting in cloud mode on port null
   [junit4]   2> 2523462 INFO  (jetty-launcher-2642-thread-2) [    ] o.a.s.s.SolrDispatchFilter \__ \/ _ \ | '_|  Install dir: null
   [junit4]   2> 2523462 INFO  (jetty-launcher-2642-thread-2) [    ] o.a.s.s.SolrDispatchFilter |___/\___/_|_|    Start time: 2016-12-04T15:51:43.354Z
   [junit4]   2> 2523462 INFO  (jetty-launcher-2642-thread-1) [    ] o.e.j.s.Server Started @2527171ms
   [junit4]   2> 2523463 INFO  (jetty-launcher-2642-thread-1) [    ] o.a.s.c.s.e.JettySolrRunner Jetty properties: {hostContext=/solr, hostPort=60923}
   [junit4]   2> 2523463 ERROR (jetty-launcher-2642-thread-1) [    ] o.a.s.s.StartupLoggingUtils Missing Java Option solr.log.dir. Logging may be missing or incomplete.
   [junit4]   2> 2523463 INFO  (jetty-launcher-2642-thread-1) [    ] o.a.s.s.SolrDispatchFilter  ___      _       Welcome to Apache Solr™ version 7.0.0
   [junit4]   2> 2523463 INFO  (jetty-launcher-2642-thread-1) [    ] o.a.s.s.SolrDispatchFilter / __| ___| |_ _   Starting in cloud mode on port null
   [junit4]   2> 2523463 INFO  (jetty-launcher-2642-thread-1) [    ] o.a.s.s.SolrDispatchFilter \__ \/ _ \ | '_|  Install dir: null
   [junit4]   2> 2523463 INFO  (jetty-launcher-2642-thread-1) [    ] o.a.s.s.SolrDispatchFilter |___/\___/_|_|    Start time: 2016-12-04T15:51:43.355Z
   [junit4]   2> 2523466 INFO  (jetty-launcher-2642-thread-1) [    ] o.a.s.s.SolrDispatchFilter solr.xml found in ZooKeeper. Loading...
   [junit4]   2> 2523466 INFO  (jetty-launcher-2642-thread-2) [    ] o.a.s.s.SolrDispatchFilter solr.xml found in ZooKeeper. Loading...
   [junit4]   2> 2523474 INFO  (jetty-launcher-2642-thread-2) [    ] o.a.s.c.ZkContainer Zookeeper client=127.0.0.1:54404/solr
   [junit4]   2> 2523477 INFO  (jetty-launcher-2642-thread-1) [    ] o.a.s.c.ZkContainer Zookeeper client=127.0.0.1:54404/solr
   [junit4]   2> 2523506 INFO  (jetty-launcher-2642-thread-2) [n:127.0.0.1:63084_solr    ] o.a.s.c.OverseerElectionContext I am going to be the leader 127.0.0.1:63084_solr
   [junit4]   2> 2523508 INFO  (jetty-launcher-2642-thread-2) [n:127.0.0.1:63084_solr    ] o.a.s.c.Overseer Overseer (id=97050080263798789-127.0.0.1:63084_solr-n_0000000000) starting
   [junit4]   2> 2523519 INFO  (jetty-launcher-2642-thread-2) [n:127.0.0.1:63084_solr    ] o.a.s.c.ZkController Register node as live in ZooKeeper:/live_nodes/127.0.0.1:63084_solr
   [junit4]   2> 2523522 INFO  (OverseerStateUpdate-97050080263798789-127.0.0.1:63084_solr-n_0000000000) [n:127.0.0.1:63084_solr    ] o.a.s.c.c.ZkStateReader Updated live nodes from ZooKeeper... (0) -> (1)
   [junit4]   2> 2523526 INFO  (jetty-launcher-2642-thread-1) [n:127.0.0.1:60923_solr    ] o.a.s.c.c.ZkStateReader Updated live nodes from ZooKeeper... (0) -> (1)
   [junit4]   2> 2523532 INFO  (jetty-launcher-2642-thread-1) [n:127.0.0.1:60923_solr    ] o.a.s.c.ZkController Register node as live in ZooKeeper:/live_nodes/127.0.0.1:60923_solr
   [junit4]   2> 2523534 INFO  (zkCallback-2652-thread-1-processing-n:127.0.0.1:63084_solr) [n:127.0.0.1:63084_solr    ] o.a.s.c.c.ZkStateReader Updated live nodes from ZooKeeper... (1) -> (2)
   [junit4]   2> 2523535 INFO  (zkCallback-2653-thread-1-processing-n:127.0.0.1:60923_solr) [n:127.0.0.1:60923_solr    ] o.a.s.c.c.ZkStateReader Updated live nodes from ZooKeeper... (1) -> (2)
   [junit4]   2> 2523597 INFO  (jetty-launcher-2642-thread-1) [n:127.0.0.1:60923_solr    ] o.a.s.c.CoreContainer Initializing authentication plugin: org.apache.solr.security.HttpParamDelegationTokenPlugin
   [junit4]   2> 2523603 INFO  (jetty-launcher-2642-thread-1) [n:127.0.0.1:60923_solr    ] o.a.s.s.KerberosPlugin Params: {token.valid=30, delegation-token.token-kind=solr-dt, cookie.domain=127.0.0.1, cookie.path=/, zk-dt-secret-manager.znodeWorkingPath=solr/security/zkdtsm, token.validity=36000, signer.secret.provider.zookeeper.path=/token, type=kerberos, zk-dt-secret-manager.enable=true, kerberos.name.rules=DEFAULT, signer.secret.provider=zookeeper}
   [junit4]   2> 2523624 INFO  (jetty-launcher-2642-thread-2) [n:127.0.0.1:63084_solr    ] o.a.s.c.CoreContainer Initializing authentication plugin: org.apache.solr.security.HttpParamDelegationTokenPlugin
   [junit4]   2> 2523624 INFO  (jetty-launcher-2642-thread-2) [n:127.0.0.1:63084_solr    ] o.a.s.s.KerberosPlugin Params: {token.valid=30, delegation-token.token-kind=solr-dt, cookie.domain=127.0.0.1, cookie.path=/, zk-dt-secret-manager.znodeWorkingPath=solr/security/zkdtsm, token.validity=36000, signer.secret.provider.zookeeper.path=/token, type=kerberos, zk-dt-secret-manager.enable=true, kerberos.name.rules=DEFAULT, signer.secret.provider=zookeeper}
   [junit4]   2> 2523702 INFO  (jetty-launcher-2642-thread-1) [n:127.0.0.1:60923_solr    ] o.a.c.f.i.CuratorFrameworkImpl Starting
   [junit4]   2> 2523702 INFO  (jetty-launcher-2642-thread-2) [n:127.0.0.1:63084_solr    ] o.a.c.f.i.CuratorFrameworkImpl Starting
   [junit4]   2> 2523728 INFO  (jetty-launcher-2642-thread-1-EventThread) [n:127.0.0.1:60923_solr    ] o.a.c.f.s.ConnectionStateManager State change: CONNECTED
   [junit4]   2> 2523728 INFO  (jetty-launcher-2642-thread-2-EventThread) [n:127.0.0.1:63084_solr    ] o.a.c.f.s.ConnectionStateManager State change: CONNECTED
   [junit4]   2> 2523891 INFO  (jetty-launcher-2642-thread-2) [n:127.0.0.1:63084_solr    ] o.a.s.c.CorePropertiesLocator Found 0 core definitions underneath /export/home/jenkins/workspace/Lucene-Solr-master-Solaris/solr/build/solr-core/test/J1/temp/solr.cloud.TestSolrCloudWithDelegationTokens_C3ED2B1DFB256FD6-001/tempDir-001/node2/.
   [junit4]   2> 2523894 INFO  (jetty-launcher-2642-thread-1) [n:127.0.0.1:60923_solr    ] o.a.s.c.CorePropertiesLocator Found 0 core definitions underneath /export/home/jenkins/workspace/Lucene-Solr-master-Solaris/solr/build/solr-core/test/J1/temp/solr.cloud.TestSolrCloudWithDelegationTokens_C3ED2B1DFB256FD6-001/tempDir-001/node1/.
   [junit4]   2> 2523900 WARN  (NIOServerCxn.Factory:0.0.0.0/0.0.0.0:0) [    ] o.a.z.s.NIOServerCnxn caught end of stream exception
   [junit4]   2> EndOfStreamException: Unable to read additional data from client sessionid 0x158ca88a78c0009, likely client has closed socket
   [junit4]   2> 	at org.apache.zookeeper.server.NIOServerCnxn.doIO(NIOServerCnxn.java:228)
   [junit4]   2> 	at org.apache.zookeeper.server.NIOServerCnxnFactory.run(NIOServerCnxnFactory.java:208)
   [junit4]   2> 	at java.lang.Thread.run(Thread.java:745)
   [junit4]   2> 2523939 INFO  (TEST-TestSolrCloudWithDelegationTokens.testDelegationTokenCancel-seed#[C3ED2B1DFB256FD6]) [    ] o.a.s.SolrTestCaseJ4 ###Starting testDelegationTokenCancel
   [junit4]   2> 2524007 ERROR (qtp380937453-18103) [    ] o.a.h.s.t.d.ZKDelegationTokenSecretManager No node in path [/ZKDTSMTokensRoot/DT_1]
   [junit4]   2> 2524030 INFO  (TEST-TestSolrCloudWithDelegationTokens.testDelegationTokenCancel-seed#[C3ED2B1DFB256FD6]) [    ] o.a.s.c.c.ZkStateReader Updated live nodes from ZooKeeper... (0) -> (2)
   [junit4]   2> 2524031 INFO  (TEST-TestSolrCloudWithDelegationTokens.testDelegationTokenCancel-seed#[C3ED2B1DFB256FD6]) [    ] o.a.s.c.s.i.ZkClientClusterStateProvider Cluster at 127.0.0.1:54404/solr ready
   [junit4]   2> 2524047 ERROR (qtp1278823760-18106) [    ] o.a.h.s.t.d.ZKDelegationTokenSecretManager No node in path [/ZKDTSMTokensRoot/DT_2]
   [junit4]   2> 2524055 INFO  (TEST-TestSolrCloudWithDelegationTokens.testDelegationTokenCancel-seed#[C3ED2B1DFB256FD6]) [    ] o.a.s.c.c.ZkStateReader Updated live nodes from ZooKeeper... (0) -> (2)
   [junit4]   2> 2524056 INFO  (TEST-TestSolrCloudWithDelegationTokens.testDelegationTokenCancel-seed#[C3ED2B1DFB256FD6]) [    ] o.a.s.c.s.i.ZkClientClusterStateProvider Cluster at 127.0.0.1:54404/solr ready
   [junit4]   2> 2524061 INFO  (TEST-TestSolrCloudWithDelegationTokens.testDelegationTokenCancel-seed#[C3ED2B1DFB256FD6]) [    ] o.a.s.SolrTestCaseJ4 ###Ending testDelegationTokenCancel
   [junit4]   2> 2524094 INFO  (TEST-TestSolrCloudWithDelegationTokens.testDelegationTokenRenew-seed#[C3ED2B1DFB256FD6]) [    ] o.a.s.SolrTestCaseJ4 ###Starting testDelegationTokenRenew
   [junit4]   2> 2524113 INFO  (qtp380937453-18092) [n:127.0.0.1:63084_solr    ] o.a.s.h.a.CollectionsHandler Invoked Collection Action :list with params action=LIST&delegation=GgADYmFyA2JhcgCKAVjKiKpzigFY7pUucwMEFEESxX_PUh5cPORspdXTtNflkVpcB3NvbHItZHQA&wt=javabin&version=2 and sendToOCPQueue=true
   [junit4]   2> 2524113 INFO  (qtp380937453-18092) [n:127.0.0.1:63084_solr    ] o.a.s.s.HttpSolrCall [admin] webapp=null path=/admin/collections params={action=LIST&delegation=GgADYmFyA2JhcgCKAVjKiKpzigFY7pUucwMEFEESxX_PUh5cPORspdXTtNflkVpcB3NvbHItZHQA&wt=javabin&version=2} status=0 QTime=0
   [junit4]   2> 2524121 INFO  (TEST-TestSolrCloudWithDelegationTokens.testDelegationTokenRenew-seed#[C3ED2B1DFB256FD6]) [    ] o.a.s.c.c.ZkStateReader Updated live nodes from ZooKeeper... (0) -> (2)
   [junit4]   2> 2524122 INFO  (TEST-TestSolrCloudWithDelegationTokens.testDelegationTokenRenew-seed#[C3ED2B1DFB256FD6]) [    ] o.a.s.c.s.i.ZkClientClusterStateProvider Cluster at 127.0.0.1:54404/solr ready
   [junit4]   2> 2524129 INFO  (TEST-TestSolrCloudWithDelegationTokens.testDelegationTokenRenew-seed#[C3ED2B1DFB256FD6]) [    ] o.a.s.c.c.ZkStateReader Updated live nodes from ZooKeeper... (0) -> (2)
   [junit4]   2> 2524130 INFO  (TEST-TestSolrCloudWithDelegationTokens.testDelegationTokenRenew-seed#[C3ED2B1DFB256FD6]) [    ] o.a.s.c.s.i.ZkClientClusterStateProvider Cluster at 127.0.0.1:54404/solr ready
   [junit4]   2> 2524132 INFO  (qtp1278823760-18093) [n:127.0.0.1:60923_solr    ] o.a.s.h.a.CollectionsHandler Invoked Collection Action :list with params action=LIST&delegation=GgADYmFyA2JhcgCKAVjKiKpzigFY7pUucwMEFEESxX_PUh5cPORspdXTtNflkVpcB3NvbHItZHQA&wt=javabin&version=2 and sendToOCPQueue=true
   [junit4]   2> 2524132 INFO  (qtp1278823760-18093) [n:127.0.0.1:60923_solr    ] o.a.s.s.HttpSolrCall [admin] webapp=null path=/admin/collections params={action=LIST&delegation=GgADYmFyA2JhcgCKAVjKiKpzigFY7pUucwMEFEESxX_PUh5cPORspdXTtNflkVpcB3NvbHItZHQA&wt=javabin&version=2} status=0 QTime=0
   [junit4]   2> 2524137 INFO  (TEST-TestSolrCloudWithDelegationTokens.testDelegationTokenRenew-seed#[C3ED2B1DFB256FD6]) [    ] o.a.s.c.c.ZkStateReader Updated live nodes from ZooKeeper... (0) -> (2)
   [junit4]   2> 2524138 INFO  (TEST-TestSolrCloudWithDelegationTokens.testDelegationTokenRenew-seed#[C3ED2B1DFB256FD6]) [    ] o.a.s.c.s.i.ZkClientClusterStateProvider Cluster at 127.0.0.1:54404/solr ready
   [junit4]   2> 2524160 INFO  (TEST-TestSolrCloudWithDelegationTokens.testDelegationTokenRenew-seed#[C3ED2B1DFB256FD6]) [    ] o.a.s.c.c.ZkStateReader Updated live nodes from ZooKeeper... (0) -> (2)
   [junit4]   2> 2524161 INFO  (TEST-TestSolrCloudWithDelegationTokens.testDelegationTokenRenew-seed#[C3ED2B1DFB256FD6]) [    ] o.a.s.c.s.i.ZkClientClusterStateProvider Cluster at 127.0.0.1:54404/solr ready
   [junit4]   2> 2524162 INFO  (qtp1278823760-18099) [n:127.0.0.1:60923_solr    ] o.a.s.h.a.CollectionsHandler Invoked Collection Action :list with params action=LIST&delegation=GgADYmFyA2JhcgCKAVjKiKqhigFY7pUuoQQEFGNZJQcqt_blva1u1vDYWJcXd5RMB3NvbHItZHQA&wt=javabin&version=2 and sendToOCPQueue=true
   [junit4]   2> 2524163 INFO  (qtp1278823760-18099) [n:127.0.0.1:60923_solr    ] o.a.s.s.HttpSolrCall [admin] webapp=null path=/admin/collections params={action=LIST&delegation=GgADYmFyA2JhcgCKAVjKiKqhigFY7pUuoQQEFGNZJQcqt_blva1u1vDYWJcXd5RMB3NvbHItZHQA&wt=javabin&version=2} status=0 QTime=0
   [junit4]   2> 2524168 INFO  (TEST-TestSolrCloudWithDelegationTokens.testDelegationTokenRenew-seed#[C3ED2B1DFB256FD6]) [    ] o.a.s.c.c.ZkStateReader Updated live nodes from ZooKeeper... (0) -> (2)
   [junit4]   2> 2524169 INFO  (TEST-TestSolrCloudWithDelegationTokens.testDelegationTokenRenew-seed#[C3ED2B1DFB256FD6]) [    ] o.a.s.c.s.i.ZkClientClusterStateProvider Cluster at 127.0.0.1:54404/solr ready
   [junit4]   2> 2524173 INFO  (qtp1278823760-18093) [n:127.0.0.1:60923_solr    ] o.a.s.h.a.CollectionsHandler Invoked Collection Action :list with params action=LIST&delegation=GgADYmFyA2JhcgCKAVjKiKqhigFY7pUuoQQEFGNZJQcqt_blva1u1vDYWJcXd5RMB3NvbHItZHQA&wt=javabin&version=2 and sendToOCPQueue=true
   [junit4]   2> 2524173 INFO  (qtp1278823760-18093) [n:127.0.0.1:60923_solr    ] o.a.s.s.HttpSolrCall [admin] webapp=null path=/admin/collections params={action=LIST&delegation=GgADYmFyA2JhcgCKAVjKiKqhigFY7pUuoQQEFGNZJQcqt_blva1u1vDYWJcXd5RMB3NvbHItZHQA&wt=javabin&version=2} status=0 QTime=0
   [junit4]   2> 2524178 INFO  (TEST-TestSolrCloudWithDelegationTokens.testDelegationTokenRenew-seed#[C3ED2B1DFB256FD6]) [    ] o.a.s.c.c.ZkStateReader Updated live nodes from ZooKeeper... (0) -> (2)
   [junit4]   2> 2524180 INFO  (TEST-TestSolrCloudWithDelegationTokens.testDelegationTokenRenew-seed#[C3ED2B1DFB256FD6]) [    ] o.a.s.c.s.i.ZkClientClusterStateProvider Cluster at 127.0.0.1:54404/solr ready
   [junit4]   2> 2524190 INFO  (qtp380937453-18097) [n:127.0.0.1:63084_solr    ] o.a.s.h.a.CollectionsHandler Invoked Collection Action :list with params action=LIST&delegation=GgADYmFyA2JhcgCKAVjKiKrKigFY7pUuygUEFMZJdTCZpS5rabMHDKbIwghuykvEB3NvbHItZHQA&wt=javabin&version=2 and sendToOCPQueue=true
   [junit4]   2> 2524191 INFO  (qtp380937453-18097) [n:127.0.0.1:63084_solr    ] o.a.s.s.HttpSolrCall [admin] webapp=null path=/admin/collections params={action=LIST&delegation=GgADYmFyA2JhcgCKAVjKiKrKigFY7pUuygUEFMZJdTCZpS5rabMHDKbIwghuykvEB3NvbHItZHQA&wt=javabin&version=2} status=0 QTime=0
   [junit4]   2> 2524196 INFO  (TEST-TestSolrCloudWithDelegationTokens.testDelegationTokenRenew-seed#[C3ED2B1DFB256FD6]) [    ] o.a.s.c.c.ZkStateReader Updated live nodes from ZooKeeper... (0) -> (2)
   [junit4]   2> 2524198 INFO  (TEST-TestSolrCloudWithDelegationTokens.testDelegationTokenRenew-seed#[C3ED2B1DFB256FD6]) [    ] o.a.s.c.s.i.ZkClientClusterStateProvider Cluster at 127.0.0.1:54404/solr ready
   [junit4]   2> 2524200 WARN  (NIOServerCxn.Factory:0.0.0.0/0.0.0.0:0) [    ] o.a.z.s.NIOServerCnxn caught end of stream exception
   [junit4]   2> EndOfStreamException: Unable to read additional data from client sessionid 0x158ca88a78c0012, likely client has closed socket
   [junit4]   2> 	at org.apache.zookeeper.server.NIOServerCnxn.doIO(NIOServerCnxn.java:228)
   [junit4]   2> 	at org.apache.zookeeper.server.NIOServerCnxnFactory.run(NIOServerCnxnFactory.java:208)
   [junit4]   2> 	at java.lang.Thread.run(Thread.java:745)
   [junit4]   2> 2524204 INFO  (TEST-TestSolrCloudWithDelegationTokens.testDelegationTokenRenew-seed#[C3ED2B1DFB256FD6]) [    ] o.a.s.c.c.ZkStateReader Updated live nodes from ZooKeeper... (0) -> (2)
   [junit4]   2> 2524206 INFO  (TEST-TestSolrCloudWithDelegationTokens.testDelegationTokenRenew-seed#[C3ED2B1DFB256FD6]) [    ] o.a.s.c.s.i.ZkClientClusterStateProvider Cluster at 127.0.0.1:54404/solr ready
   [junit4]   2> 2524207 INFO  (qtp1278823760-18104) [n:127.0.0.1:60923_solr    ] o.a.s.h.a.CollectionsHandler Invoked Collection Action :list with params action=LIST&delegation=GgADYmFyA2JhcgCKAVjKiKrKigFY7pUuygUEFMZJdTCZpS5rabMHDKbIwghuykvEB3NvbHItZHQA&wt=javabin&version=2 and sendToOCPQueue=true
   [junit4]   2> 2524207 INFO  (qtp1278823760-18104) [n:127.0.0.1:60923_solr    ] o.a.s.s.HttpSolrCall [admin] webapp=null path=/admin/collections params={action=LIST&delegation=GgADYmFyA2JhcgCKAVjKiKrKigFY7pUuygUEFMZJdTCZpS5rabMHDKbIwghuykvEB3NvbHItZHQA&wt=javabin&version=2} status=0 QTime=0
   [junit4]   2> 2524245 INFO  (TEST-TestSolrCloudWithDelegationTokens.testDelegationTokenRenew-seed#[C3ED2B1DFB256FD6]) [    ] o.a.s.c.c.ZkStateReader Updated live nodes from ZooKeeper... (0) -> (2)
   [junit4]   2> 2524246 INFO  (TEST-TestSolrCloudWithDelegationTokens.testDelegationTokenRenew-seed#[C3ED2B1DFB256FD6]) [    ] o.a.s.c.s.i.ZkClientClusterStateProvider Cluster at 127.0.0.1:54404/solr ready
   [junit4]   2> 2524247 INFO  (qtp1278823760-18101) [n:127.0.0.1:60923_solr    ] o.a.s.h.a.CollectionsHandler Invoked Collection Action :list with params action=LIST&delegation=GgADYmFyA2JhcgCKAVjKiKrnigFY7pUu5wYEFHVY5InBqpUuMcda3VXjg2KaajmkB3NvbHItZHQA&wt=javabin&version=2 and sendToOCPQueue=true
   [junit4]   2> 2524247 INFO  (qtp1278823760-18101) [n:127.0.0.1:60923_solr    ] o.a.s.s.HttpSolrCall [admin] webapp=null path=/admin/collections params={action=LIST&delegation=GgADYmFyA2JhcgCKAVjKiKrnigFY7pUu5wYEFHVY5InBqpUuMcda3VXjg2KaajmkB3NvbHItZHQA&wt=javabin&version=2} status=0 QTime=0
   [junit4]   2> 2524252 INFO  (qtp1278823760-18093) [n:127.0.0.1:60923_solr    ] o.a.s.h.a.CollectionsHandler Invoked Collection Action :list with params action=LIST&delegation=GgADYmFyA2JhcgCKAVjKiKrnigFY7pUu5wYEFHVY5InBqpUuMcda3VXjg2KaajmkB3NvbHItZHQA&wt=javabin&version=2 and sendToOCPQueue=true
   [junit4]   2> 2524252 INFO  (qtp1278823760-18093) [n:127.0.0.1:60923_solr    ] o.a.s.s.HttpSolrCall [admin] webapp=null path=/admin/collections params={action=LIST&delegation=GgADYmFyA2JhcgCKAVjKiKrnigFY7pUu5wYEFHVY5InBqpUuMcda3VXjg2KaajmkB3NvbHItZHQA&wt=javabin&version=2} status=0 QTime=0
   [junit4]   2> 2524257 INFO  (TEST-TestSolrCloudWithDelegationTokens.testDelegationTokenRenew-seed#[C3ED2B1DFB256FD6]) [    ] o.a.s.c.c.ZkStateReader Updated live nodes from ZooKeeper... (0) -> (2)
   [junit4]   2> 2524259 INFO  (TEST-TestSolrCloudWithDelegationTokens.testDelegationTokenRenew-seed#[C3ED2B1DFB256FD6]) [    ] o.a.s.c.s.i.ZkClientClusterStateProvider Cluster at 127.0.0.1:54404/solr ready
   [junit4]   2> 2524262 INFO  (TEST-TestSolrCloudWithDelegationTokens.testDelegationTokenRenew-seed#[C3ED2B1DFB256FD6]) [    ] o.a.s.SolrTestCaseJ4 ###Ending testDelegationTokenRenew
   [junit4]   2> 2524290 INFO  (TEST-TestSolrCloudWithDelegationTokens.testZNodePaths-seed#[C3ED2B1DFB256FD6]) [    ] o.a.s.SolrTestCaseJ4 ###Starting testZNodePaths
   [junit4]   2> 2524298 INFO  (TEST-TestSolrCloudWithDelegationTokens.testZNodePaths-seed#[C3ED2B1DFB256FD6]) [    ] o.a.s.SolrTestCaseJ4 ###Ending testZNodePaths
   [junit4]   2> 2524322 INFO  (TEST-TestSolrCloudWithDelegationTokens.testDelegationTokenVerify-seed#[C3ED2B1DFB256FD6]) [    ] o.a.s.SolrTestCaseJ4 ###Starting testDelegationTokenVerify
   [junit4]   2> 2524329 INFO  (qtp380937453-18095) [n:127.0.0.1:63084_solr    ] o.a.s.h.a.CollectionsHandler Invoked Collection Action :list with params action=LIST&delegation=GgADYmFyA2JhcgCKAVjKiKtXigFY7pUvVwgEFBq253FYxyjOORC2xBaffaJK1X8JB3NvbHItZHQA&wt=javabin&version=2 and sendToOCPQueue=true
   [junit4]   2> 2524329 INFO  (qtp380937453-18095) [n:127.0.0.1:63084_solr    ] o.a.s.s.HttpSolrCall [admin] webapp=null path=/admin/collections params={action=LIST&delegation=GgADYmFyA2JhcgCKAVjKiKtXigFY7pUvVwgEFBq253FYxyjOORC2xBaffaJK1X8JB3NvbHItZHQA&wt=javabin&version=2} status=0 QTime=0
   [junit4]   2> 2524337 INFO  (TEST-TestSolrCloudWithDelegationTokens.testDelegationTokenVerify-seed#[C3ED2B1DFB256FD6]) [    ] o.a.s.c.c.ZkStateReader Updated live nodes from ZooKeeper... (0) -> (2)
   [junit4]   2> 2524339 INFO  (TEST-TestSolrCloudWithDelegationTokens.testDelegationTokenVerify-seed#[C3ED2B1DFB256FD6]) [    ] o.a.s.c.s.i.ZkClientClusterStateProvider Cluster at 127.0.0.1:54404/solr ready
   [junit4]   2> 2524340 INFO  (qtp1278823760-18106) [n:127.0.0.1:60923_solr    ] o.a.s.h.a.CollectionsHandler Invoked Collection Action :list with params action=LIST&delegation=GgADYmFyA2JhcgCKAVjKiKtXigFY7pUvVwgEFBq253FYxyjOORC2xBaffaJK1X8JB3NvbHItZHQA&wt=javabin&version=2 and sendToOCPQueue=true
   [junit4]   2> 2524340 INFO  (qtp1278823760-18106) [n:127.0.0.1:60923_solr    ] o.a.s.s.HttpSolrCall [admin] webapp=null path=/admin/collections params={action=LIST&delegation=GgADYmFyA2JhcgCKAVjKiKtXigFY7pUvVwgEFBq253FYxyjOORC2xBaffaJK1X8JB3NvbHItZHQA&wt=javabin&version=2} status=0 QTime=0
   [junit4]   2> 2524349 INFO  (TEST-TestSolrCloudWithDelegationTokens.testDelegationTokenVerify-seed#[C3ED2B1DFB256FD6]) [    ] o.a.s.c.c.ZkStateReader Updated live nodes from ZooKeeper... (0) -> (2)
   [junit4]   2> 2524350 INFO  (TEST-TestSolrCloudWithDelegationTokens.testDelegationTokenVerify-seed#[C3ED2B1DFB256FD6]) [    ] o.a.s.c.s.i.ZkClientClusterStateProvider Cluster at 127.0.0.1:54404/solr ready
   [junit4]   2> 2524354 INFO  (TEST-TestSolrCloudWithDelegationTokens.testDelegationTokenVerify-seed#[C3ED2B1DFB256FD6]) [    ] o.a.s.SolrTestCaseJ4 ###Ending testDelegationTokenVerify
   [junit4]   2> 2524386 INFO  (TEST-TestSolrCloudWithDelegationTokens.testDelegationTokenSolrClient-seed#[C3ED2B1DFB256FD6]) [    ] o.a.s.SolrTestCaseJ4 ###Starting testDelegationTokenSolrClient
   [junit4]   2> 2524399 INFO  (qtp380937453-18095) [n:127.0.0.1:63084_solr    ] o.a.s.h.a.CollectionsHandler Invoked Collection Action :list with params action=LIST&delegation=GgADYmFyA2JhcgCKAVjKiKuWigFY7pUvlgkEFCLVTrBK_3pqroHrbxBvBd-Ck4HLB3NvbHItZHQA&wt=javabin&version=2 and sendToOCPQueue=true
   [junit4]   2> 2524399 INFO  (qtp380937453-18095) [n:127.0.0.1:63084_solr    ] o.a.s.s.HttpSolrCall [admin] webapp=null path=/admin/collections params={action=LIST&delegation=GgADYmFyA2JhcgCKAVjKiKuWigFY7pUvlgkEFCLVTrBK_3pqroHrbxBvBd-Ck4HLB3NvbHItZHQA&wt=javabin&version=2} status=0 QTime=0
   [junit4]   2> 2524400 INFO  (TEST-TestSolrCloudWithDelegationTokens.testDelegationTokenSolrClient-seed#[C3ED2B1DFB256FD6]) [    ] o.a.s.SolrTestCaseJ4 ###Ending testDelegationTokenSolrClient
   [junit4]   2> 2524427 INFO  (TEST-TestSolrCloudWithDelegationTokens.testDelegationTokenRenewFail-seed#[C3ED2B1DFB256FD6]) [    ] o.a.s.SolrTestCaseJ4 ###Starting testDelegationTokenRenewFail
   [junit4]   2> 2524440 WARN  (qtp380937453-18103) [    ] o.a.h.s.a.s.AuthenticationFilter Authentication exception: org.apache.hadoop.security.AccessControlException: foo tries to renew a token with renewer bar
   [junit4]   2> 2524441 WARN  (qtp380937453-18103) [    ] o.a.s.s.KerberosPlugin Could not find org.apache.solr.security.kerberosplugin.requestcontinues
   [junit4]   2> 2524442 WARN  (qtp1278823760-18099) [n:127.0.0.1:60923_solr    ] o.a.h.s.a

[...truncated too long message...]

lback-2652-thread-2-processing-n:127.0.0.1:63084_solr) [n:127.0.0.1:63084_solr    ] o.a.s.c.c.ZkStateReader ZooKeeper watch triggered, but Solr cannot talk to ZK: [KeeperErrorCode = Session expired for /live_nodes]
   [junit4]   2> 2526060 ERROR (Thread[Thread-5126,5,TGRP-TestSolrCloudWithDelegationTokens]) [n:127.0.0.1:63084_solr    ] o.a.h.s.t.d.AbstractDelegationTokenSecretManager ExpiredTokenRemover received java.lang.InterruptedException: sleep interrupted
   [junit4]   2> 2526065 INFO  (jetty-launcher-2642-thread-1) [    ] o.e.j.s.h.ContextHandler Stopped o.e.j.s.ServletContextHandler@4daf900{/solr,null,UNAVAILABLE}
   [junit4]   2> 2526068 INFO  (SUITE-TestSolrCloudWithDelegationTokens-seed#[C3ED2B1DFB256FD6]-worker) [    ] o.a.s.c.ZkTestServer connecting to 127.0.0.1:54404 54404
   [junit4]   2> 2526082 INFO  (Thread-5109) [    ] o.a.s.c.ZkTestServer connecting to 127.0.0.1:54404 54404
   [junit4]   2> 2526083 WARN  (Thread-5109) [    ] o.a.s.c.ZkTestServer Watch limit violations: 
   [junit4]   2> Maximum concurrent create/delete watches above limit:
   [junit4]   2> 
   [junit4]   2> 	17	/solr/aliases.json
   [junit4]   2> 	17	/solr/clusterprops.json
   [junit4]   2> 	2	/solr/security.json
   [junit4]   2> 
   [junit4]   2> Maximum concurrent data watches above limit:
   [junit4]   2> 
   [junit4]   2> 	17	/solr/clusterstate.json
   [junit4]   2> 	4	/solr/security/zkdtsm/ZKDTSMRoot/ZKDTSMKeyIdRoot
   [junit4]   2> 	2	/solr/security/zkdtsm/ZKDTSMRoot/ZKDTSMTokensRoot/DT_7
   [junit4]   2> 	2	/solr/security/zkdtsm/ZKDTSMRoot/ZKDTSMTokensRoot/DT_6
   [junit4]   2> 	2	/solr/security/zkdtsm/ZKDTSMRoot/ZKDTSMTokensRoot/DT_9
   [junit4]   2> 	2	/solr/security/zkdtsm/ZKDTSMRoot/ZKDTSMTokensRoot/DT_8
   [junit4]   2> 	2	/solr/security/zkdtsm/ZKDTSMRoot/ZKDTSMMasterKeyRoot/DK_1
   [junit4]   2> 	2	/solr/security/zkdtsm/ZKDTSMRoot/ZKDTSMTokensRoot/DT_1
   [junit4]   2> 	2	/solr/security/zkdtsm/ZKDTSMRoot/ZKDTSMMasterKeyRoot/DK_3
   [junit4]   2> 	2	/solr/security/zkdtsm/ZKDTSMRoot/ZKDTSMTokensRoot/DT_3
   [junit4]   2> 	2	/solr/security/zkdtsm/ZKDTSMRoot/ZKDTSMMasterKeyRoot/DK_2
   [junit4]   2> 	2	/solr/security/zkdtsm/ZKDTSMRoot/ZKDTSMTokensRoot/DT_2
   [junit4]   2> 	2	/solr/security/zkdtsm/ZKDTSMRoot/ZKDTSMTokensRoot/DT_5
   [junit4]   2> 	2	/solr/security/zkdtsm/ZKDTSMRoot/ZKDTSMMasterKeyRoot/DK_4
   [junit4]   2> 	2	/solr/security/zkdtsm/ZKDTSMRoot/ZKDTSMTokensRoot/DT_4
   [junit4]   2> 	2	/solr/security/zkdtsm/ZKDTSMRoot/ZKDTSMTokensRoot/DT_12
   [junit4]   2> 	2	/solr/security/zkdtsm/ZKDTSMRoot/ZKDTSMSeqNumRoot
   [junit4]   2> 	2	/solr/security/zkdtsm/ZKDTSMRoot/ZKDTSMTokensRoot/DT_11
   [junit4]   2> 	2	/solr/security/zkdtsm/ZKDTSMRoot/ZKDTSMTokensRoot/DT_10
   [junit4]   2> 
   [junit4]   2> Maximum concurrent children watches above limit:
   [junit4]   2> 
   [junit4]   2> 	17	/solr/live_nodes
   [junit4]   2> 	17	/solr/collections
   [junit4]   2> 	3	/solr/overseer/queue
   [junit4]   2> 	2	/solr/security/zkdtsm/ZKDTSMRoot/ZKDTSMMasterKeyRoot
   [junit4]   2> 	2	/solr/overseer/queue-work
   [junit4]   2> 	2	/solr/security/zkdtsm/ZKDTSMRoot/ZKDTSMTokensRoot
   [junit4]   2> 
   [junit4]   2> 2526084 INFO  (SUITE-TestSolrCloudWithDelegationTokens-seed#[C3ED2B1DFB256FD6]-worker) [    ] o.a.s.SolrTestCaseJ4 ###deleteCore
   [junit4]   2> NOTE: leaving temporary files on disk at: /export/home/jenkins/workspace/Lucene-Solr-master-Solaris/solr/build/solr-core/test/J1/temp/solr.cloud.TestSolrCloudWithDelegationTokens_C3ED2B1DFB256FD6-001
   [junit4]   2> Dec 04, 2016 3:51:45 PM com.carrotsearch.randomizedtesting.ThreadLeakControl checkThreadLeaks
   [junit4]   2> WARNING: Will linger awaiting termination of 2 leaked thread(s).
   [junit4]   2> NOTE: test params are: codec=Asserting(Lucene70): {}, docValues:{}, maxPointsInLeafNode=279, maxMBSortInHeap=5.854475383256464, sim=RandomSimilarity(queryNorm=false): {}, locale=sr, timezone=America/Mendoza
   [junit4]   2> NOTE: SunOS 5.11 amd64/Oracle Corporation 1.8.0_102 (64-bit)/cpus=3,threads=1,free=100753112,total=518979584
   [junit4]   2> NOTE: All tests run in this JVM: [CSVRequestHandlerTest, TestComplexPhraseQParserPlugin, TestMiniSolrCloudClusterSSL, TestBlendedInfixSuggestions, TestLMJelinekMercerSimilarityFactory, SharedFSAutoReplicaFailoverTest, SortSpecParsingTest, UpdateRequestProcessorFactoryTest, TestQuerySenderListener, TestConfigSetsAPI, SortByFunctionTest, CleanupOldIndexTest, ClassificationUpdateProcessorFactoryTest, LeaderElectionContextKeyTest, AddSchemaFieldsUpdateProcessorFactoryTest, WordBreakSolrSpellCheckerTest, ParsingFieldUpdateProcessorsTest, AliasIntegrationTest, UUIDFieldTest, TestAtomicUpdateErrorCases, JavabinLoaderTest, TestCloudInspectUtil, SuggesterTSTTest, TestNumericTerms32, TestHdfsBackupRestoreCore, TestDefaultStatsCache, TestJsonRequest, AsyncCallRequestStatusResponseTest, SecurityConfHandlerTest, TestJsonFacetRefinement, TestRealTimeGet, CircularListTest, TestCustomDocTransformer, TestReload, TestBulkSchemaConcurrent, DistribJoinFromCollectionTest, DirectUpdateHandlerOptimizeTest, TestFreeTextSuggestions, RemoteQueryErrorTest, TestSolrConfigHandler, BlockCacheTest, SuggestComponentContextFilterQueryTest, DistributedTermsComponentTest, ZkStateWriterTest, HighlighterConfigTest, TestLRUStatsCache, CoreAdminHandlerTest, TestScoreJoinQPNoScore, TestLuceneMatchVersion, DeleteNodeTest, CacheHeaderTest, TestRandomFaceting, DistributedFacetPivotLargeTest, DateMathParserTest, TestTolerantUpdateProcessorCloud, TestCodecSupport, FieldMutatingUpdateProcessorTest, LoggingHandlerTest, TestManagedResourceStorage, OverseerModifyCollectionTest, TestManagedStopFilterFactory, SolrCmdDistributorTest, TestXmlQParser, TestZkChroot, BlobRepositoryCloudTest, LeaderElectionIntegrationTest, OpenCloseCoreStressTest, TestCoreDiscovery, TestCustomStream, TestIndexSearcher, TestUnifiedSolrHighlighter, TestReversedWildcardFilterFactory, TestDistributedStatsComponentCardinality, LeaderFailureAfterFreshStartTest, ChaosMonkeySafeLeaderTest, TestHdfsCloudBackupRestore, TestDistributedMissingSort, HdfsDirectoryFactoryTest, SpellCheckCollatorTest, BadCopyFieldTest, LeaderInitiatedRecoveryOnShardRestartTest, RuleEngineTest, TestSubQueryTransformerDistrib, CollectionTooManyReplicasTest, TestQueryUtils, TestSortByMinMaxFunction, SimpleMLTQParserTest, TestIndexingPerformance, CdcrVersionReplicationTest, TestInitQParser, HdfsRecoveryZkTest, ConjunctionSolrSpellCheckerTest, FieldAnalysisRequestHandlerTest, FullSolrCloudDistribCmdsTest, TestSolrQueryParser, AnalysisErrorHandlingTest, TestFieldCache, HdfsSyncSliceTest, WrapperMergePolicyFactoryTest, BitVectorTest, DistributedIntervalFacetingTest, SpellingQueryConverterTest, TestBackupRepositoryFactory, JsonLoaderTest, TestFieldCacheWithThreads, TestFastWriter, FacetPivotSmallTest, ResourceLoaderTest, TestPerFieldSimilarityWithDefaultOverride, DirectoryFactoryTest, TestMaxScoreQueryParser, TestUseDocValuesAsStored2, HLLUtilTest, TestSimpleTrackingShardHandler, TestUtils, ClassificationUpdateProcessorTest, TestIntervalFaceting, SignatureUpdateProcessorFactoryTest, TestAuthenticationFramework, TestPHPSerializedResponseWriter, ReturnFieldsTest, DistanceFunctionTest, TestGraphTermsQParserPlugin, TestInitParams, BasicDistributedZk2Test, RollingRestartTest, SimpleCollectionCreateDeleteTest, TestComponentsName, PreAnalyzedFieldManagedSchemaCloudTest, TestNoOpRegenerator, TestJavabinTupleStreamParser, TestSystemIdResolver, BigEndianAscendingWordDeserializerTest, NotRequiredUniqueKeyTest, TestAnalyzedSuggestions, TestSmileRequest, TolerantUpdateProcessorTest, TestDocBasedVersionConstraints, CachingDirectoryFactoryTest, TestDeleteCollectionOnDownNodes, CollectionsAPISolrJTest, TestPivotHelperCode, TestSolrXml, MinimalSchemaTest, DebugComponentTest, ReplicationFactorTest, RegexBoostProcessorTest, BasicAuthStandaloneTest, TestQueryWrapperFilter, HdfsLockFactoryTest, TestCopyFieldCollectionResource, TestBadConfig, ClusterStateTest, CdcrBootstrapTest, SliceStateTest, TestSolrCloudWithKerberosAlt, ZkSolrClientTest, TestSolrDeletionPolicy2, FullHLLTest, MergeStrategyTest, TestBulkSchemaAPI, StatsComponentTest, TestFiltering, TestFunctionQuery, TestLazyCores, SolrIndexSplitterTest, TestExtendedDismaxParser, TestFoldingMultitermQuery, DocValuesTest, FileBasedSpellCheckerTest, DocumentBuilderTest, TestValueSourceCache, TermVectorComponentTest, FastVectorHighlighterTest, SolrPluginUtilsTest, QueryParsingTest, TestPartialUpdateDeduplication, TestLFUCache, TestDocSet, TestBinaryField, TestSearchPerf, TestConfig, OutputWriterTest, TestFuzzyAnalyzedSuggestions, ExternalFileFieldSortTest, TestSolrCoreProperties, TestPostingsSolrHighlighter, DirectSolrConnectionTest, TestPhraseSuggestions, SpellPossibilityIteratorTest, EchoParamsTest, TestDFRSimilarityFactory, TestLMDirichletSimilarityFactory, TestIBSimilarityFactory, TestBM25SimilarityFactory, TestJmxMonitoredMap, ScriptEngineTest, URLClassifyProcessorTest, PreAnalyzedFieldTest, PrimUtilsTest, TestSuggestSpellingConverter, DateFieldTest, DOMUtilTest, RAMDirectoryFactoryTest, TestSolrJ, ZkNodePropsTest, SystemInfoHandlerTest, TestRTGBase, CursorPagingTest, SolrTestCaseJ4Test, TestCrossCoreJoin, TestEmbeddedSolrServerConstructors, ConnectionReuseTest, CdcrReplicationHandlerTest, CollectionReloadTest, CollectionStateFormat2Test, CollectionsAPIAsyncDistributedZkTest, CreateCollectionCleanupTest, DeleteShardTest, DistribDocExpirationUpdateProcessorTest, DocValuesNotIndexedTest, ForceLeaderTest, OutOfBoxZkACLAndCredentialsProvidersTest, OverriddenZkACLAndCredentialsProvidersTest, OverseerRolesTest, OverseerStatusTest, RecoveryAfterSoftCommitTest, RestartWhileUpdatingTest, SaslZkACLProviderTest, ShardSplitTest, TestLocalFSCloudBackupRestore, TestRandomFlRTGCloud, TestRandomRequestDistribution, TestRequestForwarding, TestRequestStatusCollectionAPI, TestSolrCloudWithDelegationTokens]
   [junit4] Completed [505/658 (2!)] on J1 in 3.01s, 8 tests, 1 failure <<< FAILURES!

[...truncated 62898 lines...]


Mime
View raw message