lucene-dev mailing list archives

Site index · List index
Message view « Date » · « Thread »
Top « Date » · « Thread »
From Policeman Jenkins Server <jenk...@thetaphi.de>
Subject [JENKINS-EA] Lucene-Solr-6.x-Linux (64bit/jdk-9-ea+140) - Build # 2313 - Still Unstable!
Date Thu, 01 Dec 2016 11:52:31 GMT
Build: https://jenkins.thetaphi.de/job/Lucene-Solr-6.x-Linux/2313/
Java: 64bit/jdk-9-ea+140 -XX:-UseCompressedOops -XX:+UseConcMarkSweepGC

1 tests failed.
FAILED:  org.apache.solr.handler.component.SpellCheckComponentTest.testThresholdTokenFrequency

Error Message:
Path not found: /spellcheck/suggestions/[1]/suggestion

Stack Trace:
java.lang.RuntimeException: Path not found: /spellcheck/suggestions/[1]/suggestion
	at __randomizedtesting.SeedInfo.seed([A60419A7BBFF08A3:2CA39656341431D8]:0)
	at org.apache.solr.SolrTestCaseJ4.assertJQ(SolrTestCaseJ4.java:900)
	at org.apache.solr.SolrTestCaseJ4.assertJQ(SolrTestCaseJ4.java:847)
	at org.apache.solr.handler.component.SpellCheckComponentTest.testThresholdTokenFrequency(SpellCheckComponentTest.java:277)
	at jdk.internal.reflect.NativeMethodAccessorImpl.invoke0(java.base@9-ea/Native Method)
	at jdk.internal.reflect.NativeMethodAccessorImpl.invoke(java.base@9-ea/NativeMethodAccessorImpl.java:62)
	at jdk.internal.reflect.DelegatingMethodAccessorImpl.invoke(java.base@9-ea/DelegatingMethodAccessorImpl.java:43)
	at java.lang.reflect.Method.invoke(java.base@9-ea/Method.java:535)
	at com.carrotsearch.randomizedtesting.RandomizedRunner.invoke(RandomizedRunner.java:1713)
	at com.carrotsearch.randomizedtesting.RandomizedRunner$8.evaluate(RandomizedRunner.java:907)
	at com.carrotsearch.randomizedtesting.RandomizedRunner$9.evaluate(RandomizedRunner.java:943)
	at com.carrotsearch.randomizedtesting.RandomizedRunner$10.evaluate(RandomizedRunner.java:957)
	at com.carrotsearch.randomizedtesting.rules.SystemPropertiesRestoreRule$1.evaluate(SystemPropertiesRestoreRule.java:57)
	at org.apache.lucene.util.TestRuleSetupTeardownChained$1.evaluate(TestRuleSetupTeardownChained.java:49)
	at org.apache.lucene.util.AbstractBeforeAfterRule$1.evaluate(AbstractBeforeAfterRule.java:45)
	at org.apache.lucene.util.TestRuleThreadAndTestName$1.evaluate(TestRuleThreadAndTestName.java:48)
	at org.apache.lucene.util.TestRuleIgnoreAfterMaxFailures$1.evaluate(TestRuleIgnoreAfterMaxFailures.java:64)
	at org.apache.lucene.util.TestRuleMarkFailure$1.evaluate(TestRuleMarkFailure.java:47)
	at com.carrotsearch.randomizedtesting.rules.StatementAdapter.evaluate(StatementAdapter.java:36)
	at com.carrotsearch.randomizedtesting.ThreadLeakControl$StatementRunner.run(ThreadLeakControl.java:367)
	at com.carrotsearch.randomizedtesting.ThreadLeakControl.forkTimeoutingTask(ThreadLeakControl.java:811)
	at com.carrotsearch.randomizedtesting.ThreadLeakControl$3.evaluate(ThreadLeakControl.java:462)
	at com.carrotsearch.randomizedtesting.RandomizedRunner.runSingleTest(RandomizedRunner.java:916)
	at com.carrotsearch.randomizedtesting.RandomizedRunner$5.evaluate(RandomizedRunner.java:802)
	at com.carrotsearch.randomizedtesting.RandomizedRunner$6.evaluate(RandomizedRunner.java:852)
	at com.carrotsearch.randomizedtesting.RandomizedRunner$7.evaluate(RandomizedRunner.java:863)
	at com.carrotsearch.randomizedtesting.rules.StatementAdapter.evaluate(StatementAdapter.java:36)
	at com.carrotsearch.randomizedtesting.rules.SystemPropertiesRestoreRule$1.evaluate(SystemPropertiesRestoreRule.java:57)
	at org.apache.lucene.util.AbstractBeforeAfterRule$1.evaluate(AbstractBeforeAfterRule.java:45)
	at com.carrotsearch.randomizedtesting.rules.StatementAdapter.evaluate(StatementAdapter.java:36)
	at org.apache.lucene.util.TestRuleStoreClassName$1.evaluate(TestRuleStoreClassName.java:41)
	at com.carrotsearch.randomizedtesting.rules.NoShadowingOrOverridesOnMethodsRule$1.evaluate(NoShadowingOrOverridesOnMethodsRule.java:40)
	at com.carrotsearch.randomizedtesting.rules.NoShadowingOrOverridesOnMethodsRule$1.evaluate(NoShadowingOrOverridesOnMethodsRule.java:40)
	at com.carrotsearch.randomizedtesting.rules.StatementAdapter.evaluate(StatementAdapter.java:36)
	at com.carrotsearch.randomizedtesting.rules.StatementAdapter.evaluate(StatementAdapter.java:36)
	at com.carrotsearch.randomizedtesting.rules.StatementAdapter.evaluate(StatementAdapter.java:36)
	at org.apache.lucene.util.TestRuleAssertionsRequired$1.evaluate(TestRuleAssertionsRequired.java:53)
	at org.apache.lucene.util.TestRuleMarkFailure$1.evaluate(TestRuleMarkFailure.java:47)
	at org.apache.lucene.util.TestRuleIgnoreAfterMaxFailures$1.evaluate(TestRuleIgnoreAfterMaxFailures.java:64)
	at org.apache.lucene.util.TestRuleIgnoreTestSuites$1.evaluate(TestRuleIgnoreTestSuites.java:54)
	at com.carrotsearch.randomizedtesting.rules.StatementAdapter.evaluate(StatementAdapter.java:36)
	at com.carrotsearch.randomizedtesting.ThreadLeakControl$StatementRunner.run(ThreadLeakControl.java:367)
	at java.lang.Thread.run(java.base@9-ea/Thread.java:843)




Build Log:
[...truncated 11712 lines...]
   [junit4] Suite: org.apache.solr.handler.component.SpellCheckComponentTest
   [junit4]   2> Creating dataDir: /home/jenkins/workspace/Lucene-Solr-6.x-Linux/solr/build/solr-core/test/J1/temp/solr.handler.component.SpellCheckComponentTest_A60419A7BBFF08A3-001/init-core-data-001
   [junit4]   2> 1203816 INFO  (SUITE-SpellCheckComponentTest-seed#[A60419A7BBFF08A3]-worker) [    ] o.a.s.SolrTestCaseJ4 Randomized ssl (true) and clientAuth (true) via: @org.apache.solr.util.RandomizeSSL(reason="", value=0.0/0.0, ssl=0.0/0.0, clientAuth=0.0/0.0)
   [junit4]   2> 1203818 INFO  (SUITE-SpellCheckComponentTest-seed#[A60419A7BBFF08A3]-worker) [    ] o.a.s.SolrTestCaseJ4 ####initCore
   [junit4]   2> 1203819 INFO  (SUITE-SpellCheckComponentTest-seed#[A60419A7BBFF08A3]-worker) [    ] o.a.s.c.SolrResourceLoader [null] Added 2 libs to classloader, from paths: [/home/jenkins/workspace/Lucene-Solr-6.x-Linux/solr/core/src/test-files/solr/collection1/lib, /home/jenkins/workspace/Lucene-Solr-6.x-Linux/solr/core/src/test-files/solr/collection1/lib/classes]
   [junit4]   2> 1203877 INFO  (SUITE-SpellCheckComponentTest-seed#[A60419A7BBFF08A3]-worker) [    ] o.a.s.c.SolrConfig Using Lucene MatchVersion: 6.4.0
   [junit4]   2> 1203902 INFO  (SUITE-SpellCheckComponentTest-seed#[A60419A7BBFF08A3]-worker) [    ] o.a.s.s.IndexSchema [null] Schema name=test
   [junit4]   2> 1203978 WARN  (SUITE-SpellCheckComponentTest-seed#[A60419A7BBFF08A3]-worker) [    ] o.a.s.s.IndexSchema [null] default search field in schema is text. WARNING: Deprecated, please use 'df' on request instead.
   [junit4]   2> 1203980 INFO  (SUITE-SpellCheckComponentTest-seed#[A60419A7BBFF08A3]-worker) [    ] o.a.s.s.IndexSchema Loaded schema test/1.0 with uniqueid field id
   [junit4]   2> 1203997 INFO  (SUITE-SpellCheckComponentTest-seed#[A60419A7BBFF08A3]-worker) [    ] o.a.s.u.UpdateShardHandler Creating UpdateShardHandler HTTP client with params: socketTimeout=30000&connTimeout=30000&retry=true
   [junit4]   2> 1203999 INFO  (coreLoadExecutor-8350-thread-1) [    ] o.a.s.c.SolrResourceLoader [null] Added 2 libs to classloader, from paths: [/home/jenkins/workspace/Lucene-Solr-6.x-Linux/solr/core/src/test-files/solr/collection1/lib, /home/jenkins/workspace/Lucene-Solr-6.x-Linux/solr/core/src/test-files/solr/collection1/lib/classes]
   [junit4]   2> 1204060 INFO  (coreLoadExecutor-8350-thread-1) [    ] o.a.s.c.SolrConfig Using Lucene MatchVersion: 6.4.0
   [junit4]   2> 1204070 INFO  (coreLoadExecutor-8350-thread-1) [    ] o.a.s.s.IndexSchema [collection1] Schema name=test
   [junit4]   2> 1204133 WARN  (coreLoadExecutor-8350-thread-1) [    ] o.a.s.s.IndexSchema [collection1] default search field in schema is text. WARNING: Deprecated, please use 'df' on request instead.
   [junit4]   2> 1204135 INFO  (coreLoadExecutor-8350-thread-1) [    ] o.a.s.s.IndexSchema Loaded schema test/1.0 with uniqueid field id
   [junit4]   2> 1204151 INFO  (coreLoadExecutor-8350-thread-1) [    ] o.a.s.c.CoreContainer Creating SolrCore 'collection1' using configuration from instancedir /home/jenkins/workspace/Lucene-Solr-6.x-Linux/solr/core/src/test-files/solr/collection1
   [junit4]   2> 1204151 INFO  (coreLoadExecutor-8350-thread-1) [    ] o.a.s.c.SolrCore [[collection1] ] Opening new SolrCore at [/home/jenkins/workspace/Lucene-Solr-6.x-Linux/solr/core/src/test-files/solr/collection1], dataDir=[/home/jenkins/workspace/Lucene-Solr-6.x-Linux/solr/build/solr-core/test/J1/temp/solr.handler.component.SpellCheckComponentTest_A60419A7BBFF08A3-001/init-core-data-001/]
   [junit4]   2> 1204151 INFO  (coreLoadExecutor-8350-thread-1) [    ] o.a.s.u.RandomMergePolicy RandomMergePolicy wrapping class org.apache.lucene.index.TieredMergePolicy: [TieredMergePolicy: maxMergeAtOnce=49, maxMergeAtOnceExplicit=15, maxMergedSegmentMB=69.52734375, floorSegmentMB=1.8515625, forceMergeDeletesPctAllowed=0.7902064308233514, segmentsPerTier=19.0, maxCFSSegmentSizeMB=8.796093022207999E12, noCFSRatio=0.2557493351479492
   [junit4]   2> 1204156 INFO  (coreLoadExecutor-8350-thread-1) [    ] o.a.s.u.CommitTracker Hard AutoCommit: disabled
   [junit4]   2> 1204156 INFO  (coreLoadExecutor-8350-thread-1) [    ] o.a.s.u.CommitTracker Soft AutoCommit: disabled
   [junit4]   2> 1204156 INFO  (coreLoadExecutor-8350-thread-1) [    ] o.a.s.u.RandomMergePolicy RandomMergePolicy wrapping class org.apache.lucene.index.TieredMergePolicy: [TieredMergePolicy: maxMergeAtOnce=40, maxMergeAtOnceExplicit=23, maxMergedSegmentMB=0.19921875, floorSegmentMB=1.5126953125, forceMergeDeletesPctAllowed=29.535938841102556, segmentsPerTier=44.0, maxCFSSegmentSizeMB=8.796093022207999E12, noCFSRatio=0.12572104193042338
   [junit4]   2> 1204156 INFO  (coreLoadExecutor-8350-thread-1) [    ] o.a.s.s.SolrIndexSearcher Opening [Searcher@68ab62a5[collection1] main]
   [junit4]   2> 1204157 WARN  (coreLoadExecutor-8350-thread-1) [    ] o.a.s.r.ManagedResourceStorage Cannot write to config directory /home/jenkins/workspace/Lucene-Solr-6.x-Linux/solr/core/src/test-files/solr/collection1/conf; switching to use InMemory storage instead.
   [junit4]   2> 1204157 INFO  (coreLoadExecutor-8350-thread-1) [    ] o.a.s.h.c.SpellCheckComponent Initializing spell checkers
   [junit4]   2> 1204225 INFO  (coreLoadExecutor-8350-thread-1) [    ] o.a.s.h.c.SpellCheckComponent Registering newSearcher listener for spellchecker: default
   [junit4]   2> 1204301 INFO  (coreLoadExecutor-8350-thread-1) [    ] o.a.s.h.c.SpellCheckComponent Registering newSearcher listener for spellchecker: default_teststop
   [junit4]   2> 1204301 INFO  (coreLoadExecutor-8350-thread-1) [    ] o.a.s.s.DirectSolrSpellChecker init: {name=direct,classname=solr.DirectSolrSpellChecker,minQueryLength=3,maxQueryFrequency=100.0,field=teststop}
   [junit4]   2> 1204301 INFO  (coreLoadExecutor-8350-thread-1) [    ] o.a.s.s.DirectSolrSpellChecker init: {name=direct_lowerfilt,classname=solr.DirectSolrSpellChecker,minQueryLength=3,maxQueryFrequency=100.0,field=lowerfilt}
   [junit4]   2> 1204347 INFO  (coreLoadExecutor-8350-thread-1) [    ] o.a.s.h.c.SpellCheckComponent Registering newSearcher listener for spellchecker: threshold
   [junit4]   2> 1204348 INFO  (coreLoadExecutor-8350-thread-1) [    ] o.a.s.s.DirectSolrSpellChecker init: {name=threshold_direct,classname=solr.DirectSolrSpellChecker,field=lowerfilt,spellcheckIndexDir=spellcheckerThreshold,buildOnCommit=true,thresholdTokenFrequency=0.29}
   [junit4]   2> 1204348 INFO  (coreLoadExecutor-8350-thread-1) [    ] o.a.s.h.c.SpellCheckComponent Registering newSearcher listener for spellchecker: threshold_direct
   [junit4]   2> 1204384 INFO  (coreLoadExecutor-8350-thread-1) [    ] o.a.s.h.c.SpellCheckComponent Registering newSearcher listener for spellchecker: multipleFields
   [junit4]   2> 1204523 INFO  (coreLoadExecutor-8350-thread-1) [    ] o.a.s.h.c.SpellCheckComponent Registering newSearcher listener for spellchecker: freq
   [junit4]   2> 1204561 INFO  (coreLoadExecutor-8350-thread-1) [    ] o.a.s.h.c.SpellCheckComponent Registering newSearcher listener for spellchecker: fqcn
   [junit4]   2> 1204561 INFO  (coreLoadExecutor-8350-thread-1) [    ] o.a.s.h.ReplicationHandler Commits will be reserved for  10000
   [junit4]   2> 1204561 INFO  (searcherExecutor-8351-thread-1) [    ] o.a.s.h.c.SpellCheckComponent Loading spell index for spellchecker: default
   [junit4]   2> 1204562 INFO  (SUITE-SpellCheckComponentTest-seed#[A60419A7BBFF08A3]-worker) [    ] o.a.s.SolrTestCaseJ4 ####initCore end
   [junit4]   2> 1204563 INFO  (searcherExecutor-8351-thread-1) [    ] o.a.s.h.c.SpellCheckComponent Loading spell index for spellchecker: default_teststop
   [junit4]   2> 1204564 INFO  (TEST-SpellCheckComponentTest.testThresholdTokenFrequency-seed#[A60419A7BBFF08A3]) [    ] o.a.s.SolrTestCaseJ4 ###Starting testThresholdTokenFrequency
   [junit4]   2> 1204564 INFO  (TEST-SpellCheckComponentTest.testThresholdTokenFrequency-seed#[A60419A7BBFF08A3]) [    ] o.a.s.u.p.LogUpdateProcessorFactory [collection1]  webapp=null path=null params={}{add=[0]} 0 0
   [junit4]   2> 1204565 INFO  (searcherExecutor-8351-thread-1) [    ] o.a.s.h.c.SpellCheckComponent Loading spell index for spellchecker: direct
   [junit4]   2> 1204565 INFO  (searcherExecutor-8351-thread-1) [    ] o.a.s.h.c.SpellCheckComponent Loading spell index for spellchecker: direct_lowerfilt
   [junit4]   2> 1204565 INFO  (searcherExecutor-8351-thread-1) [    ] o.a.s.h.c.SpellCheckComponent Loading spell index for spellchecker: wordbreak
   [junit4]   2> 1204565 INFO  (searcherExecutor-8351-thread-1) [    ] o.a.s.h.c.SpellCheckComponent Loading spell index for spellchecker: threshold
   [junit4]   2> 1204566 INFO  (TEST-SpellCheckComponentTest.testThresholdTokenFrequency-seed#[A60419A7BBFF08A3]) [    ] o.a.s.u.p.LogUpdateProcessorFactory [collection1]  webapp=null path=null params={}{add=[1]} 0 0
   [junit4]   2> 1204566 INFO  (TEST-SpellCheckComponentTest.testThresholdTokenFrequency-seed#[A60419A7BBFF08A3]) [    ] o.a.s.u.p.LogUpdateProcessorFactory [collection1]  webapp=null path=null params={}{add=[2]} 0 0
   [junit4]   2> 1204566 INFO  (TEST-SpellCheckComponentTest.testThresholdTokenFrequency-seed#[A60419A7BBFF08A3]) [    ] o.a.s.u.p.LogUpdateProcessorFactory [collection1]  webapp=null path=null params={}{add=[3]} 0 0
   [junit4]   2> 1204566 INFO  (searcherExecutor-8351-thread-1) [    ] o.a.s.h.c.SpellCheckComponent Loading spell index for spellchecker: threshold_direct
   [junit4]   2> 1204566 INFO  (TEST-SpellCheckComponentTest.testThresholdTokenFrequency-seed#[A60419A7BBFF08A3]) [    ] o.a.s.u.p.LogUpdateProcessorFactory [collection1]  webapp=null path=null params={}{add=[4]} 0 0
   [junit4]   2> 1204566 INFO  (searcherExecutor-8351-thread-1) [    ] o.a.s.h.c.SpellCheckComponent Loading spell index for spellchecker: multipleFields
   [junit4]   2> 1204567 INFO  (TEST-SpellCheckComponentTest.testThresholdTokenFrequency-seed#[A60419A7BBFF08A3]) [    ] o.a.s.u.p.LogUpdateProcessorFactory [collection1]  webapp=null path=null params={}{add=[5]} 0 0
   [junit4]   2> 1204567 INFO  (TEST-SpellCheckComponentTest.testThresholdTokenFrequency-seed#[A60419A7BBFF08A3]) [    ] o.a.s.u.p.LogUpdateProcessorFactory [collection1]  webapp=null path=null params={}{add=[6]} 0 0
   [junit4]   2> 1204567 INFO  (TEST-SpellCheckComponentTest.testThresholdTokenFrequency-seed#[A60419A7BBFF08A3]) [    ] o.a.s.u.p.LogUpdateProcessorFactory [collection1]  webapp=null path=null params={}{add=[7]} 0 0
   [junit4]   2> 1204568 INFO  (TEST-SpellCheckComponentTest.testThresholdTokenFrequency-seed#[A60419A7BBFF08A3]) [    ] o.a.s.u.p.LogUpdateProcessorFactory [collection1]  webapp=null path=null params={}{add=[8]} 0 0
   [junit4]   2> 1204568 INFO  (TEST-SpellCheckComponentTest.testThresholdTokenFrequency-seed#[A60419A7BBFF08A3]) [    ] o.a.s.u.p.LogUpdateProcessorFactory [collection1]  webapp=null path=null params={}{add=[9]} 0 0
   [junit4]   2> 1204568 INFO  (TEST-SpellCheckComponentTest.testThresholdTokenFrequency-seed#[A60419A7BBFF08A3]) [    ] o.a.s.u.DirectUpdateHandler2 start commit{,optimize=false,openSearcher=true,waitSearcher=true,expungeDeletes=false,softCommit=false,prepareCommit=false}
   [junit4]   2> 1204568 INFO  (TEST-SpellCheckComponentTest.testThresholdTokenFrequency-seed#[A60419A7BBFF08A3]) [    ] o.a.s.u.SolrIndexWriter Calling setCommitData with IW:org.apache.solr.update.SolrIndexWriter@13e9f3c1
   [junit4]   2> 1204568 INFO  (searcherExecutor-8351-thread-1) [    ] o.a.s.h.c.SpellCheckComponent Loading spell index for spellchecker: jarowinkler
   [junit4]   2> 1204570 WARN  (TEST-SpellCheckComponentTest.testThresholdTokenFrequency-seed#[A60419A7BBFF08A3]) [    ] o.a.s.c.SolrCore [collection1] PERFORMANCE WARNING: Overlapping onDeckSearchers=2
   [junit4]   2> 1204570 INFO  (searcherExecutor-8351-thread-1) [    ] o.a.s.h.c.SpellCheckComponent Loading spell index for spellchecker: external
   [junit4]   2> 1204571 INFO  (TEST-SpellCheckComponentTest.testThresholdTokenFrequency-seed#[A60419A7BBFF08A3]) [    ] o.a.s.s.SolrIndexSearcher Opening [Searcher@526465cf[collection1] main]
   [junit4]   2> 1204571 INFO  (TEST-SpellCheckComponentTest.testThresholdTokenFrequency-seed#[A60419A7BBFF08A3]) [    ] o.a.s.u.DirectUpdateHandler2 end_commit_flush
   [junit4]   2> 1204572 INFO  (searcherExecutor-8351-thread-1) [    ] o.a.s.h.c.SpellCheckComponent Loading spell index for spellchecker: freq
   [junit4]   2> 1204573 INFO  (searcherExecutor-8351-thread-1) [    ] o.a.s.h.c.SpellCheckComponent Loading spell index for spellchecker: fqcn
   [junit4]   2> 1204575 INFO  (searcherExecutor-8351-thread-1) [    ] o.a.s.h.c.SpellCheckComponent Loading spell index for spellchecker: perDict
   [junit4]   2> 1204575 INFO  (searcherExecutor-8351-thread-1) [    ] o.a.s.c.SolrCore [collection1] Registered new searcher Searcher@68ab62a5[collection1] main{ExitableDirectoryReader(UninvertingDirectoryReader())}
   [junit4]   2> 1204575 INFO  (searcherExecutor-8351-thread-1) [    ] o.a.s.h.c.SpellCheckComponent Loading spell index for spellchecker: default
   [junit4]   2> 1204576 INFO  (searcherExecutor-8351-thread-1) [    ] o.a.s.h.c.SpellCheckComponent Loading spell index for spellchecker: default_teststop
   [junit4]   2> 1204577 INFO  (searcherExecutor-8351-thread-1) [    ] o.a.s.h.c.SpellCheckComponent Loading spell index for spellchecker: direct
   [junit4]   2> 1204577 INFO  (searcherExecutor-8351-thread-1) [    ] o.a.s.h.c.SpellCheckComponent Loading spell index for spellchecker: direct_lowerfilt
   [junit4]   2> 1204577 INFO  (searcherExecutor-8351-thread-1) [    ] o.a.s.h.c.SpellCheckComponent Loading spell index for spellchecker: wordbreak
   [junit4]   2> 1204578 INFO  (searcherExecutor-8351-thread-1) [    ] o.a.s.h.c.SpellCheckComponent Loading spell index for spellchecker: threshold
   [junit4]   2> 1204579 INFO  (searcherExecutor-8351-thread-1) [    ] o.a.s.h.c.SpellCheckComponent Loading spell index for spellchecker: threshold_direct
   [junit4]   2> 1204579 INFO  (searcherExecutor-8351-thread-1) [    ] o.a.s.h.c.SpellCheckComponent Loading spell index for spellchecker: multipleFields
   [junit4]   2> 1204581 INFO  (searcherExecutor-8351-thread-1) [    ] o.a.s.h.c.SpellCheckComponent Loading spell index for spellchecker: jarowinkler
   [junit4]   2> 1204582 INFO  (searcherExecutor-8351-thread-1) [    ] o.a.s.h.c.SpellCheckComponent Loading spell index for spellchecker: external
   [junit4]   2> 1204583 INFO  (searcherExecutor-8351-thread-1) [    ] o.a.s.h.c.SpellCheckComponent Loading spell index for spellchecker: freq
   [junit4]   2> 1204585 INFO  (searcherExecutor-8351-thread-1) [    ] o.a.s.h.c.SpellCheckComponent Loading spell index for spellchecker: fqcn
   [junit4]   2> 1204586 INFO  (searcherExecutor-8351-thread-1) [    ] o.a.s.h.c.SpellCheckComponent Loading spell index for spellchecker: perDict
   [junit4]   2> 1204586 INFO  (searcherExecutor-8351-thread-1) [    ] o.a.s.c.SolrCore [collection1] Registered new searcher Searcher@526465cf[collection1] main{ExitableDirectoryReader(UninvertingDirectoryReader(Uninverting(_0(6.4.0):c10)))}
   [junit4]   2> 1204586 INFO  (TEST-SpellCheckComponentTest.testThresholdTokenFrequency-seed#[A60419A7BBFF08A3]) [    ] o.a.s.u.p.LogUpdateProcessorFactory [collection1]  webapp=null path=null params={}{commit=} 0 18
   [junit4]   2> 1204587 INFO  (TEST-SpellCheckComponentTest.testThresholdTokenFrequency-seed#[A60419A7BBFF08A3]) [    ] o.a.s.c.S.Request [collection1]  webapp=null path=null params={q=documenq&qt=spellCheckCompRH&spellcheck.dictionary=threshold&spellcheck=true&spellcheck.count=5&wt=xml&spellcheck.extendedResults=true} hits=0 status=0 QTime=0
   [junit4]   2> 1204587 ERROR (TEST-SpellCheckComponentTest.testThresholdTokenFrequency-seed#[A60419A7BBFF08A3]) [    ] o.a.s.SolrTestCaseJ4 query failed JSON validation. error=Path not found: /spellcheck/suggestions/[1]/suggestion
   [junit4]   2>  expected =/spellcheck/suggestions/[1]/suggestion==[{'word':'document','freq':2}]
   [junit4]   2>  response = {
   [junit4]   2>   "responseHeader":{
   [junit4]   2>     "status":0,
   [junit4]   2>     "QTime":0},
   [junit4]   2>   "response":{"numFound":0,"start":0,"docs":[]
   [junit4]   2>   },
   [junit4]   2>   "spellcheck":{
   [junit4]   2>     "suggestions":[],
   [junit4]   2>     "correctlySpelled":false}}
   [junit4]   2> 
   [junit4]   2>  request = q=documenq&qt=spellCheckCompRH&spellcheck.dictionary=threshold&spellcheck=true&spellcheck.count=5&wt=xml&spellcheck.extendedResults=true
   [junit4]   2> 1204588 INFO  (TEST-SpellCheckComponentTest.testThresholdTokenFrequency-seed#[A60419A7BBFF08A3]) [    ] o.a.s.SolrTestCaseJ4 ###Ending testThresholdTokenFrequency
   [junit4]   2> 1204588 INFO  (TEST-SpellCheckComponentTest.testThresholdTokenFrequency-seed#[A60419A7BBFF08A3]) [    ] o.a.s.u.DirectUpdateHandler2 [collection1] REMOVING ALL DOCUMENTS FROM INDEX
   [junit4]   2> 1204588 INFO  (TEST-SpellCheckComponentTest.testThresholdTokenFrequency-seed#[A60419A7BBFF08A3]) [    ] o.a.s.u.p.LogUpdateProcessorFactory [collection1]  webapp=null path=null params={}{deleteByQuery=*:*} 0 0
   [junit4]   2> 1204588 INFO  (TEST-SpellCheckComponentTest.testThresholdTokenFrequency-seed#[A60419A7BBFF08A3]) [    ] o.a.s.u.DirectUpdateHandler2 start commit{,optimize=false,openSearcher=true,waitSearcher=true,expungeDeletes=false,softCommit=false,prepareCommit=false}
   [junit4]   2> 1204588 INFO  (TEST-SpellCheckComponentTest.testThresholdTokenFrequency-seed#[A60419A7BBFF08A3]) [    ] o.a.s.u.SolrIndexWriter Calling setCommitData with IW:org.apache.solr.update.SolrIndexWriter@13e9f3c1
   [junit4]   2> 1204588 INFO  (TEST-SpellCheckComponentTest.testThresholdTokenFrequency-seed#[A60419A7BBFF08A3]) [    ] o.a.s.s.SolrIndexSearcher Opening [Searcher@26f78b2b[collection1] main]
   [junit4]   2> 1204589 INFO  (TEST-SpellCheckComponentTest.testThresholdTokenFrequency-seed#[A60419A7BBFF08A3]) [    ] o.a.s.u.DirectUpdateHandler2 end_commit_flush
   [junit4]   2> 1204589 INFO  (searcherExecutor-8351-thread-1) [    ] o.a.s.h.c.SpellCheckComponent Building spell index for spell checker: default
   [junit4]   2> 1204659 INFO  (searcherExecutor-8351-thread-1) [    ] o.a.s.h.c.SpellCheckComponent Building spell index for spell checker: default_teststop
   [junit4]   2> 1204698 INFO  (searcherExecutor-8351-thread-1) [    ] o.a.s.h.c.SpellCheckComponent Building spell index for spell checker: threshold
   [junit4]   2> 1204785 INFO  (searcherExecutor-8351-thread-1) [    ] o.a.s.h.c.SpellCheckComponent Building spell index for spell checker: threshold_direct
   [junit4]   2> 1204785 INFO  (searcherExecutor-8351-thread-1) [    ] o.a.s.h.c.SpellCheckComponent Building spell index for spell checker: multipleFields
   [junit4]   2> 1204847 INFO  (searcherExecutor-8351-thread-1) [    ] o.a.s.h.c.SpellCheckComponent Building spell index for spell checker: freq
   [junit4]   2> 1204920 INFO  (searcherExecutor-8351-thread-1) [    ] o.a.s.h.c.SpellCheckComponent Building spell index for spell checker: fqcn
   [junit4]   2> 1204989 INFO  (searcherExecutor-8351-thread-1) [    ] o.a.s.c.SolrCore [collection1] Registered new searcher Searcher@26f78b2b[collection1] main{ExitableDirectoryReader(UninvertingDirectoryReader())}
   [junit4]   2> 1204989 INFO  (TEST-SpellCheckComponentTest.testThresholdTokenFrequency-seed#[A60419A7BBFF08A3]) [    ] o.a.s.u.p.LogUpdateProcessorFactory [collection1]  webapp=null path=null params={}{commit=} 0 400
   [junit4]   2> NOTE: reproduce with: ant test  -Dtestcase=SpellCheckComponentTest -Dtests.method=testThresholdTokenFrequency -Dtests.seed=A60419A7BBFF08A3 -Dtests.multiplier=3 -Dtests.slow=true -Dtests.locale=en-NG -Dtests.timezone=Australia/Yancowinna -Dtests.asserts=true -Dtests.file.encoding=ISO-8859-1
   [junit4] ERROR   0.43s J1 | SpellCheckComponentTest.testThresholdTokenFrequency <<<
   [junit4]    > Throwable #1: java.lang.RuntimeException: Path not found: /spellcheck/suggestions/[1]/suggestion
   [junit4]    > 	at __randomizedtesting.SeedInfo.seed([A60419A7BBFF08A3:2CA39656341431D8]:0)
   [junit4]    > 	at org.apache.solr.SolrTestCaseJ4.assertJQ(SolrTestCaseJ4.java:900)
   [junit4]    > 	at org.apache.solr.SolrTestCaseJ4.assertJQ(SolrTestCaseJ4.java:847)
   [junit4]    > 	at org.apache.solr.handler.component.SpellCheckComponentTest.testThresholdTokenFrequency(SpellCheckComponentTest.java:277)
   [junit4]    > 	at jdk.internal.reflect.NativeMethodAccessorImpl.invoke0(java.base@9-ea/Native Method)
   [junit4]    > 	at jdk.internal.reflect.NativeMethodAccessorImpl.invoke(java.base@9-ea/NativeMethodAccessorImpl.java:62)
   [junit4]    > 	at jdk.internal.reflect.DelegatingMethodAccessorImpl.invoke(java.base@9-ea/DelegatingMethodAccessorImpl.java:43)
   [junit4]    > 	at java.lang.Thread.run(java.base@9-ea/Thread.java:843)
   [junit4]   2> 1204994 INFO  (TEST-SpellCheckComponentTest.testPerDictionary-seed#[A60419A7BBFF08A3]) [    ] o.a.s.SolrTestCaseJ4 ###Starting testPerDictionary
   [junit4]   2> 1204994 INFO  (TEST-SpellCheckComponentTest.testPerDictionary-seed#[A60419A7BBFF08A3]) [    ] o.a.s.u.p.LogUpdateProcessorFactory [collection1]  webapp=null path=null params={}{add=[0]} 0 0
   [junit4]   2> 1204995 INFO  (TEST-SpellCheckComponentTest.testPerDictionary-seed#[A60419A7BBFF08A3]) [    ] o.a.s.u.p.LogUpdateProcessorFactory [collection1]  webapp=null path=null params={}{add=[1]} 0 0
   [junit4]   2> 1204995 INFO  (TEST-SpellCheckComponentTest.testPerDictionary-seed#[A60419A7BBFF08A3]) [    ] o.a.s.u.p.LogUpdateProcessorFactory [collection1]  webapp=null path=null params={}{add=[2]} 0 0
   [junit4]   2> 1204995 INFO  (TEST-SpellCheckComponentTest.testPerDictionary-seed#[A60419A7BBFF08A3]) [    ] o.a.s.u.p.LogUpdateProcessorFactory [collection1]  webapp=null path=null params={}{add=[3]} 0 0
   [junit4]   2> 1204996 INFO  (TEST-SpellCheckComponentTest.testPerDictionary-seed#[A60419A7BBFF08A3]) [    ] o.a.s.u.p.LogUpdateProcessorFactory [collection1]  webapp=null path=null params={}{add=[4]} 0 0
   [junit4]   2> 1204996 INFO  (TEST-SpellCheckComponentTest.testPerDictionary-seed#[A60419A7BBFF08A3]) [    ] o.a.s.u.p.LogUpdateProcessorFactory [collection1]  webapp=null path=null params={}{add=[5]} 0 0
   [junit4]   2> 1204996 INFO  (TEST-SpellCheckComponentTest.testPerDictionary-seed#[A60419A7BBFF08A3]) [    ] o.a.s.u.p.LogUpdateProcessorFactory [collection1]  webapp=null path=null params={}{add=[6]} 0 0
   [junit4]   2> 1204996 INFO  (TEST-SpellCheckComponentTest.testPerDictionary-seed#[A60419A7BBFF08A3]) [    ] o.a.s.u.p.LogUpdateProcessorFactory [collection1]  webapp=null path=null params={}{add=[7]} 0 0
   [junit4]   2> 1204997 INFO  (TEST-SpellCheckComponentTest.testPerDictionary-seed#[A60419A7BBFF08A3]) [    ] o.a.s.u.p.LogUpdateProcessorFactory [collection1]  webapp=null path=null params={}{add=[8]} 0 0
   [junit4]   2> 1204997 INFO  (TEST-SpellCheckComponentTest.testPerDictionary-seed#[A60419A7BBFF08A3]) [    ] o.a.s.u.p.LogUpdateProcessorFactory [collection1]  webapp=null path=null params={}{add=[9]} 0 0
   [junit4]   2> 1204997 INFO  (TEST-SpellCheckComponentTest.testPerDictionary-seed#[A60419A7BBFF08A3]) [    ] o.a.s.u.DirectUpdateHandler2 start commit{,optimize=false,openSearcher=true,waitSearcher=true,expungeDeletes=false,softCommit=false,prepareCommit=false}
   [junit4]   2> 1204997 INFO  (TEST-SpellCheckComponentTest.testPerDictionary-seed#[A60419A7BBFF08A3]) [    ] o.a.s.u.SolrIndexWriter Calling setCommitData with IW:org.apache.solr.update.SolrIndexWriter@13e9f3c1
   [junit4]   2> 1205001 INFO  (TEST-SpellCheckComponentTest.testPerDictionary-seed#[A60419A7BBFF08A3]) [    ] o.a.s.s.SolrIndexSearcher Opening [Searcher@5bdb48f7[collection1] main]
   [junit4]   2> 1205001 INFO  (TEST-SpellCheckComponentTest.testPerDictionary-seed#[A60419A7BBFF08A3]) [    ] o.a.s.u.DirectUpdateHandler2 end_commit_flush
   [junit4]   2> 1205001 INFO  (searcherExecutor-8351-thread-1) [    ] o.a.s.h.c.SpellCheckComponent Building spell index for spell checker: default
   [junit4]   2> 1205276 INFO  (searcherExecutor-8351-thread-1) [    ] o.a.s.h.c.SpellCheckComponent Building spell index for spell checker: default_teststop
   [junit4]   2> 1205373 INFO  (searcherExecutor-8351-thread-1) [    ] o.a.s.h.c.SpellCheckComponent Building spell index for spell checker: threshold
   [junit4]   2> 1205634 INFO  (searcherExecutor-8351-thread-1) [    ] o.a.s.h.c.SpellCheckComponent Building spell index for spell checker: threshold_direct
   [junit4]   2> 1205635 INFO  (searcherExecutor-8351-thread-1) [    ] o.a.s.h.c.SpellCheckComponent Building spell index for spell checker: multipleFields
   [junit4]   2> 1205922 INFO  (searcherExecutor-8351-thread-1) [    ] o.a.s.h.c.SpellCheckComponent Building spell index for spell checker: freq
   [junit4]   2> 1206150 INFO  (searcherExecutor-8351-thread-1) [    ] o.a.s.h.c.SpellCheckComponent Building spell index for spell checker: fqcn
   [junit4]   2> 1206334 INFO  (searcherExecutor-8351-thread-1) [    ] o.a.s.c.SolrCore [collection1] Registered new searcher Searcher@5bdb48f7[collection1] main{ExitableDirectoryReader(UninvertingDirectoryReader(Uninverting(_1(6.4.0):c10)))}
   [junit4]   2> 1206334 INFO  (TEST-SpellCheckComponentTest.testPerDictionary-seed#[A60419A7BBFF08A3]) [    ] o.a.s.u.p.LogUpdateProcessorFactory [collection1]  webapp=null path=null params={}{commit=} 0 1336
   [junit4]   2> 1206335 INFO  (TEST-SpellCheckComponentTest.testPerDictionary-seed#[A60419A7BBFF08A3]) [    ] o.a.s.c.S.Request [collection1]  webapp=null path=null params={q=documemt&qt=spellCheckCompRH&spellcheck.dictionary=perDict&json.nl=map&spellcheck..perDict.foo=bar&spellcheck=true&spellcheck..perDict.bar=foo&wt=xml&spellcheck.build=true} hits=0 status=0 QTime=0
   [junit4]   2> 1206336 INFO  (TEST-SpellCheckComponentTest.testPerDictionary-seed#[A60419A7BBFF08A3]) [    ] o.a.s.SolrTestCaseJ4 ###Ending testPerDictionary
   [junit4]   2> 1206336 INFO  (TEST-SpellCheckComponentTest.testPerDictionary-seed#[A60419A7BBFF08A3]) [    ] o.a.s.u.DirectUpdateHandler2 [collection1] REMOVING ALL DOCUMENTS FROM INDEX
   [junit4]   2> 1206336 INFO  (TEST-SpellCheckComponentTest.testPerDictionary-seed#[A60419A7BBFF08A3]) [    ] o.a.s.u.p.LogUpdateProcessorFactory [collection1]  webapp=null path=null params={}{deleteByQuery=*:*} 0 0
   [junit4]   2> 1206336 INFO  (TEST-SpellCheckComponentTest.testPerDictionary-seed#[A60419A7BBFF08A3]) [    ] o.a.s.u.DirectUpdateHandler2 start commit{,optimize=false,openSearcher=true,waitSearcher=true,expungeDeletes=false,softCommit=false,prepareCommit=false}
   [junit4]   2> 1206336 INFO  (TEST-SpellCheckComponentTest.testPerDictionary-seed#[A60419A7BBFF08A3]) [    ] o.a.s.u.SolrIndexWriter Calling setCommitData with IW:org.apache.solr.update.SolrIndexWriter@13e9f3c1
   [junit4]   2> 1206337 INFO  (TEST-SpellCheckComponentTest.testPerDictionary-seed#[A60419A7BBFF08A3]) [    ] o.a.s.s.SolrIndexSearcher Opening [Searcher@422200f2[collection1] main]
   [junit4]   2> 1206337 INFO  (TEST-SpellCheckComponentTest.testPerDictionary-seed#[A60419A7BBFF08A3]) [    ] o.a.s.u.DirectUpdateHandler2 end_commit_flush
   [junit4]   2> 1206337 INFO  (searcherExecutor-8351-thread-1) [    ] o.a.s.h.c.SpellCheckComponent Building spell index for spell checker: default
   [junit4]   2> 1206401 INFO  (searcherExecutor-8351-thread-1) [    ] o.a.s.h.c.SpellCheckComponent Building spell index for spell checker: default_teststop
   [junit4]   2> 1206474 INFO  (searcherExecutor-8351-thread-1) [    ] o.a.s.h.c.SpellCheckComponent Building spell index for spell checker: threshold
   [junit4]   2> 1206555 INFO  (searcherExecutor-8351-thread-1) [    ] o.a.s.h.c.SpellCheckComponent Building spell index for spell checker: threshold_direct
   [junit4]   2> 1206555 INFO  (searcherExecutor-8351-thread-1) [    ] o.a.s.h.c.SpellCheckComponent Building spell index for spell checker: multipleFields
   [junit4]   2> 1206611 INFO  (searcherExecutor-8351-thread-1) [    ] o.a.s.h.c.SpellCheckComponent Building spell index for spell checker: freq
   [junit4]   2> 1206674 INFO  (searcherExecutor-8351-thread-1) [    ] o.a.s.h.c.SpellCheckComponent Building spell index for spell checker: fqcn
   [junit4]   2> 1206745 INFO  (searcherExecutor-8351-thread-1) [    ] o.a.s.c.SolrCore [collection1] Registered new searcher Searcher@422200f2[collection1] main{ExitableDirectoryReader(UninvertingDirectoryReader())}
   [junit4]   2> 1206746 INFO  (TEST-SpellCheckComponentTest.testPerDictionary-seed#[A60419A7BBFF08A3]) [    ] o.a.s.u.p.LogUpdateProcessorFactory [collection1]  webapp=null path=null params={}{commit=} 0 409
   [junit4]   2> 1206748 INFO  (TEST-SpellCheckComponentTest.testMaximumResultsForSuggest-seed#[A60419A7BBFF08A3]) [    ] o.a.s.SolrTestCaseJ4 ###Starting testMaximumResultsForSuggest
   [junit4]   2> 1206748 INFO  (TEST-SpellCheckComponentTest.testMaximumResultsForSuggest-seed#[A60419A7BBFF08A3]) [    ] o.a.s.u.p.LogUpdateProcessorFactory [collection1]  webapp=null path=null params={}{add=[0]} 0 0
   [junit4]   2> 1206749 INFO  (TEST-SpellCheckComponentTest.testMaximumResultsForSuggest-seed#[A60419A7BBFF08A3]) [    ] o.a.s.u.p.LogUpdateProcessorFactory [collection1]  webapp=null path=null params={}{add=[1]} 0 0
   [junit4]   2> 1206749 INFO  (TEST-SpellCheckComponentTest.testMaximumResultsForSuggest-seed#[A60419A7BBFF08A3]) [    ] o.a.s.u.p.LogUpdateProcessorFactory [collection1]  webapp=null path=null params={}{add=[2]} 0 0
   [junit4]   2> 1206749 INFO  (TEST-SpellCheckComponentTest.testMaximumResultsForSuggest-seed#[A60419A7BBFF08A3]) [    ] o.a.s.u.p.LogUpdateProcessorFactory [collection1]  webapp=null path=null params={}{add=[3]} 0 0
   [junit4]   2> 1206749 INFO  (TEST-SpellCheckComponentTest.testMaximumResultsForSuggest-seed#[A60419A7BBFF08A3]) [    ] o.a.s.u.p.LogUpdateProcessorFactory [collection1]  webapp=null path=null params={}{add=[4]} 0 0
   [junit4]   2> 1206750 INFO  (TEST-SpellCheckComponentTest.testMaximumResultsForSuggest-seed#[A60419A7BBFF08A3]) [    ] o.a.s.u.p.LogUpdateProcessorFactory [collection1]  webapp=null path=null params={}{add=[5]} 0 0
   [junit4]   2> 1206750 INFO  (TEST-SpellCheckComponentTest.testMaximumResultsForSuggest-seed#[A60419A7BBFF08A3]) [    ] o.a.s.u.p.LogUpdateProcessorFactory [collection1]  webapp=null path=null params={}{add=[6]} 0 0
   [junit4]   2> 1206750 INFO  (TEST-SpellCheckComponentTest.testMaximumResultsForSuggest-seed#[A60419A7BBFF08A3]) [    ] o.a.s.u.p.LogUpdateProcessorFactory [collection1]  webapp=null path=null params={}{add=[7]} 0 0
   [junit4]   2> 1206750 INFO  (TEST-SpellCheckComponentTest.testMaximumResultsForSuggest-seed#[A60419A7BBFF08A3]) [    ] o.a.s.u.p.LogUpdateProcessorFactory [collection1]  webapp=null path=null params={}{add=[8]} 0 0
   [junit4]   2> 1206751 INFO  (TEST-SpellCheckComponentTest.testMaximumResultsForSuggest-seed#[A60419A7BBFF08A3]) [    ] o.a.s.u.p.LogUpdateProcessorFactory [collection1]  webapp=null path=null params={}{add=[9]} 0 0
   [junit4]   2> 1206751 INFO  (TEST-SpellCheckComponentTest.testMaximumResultsForSuggest-seed#[A60419A7BBFF08A3]) [    ] o.a.s.u.DirectUpdateHandler2 start commit{,optimize=false,openSearcher=true,waitSearcher=true,expungeDeletes=false,softCommit=false,prepareCommit=false}
   [junit4]   2> 1206751 INFO  (TEST-SpellCheckComponentTest.testMaximumResultsForSuggest-seed#[A60419A7BBFF08A3]) [    ] o.a.s.u.SolrIndexWriter Calling setCommitData with IW:org.apache.solr.update.SolrIndexWriter@13e9f3c1
   [junit4]   2> 1206754 INFO  (TEST-SpellCheckComponentTest.testMaximumResultsForSuggest-seed#[A60419A7BBFF08A3]) [    ] o.a.s.s.SolrIndexSearcher Opening [Searcher@5b07d50c[collection1] main]
   [junit4]   2> 1206754 INFO  (TEST-SpellCheckComponentTest.testMaximumResultsForSuggest-seed#[A60419A7BBFF08A3]) [    ] o.a.s.u.DirectUpdateHandler2 end_commit_flush
   [junit4]   2> 1206754 INFO  (searcherExecutor-8351-thread-1) [    ] o.a.s.h.c.SpellCheckComponent Building spell index for spell checker: default
   [junit4]   2> 1206860 INFO  (searcherExecutor-8351-thread-1) [    ] o.a.s.h.c.SpellCheckComponent Building spell index for spell checker: default_teststop
   [junit4]   2> 1206907 INFO  (searcherExecutor-8351-thread-1) [    ] o.a.s.h.c.SpellCheckComponent Building spell index for spell checker: threshold
   [junit4]   2> 1207059 INFO  (searcherExecutor-8351-thread-1) [    ] o.a.s.h.c.SpellCheckComponent Building spell index for spell checker: threshold_direct
   [junit4]   2> 1207059 INFO  (searcherExecutor-8351-thread-1) [    ] o.a.s.h.c.SpellCheckComponent Building spell index for spell checker: multipleFields
   [junit4]   2> 1207180 INFO  (searcherExecutor-8351-thread-1) [    ] o.a.s.h.c.SpellCheckComponent Building spell index for spell checker: freq
   [junit4]   2> 1207313 INFO  (searcherExecutor-8351-thread-1) [    ] o.a.s.h.c.SpellCheckComponent Building spell index for spell checker: fqcn
   [junit4]   2> 1207448 INFO  (searcherExecutor-8351-thread-1) [    ] o.a.s.c.SolrCore [collection1] Registered new searcher Searcher@5b07d50c[collection1] main{ExitableDirectoryReader(UninvertingDirectoryReader(Uninverting(_2(6.4.0):c10)))}
   [junit4]   2> 1207449 INFO  (TEST-SpellCheckComponentTest.testMaximumResultsForSuggest-seed#[A60419A7BBFF08A3]) [    ] o.a.s.u.p.LogUpdateProcessorFactory [collection1]  webapp=null path=null params={}{commit=} 0 697
   [junit4]   2> 1207675 INFO  (TEST-SpellCheckComponentTest.testMaximumResultsForSuggest-seed#[A60419A7BBFF08A3]) [    ] o.a.s.c.S.Request [collection1]  webapp=null path=null params={q=lowerfilt:(this+OR+brwn)&spellcheck.maxResultsForSuggest=7&qt=spellCheckCompRH&spellcheck=true&spellcheck.count=5&wt=xml&spellcheck.build=true&spellcheck.extendedResults=false} hits=7 status=0 QTime=226
   [junit4]   2> 1207917 INFO  (TEST-SpellCheckComponentTest.testMaximumResultsForSuggest-seed#[A60419A7BBFF08A3]) [    ] o.a.s.c.S.Request [collection1]  webapp=null path=null params={q=lowerfilt:(this+OR+brwn)&spellcheck.maxResultsForSuggest=6&qt=spellCheckCompRH&spellcheck=true&spellcheck.count=5&wt=xml&spellcheck.build=true&spellcheck.extendedResults=false} hits=7 status=0 QTime=240
   [junit4]   2> 1207917 ERROR (TEST-SpellCheckComponentTest.testMaximumResultsForSuggest-seed#[A60419A7BBFF08A3]) [    ] o.a.s.SolrTestCaseJ4 query failed JSON validation. error=Path not found: /spellcheck/suggestions/[1]/numFound
   [junit4]   2>  expected =/spellcheck/suggestions/[1]/numFound==1
   [junit4]   2>  response = {
   [junit4]   2>   "responseHeader":{
   [junit4]   2>     "status":0,
   [junit4]   2>     "QTime":240},
   [junit4]   2>   "command":"build",
   [junit4]   2>   "response":{"numFound":7,"start":0,"docs":[
   [junit4]   2>       {
   [junit4]   2>         "id":4,
   [junit4]   2>         "range_facet_l":[4],
   [junit4]   2>         "range_facet_l_dv":[4],
   [junit4]   2>         "range_facet_i_dv":[4],
   [junit4]   2>         "lowerfilt":["this blue"],
   [junit4]   2>         "lowerfilt1and2":["this blue"],
   [junit4]   2>         "multiDefault":["muLti-Default"],
   [junit4]   2>         "intDefault":42,
   [junit4]   2>         "timestamp":"2016-12-01T11:29:39.615Z"},
   [junit4]   2>       {
   [junit4]   2>         "id":5,
   [junit4]   2>         "range_facet_l":[5],
   [junit4]   2>         "range_facet_l_dv":[5],
   [junit4]   2>         "range_facet_i_dv":[5],
   [junit4]   2>         "lowerfilt":["this blud"],
   [junit4]   2>         "lowerfilt1and2":["this blud"],
   [junit4]   2>         "multiDefault":["muLti-Default"],
   [junit4]   2>         "intDefault":42,
   [junit4]   2>         "timestamp":"2016-12-01T11:29:39.615Z"},
   [junit4]   2>       {
   [junit4]   2>         "id":6,
   [junit4]   2>         "range_facet_l":[6],
   [junit4]   2>         "range_facet_l_dv":[6],
   [junit4]   2>         "range_facet_i_dv":[6],
   [junit4]   2>         "lowerfilt":["this boue"],
   [junit4]   2>         "lowerfilt1and2":["this boue"],
   [junit4]   2>         "multiDefault":["muLti-Default"],
   [junit4]   2>         "intDefault":42,
   [junit4]   2>         "timestamp":"2016-12-01T11:29:39.616Z"},
   [junit4]   2>       {
   [junit4]   2>         "id":7,
   [junit4]   2>         "range_facet_l":[7],
   [junit4]   2>         "range_facet_l_dv":[7],
   [junit4]   2>         "range_facet_i_dv":[7],
   [junit4]   2>         "lowerfilt":["this glue"],
   [junit4]   2>         "lowerfilt1and2":["this glue"],
   [junit4]   2>         "multiDefault":["muLti-Default"],
   [junit4]   2>         "intDefault":42,
   [junit4]   2>         "timestamp":"2016-12-01T11:29:39.616Z"},
   [junit4]   2>       {
   [junit4]   2>         "id":8,
   [junit4]   2>         "range_facet_l":[8],
   [junit4]   2>         "range_facet_l_dv":[8],
   [junit4]   2>         "range_facet_i_dv":[8],
   [junit4]   2>         "lowerfilt":["this blee"],
   [junit4]   2>         "lowerfilt1and2":["this blee"],
   [junit4]   2>         "multiDefault":["muLti-Default"],
   [junit4]   2>         "intDefault":42,
   [junit4]   2>         "timestamp":"2016-12-01T11:29:39.616Z"},
   [junit4]   2>       {
   [junit4]   2>         "id":0,
   [junit4]   2>         "range_facet_l":[0],
   [junit4]   2>         "range_facet_l_dv":[0],
   [junit4]   2>         "range_facet_i_dv":[0],
   [junit4]   2>         "lowerfilt":["This is a title"],
   [junit4]   2>         "lowerfilt1and2":["This is a title"],
   [junit4]   2>         "multiDefault":["muLti-Default"],
   [junit4]   2>         "intDefault":42,
   [junit4]   2>         "timestamp":"2016-12-01T11:29:39.614Z"},
   [junit4]   2>       {
   [junit4]   2>         "id":2,
   [junit4]   2>         "range_facet_l":[2],
   [junit4]   2>         "range_facet_l_dv":[2],
   [junit4]   2>         "range_facet_i_dv":[2],
   [junit4]   2>         "lowerfilt":["This is a document"],
   [junit4]   2>         "lowerfilt1and2":["This is a document"],
   [junit4]   2>         "multiDefault":["muLti-Default"],
   [junit4]   2>         "intDefault":42,
   [junit4]   2>         "timestamp":"2016-12-01T11:29:39.615Z"}]
   [junit4]   2>   },
   [junit4]   2>   "spellcheck":{
   [junit4]   2>     "suggestions":[]}}
   [junit4]   2> 
   [junit4]   2>  request = q=lowerfilt:(this+OR+brwn)&spellcheck.maxResultsForSuggest=6&qt=spellCheckCompRH&spellcheck=true&spellcheck.count=5&wt=xml&spellcheck.build=true&spellcheck.extendedResults=false
   [junit4]   2> 1208144 INFO  (TEST-SpellCheckComponentTest.testMaximumResultsForSuggest-seed#[A60419A7BBFF08A3]) [    ] o.a.s.c.S.Request [collection1]  webapp=null path=null params={q=lowerfilt:(this+OR+brwn)&spellcheck.maxResultsForSuggest=.90&qt=spellCheckCompRH&spellcheck=true&fq=id:[0+TO+9]&fq=lowerfilt:th*&spellcheck.count=5&wt=xml&spellcheck.build=true&spellcheck.extendedResults=false} hits=7 status=0 QTime=225
   [junit4]   2> 1208354 INFO  (TEST-SpellCheckComponentTest.testMaximumResultsForSuggest-seed#[A60419A7BBFF08A3]) [    ] o.a.s.c.S.Request [collection1]  webapp=null path=null params={q=lowerfilt:(this+OR+brwn)&spellcheck.maxResultsForSuggest=.80&qt=spellCheckCompRH&spellcheck=true&fq=id:[0+TO+9]&fq=lowerfilt:th*&spellcheck.count=5&wt=xml&spellcheck.build=true&spellcheck.extendedResults=false} hits=7 status=0 QTime=209
   [junit4]   2> 1208354 ERROR (TEST-SpellCheckComponentTest.testMaximumResultsForSuggest-seed#[A60419A7BBFF08A3]) [    ] o.a.s.SolrTestCaseJ4 query failed JSON validation. error=Path not found: /spellcheck/suggestions/[1]/numFound
   [junit4]   2>  expected =/spellcheck/suggestions/[1]/numFound==1
   [junit4]   2>  response = {
   [junit4]   2>   "responseHeader":{
   [junit4]   2>     "status":0,
   [junit4]   2>     "QTime":209},
   [junit4]   2>   "command":"build",
   [junit4]   2>   "response":{"numFound":7,"start":0,"docs":[
   [junit4]   2>       {
   [junit4]   2>         "id":4,
   [junit4]   2>         "range_facet_l":[4],
   [junit4]   2>         "range_facet_l_dv":[4],
   [junit4]   2>         "range_facet_i_dv":[4],
   [junit4]   2>         "lowerfilt":["this blue"],
   [junit4]   2>         "lowerfilt1and2":["this blue"],
   [junit4]   2>         "multiDefault":["muLti-Default"],
   [junit4]   2>         "intDefault":42,
   [junit4]   2>         "timestamp":"2016-12-01T11:29:39.615Z"},
   [junit4]   2>       {
   [junit4]   2>         "id":5,
   [junit4]   2>         "range_facet_l":[5],
   [junit4]   2>         "range_facet_l_dv":[5],
   [junit4]   2>         "range_facet_i_dv":[5],
   [junit4]   2>         "lowerfilt":["this blud"],
   [junit4]   2>         "lowerfilt1and2":["this blud"],
   [junit4]   2>         "multiDefault":["muLti-Default"],
   [junit4]   2>         "intDefault":42,
   [junit4]   2>         "timestamp":"2016-12-01T11:29:39.615Z"},
   [junit4]   2>       {
   [junit4]   2>         "id":6,
   [junit4]   2>         "range_facet_l":[6],
   [junit4]   2>         "range_facet_l_dv":[6],
   [junit4]   2>         "range_facet_i_dv":[6],
   [junit4]   2>         "lowerfilt":["this boue"],
   [junit4]   2>         "lowerfilt1and2":["this boue"],
   [junit4]   2>         "multiDefault":["muLti-Default"],
   [junit4]   2>         "intDefault":42,
   [junit4]   2>         "timestamp":"2016-12-01T11:29:39.616Z"},
   [junit4]   2>       {
   [junit4]   2>         "id":7,
   [junit4]   2>         "range_facet_l":[7],
   [junit4]   2>         "range_facet_l_dv":[7],
   [junit4]   2>         "range_facet_i_dv":[7],
   [junit4]   2>         "lowerfilt":["this glue"],
   [junit4]   2>         "lowerfilt1and2":["this glue"],
   [junit4]   2>         "multiDefault":["muLti-Default"],
   [junit4]   2>         "intDefault":42,
   [junit4]   2>         "timestamp":"2016-12-01T11:29:39.616Z"},
   [junit4]   2>       {
   [junit4]   2>         "id":8,
   [junit4]   2>         "range_facet_l":[8],
   [junit4]   2>         "range_facet_l_dv":[8],
   [junit4]   2>         "range_facet_i_dv":[8],
   [junit4]   2>         "lowerfilt":["this blee"],
   [junit4]   2>         "lowerfilt1and2":["this blee"],
   [junit4]   2>         "multiDefault":["muLti-Default"],
   [junit4]   2>         "intDefault":42,
   [junit4]   2>         "timestamp":"2016-12-01T11:29:39.616Z"},
   [junit4]   2>       {
   [junit4]   2>         "id":0,
   [junit4]   2>         "range_facet_l":[0],
   [junit4]   2>         "range_facet_l_dv":[0],
   [junit4]   2>         "range_facet_i_dv":[0],
   [junit4]   2>         "lowerfilt":["This is a title"],
   [junit4]   2>         "lowerfilt1and2":["This is a title"],
   [junit4]   2>         "multiDefault":["muLti-Default"],
   [junit4]   2>         "intDefault":42,
   [junit4]   2>         "timestamp":"2016-12-01T11:29:39.614Z"},
   [junit4]   2>       {
   [junit4]   2>         "id":2,
   [junit4]   2>         "range_facet_l":[2],
   [junit4]   2>         "range_facet_l_dv":[2],
   [junit4]   2>         "range_facet_i_dv":[2],
   [junit4]   2>         "lowerfilt":["This is a document"],
   [junit4]   2>         "lowerfilt1and2":["This is a document"],
   [junit4]   2>         "multiDefault":["muLti-Default"],
   [junit4]   2>         "intDefault":42,
   [junit4]   2>         "timestamp":"2016-12-01T11:29:39.615Z"}]
   [junit4]   2>   },
   [junit4]   2>   "spellcheck":{
   [junit4]   2>     "suggestions":[]}}
   [junit4]   2> 
   [junit4]   2>  request = q=lowerfilt:(this+OR+brwn)&spellcheck.maxResultsForSuggest=.80&qt=spellCheckCompRH&spellcheck=true&fq=id:[0+TO+9]&fq=lowerfilt:th*&spellcheck.count=5&wt=xml&spellcheck.build=true&spellcheck.extendedResults=false
   [junit4]   2> 1208479 INFO  (TEST-SpellCheckComponentTest.testMaximumResultsForSuggest-seed#[A60419A7BBFF08A3]) [    ] o.a.s.c.S.Request [collection1]  webapp=null path=null params={q=lowerfilt:(this+OR+brwn)&spellcheck.maxResultsForSuggest=.70&qt=spellCheckCompRH&spellcheck=true&fq=id:[0+TO+9]&spellcheck.count=5&wt=xml&spellcheck.build=true&spellcheck.maxResultsForSuggest.fq=id:[0+TO+9]&spellcheck.extendedResults=false} hits=7 status=0 QTime=124
   [junit4]   2> 1208635 INFO  (TEST-SpellCheckComponentTest.testMaximumResultsForSuggest-seed#[A60419A7BBFF08A3]) [    ] o.a.s.c.S.Request [collection1]  webapp=null path=null params={q=lowerfilt:(this+OR+brwn)&spellcheck.maxResultsForSuggest=.64&qt=spellCheckCompRH&spellcheck=true&fq=id:[0+TO+9]&spellcheck.count=5&wt=xml&spellcheck.build=true&spellcheck.maxResultsForSuggest.fq=lowerfilt:th*&spellcheck.extendedResults=false} hits=7 status=0 QTime=155
   [junit4]   2> 1208636 ERROR (TEST-SpellCheckComponentTest.testMaximumResultsForSuggest-seed#[A60419A7BBFF08A3]) [    ] o.a.s.SolrTestCaseJ4 query failed JSON validation. error=Path not found: /spellcheck/suggestions/[1]/numFound
   [junit4]   2>  expected =/spellcheck/suggestions/[1]/numFound==1
   [junit4]   2>  response = {
   [junit4]   2>   "responseHeader":{
   [junit4]   2>     "status":0,
   [junit4]   2>     "QTime":155},
   [junit4]   2>   "command":"build",
   [junit4]   2>   "response":{"numFound":7,"start":0,"docs":[
   [junit4]   2>       {
   [junit4]   2>         "id":4,
   [junit4]   2>         "range_facet_l":[4],
   [junit4]   2>         "range_facet_l_dv":[4],
   [junit4]   2>         "range_facet_i_dv":[4],
   [junit4]   2>         "lowerfilt":["this blue"],
   [junit4]   2>         "lowerfilt1and2":["this blue"],
   [junit4]   2>         "multiDefault":["muLti-Default"],
   [junit4]   2>         "intDefault":42,
   [junit4]   2>         "timestamp":"2016-12-01T11:29:39.615Z"},
   [junit4]   2>       {
   [junit4]   2>         "id":5,
   [junit4]   2>         "range_facet_l":[5],
   [junit4]   2>         "range_facet_l_dv":[5],
   [junit4]   2>         "range_facet_i_dv":[5],
   [junit4]   2>         "lowerfilt":["this blud"],
   [junit4]   2>         "lowerfilt1and2":["this blud"],
   [junit4]   2>         "multiDefault":["muLti-Default"],
   [junit4]   2>         "intDefault":42,
   [junit4]   2>         "timestamp":"2016-12-01T11:29:39.615Z"},
   [junit4]   2>       {
   [junit4]   2>         "id":6,
   [junit4]   2>         "range_facet_l":[6],
   [junit4]   2>         "range_facet_l_dv":[6],
   [junit4]   2>         "range_facet_i_dv":[6],
   [junit4]   2>         "lowerfilt":["this boue"],
   [junit4]   2>         "lowerfilt1and2":["this boue"],
   [junit4]   2>         "multiDefault":["muLti-Default"],
   [junit4]   2>         "intDefault":42,
   [junit4]   2>         "timestamp":"2016-12-01T11:29:39.616Z"},
   [junit4]   2>       {
   [junit4]   2>         "id":7,
   [junit4]   2>         "range_facet_l":[7],
   [junit4]   2>         "range_facet_l_dv":[7],
   [junit4]   2>         "range_facet_i_dv":[7],
   [junit4]   2>         "lowerfilt":["this glue"],
   [junit4]   2>         "lowerfilt1and2":["this glue"],
   [junit4]   2>         "multiDefault":["muLti-Default"],
   [junit4]   2>         "intDefault":42,
   [junit4]   2>         "timestamp":"2016-12-01T11:29:39.616Z"},
   [junit4]   2>       {
   [junit4]   2>         "id":8,
   [junit4]   2>         "range_facet_l":[8],
   [junit4]   2>         "range_facet_l_dv":[8],
   [junit4]   2>         "range_facet_i_dv":[8],
   [junit4]   2>         "lowerfilt":["this blee"],
   [junit4]   2>         "lowerfilt1and2":["this blee"],
   [junit4]   2>         "multiDefault":["muLti-Default"],
   [junit4]   2>         "intDefault":42,
   [junit4]   2>         "timestamp":"2016-12-01T11:29:39.616Z"},
   [junit4]   2>       {
   [junit4]   2>         "id":0,
   [junit4]   2>         "range_facet_l":[0],
   [junit4]   2>         "range_facet_l_dv":[0],
   [junit4]   2>         "range_facet_i_dv":[0],
   [junit4]   2>         "lowerfilt":["This is a title"],
   [junit4]   2>         "lowerfilt1and2":["This is a title"],
   [junit4]   2>         "multiDefault":["muLti-Default"],
   [junit4]   2>         "intDefault":42,
   [junit4]   2>         "timestamp":"2016-12-01T11:29:39.614Z"},
   [junit4]   2>       {
   [junit4]   2>         "id":2,
   [junit4]   2>         "range_facet_l":[2],
   [junit4]   2>         "range_facet_l_dv":[2],
   [junit4]   2>         "range_facet_i_dv":[2],
   [junit4]   2>         "lowerfilt":["This is a document"],
   [junit4]   2>         "lowerfilt1and2":["This is a document"],
   [junit4]   2>         "multiDefault":["muLti-Default"],
   [junit4]   2>         "intDefault":42,
   [junit4]   2>         "timestamp":"2016-12-01T11:29:39.615Z"}]
   [junit4]   2>   },
   [junit4]   2>   "spellcheck":{
   [junit4]   2>     "suggestions":[]}}
   [junit4]   2> 
   [junit4]   2>  request = q=lowerfilt:(this+OR+brwn)&spellcheck.maxResultsForSuggest=.64&qt=spellCheckCompRH&spellcheck=true&fq=id:[0+TO+9]&spellcheck.count=5&wt=xml&spellcheck.build=true&spellcheck.maxResultsForSuggest.fq=lowerfilt:th*&spellcheck.extendedResults=false
   [junit4]   2> 1208636 INFO  (TEST-SpellCheckComponentTest.testMaximumResultsForSuggest-seed#[A60419A7BBFF08A3]) [    ] o.a.s.SolrTestCaseJ4 ###Ending testMaximumResultsForSuggest
   [junit4]   2> 1208636 INFO  (TEST-SpellCheckComponentTest.testMaximumResultsForSuggest-seed#[A60419A7BBFF08A3]) [    ] o.a.s.u.DirectUpdateHandler2 [collection1] REMOVING ALL DOCUMENTS FROM INDEX
   [junit4]   2> 1208636 INFO  (TEST-SpellCheckComponentTest.testMaximumResultsForSuggest-seed#[A60419A7BBFF08A3]) [    ] o.a.s.u.p.LogUpdateProcessorFactory [collection1]  webapp=null path=null params={}{deleteByQuery=*:*} 0 0
   [junit4]   2> 1208636 INFO  (TEST-SpellCheckComponentTest.testMaximumResultsForSuggest-seed#[A60419A7BBFF08A3]) [    ] o.a.s.u.DirectUpdateHandler2 start commit{,optimize=false,openSearcher=true,waitSearcher=true,expungeDeletes=false,softCommit=false,prepareCommit=false}
   [junit4]   2> 1208636 INFO  (TEST-SpellCheckComponentTest.testMaximumResultsForSuggest-seed#[A60419A7BBFF08A3]) [    ] o.a.s.u.SolrIndexWriter Calling setCommitData with IW:org.apache.solr.update.SolrIndexWriter@13e9f3c1
   [junit4]   2> 1208637 INFO  (TEST-SpellCheckComponentTest.testMaximumResultsForSuggest-seed#[A60419A7BBFF08A3]) [    ] o.a.s.s.SolrIndexSearcher Opening [Searcher@5e27729e[collection1] main]
   [junit4]   2> 1208637 INFO  (TEST-SpellCheckComponentTest.testMaximumResultsForSuggest-seed#[A60419A7BBFF08A3]) [    ] o.a.s.u.DirectUpdateHandler2 end_commit_flush
   [junit4]   2> 1208637 INFO  (searcherExecutor-8351-thread-1) [    ] o.a.s.h.c.SpellCheckComponent Building spell index for spell checker: default
   [junit4]   2> 1208701 INFO  (searcherExecutor-8351-thread-1) [    ] o.a.s.h.c.SpellCheckComponent Building spell index for spell checker: default_teststop
   [junit4]   2> 1208748 INFO  (searcherExecutor-8351-thread-1) [    ] o.a.s.h.c.SpellCheckComponent Building spell index for spell checker: threshold
   [junit4]   2> 1208812 INFO  (searcherExecutor-8351-thread-1) [    ] o.a.s.h.c.SpellCheckComponent Building spell index for spell checker: threshold_direct
   [junit4]   2> 1208812 INFO  (searcherExecutor-8351-thread-1) [    ] o.a.s.h.c.SpellCheckComponent Building spell index for spell checker: multipleFields
   [junit4]   2> 1208881 INFO  (searcherExecutor-8351-thread-1) [    ] o.a.s.h.c.SpellCheckComponent Building spell index for spell checker: freq
   [junit4]   2> 1208943 INFO  (searcherExecutor-8351-thread-1) [    ] o.a.s.h.c.SpellCheckComponent Building spell index for spell checker: fqcn
   [junit4]   2> 1209003 INFO  (searcherExecutor-8351-thread-1) [    ] o.a.s.c.SolrCore [collection1] Registered new searcher Searcher@5e27729e[collection1] main{ExitableDirectoryReader(UninvertingDirectoryReader())}
   [junit4]   2> 1209003 INFO  (TEST-SpellCheckComponentTest.testMaximumResultsForSuggest-seed#[A60419A7BBFF08A3]) [    ] o.a.s.u.p.LogUpdateProcessorFactory [collection1]  webapp=null path=null params={}{commit=} 0 366
   [junit4]   2> 1209004 INFO  (TEST-SpellCheckComponentTest.testExtendedResultsCount-seed#[A60419A7BBFF08A3]) [    ] o.a.s.SolrTestCaseJ4 ###Starting testExtendedResultsCount
   [junit4]   2> 1209005 INFO  (TEST-SpellCheckComponentTest.testExtendedResultsCount-seed#[A60419A7BBFF08A3]) [    ] o.a.s.u.p.LogUpdateProcessorFactory [collection1]  webapp=null path=null params={}{add=[0]} 0 0
   [junit4]   2> 1209005 INFO  (TEST-SpellCheckComponentTest.testExtendedResultsCount-seed#[A60419A7BBFF08A3]) [    ] o.a.s.u.p.LogUpdateProcessorFactory [collection1]  webapp=null path=null params={}{add=[1]} 0 0
   [junit4]   2> 1209005 INFO  (TEST-SpellCheckComponentTest.testExtendedResultsCount-seed#[A60419A7BBFF08A3]) [    ] o.a.s.u.p.LogUpdateProcessorFactory [collection1]  webapp=null path=null params={}{add=[2]} 0 0
   [junit4]   2> 1209006 INFO  (TEST-SpellCheckComponentTest.testExtendedResultsCount-seed#[A60419A7BBFF08A3]) [    ] o.a.s.u.p.LogUpdateProcessorFactory [collection1]  webapp=null path=null params={}{add=[3]} 0 0
   [junit4]   2> 1209006 INFO  (TEST-SpellCheckComponentTest.testExtendedResultsCount-seed#[A60419A7BBFF08A3]) [    ] o.a.s.u.p.LogUpdateProcessorFactory [collection1]  webapp=null path=null params={}{add=[4]} 0 0
   [junit4]   2> 1209006 INFO  (TEST-SpellCheckComponentTest.testExtendedResultsCount-seed#[A60419A7BBFF08A3]) [    ] o.a.s.u.p.LogUpdateProcessorFactory [collection1]  webapp=null path=null params={}{add=[5]} 0 0
   [junit4]   2> 1209006 INFO  (TEST-SpellCheckComponentTest.testExtendedResultsCount-seed#[A60419A7BBFF08A3]) [    ] o.a.s.u.p.LogUpdateProcessorFactory [collection1]  webapp=null path=null params={}{add=[6]} 0 0
   [junit4]   2> 1209006 INFO  (TEST-SpellCheckComponentTest.testExtendedResultsCount-seed#[A60419A7BBFF08A3]) [    ] o.a.s.u.p.LogUpdateProcessorFactory [collection1]  webapp=null path=null params={}{add=[7]} 0 0
   [junit4]   2> 1209007 INFO  (TEST-SpellCheckComponentTest.testExtendedResultsCount-seed#[A60419A7BBFF08A3]) [    ] o.a.s.u.p.LogUpdateProcessorFactory [collection1]  webapp=null path=null params={}{add=[8]} 0 0
   [junit4]   2> 1209007 INFO  (TEST-SpellCheckComponentTest.testExtendedResultsCount-seed#[A60419A7BBFF08A3]) [    ] o.a.s.u.p.LogUpdateProcessorFactory [collection1]  webapp=null path=null params={}{add=[9]} 0 0
   [junit4]   2> 1209008 INFO  (TEST-SpellCheckComponentTest.testExtendedResultsCount-seed#[A60419A7BBFF08A3]) [    ] o.a.s.u.DirectUpdateHandler2 start commit{,optimize=false,openSearcher=true,waitSearcher=true,expungeDeletes=false,softCommit=false,prepareCommit=false}
   [junit4]   2> 1209008 INFO  (TEST-SpellCheckComponentTest.testExtendedResultsCount-seed#[A60419A7BBFF08A3]) [    ] o.a.s.u.SolrIndexWriter Calling setCommitData with IW:org.apache.solr.update.SolrIndexWriter@13e9f3c1
   [junit4]   2> 1209009 INFO  (TEST-SpellCheckComponentTest.testExtendedResultsCount-seed#[A60419A7BBFF08A3]) [    ] o.a.s.s.SolrIndexSearcher Opening [Searcher@61280adf[collection1] main]
   [junit4]   2> 1209009 INFO  (TEST-SpellCheckComponentTest.testExtendedResultsCount-seed#[A60419A7BBFF08A3]) [    ] o.a.s.u.DirectUpdateHandler2 end_commit_flush
   [junit4]   2> 1209009 INFO  (searcherExecutor-8351-thread-1) [    ] o.a.s.h.c.SpellCheckComponent Building spell index for spell checker: default
   [junit4]   2> 1209183 INFO  (searcherExecutor-8351-thread-1) [    ] o.a.s.h.c.SpellCheckComponent Building spell index for spell checker: default_teststop
   [junit4]   2> 1209225 INFO  (searcherExecutor-8351-thread-1) [    ] o.a.s.h.c.SpellCheckComponent Building spell index for spell checker: threshold
   [junit4]   2> 1209433 INFO  (searcherExecutor-8351-thread-1) [    ] o.a.s.h.c.SpellCheckComponent Building spell index for spell checker: threshold_direct
   [junit4]   2> 1209433 INFO  (searcherExecutor-8351-thread-1) [    ] o.a.s.h.c.SpellCheckComponent Building spell index for spell checker: multipleFields
   [junit4]   2> 1209615 INFO  (searcherExecutor-8351-thread-1) [    ] o.a.s.h.c.SpellCheckComponent Building spell index for spell checker: freq
   [junit4]   2> 1209790 INFO  (searcherExecutor-8351-thread-1) [    ] o.a.s.h.c.SpellCheckComponent Building spell index for spell checker: fqcn
   [junit4]   2> 1209983 INFO  (searcherExecutor-8351-thread-1) [    ] o.a.s.c.SolrCore [collection1] Registered new searcher Searcher@61280adf[collection1] main{ExitableDirectoryReader(UninvertingDirectoryReader(Uninverting(_3(6.4.0):c10)))}
   [junit4]   2> 1209983 INFO  (TEST-SpellCheckComponentTest.testExtendedResultsCount-seed#[A60419A7BBFF08A3]) [    ] o.a.s.u.p.LogUpdateProcessorFactory [collection1]  webapp=null path=null params={}{commit=} 0 975
   [junit4]   2> 1210205 INFO  (TEST-SpellCheckComponentTest.testExtendedResultsCount-seed#[A60419A7BBFF08A3]) [    ] o.a.s.c.S.Request [collection1]  webapp=null path=null params={q=bluo&qt=spellCheckCompRH&spellcheck=true&spellcheck.count=5&wt=xml&spellcheck.build=true&spellcheck.extendedResults=false} hits=0 status=0 QTime=221
   [junit4]   2> 1210205 INFO  (TEST-SpellCheckComponentTest.testExtendedResultsCount-seed#[A60419A7BBFF08A3]) [    ] o.a.s.c.S.Request [collection1]  webapp=null path=null params={q=bluo&qt=spellCheckCompRH&spellcheck=true&spellcheck.count=3&wt=xml&spellcheck.extendedResults=true} hits=0 status=0 QTime=0
   [junit4]   2> 1210206 INFO  (TEST-SpellCheckComponentTest.testExtendedResultsCount-seed#[A60419A7BBFF08A3]) [    ] o.a.s.SolrTestCaseJ4 ###Ending testExtendedResultsCount
   [junit4]   2> 1210206 INFO  (TEST-SpellCheckComponentTest.testExtendedResultsCount-seed#[A60419A7BBFF08A3]) [    ] o.a.s.u.DirectUpdateHandler2 [collection1] REMOVING ALL DOCUMENTS FROM INDEX
   [junit4]   2> 1210206 INFO  (TEST-SpellCheckComponentTest.testExtendedResultsCount-seed#[A60419A7BBFF08A3]) [    ] o.a.s.u.p.LogUpdateProcessorFactory [collection1]  webapp=null path=null params={}{deleteByQuery=*:*} 0 0
   [junit4]   2> 1210206 INFO  (TEST-SpellCheckComponentTest.testExtendedResultsCount-seed#[A60419A7BBFF08A3]) [    ] o.a.s.u.DirectUpdateHandler2 start commit{,optimize=false,openSearcher=true,waitSearcher=true,expungeDeletes=false,softCommit=false,prepareCommit=false}
   [junit4]   2> 1210206 INFO  (TEST-SpellCheckComponentTest.testExtendedResultsCount-seed#[A60419A7BBFF08A3]) [    ] o.a.s.u.SolrIndexWriter Calling setCommitData with IW:org.apache.solr.update.SolrIndexWriter@13e9f3c1
   [junit4]   2> 1210207 INFO  (TEST-SpellCheckComponentTest.testExtendedResultsCount-seed#[A60419A7BBFF08A3]) [    ] o.a.s.s.SolrIndexSearcher Opening [Searcher@589e4fa6[collection1] main]
   [junit4]   2> 1210207 INFO  (TEST-SpellCheckComponentTest.testExtendedResultsCount-seed#[A60419A7BBFF08A3]) [    ] o.a.s.u.DirectUpdateHandler2 end_commit_flush
   [junit4]   2> 1210207 INFO  (searcherExecutor-8351-thread-1) [    ] o.a.s.h.c.SpellCheckComponent Building spell index for spell checker: default
   [junit4]   2> 1210294 INFO  (searcherExecutor-8351-thread-1) [    ] o.a.s.h.c.SpellCheckComponent Building spell index for spell checker: default_teststop
   [junit4]   2> 1210391 INFO  (searcherExecutor-8351-thread-1) [    ] o.a.s.h.c.SpellCheckComponent Building spell index for spell checker: threshold
   [junit4]   2> 1210471 INFO  (searcherExecutor-8351-thread-1) [    ] o.a.s.h.c.SpellCheckComponent Building spell index for spell checker: threshold_direct
   [junit4]   2> 1210472 INFO  (searcherExecutor-8351-thread-1) [    ] o.a.s.h.c.SpellCheckComponent Building spell index for spell checker: multipleFields
   [junit4]   2> 1210568 INFO  (searcherExecutor-8351-thread-1) [    ] o.a.s.h.c.SpellCheckComponent Building spell index for spell checker: freq
   [junit4]   2> 1210639 INFO  (searcherExecutor-8351-thread-1) [    ] o.a.s.h.c.SpellCheckComponent Building spell index for spell checker: fqcn
   [junit4]   2> 1210719 INFO  (searcherExecutor-8351-thread-1) [    ] o.a.s.c.SolrCore [collection1] Registered new searcher Searcher@589e4fa6[collection1] main{ExitableDirectoryReader(UninvertingDirectoryReader())}
   [junit4]   2> 1210719 INFO  (TEST-SpellCheckComponentTest.testExtendedResultsCount-seed#[A60419A7BBFF08A3]) [    ] o.a.s.u.p.LogUpdateProcessorFactory [collection1]  webapp=null path=null params={}{commit=} 0 512
   [junit4]   2> 1210720 INFO  (TEST-SpellCheckComponentTest.testCorrectSpelling-seed#[A60419A7BBFF08A3]) [    ] o.a.s.SolrTestCaseJ4 ###Starting testCorrectSpelling
   [junit4]   2> 1210721 INFO  (TEST-SpellCheckComponentTest.testCorrectSpelling-seed#[A60419A7BBFF08A3]) [    ] o.a.s.u.p.LogUpdateProcessorFactory [collection1]  webapp=null path=null params={}{add=[0]} 0 0
   [junit4]   2> 1210721 INFO  (TEST-SpellCheckComponentTest.testCorrectSpelling-seed#[A60419A7BBFF08A3]) [    ] o.a.s.u.p.LogUpdateProcessorFactory [collection1]  webapp=null path=null params={}{add=[1]} 0 0
   [junit4]   2> 1210721 INFO  (TEST-SpellCheckComponentTest.testCorrectSpelling-seed#[A60419A7BBFF08A3]) [    ] o.a.s.u.p.LogUpdateProcessorFactory [collection1]  webapp=null path=null params={}{add=[2]} 0 0
   [junit4]   2> 1210721 INFO  (TEST-SpellCheckComponentTest.testCorrectSpelling-seed#[A60419A7BBFF08A3]) [    ] o.a.s.u.p.LogUpdateProcessorFactory [collection1]  webapp=null path=null params={}{add=[3]} 0 0
   [junit4]   2> 1210721 INFO  (TEST-SpellCheckComponentTest.testCorrectSpelling-seed#[A60419A7BBFF08A3]) [    ] o.a.s.u.p.LogUpdateProcessorFactory [collection1]  webapp=null path=null params={}{add=[4]} 0 0
   [junit4]   2> 1210722 INFO  (TEST-SpellCheckComponentTest.testCorrectSpelling-seed#[A60419A7BBFF08A3]) [    ] o.a.s.u.p.LogUpdateProcessorFactory [collection1]  webapp=null path=null params={}{add=[5]} 0 0
   [junit4]   2> 1210722 INFO  (TEST-SpellCheckComponentTest.testCorrectSpelling-seed#[A60419A7BBFF08A3]) [    ] o.a.s.u.p.LogUpdateProcessorFactory [collection1]  webapp=null path=null params={}{add=[6]} 0 0
   [junit4]   2> 1210722 INFO  (TEST-SpellCheckComponentTest.testCorrectSpelling-seed#[A60419A7BBFF08A3]) [    ] o.a.s.u.p.LogUpdateProcessorFactory [collection1]  webapp=null path=null params={}{add=[7]} 0 0
   [junit4]   2> 1210722 INFO  (TEST-SpellCheckComponentTest.testCorrectSpelling-seed#[A60419A7BBFF08A3]) [    ] o.a.s.u.p.LogUpdateProcessorFactory [collection1]  webapp=null path=null params={}{add=[8]} 0 0
   [junit4]   2> 1210722 INFO  (TEST-SpellCheckComponentTest.testCorrectSpelling-seed#[A60419A7BBFF08A3]) [    ] o.a.s.u.p.LogUpdateProcessorFactory [collection1]  webapp=null path=null params={}{add=[9]} 0 0
   [junit4]   2> 1210723 INFO  (TEST-SpellCheckComponentTest.testCorrectSpelling-seed#[A60419A7BBFF08A3]) [    ] o.a.s.u.DirectUpdateHandler2 start commit{,optimize=false,openSearcher=true,waitSearcher=true,expungeDeletes=false,softCommit=false,prepareCommit=false}
   [junit4]   2> 1210723 INFO  (TEST-SpellCheckComponentTest.testCorrectSpelling-seed#[A60419A7BBFF08A3]) [    ] o.a.s.u.SolrIndexWriter Calling setCommitData with IW:org.apache.solr.update.SolrIndexWriter@13e9f3c1
   [junit4]   2> 1210725 INFO  (TEST-SpellCheckComponentTest.testCorrectSpelling-seed#[A60419A7BBFF08A3]) [    ] o.a.s.s.SolrIndexSearcher Opening [Searcher@71d92574[collection1] main]
   [junit4]   2> 1210725 INFO  (TEST-SpellCheckComponentTest.testCorrectSpelling-seed#[A60419A7BBFF08A3]) [    ] o.a.s.u.DirectUpdateHandler2 end_commit_flush
   [junit4]   2> 1210725 INFO  (searcherExecutor-8351-thread-1) [    ] o.a.s.h.c.SpellCheckComponent Building spell index for spell checker: default
   [junit4]   2> 1210925 INFO  (searcherExecutor-8351-thread-1) [    ] o.a.s.h.c.SpellCheckComponent Building spell index for spell checker: default_teststop
   [junit4]   2> 1211031 INFO  (searcherExecutor-8351-thread-1) [    ] o.a.s.h.c.SpellCheckComponent Building spell index for spell checker: threshold
   [junit4]   2> 1211260 INFO  (searcherExecutor-8351-thread-1) [    ] o.a.s.h.c.SpellCheckComponent Building spell index for spell checker: threshold_direct
   [junit4]   2> 1211260 INFO  (searcherExecutor-8351-thread-1) [    ] o.a.s.h.c.SpellCheckComponent Building spell index for spell checker: multipleFields
   [junit4]   2> 1211410 INFO  (searcherExecutor-8351-thread-1) [    ] o.a.s.h.c.SpellCheckComponent Building spell index for spell checker: freq
   [junit4]   2> 1211557 INFO  (searcherExecutor-8351-thread-1) [    ] o.a.s.h.c.SpellCheckComponent Building spell index for spell checker: fqcn
   [junit4]   2> 1211717 INFO  (searcherExecutor-8351-thread-1) [    ] o.a.s.c.SolrCore [collection1] Registered new searcher Searcher@71d92574[collection1] main{ExitableDirectoryReader(UninvertingDirectoryReader(Uninverting(_4(6.4.0):c10)))}
   [junit4]   2> 1211717 INFO  (TEST-SpellCheckComponentTest.testCorrectSpelling-seed#[A60419A7BBFF08A3]) [    ] o.a.s.u.p.LogUpdateProcessorFactory [collection1]  webapp=null path=null params={}{commit=} 0 993
   [junit4]   2> 1211718 INFO  (TEST-SpellCheckComponentTest.testCorrectSpelling-seed#[A60419A7BBFF08A3]) [    ] o.a.s.c.S.Request [collection1]  webapp=null path=null params={q=lowerfilt:lazy+lowerfilt:brown&qt=spellCheckCompRH&json.nl=map&spellcheck=true&wt=xml&spellcheck.extendedResults=true} hits=1 status=0 QTime=0
   [junit4]   2> 1211718 INFO  (TEST-SpellCheckComponentTest.testCorrectSpelling-seed#[A60419A7BBFF08A3]) [    ] o.a.s.c.S.Request [collection1]  webapp=null path=null params={q=lowerfilt:lazy+lowerfilt:brown&qt=spellCheckCompRH&spellcheck.dictionary=direct_lowerfilt&json.nl=map&spellcheck=true&wt=xml&spellcheck.extendedResults=true} hits=1 status=0 QTime=0
   [junit4]   2> 1211720 INFO  (TEST-SpellCheckComponentTest.testCorrectSpelling-seed#[A60419A7BBFF08A3]) [    ] o.a.s.c.S.Request [collection1]  webapp=null path=null params={q=lakkle&qt=spellCheckCompRH&spellcheck.dictionary=direct_lowerfilt&json.nl=map&spellcheck=true&wt=xml&spellcheck.extendedResults=true} hits=0 status=0 QTime=1
   [junit4]   2> 1211720 INFO  (TEST-SpellCheckComponentTest.testCorrectSpelling-seed#[A60419A7BBFF08A3]) [    ] o.a.s.SolrTestCaseJ4 ###Ending testCorrectSpelling
   [junit4]   2> 1211720 INFO  (TEST-SpellCheckComponentTest.testCorrectSpelling-seed#[A60419A7BBFF08A3]) [    ] o.a.s.u.DirectUpdateHandler2 [collection1] REMOVING ALL DOCUMENTS FROM INDEX
   [junit4]   2> 1211720 INFO  (TEST-SpellCheckComponentTest.testCorrectSpelling-seed#[A60419A7BBFF08A3]) [    ] o.a.s.u.p.LogUpdateProcessorFactory [collection1]  webapp=null path=null params={}{deleteByQuery=*:*} 0 0
   [junit4]   2> 1211721 INFO  (TEST-SpellCheckComponentTest.testCorrectSpelling-seed#[A60419A7BBFF08A3]) [    ] o.a.s.u.DirectUpdateHandler2 start commit{,optimize=false,openSearcher=true,waitSearcher=true,expungeDeletes=false,softCommit=false,prepareCommit=false}
   [junit4]   2> 1211721 INFO  (TEST-SpellCheckComponentTest.testCorrectSpelling-seed#[A60419A7BBFF08A3]) [    ] o.a.s.u.SolrIndexWriter Calling setCommitData with IW:org.apache.solr.update.SolrIndexWriter@13e9f3c1
   [junit4]   2> 1211721 INFO  (TEST-SpellCheckComponentTest.testCorrectSpelling-seed#[A60419A7BBFF08A3]) [    ] o.a.s.s.SolrIndexSearcher Opening [Searcher@7f6eccbd[collection1] main]
   [junit4]   2> 1211721 INFO  (TEST-SpellCheckComponentTest.testCorrectSpelling-seed#[A60419A7BBFF08A3]) [    ] o.a.s.u.DirectUpdateHandler2 end_commit_flush
   [junit4]   2> 1211721 INFO  (searcherExecutor-8351-thread-1) [    ] o.a.s.h.c.SpellCheckComponent Building spell index for spell checker: default
   [junit4]   2> 1211789 INFO  (searcherExecutor-8351-thread-1) [    ] o.a.s.h.c.SpellCheckComponent Building spell index for spell checker: default_teststop
   [junit4]   2> 1211875 INFO  (searcherExecutor-8351-thread-1) [    ] o.a.s.h.c.SpellCheckComponent Building spell index for spell checker: threshold
   [junit4]   2> 1211935 INFO  (searcherExecutor-8351-thread-1) [    ] o.a.s.h.c.SpellCheckComponent Building spell index for spell checker: threshold_direct
   [junit4]   2> 1211935 INFO  (searcherExecutor-8351-thread-1) [    ] o.a.s.h.c.SpellCheckComponent Building spell index for spell checker: multipleFields
   [junit4]   2> 1212650 INFO  (searcherExecutor-8351-thread-1) [    ] o.a.s.h.c.SpellCheckComponent Building spell index for spell checker: freq
   [junit4]   2> 1212746 INFO  (searcherExecutor-8351-thread-1) [    ] o.a.s.h.c.SpellCheckComponent Building spell index for spell checker: fqcn
   [junit4]   2> 1212847 INFO  (searcherExecutor-8351-thread-1) [    ] o.a.s.c.SolrCore [collection1] Registered new searcher Searcher@7f6eccbd[collection1] main{ExitableDirectoryReader(UninvertingDirectoryReader())}
   [junit4]   2> 1212848 INFO  (TEST-SpellCheckComponentTest.testCorrectSpelling-seed#[A60419A7BBFF08A3]) [    ] o.a.s.u.p.LogUpdateProcessorFactory [collection1]  webapp=null path=null params={}{commit=} 0 1127
   [junit4]   2> 1212849 INFO  (TEST-SpellCheckComponentTest.testRelativeIndexDirLocation-seed#[A60419A7BBFF08A3]) [    ] o.a.s.SolrTestCaseJ4 ###Starting testRelativeIndexDirLocation
   [junit4]   2> 1212849 INFO  (TEST-SpellCheckComponentTest.testRelativeIndexDirLocation-seed#[A60419A7BBFF08A3]) [    ] o.a.s.u.p.LogUpdateProcessorFactory [collection1]  webapp=null path=null params={}{add=[0]} 0 0
   [junit4]   2> 1212850 INFO  (TEST-SpellCheckComponentTest.testRelativeIndexDirLocation-seed#[A60419A7BBFF08A3]) [    ] o.a.s.u.p.LogUpdateProcessorFactory [collection1]  webapp=null path=null params={}{add=[1]} 0 0
   [junit4]   2> 1212850 INFO  (TEST-SpellCheckComponentTest.testRelativeIndexDirLocation-seed#[A60419A7BBFF08A3]) [    ] o.a.s.u.p.LogUpdateProcessorFactory [collection1]  webapp=null path=null params={}{add=[2]} 0 0
   [junit4]   2> 1212850 INFO  (TEST-SpellCheckComponentTest.testRelativeIndexDirLocation-seed#[A60419A7BBFF08A3]) [    ] o.a.s.u.p.LogUpdateProcessorFactory [collection1]  webapp=null path=null params={}{add=[3]} 0 0
   [junit4]   2> 1212851 INFO  (TEST-SpellCheckComponentTest.testRelativeIndexDirLocation-seed#[A60419A7BBFF08A3]) [    ] o.a.s.u.p.LogUpdateProcessorFactory [collection1]  webapp=null path=null params={}{add=[4]} 0 0
   [junit4]   2> 1212851 INFO  (TEST-SpellCheckComponentTest.testRelativeIndexDirLocation-seed#[A60419A7BBFF08A3]) [    ] o.a.s.u.p.LogUpdateProcessorFactory [collection1]  webapp=null path=null params={}{add=[5]} 0 0
   [junit4]   2> 1212851 INFO  (TEST-SpellCheckComponentTest.testRelativeIndexDirLocation-seed#[A60419A7BBFF08A3]) [    ] o.a.s.u.p.LogUpdateProcessorFactory [collection1]  webapp=null path=null params={}{add=[6]} 0 0
   [junit4]   2> 1212851 INFO  (TEST-SpellCheckComponentTest.testRelativeIndexDirLocation-seed#[A60419A7BBFF08A3]) [    ] o.a.s.u.p.LogUpdateProcessorFactory [collection1]  webapp=null path=null params={}{add=[7]} 0 0
   [junit4]   2> 1212851 INFO  (TEST-SpellCheckComponentTest.testRelativeIndexDirLocation-seed#[A60419A7BBFF08A3]) [    ] o.a.s.u.p.LogUpdateProcessorFactory [collection1]  webapp=null path=null params={}{add=[8]} 0 0
   [junit4]   2> 1212852 INFO  (TEST-SpellCheckComponentTest.testRelativeIndexDirLocation-seed#[A60419A7BBFF08A3]) [    ] o.a.s.u.p.LogUpdateProcessorFactory [collection1]  webapp=null path=null params={}{add=[9]} 0 0
   [junit4]   2> 1212852 INFO  (TEST-SpellCheckComponentTest.testRelativeIndexDirLocation-seed#[A60419A7BBFF08A3]) [    ] o.a.s.u.DirectUpdateHandler2 start commit{,optimize=false,openSearcher=true,waitSearcher=true,expungeDeletes=false,softCommit=false,prepareCommit=false}
   [junit4]   2> 1212852 INFO  (TEST-SpellCheckComponentTest.testRelativeIndexDirLocation-seed#[A60419A7BBFF08A3]) [    ] o.a.s.u.SolrIndexWriter Calling setCommitData with IW:org.apache.solr.update.SolrIndexWriter@13e9f3c1
   [junit4]   2> 1212853 INFO  (TEST-SpellCheckComponentTest.testRelativeIndexDirLocation-seed#[A60419A7BBFF08A3]) [    ] o.a.s.s.SolrIndexSearcher Opening [Searcher@4e8571a8[collection1] main]
   [junit4]   2> 1212854 INFO  (TEST-SpellCheckComponentTest.testRelativeIndexDirLocation-seed#[A60419A7BBFF08A3]) [    ] o.a.s.u.DirectUpdateHandler2 end_commit_flush
   [junit4]   2> 1212854 INFO  (searcherExecutor-8351-thread-1) [    ] o.a.s.h.c.SpellCheckComponent Building spell index for spell checker: default
   [junit4]   2> 1213178 INFO  (searcherExecutor-8351-thread-1) [    ] o.a.s.h.c.SpellCheckComponent Building spell index for spell checker: default_teststop
   [junit4]   2> 1213253 INFO  (searcherExecutor-8351-thread-1) [    ] o.a.s.h.c.SpellCheckComponent Building spell index for spell checker: threshold
   [junit4]   2> 1213590 INFO  (searcherExecutor-8351-thread-1) [    ] o.a.s.h.c.SpellCheckComponent Building spell index for spell checker: threshold_direct
   [junit4]   2> 1213590 INFO  (searcherExecutor-8351-thread-1) [    ] o.a.s.h.c.SpellCheckComponent Building spell index for spell checker: multipleFields
   [junit4]   2> 1213844 INFO  (searcherExecutor-8351-thread-1) [    ] o.a.s.h.c.SpellCheckComponent Building spell index for spell checker: freq
   [junit4]   2> 1214081 INFO  (searcherExecutor-8351-thread-1) [    ] o.a.s.h.c.SpellCheckComponent Building spell index for spell checker: fqcn
   [junit4]   2> 1214285 INFO  (searcherExecutor-8351-thread-1) [    ] o.a.s.c.SolrCore [collection1] Registered new searcher Searcher@4e8571a8[collection1] main{ExitableDirectoryReader(UninvertingDirectoryReader(Uninverting(_5(6.4.0):c10)))}
   [junit4]   2> 1214285 INFO  (TEST-SpellCheckComponentTest.testRelativeIndexDirLocation-seed#[A60419A7BBFF08A3]) [    ] o.a.s.u.p.LogUpdateProcessorFactory [collection1]  webapp=null path=null params={}{commit=} 0 1432
   [junit4]   2> 1214286 INFO  (TEST-SpellCheckComponentTest.testRelativeIndexDirLocation-seed#[A60419A7BBFF08A3]) [    ] o.a.s.SolrTestCaseJ4 ###Ending testRelativeIndexDirLocation
   [junit4]   2> 1214286 INFO  (TEST-SpellCheckComponentTest.testRelativeIndexDirLocation-seed#[A60419A7BBFF08A3]) [    ] o.a.s.u.DirectUpdateHandler2 [collection1] REMOVING ALL DOCUMENTS FROM INDEX
   [junit4]   2> 1214286 INFO  (TEST-SpellCheckComponentTest.testRelativeIndexDirLocation-seed#[A60419A7BBFF08A3]) [    ] o.a.s.u.p.LogUpdateProcessorFactory [collection1]  webapp=null path=null params={}{deleteByQuery=*:*} 0 0
   [junit4]   2> 1214286 INFO  (TEST-SpellCheckComponentTest.testRelativeIndexDirLocation-seed#[A60419A7BBFF08A3]) [    ] o.a.s.u.DirectUpdateHandler2 start commit{,optimize=false,openSearcher=true,waitSearcher=true,expungeDeletes=false,softCommit=false,prepareCommit=false}
   [junit4]   2> 1214286 INFO  (TEST-SpellCheckComponentTest.testRelativeIndexDirLocation-seed#[A60419A7BBFF08A3]) [    ] o.a.s.u.SolrIndexWriter Calling setCommitData with IW:org.apache.solr.update.SolrIndexWriter@13e9f3c1
   [junit4]   2> 1214287 INFO  (TEST-SpellCheckComponentTest.testRelativeIndexDirLocation-seed#[A60419A7BBFF08A3]) [    ] o.a.s.s.SolrIndexSearcher Opening [Searcher@518928dd[collection1] main]
   [junit4]   2> 1214287 INFO  (TEST-SpellCheckComponentTest.testRelativeIndexDirLocation-seed#[A60419A7BBFF08A3]) [    ] o.a.s.u.DirectUpdateHandler2 end_commit_flush
   [junit4]   2> 1214287 INFO  (searcherExecutor-8351-thread-1) [    ] o.a.s.h.c.SpellCheckComponent Building spell index for spell checker: default
   [junit4]   2> 1214364 INFO  (searcherExecutor-8351-thread-1) [    ] o.a.s.h.c.SpellCheckComponent Building spell index for spell checker: default_teststop
   [junit4]   2> 1214451 INFO  (searcherExecutor-8351-thread-1) [    ] o.a.s.h.c.SpellCheckComponent Building spell index for spell checker: threshold
   [junit4]   2> 1214519 INFO  (searcherExecutor-8351-thread-1) [    ] o.a.s.h.c.SpellCheckComponent Building spell index for spell checker: threshold_direct
   [junit4]   2> 1214519 INFO  (searcherExecutor-8351-thread-1) [    ] o.a.s.h.c.SpellCheckComponent Building spell index for spell checker: multipleFields
   [junit4]   2> 1214580 INFO  (searcherExecutor-8351-thread-1) [    ] o.a.s.h.c.SpellCheckComponent Building spell index for spell checker: freq
   [junit4]   2> 1214642 INFO  (searcherExecutor-8351-thread-1) [    ] o.a.s.h.c.SpellCheckComponent Building spell index for spell checker: fqcn
   [junit4]   2> 1214712 INFO  (searcherExecutor-8351-thread-1) [    ] o.a.s.c.SolrCore [collection1] Registered new searcher Searcher@518928dd[collection1] main{ExitableDirectoryReader(UninvertingDirectoryReader())}
   [junit4]   2> 1214712 INFO  (TEST-SpellCheckComponentTest.testRelativeIndexDirLocation-seed#[A60419A7BBFF08A3]) [    ] o.a.s.u.p.LogUpdateProcessorFactory [collection1]  webapp=null path=null params={}{commit=} 0 425
   [junit4]   2> 1214713 INFO  (TEST-SpellCheckComponentTest.testNumericQuery-seed#[A60419A7BBFF08A3]) [    ] o.a.s.SolrTestCaseJ4 ###Starting testNumericQuery
   [junit4]   2> 1214714 INFO  (TEST-SpellCheckComponentTest.testNumericQuery-seed#[A60419A7BBFF08A3]) [    ] o.a.s.u.p.LogUpdateProcessorFactory [collection1]  webapp=null path=null params={}{add=[0]} 0 0
   [junit4]   2> 1214714 INFO  (TEST-SpellCheckComponentTest.testNumericQuery-seed#[A60419A7BBFF08A3]) [    ] o.a.s.u.p.LogUpdateProcessorFactory [collection1]  webapp=null path=null params={}{add=[1]} 0 0
   [junit4]   2> 1214714 INFO  (TEST-SpellCheckComponentTest.testNumericQuery-seed#[A60419A7BBFF08A3]) [    ] o.a.s.u.p.LogUpdateProcessorFactory [collection1]  webapp=null path=null params={}{add=[2]} 0 0
   [junit4]   2> 1214714 INFO  (TEST-SpellCheckComponentTest.testNumericQuery-seed#[A60419A7BBFF08A3]) [    ] o.a.s.u.p.LogUpdateProcessorFactory [collection1]  webapp=null path=null params={}{add=[3]} 0 0
   [junit4]   2> 1214715 INFO  (TEST-SpellCheckComponentTest.testNumericQuery-seed#[A60419A7BBFF08A3]) [    ] o.a.s.u.p.LogUpdateProcessorFactory [collection1]  webapp=null path=null params={}{add=[4]} 0 0
   [junit4]   2> 1214715 INFO  (TEST-SpellCheckComponentTest.testNumericQuery-seed#[A60419A7BBFF08A3]) [    ] o.a.s.u.p.LogUpdateProcessorFactory [collection1]  webapp=null path=null params={}{add=[5]} 0 0
   [junit4]   2> 1214715 INFO  (TEST-SpellCheckComponentTest.testNumericQuery-seed#[A60419A7BBFF08A3]) [    ] o.a.s.u.p.LogUpdateProcessorFactory [collection1]  webapp=null path=null params={}{add=[6]} 0 0
   [junit4]   2> 1214715 INFO  (TEST-SpellCheckComponentTest.testNumericQuery-seed#[A60419A7BBFF08A3]) [    ] o.a.s.u.p.LogUpdateProcessorFactory [collection1]  webapp=null path=null params={}{add=[7]} 0 0
   [junit4]   2> 1214715 INFO  (TEST-SpellCheckComponentTest.testNumericQuery-seed#[A60419A7BBFF08A3]) [    ] o.a.s.u.p.LogUpdateProcessorFactory [collection1]  webapp=null path=null params={}{add=[8]} 0 0
   [junit4]   2> 1214716 INFO  (TEST-SpellCheckComponentTest.testNumericQuery-seed#[A60419A7BBFF08A3]) [    ] o.a.s.u.p.LogUpdateProcessorFactory [collection1]  webapp=null path=null params={}{add=[9]} 0 0
   [junit4]   2> 1214716 INFO  (TEST-SpellCheckComponentTest.testNumericQuery-seed#[A60419A7BBFF08A3]) [    ] o.a.s.u.DirectUpdateHandler2 start commit{,optimize=false,openSearcher=true,waitSearcher=true,expungeDeletes=false,softCommit=false,prepareCommit=false}
   [junit4]   2> 1214716 INFO  (TEST-SpellCheckComponentTest.testNumericQuery-seed#[A60419A7BBFF08A3]) [    ] o.a.s.u.SolrIndexWriter Calling setCommitData with IW:org.apache.solr.update.SolrIndexWriter@13e9f3c1
   [junit4]   2> 1214717 INFO  (TEST-SpellCheckComponentTest.testNumericQuery-seed#[A60419A7BBFF08A3]) [    ] o.a.s.s.SolrIndexSearcher Opening [Searcher@5effb4f3[collection1] main]
   [junit4]   2> 1214717 INFO  (TEST-SpellCheckComponentTest.testNumericQuery-seed#[A60419A7BBFF08A3]) [    ] o.a.s.u.DirectUpdateHandler2 end_commit_flush
   [junit4]   2> 1214717 INFO  (searcherExecutor-8351-thread-1) [    ] o.a.s.h.c.SpellCheckComponent Building spell index for spell checker: default
   [junit4]   2> 1214890 INFO  (searcherExecutor-8351-thread-1) [    ] o.a.s.h.c.SpellCheckComponent Building spell index for spell checker: default_teststop
   [junit4]   2> 1214952 INFO  (searcherExecutor-8351-thread-1) [    ] o.a.s.h.c.SpellCheckComponent Building spell index for spell checker: threshold
   [junit4]   2> 1215088 INFO  (searcherExecutor-8351-thread-1) [    ] o.a.s.h.c.SpellCheckComponent Building spell index for spell checker: threshold_direct
   [junit4]   2> 1215088 INFO  (searcherExecutor-8351-thread-1) [    ] o.a.s.h.c.SpellCheckComponent Building spell index for spell checker: multipleFields
   [junit4]   2> 1215204 INFO  (searcherExecutor-8351-thread-1) [    ] o.a.s.h.c.SpellCheckComponent Building spell index for spell checker: freq
   [junit4]   2> 1215327 INFO  (searcherExecutor-8351-thread-1) [    ] o.a.s.h.c.SpellCheckComponent Building spell index for spell checker: fqcn
   [junit4]   2> 1215510 INFO  (searcherExecutor-8351-thread-1) [    ] o.a.s.c.SolrCore [collection1] Registered new searcher Searcher@5effb4f3[collection1] main{ExitableDirectoryReader(UninvertingDirectoryReader(Uninverting(_6(6.4.0):c10)))}
   [junit4]   2> 1215510 INFO  (TEST-SpellCheckComponentTest.testNumericQuery-seed#[A60419A7BBFF08A3]) [    ] o.a.s.u.p.LogUpdateProcessorFactory [collection1]  webapp=null path=null params={}{commit=} 0 794
   [junit4]   2> 1215512 INFO  (TEST-SpellCheckComponentTest.testNumericQuery-seed#[A60419A7BBFF08A3]) [    ] o.a.s.c.S.Request [collection1]  webapp=null path=null params={q=12346&qt=spellCheckCompRH&spellcheck=true&wt=xml} hits=0 status=0 QTime=0
   [junit4]   2> 1215512 INFO  (TEST-SpellCheckComponentTest.testNumericQuery-seed#[A60419A7BBFF08A3]) [    ] o.a.s.SolrTestCaseJ4 ###Ending testNumericQuery
   [junit4]   2> 1215512 INFO  (TEST-SpellCheckComponentTest.testNumericQuery-seed#[A60419A7BBFF08A3]) [    ] o.a.s.u.DirectUpdateHandler2 [collection1] REMOVING ALL DOCUMENTS FROM INDEX
   [junit4]   2> 1215512 INFO  (TEST-SpellCheckComponentTest.testNumericQuery-seed#[A60419A7BBFF08A3]) [    ] o.a.s.u.p.LogUpdateProcessorFactory [collection1]  webapp=null path=null params={}{deleteByQuery=*:*} 0 0
   [junit4]   2> 1215513 INFO  (TEST-SpellCheckComponentTest.testNumericQuery-seed#[A60419A7BBFF08A3]) [    ] o.a.s.u.DirectUpdateHandler2 start commit{,optimize=false,openSearcher=true,waitSearcher=true,expungeDeletes=false,softCommit=false,prepareCommit=false}
   [junit4]   2> 1215513 INFO  (TEST-SpellCheckComponentTest.testNumericQuery-seed#[A60419A7BBFF08A3]) [    ] o.a.s.u.SolrIndexWriter Calling setCommitData with IW:org.apache.solr.update.SolrIndexWriter@13e9f3c1
   [junit4]   2> 1215513 INFO  (TEST-SpellCheckComponentTest.testNumericQuery-seed#[A60419A7BBFF08A3]) [    ] o.a.s.s.SolrIndexSearcher Opening [Searcher@5ce1b639[collection1] main]
   [junit4]   2> 1215513 INFO  (searcherExecutor-8351-thread-1) [    ] o.a.s.h.c.SpellCheckComponent Building spell index for spell checker: default
   [junit4]   2> 1215513 INFO  (TEST-SpellCheckComponentTest.testNumericQuery-seed#[A60419A7BBFF08A3]) [    ] o.a.s.u.DirectUpdateHandler2 end_commit_flush
   [junit4]   2> 1215579 INFO  (searcherExecutor-8351-thread-1) [    ] o.a.s.h.c.SpellCheckComponent Building spell index for spell checker: default_teststop
   [junit4]   2> 1215655 INFO  (searcherExecutor-8351-thread-1) [    ] o.a.s.h.c.SpellCheckComponent Building spell index for spell checker: threshold
   [junit4]   2> 1215708 INFO  (searcherExecutor-8351-thread-1) [    ] o.a.s.h.c.SpellCheckComponent Building spell index for spell checker: threshold_direct
   [junit4]   2> 1215708 INFO  (searcherExecutor-8351-thread-1) [    ] o.a.s.h.c.SpellCheckComponent Building spell index for spell checker: multipleFields
   [junit4]   2> 1215801 INFO  (searcherExecutor-8351-thread-1) [    ] o.a.s.h.c.SpellCheckComponent Building spell index for spell checker: freq
   [junit4]   2> 1215889 INFO  (searcherExecutor-8351-thread-1) [    ] o.a.s.h.c.SpellCheckComponent Building spell index for spell checker: fqcn
   [junit4]   2> 1215983 INFO  (searcherExecutor-8351-thread-1) [    ] o.a.s.c.SolrCore [collection1] Registered new searcher Searcher@5ce1b639[collection1] main{ExitableDirectoryReader(UninvertingDirectoryReader())}
   [junit4]   2> 1215983 INFO  (TEST-SpellCheckComponentTest.testNumericQuery-seed#[A60419A7BBFF08A3]) [    ] o.a.s.u.p.LogUpdateProcessorFactory [collection1]  webapp=null path=null params={}{commit=} 0 470
   [junit4]   2> 1215985 INFO  (TEST-SpellCheckComponentTest.testCollate-seed#[A60419A7BBFF08A3]) [    ] o.a.s.SolrTestCaseJ4 ###Starting testCollate
   [junit4]   2> 1215986 INFO  (TEST-SpellCheckComponentTest.testCollate-seed#[A60419A7BBFF08A3]) [    ] o.a.s.u.p.LogUpdateProcessorFactory [collection1]  webapp=null path=null params={}{add=[0]} 0 0
   [junit4]   2> 1215987 INFO  (TEST-SpellCheckComponentTest.testCollate-seed#[A60419A7BBFF08A3]) [    ] o.a.s.u.p.LogUpdateProcessorFactory [collection1]  webapp=null path=null params={}{add=[1]} 0 0
   [junit4]   2> 1215987 INFO  (TEST-SpellCheckComponentTest.testCollate-seed#[A60419A7BBFF08A3]) [    ] o.a.s.u.p.LogUpdateProcessorFactory [collection1]  webapp=null path=null params={}{add=[2]} 0 0
   [junit4]   2> 1215987 INFO  (TEST-SpellCheckComponentTest.testCollate-seed#[A60419A7BBFF08A3]) [    ] o.a.s.u.p.LogUpdateProcessorFactory [collection1]  webapp=null path=null params={}{add=[3]} 0 0
   [junit4]   2> 1215987 INFO  (TEST-SpellCheckComponentTest.testCollate-seed#[A60419A7BBFF08A3]) [    ] o.a.s.u.p.LogUpdateProcessorFactory [collection1]  webapp=null path=null params={}{add=[4]} 0 0
   [junit4]   2> 1215988 INFO  (TEST-SpellCheckComponentTest.testCollate-seed#[A60419A7BBFF08A3]) [    ] o.a.s.u.p.LogUpdateProcessorFactory [collection1]  webapp=null path=null params={}{add=[5]} 0 0
   [junit4]   2> 1215988 INFO  (TEST-SpellCheckComponentTest.testCollate-seed#[A60419A7BBFF08A3]) [    ] o.

[...truncated too long message...]

e=0
   [junit4]   2> 1224341 INFO  (TEST-SpellCheckComponentTest.testRebuildOnCommit-seed#[A60419A7BBFF08A3]) [    ] o.a.s.u.p.LogUpdateProcessorFactory [collection1]  webapp=null path=null params={}{add=[11231]} 0 0
   [junit4]   2> 1224341 INFO  (TEST-SpellCheckComponentTest.testRebuildOnCommit-seed#[A60419A7BBFF08A3]) [    ] o.a.s.u.DirectUpdateHandler2 start commit{,optimize=false,openSearcher=true,waitSearcher=true,expungeDeletes=false,softCommit=false,prepareCommit=false}
   [junit4]   2> 1224341 INFO  (TEST-SpellCheckComponentTest.testRebuildOnCommit-seed#[A60419A7BBFF08A3]) [    ] o.a.s.u.SolrIndexWriter Calling setCommitData with IW:org.apache.solr.update.SolrIndexWriter@13e9f3c1
   [junit4]   2> 1224343 INFO  (TEST-SpellCheckComponentTest.testRebuildOnCommit-seed#[A60419A7BBFF08A3]) [    ] o.a.s.s.SolrIndexSearcher Opening [Searcher@3dec409d[collection1] main]
   [junit4]   2> 1224343 INFO  (TEST-SpellCheckComponentTest.testRebuildOnCommit-seed#[A60419A7BBFF08A3]) [    ] o.a.s.u.DirectUpdateHandler2 end_commit_flush
   [junit4]   2> 1224343 INFO  (searcherExecutor-8351-thread-1) [    ] o.a.s.h.c.SpellCheckComponent Building spell index for spell checker: default
   [junit4]   2> 1224591 INFO  (searcherExecutor-8351-thread-1) [    ] o.a.s.h.c.SpellCheckComponent Building spell index for spell checker: default_teststop
   [junit4]   2> 1224667 INFO  (searcherExecutor-8351-thread-1) [    ] o.a.s.h.c.SpellCheckComponent Building spell index for spell checker: threshold
   [junit4]   2> 1224791 INFO  (searcherExecutor-8351-thread-1) [    ] o.a.s.h.c.SpellCheckComponent Building spell index for spell checker: threshold_direct
   [junit4]   2> 1224792 INFO  (searcherExecutor-8351-thread-1) [    ] o.a.s.h.c.SpellCheckComponent Building spell index for spell checker: multipleFields
   [junit4]   2> 1224943 INFO  (searcherExecutor-8351-thread-1) [    ] o.a.s.h.c.SpellCheckComponent Building spell index for spell checker: freq
   [junit4]   2> 1225071 INFO  (searcherExecutor-8351-thread-1) [    ] o.a.s.h.c.SpellCheckComponent Building spell index for spell checker: fqcn
   [junit4]   2> 1225195 INFO  (searcherExecutor-8351-thread-1) [    ] o.a.s.c.SolrCore [collection1] Registered new searcher Searcher@3dec409d[collection1] main{ExitableDirectoryReader(UninvertingDirectoryReader(Uninverting(_b(6.4.0):c10) Uninverting(_c(6.4.0):c1)))}
   [junit4]   2> 1225195 INFO  (TEST-SpellCheckComponentTest.testRebuildOnCommit-seed#[A60419A7BBFF08A3]) [    ] o.a.s.u.p.LogUpdateProcessorFactory [collection1]  webapp=null path=null params={}{commit=} 0 853
   [junit4]   2> 1225196 INFO  (TEST-SpellCheckComponentTest.testRebuildOnCommit-seed#[A60419A7BBFF08A3]) [    ] o.a.s.c.S.Request [collection1]  webapp=null path=null params={q=lowerfilt:lucenejavt&qt=spellCheckCompRH&spellcheck=true&wt=xml} hits=0 status=0 QTime=855
   [junit4]   2> 1225196 INFO  (TEST-SpellCheckComponentTest.testRebuildOnCommit-seed#[A60419A7BBFF08A3]) [    ] o.a.s.SolrTestCaseJ4 ###Ending testRebuildOnCommit
   [junit4]   2> 1225196 INFO  (TEST-SpellCheckComponentTest.testRebuildOnCommit-seed#[A60419A7BBFF08A3]) [    ] o.a.s.u.DirectUpdateHandler2 [collection1] REMOVING ALL DOCUMENTS FROM INDEX
   [junit4]   2> 1225197 INFO  (TEST-SpellCheckComponentTest.testRebuildOnCommit-seed#[A60419A7BBFF08A3]) [    ] o.a.s.u.p.LogUpdateProcessorFactory [collection1]  webapp=null path=null params={}{deleteByQuery=*:*} 0 0
   [junit4]   2> 1225197 INFO  (TEST-SpellCheckComponentTest.testRebuildOnCommit-seed#[A60419A7BBFF08A3]) [    ] o.a.s.u.DirectUpdateHandler2 start commit{,optimize=false,openSearcher=true,waitSearcher=true,expungeDeletes=false,softCommit=false,prepareCommit=false}
   [junit4]   2> 1225197 INFO  (TEST-SpellCheckComponentTest.testRebuildOnCommit-seed#[A60419A7BBFF08A3]) [    ] o.a.s.u.SolrIndexWriter Calling setCommitData with IW:org.apache.solr.update.SolrIndexWriter@13e9f3c1
   [junit4]   2> 1225197 INFO  (TEST-SpellCheckComponentTest.testRebuildOnCommit-seed#[A60419A7BBFF08A3]) [    ] o.a.s.s.SolrIndexSearcher Opening [Searcher@3fbed67d[collection1] main]
   [junit4]   2> 1225197 INFO  (TEST-SpellCheckComponentTest.testRebuildOnCommit-seed#[A60419A7BBFF08A3]) [    ] o.a.s.u.DirectUpdateHandler2 end_commit_flush
   [junit4]   2> 1225197 INFO  (searcherExecutor-8351-thread-1) [    ] o.a.s.h.c.SpellCheckComponent Building spell index for spell checker: default
   [junit4]   2> 1225251 INFO  (searcherExecutor-8351-thread-1) [    ] o.a.s.h.c.SpellCheckComponent Building spell index for spell checker: default_teststop
   [junit4]   2> 1225299 INFO  (searcherExecutor-8351-thread-1) [    ] o.a.s.h.c.SpellCheckComponent Building spell index for spell checker: threshold
   [junit4]   2> 1225357 INFO  (searcherExecutor-8351-thread-1) [    ] o.a.s.h.c.SpellCheckComponent Building spell index for spell checker: threshold_direct
   [junit4]   2> 1225357 INFO  (searcherExecutor-8351-thread-1) [    ] o.a.s.h.c.SpellCheckComponent Building spell index for spell checker: multipleFields
   [junit4]   2> 1225405 INFO  (searcherExecutor-8351-thread-1) [    ] o.a.s.h.c.SpellCheckComponent Building spell index for spell checker: freq
   [junit4]   2> 1225444 INFO  (searcherExecutor-8351-thread-1) [    ] o.a.s.h.c.SpellCheckComponent Building spell index for spell checker: fqcn
   [junit4]   2> 1225486 INFO  (searcherExecutor-8351-thread-1) [    ] o.a.s.c.SolrCore [collection1] Registered new searcher Searcher@3fbed67d[collection1] main{ExitableDirectoryReader(UninvertingDirectoryReader())}
   [junit4]   2> 1225486 INFO  (TEST-SpellCheckComponentTest.testRebuildOnCommit-seed#[A60419A7BBFF08A3]) [    ] o.a.s.u.p.LogUpdateProcessorFactory [collection1]  webapp=null path=null params={}{commit=} 0 289
   [junit4]   2> 1225487 INFO  (SUITE-SpellCheckComponentTest-seed#[A60419A7BBFF08A3]-worker) [    ] o.a.s.SolrTestCaseJ4 ###deleteCore
   [junit4]   2> 1225487 INFO  (SUITE-SpellCheckComponentTest-seed#[A60419A7BBFF08A3]-worker) [    ] o.a.s.c.CoreContainer Shutting down CoreContainer instance=134218308
   [junit4]   2> 1225487 INFO  (coreCloseExecutor-8355-thread-1) [    ] o.a.s.c.SolrCore [collection1]  CLOSING SolrCore org.apache.solr.core.SolrCore@2de53d06
   [junit4]   2> NOTE: leaving temporary files on disk at: /home/jenkins/workspace/Lucene-Solr-6.x-Linux/solr/build/solr-core/test/J1/temp/solr.handler.component.SpellCheckComponentTest_A60419A7BBFF08A3-001
   [junit4]   2> NOTE: test params are: codec=Lucene62, sim=RandomSimilarity(queryNorm=false,coord=crazy): {}, locale=en-NG, timezone=Australia/Yancowinna
   [junit4]   2> NOTE: Linux 4.4.0-47-generic amd64/Oracle Corporation 9-ea (64-bit)/cpus=12,threads=1,free=170677672,total=518979584
   [junit4]   2> NOTE: All tests run in this JVM: [TestFieldCacheReopen, TestInitParams, DistributedFacetPivotLargeTest, TestCustomDocTransformer, DistributedDebugComponentTest, TermsComponentTest, SpellingQueryConverterTest, TestSearchPerf, WordBreakSolrSpellCheckerTest, TestRawResponseWriter, ClusterStateUpdateTest, SuggestComponentContextFilterQueryTest, ClassificationUpdateProcessorFactoryTest, JsonLoaderTest, CopyFieldTest, TestExpandComponent, HdfsDirectoryFactoryTest, TestWordDelimiterFilterFactory, DistributedQueryComponentOptimizationTest, TestExclusionRuleCollectionAccess, SuggesterFSTTest, TestFreeTextSuggestions, TestSimpleTrackingShardHandler, TestRestManager, DistanceFunctionTest, RequestLoggingTest, TestHashQParserPlugin, DistributedMLTComponentTest, BasicFunctionalityTest, TestLRUCache, TestLegacyFieldCache, SortByFunctionTest, TestChildDocTransformer, TestBM25SimilarityFactory, TestFieldCacheSortRandom, TestRandomRequestDistribution, ReplicaListTransformerTest, TestQueryWrapperFilter, OverseerStatusTest, TestMissingGroups, TestLockTree, TestQueryUtils, BlockDirectoryTest, SolrCLIZkUtilsTest, DocumentBuilderTest, TestStressVersions, BadCopyFieldTest, SpellCheckCollatorTest, DistributedTermsComponentTest, HLLSerializationTest, TestSolrXml, TestPKIAuthenticationPlugin, TestAnalyzeInfixSuggestions, OverseerCollectionConfigSetProcessorTest, TlogReplayBufferedWhileIndexingTest, DistributedIntervalFacetingTest, TestSearcherReuse, URLClassifyProcessorTest, TestCloudPivotFacet, TestLMDirichletSimilarityFactory, TestDocBasedVersionConstraints, TestSolrConfigHandlerCloud, TestSlowCompositeReaderWrapper, DistributedFacetPivotSmallTest, OpenCloseCoreStressTest, DateMathParserTest, RAMDirectoryFactoryTest, UpdateRequestProcessorFactoryTest, UUIDUpdateProcessorFallbackTest, TestStressLiveNodes, DocValuesNotIndexedTest, HdfsUnloadDistributedZkTest, IndexSchemaTest, IndexBasedSpellCheckerTest, IndexSchemaRuntimeFieldTest, TestFastOutputStream, AliasIntegrationTest, BasicAuthIntegrationTest, BlockJoinFacetSimpleTest, TestCharFilters, TestQueryTypes, CSVRequestHandlerTest, TestCursorMarkWithoutUniqueKey, DocValuesTest, ConvertedLegacyTest, TestJettySolrRunner, DateRangeFieldTest, TestSerializedLuceneMatchVersion, TestConfigSetsAPIExclusivity, TestSchemaResource, TestReRankQParserPlugin, TestLeaderElectionZkExpiry, SimpleMLTQParserTest, TestFuzzyAnalyzedSuggestions, TestQuerySenderListener, TestConfigSets, SimplePostToolTest, HdfsBasicDistributedZk2Test, SearchHandlerTest, TestCollapseQParserPlugin, HdfsLockFactoryTest, TestFieldTypeCollectionResource, TestElisionMultitermQuery, TestDeleteCollectionOnDownNodes, SolrIndexSplitterTest, CdcrUpdateLogTest, ShardRoutingCustomTest, HdfsSyncSliceTest, ChaosMonkeySafeLeaderTest, CollectionsAPIDistributedZkTest, SyncSliceTest, OverseerTest, ShardRoutingTest, TestRandomFaceting, LeaderElectionTest, ZkSolrClientTest, TestZkChroot, ZkCLITest, TestDistributedSearch, AutoCommitTest, TestDistributedGrouping, TestFaceting, TestHashPartitioner, TermVectorComponentDistributedTest, ZkControllerTest, TestRealTimeGet, TestStressReorder, TestReload, TestCoreContainer, SpellCheckComponentTest]
   [junit4] Completed [315/658 (1!)] on J1 in 21.69s, 11 tests, 1 error <<< FAILURES!

[...truncated 51113 lines...]


Mime
View raw message