lucene-dev mailing list archives

Site index · List index
Message view « Date » · « Thread »
Top « Date » · « Thread »
From Apache Jenkins Server <jenk...@builds.apache.org>
Subject [JENKINS] Lucene-Solr-NightlyTests-6.x - Build # 224 - Still unstable
Date Sat, 10 Dec 2016 14:40:09 GMT
Build: https://builds.apache.org/job/Lucene-Solr-NightlyTests-6.x/224/

4 tests failed.
FAILED:  org.apache.solr.cloud.hdfs.HdfsRestartWhileUpdatingTest.test

Error Message:
There are still nodes recoverying - waited for 320 seconds

Stack Trace:
java.lang.AssertionError: There are still nodes recoverying - waited for 320 seconds
	at __randomizedtesting.SeedInfo.seed([A18CB334F5F66975:29D88CEE5B0A048D]:0)
	at org.junit.Assert.fail(Assert.java:93)
	at org.apache.solr.cloud.AbstractDistribZkTestBase.waitForRecoveriesToFinish(AbstractDistribZkTestBase.java:184)
	at org.apache.solr.cloud.AbstractFullDistribZkTestBase.waitForRecoveriesToFinish(AbstractFullDistribZkTestBase.java:862)
	at org.apache.solr.cloud.AbstractFullDistribZkTestBase.waitForThingsToLevelOut(AbstractFullDistribZkTestBase.java:1418)
	at org.apache.solr.cloud.RestartWhileUpdatingTest.test(RestartWhileUpdatingTest.java:144)
	at sun.reflect.NativeMethodAccessorImpl.invoke0(Native Method)
	at sun.reflect.NativeMethodAccessorImpl.invoke(NativeMethodAccessorImpl.java:62)
	at sun.reflect.DelegatingMethodAccessorImpl.invoke(DelegatingMethodAccessorImpl.java:43)
	at java.lang.reflect.Method.invoke(Method.java:498)
	at com.carrotsearch.randomizedtesting.RandomizedRunner.invoke(RandomizedRunner.java:1713)
	at com.carrotsearch.randomizedtesting.RandomizedRunner$8.evaluate(RandomizedRunner.java:907)
	at com.carrotsearch.randomizedtesting.RandomizedRunner$9.evaluate(RandomizedRunner.java:943)
	at com.carrotsearch.randomizedtesting.RandomizedRunner$10.evaluate(RandomizedRunner.java:957)
	at org.apache.solr.BaseDistributedSearchTestCase$ShardsRepeatRule$ShardsFixedStatement.callStatement(BaseDistributedSearchTestCase.java:992)
	at org.apache.solr.BaseDistributedSearchTestCase$ShardsRepeatRule$ShardsStatement.evaluate(BaseDistributedSearchTestCase.java:967)
	at com.carrotsearch.randomizedtesting.rules.SystemPropertiesRestoreRule$1.evaluate(SystemPropertiesRestoreRule.java:57)
	at org.apache.lucene.util.TestRuleSetupTeardownChained$1.evaluate(TestRuleSetupTeardownChained.java:49)
	at org.apache.lucene.util.AbstractBeforeAfterRule$1.evaluate(AbstractBeforeAfterRule.java:45)
	at org.apache.lucene.util.TestRuleThreadAndTestName$1.evaluate(TestRuleThreadAndTestName.java:48)
	at org.apache.lucene.util.TestRuleIgnoreAfterMaxFailures$1.evaluate(TestRuleIgnoreAfterMaxFailures.java:64)
	at org.apache.lucene.util.TestRuleMarkFailure$1.evaluate(TestRuleMarkFailure.java:47)
	at com.carrotsearch.randomizedtesting.rules.StatementAdapter.evaluate(StatementAdapter.java:36)
	at com.carrotsearch.randomizedtesting.ThreadLeakControl$StatementRunner.run(ThreadLeakControl.java:367)
	at com.carrotsearch.randomizedtesting.ThreadLeakControl.forkTimeoutingTask(ThreadLeakControl.java:811)
	at com.carrotsearch.randomizedtesting.ThreadLeakControl$3.evaluate(ThreadLeakControl.java:462)
	at com.carrotsearch.randomizedtesting.RandomizedRunner.runSingleTest(RandomizedRunner.java:916)
	at com.carrotsearch.randomizedtesting.RandomizedRunner$5.evaluate(RandomizedRunner.java:802)
	at com.carrotsearch.randomizedtesting.RandomizedRunner$6.evaluate(RandomizedRunner.java:852)
	at com.carrotsearch.randomizedtesting.RandomizedRunner$7.evaluate(RandomizedRunner.java:863)
	at com.carrotsearch.randomizedtesting.rules.StatementAdapter.evaluate(StatementAdapter.java:36)
	at com.carrotsearch.randomizedtesting.rules.SystemPropertiesRestoreRule$1.evaluate(SystemPropertiesRestoreRule.java:57)
	at org.apache.lucene.util.AbstractBeforeAfterRule$1.evaluate(AbstractBeforeAfterRule.java:45)
	at com.carrotsearch.randomizedtesting.rules.StatementAdapter.evaluate(StatementAdapter.java:36)
	at org.apache.lucene.util.TestRuleStoreClassName$1.evaluate(TestRuleStoreClassName.java:41)
	at com.carrotsearch.randomizedtesting.rules.NoShadowingOrOverridesOnMethodsRule$1.evaluate(NoShadowingOrOverridesOnMethodsRule.java:40)
	at com.carrotsearch.randomizedtesting.rules.NoShadowingOrOverridesOnMethodsRule$1.evaluate(NoShadowingOrOverridesOnMethodsRule.java:40)
	at com.carrotsearch.randomizedtesting.rules.StatementAdapter.evaluate(StatementAdapter.java:36)
	at com.carrotsearch.randomizedtesting.rules.StatementAdapter.evaluate(StatementAdapter.java:36)
	at com.carrotsearch.randomizedtesting.rules.StatementAdapter.evaluate(StatementAdapter.java:36)
	at org.apache.lucene.util.TestRuleAssertionsRequired$1.evaluate(TestRuleAssertionsRequired.java:53)
	at org.apache.lucene.util.TestRuleMarkFailure$1.evaluate(TestRuleMarkFailure.java:47)
	at org.apache.lucene.util.TestRuleIgnoreAfterMaxFailures$1.evaluate(TestRuleIgnoreAfterMaxFailures.java:64)
	at org.apache.lucene.util.TestRuleIgnoreTestSuites$1.evaluate(TestRuleIgnoreTestSuites.java:54)
	at com.carrotsearch.randomizedtesting.rules.StatementAdapter.evaluate(StatementAdapter.java:36)
	at com.carrotsearch.randomizedtesting.ThreadLeakControl$StatementRunner.run(ThreadLeakControl.java:367)
	at java.lang.Thread.run(Thread.java:745)


FAILED:  org.apache.solr.handler.TestReplicationHandler.doTestStressReplication

Error Message:
timed out waiting for collection1 startAt time to exceed: Sat Dec 10 12:23:01 CVT 2016

Stack Trace:
java.lang.AssertionError: timed out waiting for collection1 startAt time to exceed: Sat Dec 10 12:23:01 CVT 2016
	at __randomizedtesting.SeedInfo.seed([A18CB334F5F66975:7A27B3F2F0DE00C6]:0)
	at org.junit.Assert.fail(Assert.java:93)
	at org.apache.solr.handler.TestReplicationHandler.watchCoreStartAt(TestReplicationHandler.java:1510)
	at org.apache.solr.handler.TestReplicationHandler.doTestStressReplication(TestReplicationHandler.java:860)
	at sun.reflect.NativeMethodAccessorImpl.invoke0(Native Method)
	at sun.reflect.NativeMethodAccessorImpl.invoke(NativeMethodAccessorImpl.java:62)
	at sun.reflect.DelegatingMethodAccessorImpl.invoke(DelegatingMethodAccessorImpl.java:43)
	at java.lang.reflect.Method.invoke(Method.java:498)
	at com.carrotsearch.randomizedtesting.RandomizedRunner.invoke(RandomizedRunner.java:1713)
	at com.carrotsearch.randomizedtesting.RandomizedRunner$8.evaluate(RandomizedRunner.java:907)
	at com.carrotsearch.randomizedtesting.RandomizedRunner$9.evaluate(RandomizedRunner.java:943)
	at com.carrotsearch.randomizedtesting.RandomizedRunner$10.evaluate(RandomizedRunner.java:957)
	at com.carrotsearch.randomizedtesting.rules.SystemPropertiesRestoreRule$1.evaluate(SystemPropertiesRestoreRule.java:57)
	at org.apache.lucene.util.TestRuleSetupTeardownChained$1.evaluate(TestRuleSetupTeardownChained.java:49)
	at org.apache.lucene.util.AbstractBeforeAfterRule$1.evaluate(AbstractBeforeAfterRule.java:45)
	at org.apache.lucene.util.TestRuleThreadAndTestName$1.evaluate(TestRuleThreadAndTestName.java:48)
	at org.apache.lucene.util.TestRuleIgnoreAfterMaxFailures$1.evaluate(TestRuleIgnoreAfterMaxFailures.java:64)
	at org.apache.lucene.util.TestRuleMarkFailure$1.evaluate(TestRuleMarkFailure.java:47)
	at com.carrotsearch.randomizedtesting.rules.StatementAdapter.evaluate(StatementAdapter.java:36)
	at com.carrotsearch.randomizedtesting.ThreadLeakControl$StatementRunner.run(ThreadLeakControl.java:367)
	at com.carrotsearch.randomizedtesting.ThreadLeakControl.forkTimeoutingTask(ThreadLeakControl.java:811)
	at com.carrotsearch.randomizedtesting.ThreadLeakControl$3.evaluate(ThreadLeakControl.java:462)
	at com.carrotsearch.randomizedtesting.RandomizedRunner.runSingleTest(RandomizedRunner.java:916)
	at com.carrotsearch.randomizedtesting.RandomizedRunner$5.evaluate(RandomizedRunner.java:802)
	at com.carrotsearch.randomizedtesting.RandomizedRunner$6.evaluate(RandomizedRunner.java:852)
	at com.carrotsearch.randomizedtesting.RandomizedRunner$7.evaluate(RandomizedRunner.java:863)
	at com.carrotsearch.randomizedtesting.rules.StatementAdapter.evaluate(StatementAdapter.java:36)
	at com.carrotsearch.randomizedtesting.rules.SystemPropertiesRestoreRule$1.evaluate(SystemPropertiesRestoreRule.java:57)
	at org.apache.lucene.util.AbstractBeforeAfterRule$1.evaluate(AbstractBeforeAfterRule.java:45)
	at com.carrotsearch.randomizedtesting.rules.StatementAdapter.evaluate(StatementAdapter.java:36)
	at org.apache.lucene.util.TestRuleStoreClassName$1.evaluate(TestRuleStoreClassName.java:41)
	at com.carrotsearch.randomizedtesting.rules.NoShadowingOrOverridesOnMethodsRule$1.evaluate(NoShadowingOrOverridesOnMethodsRule.java:40)
	at com.carrotsearch.randomizedtesting.rules.NoShadowingOrOverridesOnMethodsRule$1.evaluate(NoShadowingOrOverridesOnMethodsRule.java:40)
	at com.carrotsearch.randomizedtesting.rules.StatementAdapter.evaluate(StatementAdapter.java:36)
	at com.carrotsearch.randomizedtesting.rules.StatementAdapter.evaluate(StatementAdapter.java:36)
	at com.carrotsearch.randomizedtesting.rules.StatementAdapter.evaluate(StatementAdapter.java:36)
	at org.apache.lucene.util.TestRuleAssertionsRequired$1.evaluate(TestRuleAssertionsRequired.java:53)
	at org.apache.lucene.util.TestRuleMarkFailure$1.evaluate(TestRuleMarkFailure.java:47)
	at org.apache.lucene.util.TestRuleIgnoreAfterMaxFailures$1.evaluate(TestRuleIgnoreAfterMaxFailures.java:64)
	at org.apache.lucene.util.TestRuleIgnoreTestSuites$1.evaluate(TestRuleIgnoreTestSuites.java:54)
	at com.carrotsearch.randomizedtesting.rules.StatementAdapter.evaluate(StatementAdapter.java:36)
	at com.carrotsearch.randomizedtesting.ThreadLeakControl$StatementRunner.run(ThreadLeakControl.java:367)
	at java.lang.Thread.run(Thread.java:745)


FAILED:  org.apache.solr.cloud.hdfs.HdfsCollectionsAPIDistributedZkTest.testSpecificConfigsets

Error Message:
KeeperErrorCode = NoNode for /collections/withconfigset2

Stack Trace:
org.apache.zookeeper.KeeperException$NoNodeException: KeeperErrorCode = NoNode for /collections/withconfigset2
	at __randomizedtesting.SeedInfo.seed([A18CB334F5F66975:8CF2FC6E02D2D379]:0)
	at org.apache.zookeeper.KeeperException.create(KeeperException.java:111)
	at org.apache.zookeeper.KeeperException.create(KeeperException.java:51)
	at org.apache.zookeeper.ZooKeeper.getData(ZooKeeper.java:1155)
	at org.apache.solr.common.cloud.SolrZkClient$7.execute(SolrZkClient.java:356)
	at org.apache.solr.common.cloud.SolrZkClient$7.execute(SolrZkClient.java:353)
	at org.apache.solr.common.cloud.ZkCmdExecutor.retryOperation(ZkCmdExecutor.java:60)
	at org.apache.solr.common.cloud.SolrZkClient.getData(SolrZkClient.java:353)
	at org.apache.solr.cloud.CollectionsAPIDistributedZkTest.testSpecificConfigsets(CollectionsAPIDistributedZkTest.java:425)
	at sun.reflect.NativeMethodAccessorImpl.invoke0(Native Method)
	at sun.reflect.NativeMethodAccessorImpl.invoke(NativeMethodAccessorImpl.java:62)
	at sun.reflect.DelegatingMethodAccessorImpl.invoke(DelegatingMethodAccessorImpl.java:43)
	at java.lang.reflect.Method.invoke(Method.java:498)
	at com.carrotsearch.randomizedtesting.RandomizedRunner.invoke(RandomizedRunner.java:1713)
	at com.carrotsearch.randomizedtesting.RandomizedRunner$8.evaluate(RandomizedRunner.java:907)
	at com.carrotsearch.randomizedtesting.RandomizedRunner$9.evaluate(RandomizedRunner.java:943)
	at com.carrotsearch.randomizedtesting.RandomizedRunner$10.evaluate(RandomizedRunner.java:957)
	at com.carrotsearch.randomizedtesting.rules.SystemPropertiesRestoreRule$1.evaluate(SystemPropertiesRestoreRule.java:57)
	at org.apache.lucene.util.TestRuleSetupTeardownChained$1.evaluate(TestRuleSetupTeardownChained.java:49)
	at org.apache.lucene.util.AbstractBeforeAfterRule$1.evaluate(AbstractBeforeAfterRule.java:45)
	at org.apache.lucene.util.TestRuleThreadAndTestName$1.evaluate(TestRuleThreadAndTestName.java:48)
	at org.apache.lucene.util.TestRuleIgnoreAfterMaxFailures$1.evaluate(TestRuleIgnoreAfterMaxFailures.java:64)
	at org.apache.lucene.util.TestRuleMarkFailure$1.evaluate(TestRuleMarkFailure.java:47)
	at com.carrotsearch.randomizedtesting.rules.StatementAdapter.evaluate(StatementAdapter.java:36)
	at com.carrotsearch.randomizedtesting.ThreadLeakControl$StatementRunner.run(ThreadLeakControl.java:367)
	at com.carrotsearch.randomizedtesting.ThreadLeakControl.forkTimeoutingTask(ThreadLeakControl.java:811)
	at com.carrotsearch.randomizedtesting.ThreadLeakControl$3.evaluate(ThreadLeakControl.java:462)
	at com.carrotsearch.randomizedtesting.RandomizedRunner.runSingleTest(RandomizedRunner.java:916)
	at com.carrotsearch.randomizedtesting.RandomizedRunner$5.evaluate(RandomizedRunner.java:802)
	at com.carrotsearch.randomizedtesting.RandomizedRunner$6.evaluate(RandomizedRunner.java:852)
	at com.carrotsearch.randomizedtesting.RandomizedRunner$7.evaluate(RandomizedRunner.java:863)
	at com.carrotsearch.randomizedtesting.rules.StatementAdapter.evaluate(StatementAdapter.java:36)
	at com.carrotsearch.randomizedtesting.rules.SystemPropertiesRestoreRule$1.evaluate(SystemPropertiesRestoreRule.java:57)
	at org.apache.lucene.util.AbstractBeforeAfterRule$1.evaluate(AbstractBeforeAfterRule.java:45)
	at com.carrotsearch.randomizedtesting.rules.StatementAdapter.evaluate(StatementAdapter.java:36)
	at org.apache.lucene.util.TestRuleStoreClassName$1.evaluate(TestRuleStoreClassName.java:41)
	at com.carrotsearch.randomizedtesting.rules.NoShadowingOrOverridesOnMethodsRule$1.evaluate(NoShadowingOrOverridesOnMethodsRule.java:40)
	at com.carrotsearch.randomizedtesting.rules.NoShadowingOrOverridesOnMethodsRule$1.evaluate(NoShadowingOrOverridesOnMethodsRule.java:40)
	at com.carrotsearch.randomizedtesting.rules.StatementAdapter.evaluate(StatementAdapter.java:36)
	at com.carrotsearch.randomizedtesting.rules.StatementAdapter.evaluate(StatementAdapter.java:36)
	at com.carrotsearch.randomizedtesting.rules.StatementAdapter.evaluate(StatementAdapter.java:36)
	at org.apache.lucene.util.TestRuleAssertionsRequired$1.evaluate(TestRuleAssertionsRequired.java:53)
	at org.apache.lucene.util.TestRuleMarkFailure$1.evaluate(TestRuleMarkFailure.java:47)
	at org.apache.lucene.util.TestRuleIgnoreAfterMaxFailures$1.evaluate(TestRuleIgnoreAfterMaxFailures.java:64)
	at org.apache.lucene.util.TestRuleIgnoreTestSuites$1.evaluate(TestRuleIgnoreTestSuites.java:54)
	at com.carrotsearch.randomizedtesting.rules.StatementAdapter.evaluate(StatementAdapter.java:36)
	at com.carrotsearch.randomizedtesting.ThreadLeakControl$StatementRunner.run(ThreadLeakControl.java:367)
	at java.lang.Thread.run(Thread.java:745)


FAILED:  org.apache.solr.cloud.hdfs.HdfsCollectionsAPIDistributedZkTest.testCollectionsAPI

Error Message:
Expected to see collection awhollynewcollection_0 null Last available state: DocCollection(awhollynewcollection_0//collections/awhollynewcollection_0/state.json/10)={   "replicationFactor":"3",   "shards":{     "shard1":{       "range":"80000000-bfffffff",       "state":"active",       "replicas":{}},     "shard2":{       "range":"c0000000-ffffffff",       "state":"active",       "replicas":{}},     "shard3":{       "range":"0-3fffffff",       "state":"active",       "replicas":{}},     "shard4":{       "range":"40000000-7fffffff",       "state":"active",       "replicas":{}}},   "router":{"name":"compositeId"},   "maxShardsPerNode":"4",   "autoAddReplicas":"false"}

Stack Trace:
java.lang.AssertionError: Expected to see collection awhollynewcollection_0
null
Last available state: DocCollection(awhollynewcollection_0//collections/awhollynewcollection_0/state.json/10)={
  "replicationFactor":"3",
  "shards":{
    "shard1":{
      "range":"80000000-bfffffff",
      "state":"active",
      "replicas":{}},
    "shard2":{
      "range":"c0000000-ffffffff",
      "state":"active",
      "replicas":{}},
    "shard3":{
      "range":"0-3fffffff",
      "state":"active",
      "replicas":{}},
    "shard4":{
      "range":"40000000-7fffffff",
      "state":"active",
      "replicas":{}}},
  "router":{"name":"compositeId"},
  "maxShardsPerNode":"4",
  "autoAddReplicas":"false"}
	at __randomizedtesting.SeedInfo.seed([A18CB334F5F66975:E9F9C780F3C546E0]:0)
	at org.junit.Assert.fail(Assert.java:93)
	at org.apache.solr.cloud.SolrCloudTestCase.waitForState(SolrCloudTestCase.java:237)
	at org.apache.solr.cloud.CollectionsAPIDistributedZkTest.testCollectionsAPI(CollectionsAPIDistributedZkTest.java:496)
	at sun.reflect.NativeMethodAccessorImpl.invoke0(Native Method)
	at sun.reflect.NativeMethodAccessorImpl.invoke(NativeMethodAccessorImpl.java:62)
	at sun.reflect.DelegatingMethodAccessorImpl.invoke(DelegatingMethodAccessorImpl.java:43)
	at java.lang.reflect.Method.invoke(Method.java:498)
	at com.carrotsearch.randomizedtesting.RandomizedRunner.invoke(RandomizedRunner.java:1713)
	at com.carrotsearch.randomizedtesting.RandomizedRunner$8.evaluate(RandomizedRunner.java:907)
	at com.carrotsearch.randomizedtesting.RandomizedRunner$9.evaluate(RandomizedRunner.java:943)
	at com.carrotsearch.randomizedtesting.RandomizedRunner$10.evaluate(RandomizedRunner.java:957)
	at com.carrotsearch.randomizedtesting.rules.SystemPropertiesRestoreRule$1.evaluate(SystemPropertiesRestoreRule.java:57)
	at org.apache.lucene.util.TestRuleSetupTeardownChained$1.evaluate(TestRuleSetupTeardownChained.java:49)
	at org.apache.lucene.util.AbstractBeforeAfterRule$1.evaluate(AbstractBeforeAfterRule.java:45)
	at org.apache.lucene.util.TestRuleThreadAndTestName$1.evaluate(TestRuleThreadAndTestName.java:48)
	at org.apache.lucene.util.TestRuleIgnoreAfterMaxFailures$1.evaluate(TestRuleIgnoreAfterMaxFailures.java:64)
	at org.apache.lucene.util.TestRuleMarkFailure$1.evaluate(TestRuleMarkFailure.java:47)
	at com.carrotsearch.randomizedtesting.rules.StatementAdapter.evaluate(StatementAdapter.java:36)
	at com.carrotsearch.randomizedtesting.ThreadLeakControl$StatementRunner.run(ThreadLeakControl.java:367)
	at com.carrotsearch.randomizedtesting.ThreadLeakControl.forkTimeoutingTask(ThreadLeakControl.java:811)
	at com.carrotsearch.randomizedtesting.ThreadLeakControl$3.evaluate(ThreadLeakControl.java:462)
	at com.carrotsearch.randomizedtesting.RandomizedRunner.runSingleTest(RandomizedRunner.java:916)
	at com.carrotsearch.randomizedtesting.RandomizedRunner$5.evaluate(RandomizedRunner.java:802)
	at com.carrotsearch.randomizedtesting.RandomizedRunner$6.evaluate(RandomizedRunner.java:852)
	at com.carrotsearch.randomizedtesting.RandomizedRunner$7.evaluate(RandomizedRunner.java:863)
	at com.carrotsearch.randomizedtesting.rules.StatementAdapter.evaluate(StatementAdapter.java:36)
	at com.carrotsearch.randomizedtesting.rules.SystemPropertiesRestoreRule$1.evaluate(SystemPropertiesRestoreRule.java:57)
	at org.apache.lucene.util.AbstractBeforeAfterRule$1.evaluate(AbstractBeforeAfterRule.java:45)
	at com.carrotsearch.randomizedtesting.rules.StatementAdapter.evaluate(StatementAdapter.java:36)
	at org.apache.lucene.util.TestRuleStoreClassName$1.evaluate(TestRuleStoreClassName.java:41)
	at com.carrotsearch.randomizedtesting.rules.NoShadowingOrOverridesOnMethodsRule$1.evaluate(NoShadowingOrOverridesOnMethodsRule.java:40)
	at com.carrotsearch.randomizedtesting.rules.NoShadowingOrOverridesOnMethodsRule$1.evaluate(NoShadowingOrOverridesOnMethodsRule.java:40)
	at com.carrotsearch.randomizedtesting.rules.StatementAdapter.evaluate(StatementAdapter.java:36)
	at com.carrotsearch.randomizedtesting.rules.StatementAdapter.evaluate(StatementAdapter.java:36)
	at com.carrotsearch.randomizedtesting.rules.StatementAdapter.evaluate(StatementAdapter.java:36)
	at org.apache.lucene.util.TestRuleAssertionsRequired$1.evaluate(TestRuleAssertionsRequired.java:53)
	at org.apache.lucene.util.TestRuleMarkFailure$1.evaluate(TestRuleMarkFailure.java:47)
	at org.apache.lucene.util.TestRuleIgnoreAfterMaxFailures$1.evaluate(TestRuleIgnoreAfterMaxFailures.java:64)
	at org.apache.lucene.util.TestRuleIgnoreTestSuites$1.evaluate(TestRuleIgnoreTestSuites.java:54)
	at com.carrotsearch.randomizedtesting.rules.StatementAdapter.evaluate(StatementAdapter.java:36)
	at com.carrotsearch.randomizedtesting.ThreadLeakControl$StatementRunner.run(ThreadLeakControl.java:367)
	at java.lang.Thread.run(Thread.java:745)




Build Log:
[...truncated 11718 lines...]
   [junit4] Suite: org.apache.solr.handler.TestReplicationHandler
   [junit4]   2> Creating dataDir: /x1/jenkins/jenkins-slave/workspace/Lucene-Solr-NightlyTests-6.x/checkout/solr/build/solr-core/test/J0/temp/solr.handler.TestReplicationHandler_A18CB334F5F66975-001/init-core-data-001
   [junit4]   2> 689066 INFO  (SUITE-TestReplicationHandler-seed#[A18CB334F5F66975]-worker) [    ] o.a.s.SolrTestCaseJ4 Randomized ssl (false) and clientAuth (false) via: @org.apache.solr.SolrTestCaseJ4$SuppressSSL(bugUrl=None)
   [junit4]   2> 689067 INFO  (TEST-TestReplicationHandler.doTestReplicateAfterStartupWithNoActivity-seed#[A18CB334F5F66975]) [    ] o.a.s.SolrTestCaseJ4 ###Starting doTestReplicateAfterStartupWithNoActivity
   [junit4]   2> 689067 INFO  (TEST-TestReplicationHandler.doTestReplicateAfterStartupWithNoActivity-seed#[A18CB334F5F66975]) [    ] o.a.s.SolrTestCaseJ4 Writing core.properties file to /x1/jenkins/jenkins-slave/workspace/Lucene-Solr-NightlyTests-6.x/checkout/solr/build/solr-core/test/J0/temp/solr.handler.TestReplicationHandler_A18CB334F5F66975-001/solr-instance-001/collection1
   [junit4]   2> 689072 INFO  (TEST-TestReplicationHandler.doTestReplicateAfterStartupWithNoActivity-seed#[A18CB334F5F66975]) [    ] o.e.j.s.Server jetty-9.3.14.v20161028
   [junit4]   2> 689076 INFO  (TEST-TestReplicationHandler.doTestReplicateAfterStartupWithNoActivity-seed#[A18CB334F5F66975]) [    ] o.e.j.s.h.ContextHandler Started o.e.j.s.ServletContextHandler@4f34cc76{/solr,null,AVAILABLE}
   [junit4]   2> 689077 INFO  (TEST-TestReplicationHandler.doTestReplicateAfterStartupWithNoActivity-seed#[A18CB334F5F66975]) [    ] o.e.j.s.AbstractConnector Started ServerConnector@79d833d{HTTP/1.1,[http/1.1]}{127.0.0.1:48235}
   [junit4]   2> 689077 INFO  (TEST-TestReplicationHandler.doTestReplicateAfterStartupWithNoActivity-seed#[A18CB334F5F66975]) [    ] o.e.j.s.Server Started @692131ms
   [junit4]   2> 689077 INFO  (TEST-TestReplicationHandler.doTestReplicateAfterStartupWithNoActivity-seed#[A18CB334F5F66975]) [    ] o.a.s.c.s.e.JettySolrRunner Jetty properties: {solr.data.dir=/x1/jenkins/jenkins-slave/workspace/Lucene-Solr-NightlyTests-6.x/checkout/solr/build/solr-core/test/J0/temp/solr.handler.TestReplicationHandler_A18CB334F5F66975-001/solr-instance-001/collection1/data, hostContext=/solr, hostPort=48235}
   [junit4]   2> 689077 ERROR (TEST-TestReplicationHandler.doTestReplicateAfterStartupWithNoActivity-seed#[A18CB334F5F66975]) [    ] o.a.s.s.StartupLoggingUtils Missing Java Option solr.log.dir. Logging may be missing or incomplete.
   [junit4]   2> 689079 INFO  (TEST-TestReplicationHandler.doTestReplicateAfterStartupWithNoActivity-seed#[A18CB334F5F66975]) [    ] o.a.s.s.SolrDispatchFilter  ___      _       Welcome to Apache Solr™ version 6.4.0
   [junit4]   2> 689079 INFO  (TEST-TestReplicationHandler.doTestReplicateAfterStartupWithNoActivity-seed#[A18CB334F5F66975]) [    ] o.a.s.s.SolrDispatchFilter / __| ___| |_ _   Starting in standalone mode on port null
   [junit4]   2> 689079 INFO  (TEST-TestReplicationHandler.doTestReplicateAfterStartupWithNoActivity-seed#[A18CB334F5F66975]) [    ] o.a.s.s.SolrDispatchFilter \__ \/ _ \ | '_|  Install dir: null
   [junit4]   2> 689079 INFO  (TEST-TestReplicationHandler.doTestReplicateAfterStartupWithNoActivity-seed#[A18CB334F5F66975]) [    ] o.a.s.s.SolrDispatchFilter |___/\___/_|_|    Start time: 2016-12-10T13:15:34.212Z
   [junit4]   2> 689079 INFO  (TEST-TestReplicationHandler.doTestReplicateAfterStartupWithNoActivity-seed#[A18CB334F5F66975]) [    ] o.a.s.c.SolrXmlConfig Loading container configuration from /x1/jenkins/jenkins-slave/workspace/Lucene-Solr-NightlyTests-6.x/checkout/solr/build/solr-core/test/J0/temp/solr.handler.TestReplicationHandler_A18CB334F5F66975-001/solr-instance-001/solr.xml
   [junit4]   2> 689089 INFO  (TEST-TestReplicationHandler.doTestReplicateAfterStartupWithNoActivity-seed#[A18CB334F5F66975]) [    ] o.a.s.u.UpdateShardHandler Creating UpdateShardHandler HTTP client with params: socketTimeout=340000&connTimeout=45000&retry=true
   [junit4]   2> 689099 INFO  (TEST-TestReplicationHandler.doTestReplicateAfterStartupWithNoActivity-seed#[A18CB334F5F66975]) [    ] o.a.s.c.CorePropertiesLocator Found 1 core definitions underneath /x1/jenkins/jenkins-slave/workspace/Lucene-Solr-NightlyTests-6.x/checkout/solr/build/solr-core/test/J0/temp/solr.handler.TestReplicationHandler_A18CB334F5F66975-001/solr-instance-001/.
   [junit4]   2> 689099 INFO  (TEST-TestReplicationHandler.doTestReplicateAfterStartupWithNoActivity-seed#[A18CB334F5F66975]) [    ] o.a.s.c.CorePropertiesLocator Cores are: [collection1]
   [junit4]   2> 689125 INFO  (coreLoadExecutor-2156-thread-1) [    ] o.a.s.c.SolrConfig Using Lucene MatchVersion: 6.4.0
   [junit4]   2> 689396 INFO  (coreLoadExecutor-2156-thread-1) [    ] o.a.s.s.IndexSchema [collection1] Schema name=test
   [junit4]   2> 689420 INFO  (coreLoadExecutor-2156-thread-1) [    ] o.a.s.s.IndexSchema Loaded schema test/1.2 with uniqueid field id
   [junit4]   2> 689421 INFO  (coreLoadExecutor-2156-thread-1) [    ] o.a.s.c.CoreContainer Creating SolrCore 'collection1' using configuration from instancedir /x1/jenkins/jenkins-slave/workspace/Lucene-Solr-NightlyTests-6.x/checkout/solr/build/solr-core/test/J0/temp/solr.handler.TestReplicationHandler_A18CB334F5F66975-001/solr-instance-001/./collection1
   [junit4]   2> 689422 INFO  (coreLoadExecutor-2156-thread-1) [    x:collection1] o.a.s.c.SolrCore [[collection1] ] Opening new SolrCore at [/x1/jenkins/jenkins-slave/workspace/Lucene-Solr-NightlyTests-6.x/checkout/solr/build/solr-core/test/J0/temp/solr.handler.TestReplicationHandler_A18CB334F5F66975-001/solr-instance-001/collection1], dataDir=[/x1/jenkins/jenkins-slave/workspace/Lucene-Solr-NightlyTests-6.x/checkout/solr/build/solr-core/test/J0/temp/solr.handler.TestReplicationHandler_A18CB334F5F66975-001/solr-instance-001/./collection1/data/]
   [junit4]   2> 689426 INFO  (coreLoadExecutor-2156-thread-1) [    x:collection1] o.a.s.u.RandomMergePolicy RandomMergePolicy wrapping class org.apache.lucene.index.LogByteSizeMergePolicy: [LogByteSizeMergePolicy: minMergeSize=1677721, mergeFactor=16, maxMergeSize=2147483648, maxMergeSizeForForcedMerge=9223372036854775807, calibrateSizeByDeletes=false, maxMergeDocs=2147483647, maxCFSSegmentSizeMB=8.796093022207999E12, noCFSRatio=1.0]
   [junit4]   2> 689451 INFO  (coreLoadExecutor-2156-thread-1) [    x:collection1] o.a.s.u.CommitTracker Hard AutoCommit: disabled
   [junit4]   2> 689451 INFO  (coreLoadExecutor-2156-thread-1) [    x:collection1] o.a.s.u.CommitTracker Soft AutoCommit: disabled
   [junit4]   2> 689452 INFO  (coreLoadExecutor-2156-thread-1) [    x:collection1] o.a.s.u.RandomMergePolicy RandomMergePolicy wrapping class org.apache.lucene.index.LogDocMergePolicy: [LogDocMergePolicy: minMergeSize=1000, mergeFactor=18, maxMergeSize=9223372036854775807, maxMergeSizeForForcedMerge=9223372036854775807, calibrateSizeByDeletes=true, maxMergeDocs=2147483647, maxCFSSegmentSizeMB=8.796093022207999E12, noCFSRatio=0.0]
   [junit4]   2> 689453 INFO  (coreLoadExecutor-2156-thread-1) [    x:collection1] o.a.s.s.SolrIndexSearcher Opening [Searcher@18737e45[collection1] main]
   [junit4]   2> 689453 INFO  (coreLoadExecutor-2156-thread-1) [    x:collection1] o.a.s.r.ManagedResourceStorage File-based storage initialized to use dir: /x1/jenkins/jenkins-slave/workspace/Lucene-Solr-NightlyTests-6.x/checkout/solr/build/solr-core/test/J0/temp/solr.handler.TestReplicationHandler_A18CB334F5F66975-001/solr-instance-001/collection1/conf
   [junit4]   2> 689453 INFO  (coreLoadExecutor-2156-thread-1) [    x:collection1] o.a.s.h.ReplicationHandler Replication enabled for following config files: schema.xml,xslt/dummy.xsl
   [junit4]   2> 689453 INFO  (coreLoadExecutor-2156-thread-1) [    x:collection1] o.a.s.h.ReplicationHandler Commits will be reserved for  10000
   [junit4]   2> 689453 INFO  (searcherExecutor-2157-thread-1-processing-x:collection1) [    x:collection1] o.a.s.c.SolrCore [collection1] Registered new searcher Searcher@18737e45[collection1] main{ExitableDirectoryReader(UninvertingDirectoryReader())}
   [junit4]   2> 689860 INFO  (TEST-TestReplicationHandler.doTestReplicateAfterStartupWithNoActivity-seed#[A18CB334F5F66975]) [    ] o.a.s.SolrTestCaseJ4 Writing core.properties file to /x1/jenkins/jenkins-slave/workspace/Lucene-Solr-NightlyTests-6.x/checkout/solr/build/solr-core/test/J0/temp/solr.handler.TestReplicationHandler_A18CB334F5F66975-001/solr-instance-002/collection1
   [junit4]   2> 689862 INFO  (TEST-TestReplicationHandler.doTestReplicateAfterStartupWithNoActivity-seed#[A18CB334F5F66975]) [    ] o.e.j.s.Server jetty-9.3.14.v20161028
   [junit4]   2> 689873 INFO  (TEST-TestReplicationHandler.doTestReplicateAfterStartupWithNoActivity-seed#[A18CB334F5F66975]) [    ] o.e.j.s.h.ContextHandler Started o.e.j.s.ServletContextHandler@58f85326{/solr,null,AVAILABLE}
   [junit4]   2> 689873 INFO  (TEST-TestReplicationHandler.doTestReplicateAfterStartupWithNoActivity-seed#[A18CB334F5F66975]) [    ] o.e.j.s.AbstractConnector Started ServerConnector@4eff1a7a{HTTP/1.1,[http/1.1]}{127.0.0.1:40349}
   [junit4]   2> 689873 INFO  (TEST-TestReplicationHandler.doTestReplicateAfterStartupWithNoActivity-seed#[A18CB334F5F66975]) [    ] o.e.j.s.Server Started @692927ms
   [junit4]   2> 689873 INFO  (TEST-TestReplicationHandler.doTestReplicateAfterStartupWithNoActivity-seed#[A18CB334F5F66975]) [    ] o.a.s.c.s.e.JettySolrRunner Jetty properties: {solr.data.dir=/x1/jenkins/jenkins-slave/workspace/Lucene-Solr-NightlyTests-6.x/checkout/solr/build/solr-core/test/J0/temp/solr.handler.TestReplicationHandler_A18CB334F5F66975-001/solr-instance-002/collection1/data, hostContext=/solr, hostPort=40349}
   [junit4]   2> 689874 ERROR (TEST-TestReplicationHandler.doTestReplicateAfterStartupWithNoActivity-seed#[A18CB334F5F66975]) [    ] o.a.s.s.StartupLoggingUtils Missing Java Option solr.log.dir. Logging may be missing or incomplete.
   [junit4]   2> 689874 INFO  (TEST-TestReplicationHandler.doTestReplicateAfterStartupWithNoActivity-seed#[A18CB334F5F66975]) [    ] o.a.s.s.SolrDispatchFilter  ___      _       Welcome to Apache Solr™ version 6.4.0
   [junit4]   2> 689874 INFO  (TEST-TestReplicationHandler.doTestReplicateAfterStartupWithNoActivity-seed#[A18CB334F5F66975]) [    ] o.a.s.s.SolrDispatchFilter / __| ___| |_ _   Starting in standalone mode on port null
   [junit4]   2> 689874 INFO  (TEST-TestReplicationHandler.doTestReplicateAfterStartupWithNoActivity-seed#[A18CB334F5F66975]) [    ] o.a.s.s.SolrDispatchFilter \__ \/ _ \ | '_|  Install dir: null
   [junit4]   2> 689874 INFO  (TEST-TestReplicationHandler.doTestReplicateAfterStartupWithNoActivity-seed#[A18CB334F5F66975]) [    ] o.a.s.s.SolrDispatchFilter |___/\___/_|_|    Start time: 2016-12-10T13:15:35.007Z
   [junit4]   2> 689874 INFO  (TEST-TestReplicationHandler.doTestReplicateAfterStartupWithNoActivity-seed#[A18CB334F5F66975]) [    ] o.a.s.c.SolrXmlConfig Loading container configuration from /x1/jenkins/jenkins-slave/workspace/Lucene-Solr-NightlyTests-6.x/checkout/solr/build/solr-core/test/J0/temp/solr.handler.TestReplicationHandler_A18CB334F5F66975-001/solr-instance-002/solr.xml
   [junit4]   2> 689879 INFO  (TEST-TestReplicationHandler.doTestReplicateAfterStartupWithNoActivity-seed#[A18CB334F5F66975]) [    ] o.a.s.u.UpdateShardHandler Creating UpdateShardHandler HTTP client with params: socketTimeout=340000&connTimeout=45000&retry=true
   [junit4]   2> 689880 INFO  (TEST-TestReplicationHandler.doTestReplicateAfterStartupWithNoActivity-seed#[A18CB334F5F66975]) [    ] o.a.s.c.CorePropertiesLocator Found 1 core definitions underneath /x1/jenkins/jenkins-slave/workspace/Lucene-Solr-NightlyTests-6.x/checkout/solr/build/solr-core/test/J0/temp/solr.handler.TestReplicationHandler_A18CB334F5F66975-001/solr-instance-002/.
   [junit4]   2> 689881 INFO  (TEST-TestReplicationHandler.doTestReplicateAfterStartupWithNoActivity-seed#[A18CB334F5F66975]) [    ] o.a.s.c.CorePropertiesLocator Cores are: [collection1]
   [junit4]   2> 689886 INFO  (coreLoadExecutor-2166-thread-1) [    ] o.a.s.c.SolrConfig Using Lucene MatchVersion: 6.4.0
   [junit4]   2> 689893 INFO  (coreLoadExecutor-2166-thread-1) [    ] o.a.s.s.IndexSchema [collection1] Schema name=test
   [junit4]   2> 689894 INFO  (coreLoadExecutor-2166-thread-1) [    ] o.a.s.s.IndexSchema Loaded schema test/1.2 with uniqueid field id
   [junit4]   2> 689895 INFO  (coreLoadExecutor-2166-thread-1) [    ] o.a.s.c.CoreContainer Creating SolrCore 'collection1' using configuration from instancedir /x1/jenkins/jenkins-slave/workspace/Lucene-Solr-NightlyTests-6.x/checkout/solr/build/solr-core/test/J0/temp/solr.handler.TestReplicationHandler_A18CB334F5F66975-001/solr-instance-002/./collection1
   [junit4]   2> 689895 INFO  (coreLoadExecutor-2166-thread-1) [    x:collection1] o.a.s.c.SolrCore [[collection1] ] Opening new SolrCore at [/x1/jenkins/jenkins-slave/workspace/Lucene-Solr-NightlyTests-6.x/checkout/solr/build/solr-core/test/J0/temp/solr.handler.TestReplicationHandler_A18CB334F5F66975-001/solr-instance-002/collection1], dataDir=[/x1/jenkins/jenkins-slave/workspace/Lucene-Solr-NightlyTests-6.x/checkout/solr/build/solr-core/test/J0/temp/solr.handler.TestReplicationHandler_A18CB334F5F66975-001/solr-instance-002/./collection1/data/]
   [junit4]   2> 689896 INFO  (coreLoadExecutor-2166-thread-1) [    x:collection1] o.a.s.u.RandomMergePolicy RandomMergePolicy wrapping class org.apache.lucene.index.LogByteSizeMergePolicy: [LogByteSizeMergePolicy: minMergeSize=1677721, mergeFactor=16, maxMergeSize=2147483648, maxMergeSizeForForcedMerge=9223372036854775807, calibrateSizeByDeletes=false, maxMergeDocs=2147483647, maxCFSSegmentSizeMB=8.796093022207999E12, noCFSRatio=1.0]
   [junit4]   2> 689909 INFO  (coreLoadExecutor-2166-thread-1) [    x:collection1] o.a.s.u.CommitTracker Hard AutoCommit: disabled
   [junit4]   2> 689909 INFO  (coreLoadExecutor-2166-thread-1) [    x:collection1] o.a.s.u.CommitTracker Soft AutoCommit: disabled
   [junit4]   2> 689909 INFO  (coreLoadExecutor-2166-thread-1) [    x:collection1] o.a.s.u.RandomMergePolicy RandomMergePolicy wrapping class org.apache.lucene.index.LogDocMergePolicy: [LogDocMergePolicy: minMergeSize=1000, mergeFactor=18, maxMergeSize=9223372036854775807, maxMergeSizeForForcedMerge=9223372036854775807, calibrateSizeByDeletes=true, maxMergeDocs=2147483647, maxCFSSegmentSizeMB=8.796093022207999E12, noCFSRatio=0.0]
   [junit4]   2> 689910 INFO  (coreLoadExecutor-2166-thread-1) [    x:collection1] o.a.s.s.SolrIndexSearcher Opening [Searcher@13a1cd3a[collection1] main]
   [junit4]   2> 689910 INFO  (coreLoadExecutor-2166-thread-1) [    x:collection1] o.a.s.r.ManagedResourceStorage File-based storage initialized to use dir: /x1/jenkins/jenkins-slave/workspace/Lucene-Solr-NightlyTests-6.x/checkout/solr/build/solr-core/test/J0/temp/solr.handler.TestReplicationHandler_A18CB334F5F66975-001/solr-instance-002/collection1/conf
   [junit4]   2> 689913 INFO  (coreLoadExecutor-2166-thread-1) [    x:collection1] o.a.s.h.ReplicationHandler Poll scheduled at an interval of 1000ms
   [junit4]   2> 689913 INFO  (searcherExecutor-2167-thread-1-processing-x:collection1) [    x:collection1] o.a.s.c.SolrCore [collection1] Registered new searcher Searcher@13a1cd3a[collection1] main{ExitableDirectoryReader(UninvertingDirectoryReader())}
   [junit4]   2> 689927 INFO  (qtp1589534495-5638) [    x:collection1] o.a.s.c.S.Request [collection1]  webapp=/solr path=/replication params={qt=/replication&wt=javabin&version=2&command=indexversion} status=0 QTime=0
   [junit4]   2> 689930 INFO  (indexFetcher-2171-thread-1) [    x:collection1] o.a.s.h.IndexFetcher Master's generation: 1
   [junit4]   2> 689933 INFO  (indexFetcher-2171-thread-1) [    x:collection1] o.a.s.h.IndexFetcher Master's version: 0
   [junit4]   2> 689933 INFO  (indexFetcher-2171-thread-1) [    x:collection1] o.a.s.h.IndexFetcher Slave's generation: 1
   [junit4]   2> 690382 INFO  (TEST-TestReplicationHandler.doTestReplicateAfterStartupWithNoActivity-seed#[A18CB334F5F66975]) [    ] o.e.j.s.AbstractConnector Stopped ServerConnector@4eff1a7a{HTTP/1.1,[http/1.1]}{127.0.0.1:0}
   [junit4]   2> 690382 INFO  (TEST-TestReplicationHandler.doTestReplicateAfterStartupWithNoActivity-seed#[A18CB334F5F66975]) [    ] o.a.s.c.CoreContainer Shutting down CoreContainer instance=231522370
   [junit4]   2> 690386 INFO  (coreCloseExecutor-2172-thread-1) [    x:collection1] o.a.s.c.SolrCore [collection1]  CLOSING SolrCore org.apache.solr.core.SolrCore@1f6c565e
   [junit4]   2> 690397 INFO  (TEST-TestReplicationHandler.doTestReplicateAfterStartupWithNoActivity-seed#[A18CB334F5F66975]) [    ] o.e.j.s.h.ContextHandler Stopped o.e.j.s.ServletContextHandler@58f85326{/solr,null,UNAVAILABLE}
   [junit4]   2> 690400 INFO  (qtp1589534495-5636) [    x:collection1] o.a.s.u.DirectUpdateHandler2 [collection1] REMOVING ALL DOCUMENTS FROM INDEX
   [junit4]   2> 690401 INFO  (qtp1589534495-5636) [    x:collection1] o.a.s.u.p.LogUpdateProcessorFactory [collection1]  webapp=/solr path=/update params={wt=javabin&version=2}{deleteByQuery=*:*} 0 2
   [junit4]   2> 690404 INFO  (qtp1589534495-5641) [    x:collection1] o.a.s.u.DirectUpdateHandler2 start commit{,optimize=false,openSearcher=true,waitSearcher=true,expungeDeletes=false,softCommit=false,prepareCommit=false}
   [junit4]   2> 690404 INFO  (qtp1589534495-5641) [    x:collection1] o.a.s.u.SolrIndexWriter Calling setCommitData with IW:org.apache.solr.update.SolrIndexWriter@26570b4f
   [junit4]   2> 690406 INFO  (qtp1589534495-5641) [    x:collection1] o.a.s.s.SolrIndexSearcher Opening [Searcher@69adebce[collection1] main]
   [junit4]   2> 690406 INFO  (qtp1589534495-5641) [    x:collection1] o.a.s.u.DirectUpdateHandler2 end_commit_flush
   [junit4]   2> 690406 INFO  (searcherExecutor-2157-thread-1-processing-x:collection1) [    x:collection1] o.a.s.c.SolrCore [collection1] Registered new searcher Searcher@69adebce[collection1] main{ExitableDirectoryReader(UninvertingDirectoryReader())}
   [junit4]   2> 690406 INFO  (qtp1589534495-5641) [    x:collection1] o.a.s.u.p.LogUpdateProcessorFactory [collection1]  webapp=/solr path=/update params={waitSearcher=true&commit=true&softCommit=false&wt=javabin&version=2}{commit=} 0 2
   [junit4]   2> 690409 INFO  (TEST-TestReplicationHandler.doTestReplicateAfterStartupWithNoActivity-seed#[A18CB334F5F66975]) [    ] o.e.j.s.AbstractConnector Stopped ServerConnector@79d833d{HTTP/1.1,[http/1.1]}{127.0.0.1:0}
   [junit4]   2> 690409 INFO  (TEST-TestReplicationHandler.doTestReplicateAfterStartupWithNoActivity-seed#[A18CB334F5F66975]) [    ] o.a.s.c.CoreContainer Shutting down CoreContainer instance=1942680919
   [junit4]   2> 690409 INFO  (coreCloseExecutor-2174-thread-1) [    x:collection1] o.a.s.c.SolrCore [collection1]  CLOSING SolrCore org.apache.solr.core.SolrCore@fa52d9f
   [junit4]   2> 690413 INFO  (TEST-TestReplicationHandler.doTestReplicateAfterStartupWithNoActivity-seed#[A18CB334F5F66975]) [    ] o.e.j.s.h.ContextHandler Stopped o.e.j.s.ServletContextHandler@4f34cc76{/solr,null,UNAVAILABLE}
   [junit4]   2> 690414 INFO  (TEST-TestReplicationHandler.doTestReplicateAfterStartupWithNoActivity-seed#[A18CB334F5F66975]) [    ] o.e.j.s.Server jetty-9.3.14.v20161028
   [junit4]   2> 690421 INFO  (TEST-TestReplicationHandler.doTestReplicateAfterStartupWithNoActivity-seed#[A18CB334F5F66975]) [    ] o.e.j.s.h.ContextHandler Started o.e.j.s.ServletContextHandler@3e5c7d24{/solr,null,AVAILABLE}
   [junit4]   2> 690421 INFO  (TEST-TestReplicationHandler.doTestReplicateAfterStartupWithNoActivity-seed#[A18CB334F5F66975]) [    ] o.e.j.s.AbstractConnector Started ServerConnector@623f563d{HTTP/1.1,[http/1.1]}{127.0.0.1:32789}
   [junit4]   2> 690421 INFO  (TEST-TestReplicationHandler.doTestReplicateAfterStartupWithNoActivity-seed#[A18CB334F5F66975]) [    ] o.e.j.s.Server Started @693476ms
   [junit4]   2> 690421 INFO  (TEST-TestReplicationHandler.doTestReplicateAfterStartupWithNoActivity-seed#[A18CB334F5F66975]) [    ] o.a.s.c.s.e.JettySolrRunner Jetty properties: {solr.data.dir=/x1/jenkins/jenkins-slave/workspace/Lucene-Solr-NightlyTests-6.x/checkout/solr/build/solr-core/test/J0/temp/solr.handler.TestReplicationHandler_A18CB334F5F66975-001/solr-instance-001/collection1/data, hostContext=/solr, hostPort=32789}
   [junit4]   2> 690422 ERROR (TEST-TestReplicationHandler.doTestReplicateAfterStartupWithNoActivity-seed#[A18CB334F5F66975]) [    ] o.a.s.s.StartupLoggingUtils Missing Java Option solr.log.dir. Logging may be missing or incomplete.
   [junit4]   2> 690422 INFO  (TEST-TestReplicationHandler.doTestReplicateAfterStartupWithNoActivity-seed#[A18CB334F5F66975]) [    ] o.a.s.s.SolrDispatchFilter  ___      _       Welcome to Apache Solr™ version 6.4.0
   [junit4]   2> 690422 INFO  (TEST-TestReplicationHandler.doTestReplicateAfterStartupWithNoActivity-seed#[A18CB334F5F66975]) [    ] o.a.s.s.SolrDispatchFilter / __| ___| |_ _   Starting in standalone mode on port null
   [junit4]   2> 690422 INFO  (TEST-TestReplicationHandler.doTestReplicateAfterStartupWithNoActivity-seed#[A18CB334F5F66975]) [    ] o.a.s.s.SolrDispatchFilter \__ \/ _ \ | '_|  Install dir: null
   [junit4]   2> 690422 INFO  (TEST-TestReplicationHandler.doTestReplicateAfterStartupWithNoActivity-seed#[A18CB334F5F66975]) [    ] o.a.s.s.SolrDispatchFilter |___/\___/_|_|    Start time: 2016-12-10T13:15:35.555Z
   [junit4]   2> 690422 INFO  (TEST-TestReplicationHandler.doTestReplicateAfterStartupWithNoActivity-seed#[A18CB334F5F66975]) [    ] o.a.s.c.SolrXmlConfig Loading container configuration from /x1/jenkins/jenkins-slave/workspace/Lucene-Solr-NightlyTests-6.x/checkout/solr/build/solr-core/test/J0/temp/solr.handler.TestReplicationHandler_A18CB334F5F66975-001/solr-instance-001/solr.xml
   [junit4]   2> 690440 INFO  (TEST-TestReplicationHandler.doTestReplicateAfterStartupWithNoActivity-seed#[A18CB334F5F66975]) [    ] o.a.s.u.UpdateShardHandler Creating UpdateShardHandler HTTP client with params: socketTimeout=340000&connTimeout=45000&retry=true
   [junit4]   2> 690441 INFO  (TEST-TestReplicationHandler.doTestReplicateAfterStartupWithNoActivity-seed#[A18CB334F5F66975]) [    ] o.a.s.c.CorePropertiesLocator Found 1 core definitions underneath /x1/jenkins/jenkins-slave/workspace/Lucene-Solr-NightlyTests-6.x/checkout/solr/build/solr-core/test/J0/temp/solr.handler.TestReplicationHandler_A18CB334F5F66975-001/solr-instance-001/.
   [junit4]   2> 690442 INFO  (TEST-TestReplicationHandler.doTestReplicateAfterStartupWithNoActivity-seed#[A18CB334F5F66975]) [    ] o.a.s.c.CorePropertiesLocator Cores are: [collection1]
   [junit4]   2> 690461 INFO  (coreLoadExecutor-2181-thread-1) [    ] o.a.s.c.SolrConfig Using Lucene MatchVersion: 6.4.0
   [junit4]   2> 690471 INFO  (coreLoadExecutor-2181-thread-1) [    ] o.a.s.s.IndexSchema [collection1] Schema name=test
   [junit4]   2> 690472 INFO  (coreLoadExecutor-2181-thread-1) [    ] o.a.s.s.IndexSchema Loaded schema test/1.2 with uniqueid field id
   [junit4]   2> 690473 INFO  (coreLoadExecutor-2181-thread-1) [    ] o.a.s.c.CoreContainer Creating SolrCore 'collection1' using configuration from instancedir /x1/jenkins/jenkins-slave/workspace/Lucene-Solr-NightlyTests-6.x/checkout/solr/build/solr-core/test/J0/temp/solr.handler.TestReplicationHandler_A18CB334F5F66975-001/solr-instance-001/./collection1
   [junit4]   2> 690473 INFO  (coreLoadExecutor-2181-thread-1) [    x:collection1] o.a.s.c.SolrCore [[collection1] ] Opening new SolrCore at [/x1/jenkins/jenkins-slave/workspace/Lucene-Solr-NightlyTests-6.x/checkout/solr/build/solr-core/test/J0/temp/solr.handler.TestReplicationHandler_A18CB334F5F66975-001/solr-instance-001/collection1], dataDir=[/x1/jenkins/jenkins-slave/workspace/Lucene-Solr-NightlyTests-6.x/checkout/solr/build/solr-core/test/J0/temp/solr.handler.TestReplicationHandler_A18CB334F5F66975-001/solr-instance-001/./collection1/data/]
   [junit4]   2> 690474 INFO  (coreLoadExecutor-2181-thread-1) [    x:collection1] o.a.s.u.RandomMergePolicy RandomMergePolicy wrapping class org.apache.lucene.index.MockRandomMergePolicy: org.apache.lucene.index.MockRandomMergePolicy@3055a5ae
   [junit4]   2> 690482 INFO  (coreLoadExecutor-2181-thread-1) [    x:collection1] o.a.s.u.CommitTracker Hard AutoCommit: disabled
   [junit4]   2> 690482 INFO  (coreLoadExecutor-2181-thread-1) [    x:collection1] o.a.s.u.CommitTracker Soft AutoCommit: disabled
   [junit4]   2> 690482 INFO  (coreLoadExecutor-2181-thread-1) [    x:collection1] o.a.s.u.RandomMergePolicy RandomMergePolicy wrapping class org.apache.lucene.index.TieredMergePolicy: [TieredMergePolicy: maxMergeAtOnce=8, maxMergeAtOnceExplicit=2, maxMergedSegmentMB=1.0478515625, floorSegmentMB=0.6171875, forceMergeDeletesPctAllowed=25.866580883706025, segmentsPerTier=20.0, maxCFSSegmentSizeMB=8.796093022207999E12, noCFSRatio=0.0
   [junit4]   2> 690484 INFO  (coreLoadExecutor-2181-thread-1) [    x:collection1] o.a.s.s.SolrIndexSearcher Opening [Searcher@70bf8daf[collection1] main]
   [junit4]   2> 690484 INFO  (coreLoadExecutor-2181-thread-1) [    x:collection1] o.a.s.r.ManagedResourceStorage File-based storage initialized to use dir: /x1/jenkins/jenkins-slave/workspace/Lucene-Solr-NightlyTests-6.x/checkout/solr/build/solr-core/test/J0/temp/solr.handler.TestReplicationHandler_A18CB334F5F66975-001/solr-instance-001/collection1/conf
   [junit4]   2> 690484 INFO  (coreLoadExecutor-2181-thread-1) [    x:collection1] o.a.s.h.ReplicationHandler Replication enabled for following config files: schema.xml
   [junit4]   2> 690484 INFO  (coreLoadExecutor-2181-thread-1) [    x:collection1] o.a.s.h.ReplicationHandler Commits will be reserved for  10000
   [junit4]   2> 690487 INFO  (searcherExecutor-2182-thread-1-processing-x:collection1) [    x:collection1] o.a.s.c.SolrCore [collection1] Registered new searcher Searcher@70bf8daf[collection1] main{ExitableDirectoryReader(UninvertingDirectoryReader())}
   [junit4]   2> 690970 INFO  (qtp663889119-5676) [    x:collection1] o.a.s.u.p.LogUpdateProcessorFactory [collection1]  webapp=/solr path=/update params={wt=javabin&version=2}{add=[0]} 0 0
   [junit4]   2> 690977 INFO  (qtp663889119-5679) [    x:collection1] o.a.s.u.p.LogUpdateProcessorFactory [collection1]  webapp=/solr path=/update params={wt=javabin&version=2}{add=[1]} 0 5
   [junit4]   2> 690983 INFO  (qtp663889119-5682) [    x:collection1] o.a.s.u.p.LogUpdateProcessorFactory [collection1]  webapp=/solr path=/update params={wt=javabin&version=2}{add=[2]} 0 0
   [junit4]   2> 690991 INFO  (qtp663889119-5681) [    x:collection1] o.a.s.u.p.LogUpdateProcessorFactory [collection1]  webapp=/solr path=/update params={wt=javabin&version=2}{add=[3]} 0 0
   [junit4]   2> 690994 INFO  (qtp663889119-5681) [    x:collection1] o.a.s.u.p.LogUpdateProcessorFactory [collection1]  webapp=/solr path=/update params={wt=javabin&version=2}{add=[4]} 0 0
   [junit4]   2> 690995 INFO  (qtp663889119-5681) [    x:collection1] o.a.s.u.p.LogUpdateProcessorFactory [collection1]  webapp=/solr path=/update params={wt=javabin&version=2}{add=[5]} 0 0
   [junit4]   2> 690997 INFO  (qtp663889119-5681) [    x:collection1] o.a.s.u.p.LogUpdateProcessorFactory [collection1]  webapp=/solr path=/update params={wt=javabin&version=2}{add=[6]} 0 0
   [junit4]   2> 690999 INFO  (qtp663889119-5681) [    x:collection1] o.a.s.u.p.LogUpdateProcessorFactory [collection1]  webapp=/solr path=/update params={wt=javabin&version=2}{add=[7]} 0 0
   [junit4]   2> 691000 INFO  (qtp663889119-5681) [    x:collection1] o.a.s.u.p.LogUpdateProcessorFactory [collection1]  webapp=/solr path=/update params={wt=javabin&version=2}{add=[8]} 0 0
   [junit4]   2> 691002 INFO  (qtp663889119-5681) [    x:collection1] o.a.s.u.p.LogUpdateProcessorFactory [collection1]  webapp=/solr path=/update params={wt=javabin&version=2}{add=[9]} 0 0
   [junit4]   2> 691004 INFO  (qtp663889119-5682) [    x:collection1] o.a.s.u.p.LogUpdateProcessorFactory [collection1]  webapp=/solr path=/update params={wt=javabin&version=2}{add=[10]} 0 0
   [junit4]   2> 691005 INFO  (qtp663889119-5682) [    x:collection1] o.a.s.u.p.LogUpdateProcessorFactory [collection1]  webapp=/solr path=/update params={wt=javabin&version=2}{add=[11]} 0 0
   [junit4]   2> 691007 INFO  (qtp663889119-5675) [    x:collection1] o.a.s.u.p.LogUpdateProcessorFactory [collection1]  webapp=/solr path=/update params={wt=javabin&version=2}{add=[12]} 0 0
   [junit4]   2> 691009 INFO  (qtp663889119-5675) [    x:collection1] o.a.s.u.p.LogUpdateProcessorFactory [collection1]  webapp=/solr path=/update params={wt=javabin&version=2}{add=[13]} 0 0
   [junit4]   2> 691023 INFO  (qtp663889119-5675) [    x:collection1] o.a.s.u.p.LogUpdateProcessorFactory [collection1]  webapp=/solr path=/update params={wt=javabin&version=2}{add=[14]} 0 2
   [junit4]   2> 691024 INFO  (qtp663889119-5681) [    x:collection1] o.a.s.u.p.LogUpdateProcessorFactory [collection1]  webapp=/solr path=/update params={wt=javabin&version=2}{add=[15]} 0 0
   [junit4]   2> 691028 INFO  (qtp663889119-5681) [    x:collection1] o.a.s.u.p.LogUpdateProcessorFactory [collection1]  webapp=/solr path=/update params={wt=javabin&version=2}{add=[16]} 0 0
   [junit4]   2> 691031 INFO  (qtp663889119-5681) [    x:collection1] o.a.s.u.p.LogUpdateProcessorFactory [collection1]  webapp=/solr path=/update params={wt=javabin&version=2}{add=[17]} 0 0
   [junit4]   2> 691035 INFO  (qtp663889119-5681) [    x:collection1] o.a.s.u.p.LogUpdateProcessorFactory [collection1]  webapp=/solr path=/update params={wt=javabin&version=2}{add=[18]} 0 1
   [junit4]   2> 691040 INFO  (qtp663889119-5679) [    x:collection1] o.a.s.u.p.LogUpdateProcessorFactory [collection1]  webapp=/solr path=/update params={wt=javabin&version=2}{add=[19]} 0 0
   [junit4]   2> 691044 INFO  (qtp663889119-5679) [    x:collection1] o.a.s.u.p.LogUpdateProcessorFactory [collection1]  webapp=/solr path=/update params={wt=javabin&version=2}{add=[20]} 0 0
   [junit4]   2> 691046 INFO  (qtp663889119-5679) [    x:collection1] o.a.s.u.p.LogUpdateProcessorFactory [collection1]  webapp=/solr path=/update params={wt=javabin&version=2}{add=[21]} 0 0
   [junit4]   2> 691049 INFO  (qtp663889119-5679) [    x:collection1] o.a.s.u.p.LogUpdateProcessorFactory [collection1]  webapp=/solr path=/update params={wt=javabin&version=2}{add=[22]} 0 0
   [junit4]   2> 691051 INFO  (qtp663889119-5676) [    x:collection1] o.a.s.u.p.LogUpdateProcessorFactory [collection1]  webapp=/solr path=/update params={wt=javabin&version=2}{add=[23]} 0 0
   [junit4]   2> 691053 INFO  (qtp663889119-5676) [    x:collection1] o.a.s.u.p.LogUpdateProcessorFactory [collection1]  webapp=/solr path=/update params={wt=javabin&version=2}{add=[24]} 0 0
   [junit4]   2> 691055 INFO  (qtp663889119-5676) [    x:collection1] o.a.s.u.p.LogUpdateProcessorFactory [collection1]  webapp=/solr path=/update params={wt=javabin&version=2}{add=[25]} 0 0
   [junit4]   2> 691057 INFO  (qtp663889119-5676) [    x:collection1] o.a.s.u.p.LogUpdateProcessorFactory [collection1]  webapp=/solr path=/update params={wt=javabin&version=2}{add=[26]} 0 0
   [junit4]   2> 691059 INFO  (qtp663889119-5676) [    x:collection1] o.a.s.u.p.LogUpdateProcessorFactory [collection1]  webapp=/solr path=/update params={wt=javabin&version=2}{add=[27]} 0 0
   [junit4]   2> 691067 INFO  (qtp663889119-5676) [    x:collection1] o.a.s.u.p.LogUpdateProcessorFactory [collection1]  webapp=/solr path=/update params={wt=javabin&version=2}{add=[28]} 0 0
   [junit4]   2> 691070 INFO  (qtp663889119-5681) [    x:collection1] o.a.s.u.p.LogUpdateProcessorFactory [collection1]  webapp=/solr path=/update params={wt=javabin&version=2}{add=[29]} 0 0
   [junit4]   2> 691072 INFO  (qtp663889119-5681) [    x:collection1] o.a.s.u.p.LogUpdateProcessorFactory [collection1]  webapp=/solr path=/update params={wt=javabin&version=2}{add=[30]} 0 0
   [junit4]   2> 691074 INFO  (qtp663889119-5681) [    x:collection1] o.a.s.u.p.LogUpdateProcessorFactory [collection1]  webapp=/solr path=/update params={wt=javabin&version=2}{add=[31]} 0 0
   [junit4]   2> 691078 INFO  (qtp663889119-5682) [    x:collection1] o.a.s.u.p.LogUpdateProcessorFactory [collection1]  webapp=/solr path=/update params={wt=javabin&version=2}{add=[32]} 0 0
   [junit4]   2> 691088 INFO  (qtp663889119-5682) [    x:collection1] o.a.s.u.p.LogUpdateProcessorFactory [collection1]  webapp=/solr path=/update params={wt=javabin&version=2}{add=[33]} 0 0
   [junit4]   2> 691094 INFO  (qtp663889119-5682) [    x:collection1] o.a.s.u.p.LogUpdateProcessorFactory [collection1]  webapp=/solr path=/update params={wt=javabin&version=2}{add=[34]} 0 0
   [junit4]   2> 691096 INFO  (qtp663889119-5682) [    x:collection1] o.a.s.u.p.LogUpdateProcessorFactory [collection1]  webapp=/solr path=/update params={wt=javabin&version=2}{add=[35]} 0 0
   [junit4]   2> 691107 INFO  (qtp663889119-5680) [    x:collection1] o.a.s.u.p.LogUpdateProcessorFactory [collection1]  webapp=/solr path=/update params={wt=javabin&version=2}{add=[36]} 0 0
   [junit4]   2> 691174 INFO  (qtp663889119-5681) [    x:collection1] o.a.s.u.p.LogUpdateProcessorFactory [collection1]  webapp=/solr path=/update params={wt=javabin&version=2}{add=[37]} 0 0
   [junit4]   2> 691188 INFO  (qtp663889119-5679) [    x:collection1] o.a.s.u.p.LogUpdateProcessorFactory [collection1]  webapp=/solr path=/update params={wt=javabin&version=2}{add=[38]} 0 0
   [junit4]   2> 691190 INFO  (qtp663889119-5679) [    x:collection1] o.a.s.u.p.LogUpdateProcessorFactory [collection1]  webapp=/solr path=/update params={wt=javabin&version=2}{add=[39]} 0 0
   [junit4]   2> 691209 INFO  (qtp663889119-5675) [    x:collection1] o.a.s.u.p.LogUpdateProcessorFactory [collection1]  webapp=/solr path=/update params={wt=javabin&version=2}{add=[40]} 0 0
   [junit4]   2> 691218 INFO  (qtp663889119-5675) [    x:collection1] o.a.s.u.p.LogUpdateProcessorFactory [collection1]  webapp=/solr path=/update params={wt=javabin&version=2}{add=[41]} 0 0
   [junit4]   2> 691237 INFO  (qtp663889119-5680) [    x:collection1] o.a.s.u.p.LogUpdateProcessorFactory [collection1]  webapp=/solr path=/update params={wt=javabin&version=2}{add=[42]} 0 0
   [junit4]   2> 691241 INFO  (qtp663889119-5681) [    x:collection1] o.a.s.u.p.LogUpdateProcessorFactory [collection1]  webapp=/solr path=/update params={wt=javabin&version=2}{add=[43]} 0 0
   [junit4]   2> 691249 INFO  (qtp663889119-5676) [    x:collection1] o.a.s.u.p.LogUpdateProcessorFactory [collection1]  webapp=/solr path=/update params={wt=javabin&version=2}{add=[44]} 0 0
   [junit4]   2> 691254 INFO  (qtp663889119-5679) [    x:collection1] o.a.s.u.p.LogUpdateProcessorFactory [collection1]  webapp=/solr path=/update params={wt=javabin&version=2}{add=[45]} 0 0
   [junit4]   2> 691258 INFO  (qtp663889119-5679) [    x:collection1] o.a.s.u.p.LogUpdateProcessorFactory [collection1]  webapp=/solr path=/update params={wt=javabin&version=2}{add=[46]} 0 0
   [junit4]   2> 691259 INFO  (qtp663889119-5679) [    x:collection1] o.a.s.u.p.LogUpdateProcessorFactory [collection1]  webapp=/solr path=/update params={wt=javabin&version=2}{add=[47]} 0 0
   [junit4]   2> 691261 INFO  (qtp663889119-5679) [    x:collection1] o.a.s.u.p.LogUpdateProcessorFactory [collection1]  webapp=/solr path=/update params={wt=javabin&version=2}{add=[48]} 0 0
   [junit4]   2> 691263 INFO  (qtp663889119-5679) [    x:collection1] o.a.s.u.p.LogUpdateProcessorFactory [collection1]  webapp=/solr path=/update params={wt=javabin&version=2}{add=[49]} 0 0
   [junit4]   2> 691264 INFO  (qtp663889119-5676) [    x:collection1] o.a.s.u.p.LogUpdateProcessorFactory [collection1]  webapp=/solr path=/update params={wt=javabin&version=2}{add=[50]} 0 0
   [junit4]   2> 691271 INFO  (qtp663889119-5676) [    x:collection1] o.a.s.u.p.LogUpdateProcessorFactory [collection1]  webapp=/solr path=/update params={wt=javabin&version=2}{add=[51]} 0 0
   [junit4]   2> 691273 INFO  (qtp663889119-5676) [    x:collection1] o.a.s.u.p.LogUpdateProcessorFactory [collection1]  webapp=/solr path=/update params={wt=javabin&version=2}{add=[52]} 0 0
   [junit4]   2> 691275 INFO  (qtp663889119-5680) [    x:collection1] o.a.s.u.p.LogUpdateProcessorFactory [collection1]  webapp=/solr path=/update params={wt=javabin&version=2}{add=[53]} 0 0
   [junit4]   2> 691277 INFO  (qtp663889119-5680) [    x:collection1] o.a.s.u.p.LogUpdateProcessorFactory [collection1]  webapp=/solr path=/update params={wt=javabin&version=2}{add=[54]} 0 0
   [junit4]   2> 691279 INFO  (qtp663889119-5679) [    x:collection1] o.a.s.u.p.LogUpdateProcessorFactory [collection1]  webapp=/solr path=/update params={wt=javabin&version=2}{add=[55]} 0 0
   [junit4]   2> 691281 INFO  (qtp663889119-5679) [    x:collection1] o.a.s.u.p.LogUpdateProcessorFactory [collection1]  webapp=/solr path=/update params={wt=javabin&version=2}{add=[56]} 0 0
   [junit4]   2> 691283 INFO  (qtp663889119-5679) [    x:collection1] o.a.s.u.p.LogUpdateProcessorFactory [collection1]  webapp=/solr path=/update params={wt=javabin&version=2}{add=[57]} 0 0
   [junit4]   2> 691285 INFO  (qtp663889119-5679) [    x:collection1] o.a.s.u.p.LogUpdateProcessorFactory [collection1]  webapp=/solr path=/update params={wt=javabin&version=2}{add=[58]} 0 0
   [junit4]   2> 691289 INFO  (qtp663889119-5681) [    x:collection1] o.a.s.u.p.LogUpdateProcessorFactory [collection1]  webapp=/solr path=/update params={wt=javabin&version=2}{add=[59]} 0 0
   [junit4]   2> 691293 INFO  (qtp663889119-5681) [    x:collection1] o.a.s.u.p.LogUpdateProcessorFactory [collection1]  webapp=/solr path=/update params={wt=javabin&version=2}{add=[60]} 0 0
   [junit4]   2> 691297 INFO  (qtp663889119-5681) [    x:collection1] o.a.s.u.p.LogUpdateProcessorFactory [collection1]  webapp=/solr path=/update params={wt=javabin&version=2}{add=[61]} 0 0
   [junit4]   2> 691298 INFO  (qtp663889119-5681) [    x:collection1] o.a.s.u.p.LogUpdateProcessorFactory [collection1]  webapp=/solr path=/update params={wt=javabin&version=2}{add=[62]} 0 0
   [junit4]   2> 691302 INFO  (qtp663889119-5681) [    x:collection1] o.a.s.u.p.LogUpdateProcessorFactory [collection1]  webapp=/solr path=/update params={wt=javabin&version=2}{add=[63]} 0 0
   [junit4]   2> 691303 INFO  (qtp663889119-5681) [    x:collection1] o.a.s.u.p.LogUpdateProcessorFactory [collection1]  webapp=/solr path=/update params={wt=javabin&version=2}{add=[64]} 0 0
   [junit4]   2> 691305 INFO  (qtp663889119-5681) [    x:collection1] o.a.s.u.p.LogUpdateProcessorFactory [collection1]  webapp=/solr path=/update params={wt=javabin&version=2}{add=[65]} 0 0
   [junit4]   2> 691307 INFO  (qtp663889119-5681) [    x:collection1] o.a.s.u.p.LogUpdateProcessorFactory [collection1]  webapp=/solr path=/update params={wt=javabin&version=2}{add=[66]} 0 0
   [junit4]   2> 691309 INFO  (qtp663889119-5681) [    x:collection1] o.a.s.u.p.LogUpdateProcessorFactory [collection1]  webapp=/solr path=/update params={wt=javabin&version=2}{add=[67]} 0 0
   [junit4]   2> 691310 INFO  (qtp663889119-5681) [    x:collection1] o.a.s.u.p.LogUpdateProcessorFactory [collection1]  webapp=/solr path=/update params={wt=javabin&version=2}{add=[68]} 0 0
   [junit4]   2> 691313 INFO  (qtp663889119-5681) [    x:collection1] o.a.s.u.p.LogUpdateProcessorFactory [collection1]  webapp=/solr path=/update params={wt=javabin&version=2}{add=[69]} 0 0
   [junit4]   2> 691315 INFO  (qtp663889119-5681) [    x:collection1] o.a.s.u.p.LogUpdateProcessorFactory [collection1]  webapp=/solr path=/update params={wt=javabin&version=2}{add=[70]} 0 0
   [junit4]   2> 691317 INFO  (qtp663889119-5681) [    x:collection1] o.a.s.u.p.LogUpdateProcessorFactory [collection1]  webapp=/solr path=/update params={wt=javabin&version=2}{add=[71]} 0 0
   [junit4]   2> 691318 INFO  (qtp663889119-5681) [    x:collection1] o.a.s.u.p.LogUpdateProcessorFactory [collection1]  webapp=/solr path=/update params={wt=javabin&version=2}{add=[72]} 0 0
   [junit4]   2> 691320 INFO  (qtp663889119-5681) [    x:collection1] o.a.s.u.p.LogUpdateProcessorFactory [collection1]  webapp=/solr path=/update params={wt=javabin&version=2}{add=[73]} 0 0
   [junit4]   2> 691325 INFO  (qtp663889119-5681) [    x:collection1] o.a.s.u.p.LogUpdateProcessorFactory [collection1]  webapp=/solr path=/update params={wt=javabin&version=2}{add=[74]} 0 0
   [junit4]   2> 691327 INFO  (qtp663889119-5681) [    x:collection1] o.a.s.u.p.LogUpdateProcessorFactory [collection1]  webapp=/solr path=/update params={wt=javabin&version=2}{add=[75]} 0 0
   [junit4]   2> 691329 INFO  (qtp663889119-5681) [    x:collection1] o.a.s.u.p.LogUpdateProcessorFactory [collection1]  webapp=/solr path=/update params={wt=javabin&version=2}{add=[76]} 0 0
   [junit4]   2> 691332 INFO  (qtp663889119-5681) [    x:collection1] o.a.s.u.p.LogUpdateProcessorFactory [collection1]  webapp=/solr path=/update params={wt=javabin&version=2}{add=[77]} 0 0
   [junit4]   2> 691334 INFO  (qtp663889119-5681) [    x:collection1] o.a.s.u.p.LogUpdateProcessorFactory [collection1]  webapp=/solr path=/update params={wt=javabin&version=2}{add=[78]} 0 0
   [junit4]   2> 691336 INFO  (qtp663889119-5681) [    x:collection1] o.a.s.u.p.LogUpdateProcessorFactory [collection1]  webapp=/solr path=/update params={wt=javabin&version=2}{add=[79]} 0 0
   [junit4]   2> 691338 INFO  (qtp663889119-5681) [    x:collection1] o.a.s.u.p.LogUpdateProcessorFactory [collection1]  webapp=/solr path=/update params={wt=javabin&version=2}{add=[80]} 0 0
   [junit4]   2> 691339 INFO  (qtp663889119-5681) [    x:collection1] o.a.s.u.p.LogUpdateProcessorFactory [collection1]  webapp=/solr path=/update params={wt=javabin&version=2}{add=[81]} 0 0
   [junit4]   2> 691341 INFO  (qtp663889119-5681) [    x:collection1] o.a.s.u.p.LogUpdateProcessorFactory [collection1]  webapp=/solr path=/update params={wt=javabin&version=2}{add=[82]} 0 0
   [junit4]   2> 691343 INFO  (qtp663889119-5681) [    x:collection1] o.a.s.u.p.LogUpdateProcessorFactory [collection1]  webapp=/solr path=/update params={wt=javabin&version=2}{add=[83]} 0 0
   [junit4]   2> 691345 INFO  (qtp663889119-5681) [    x:collection1] o.a.s.u.p.LogUpdateProcessorFactory [collection1]  webapp=/solr path=/update params={wt=javabin&version=2}{add=[84]} 0 0
   [junit4]   2> 691347 INFO  (qtp663889119-5681) [    x:collection1] o.a.s.u.p.LogUpdateProcessorFactory [collection1]  webapp=/solr path=/update params={wt=javabin&version=2}{add=[85]} 0 0
   [junit4]   2> 691349 INFO  (qtp663889119-5681) [    x:collection1] o.a.s.u.p.LogUpdateProcessorFactory [collection1]  webapp=/solr path=/update params={wt=javabin&version=2}{add=[86]} 0 0
   [junit4]   2> 691350 INFO  (qtp663889119-5681) [    x:collection1] o.a.s.u.p.LogUpdateProcessorFactory [collection1]  webapp=/solr path=/update params={wt=javabin&version=2}{add=[87]} 0 0
   [junit4]   2> 691352 INFO  (qtp663889119-5681) [    x:collection1] o.a.s.u.p.LogUpdateProcessorFactory [collection1]  webapp=/solr path=/update params={wt=javabin&version=2}{add=[88]} 0 0
   [junit4]   2> 691353 INFO  (qtp663889119-5681) [    x:collection1] o.a.s.u.p.LogUpdateProcessorFactory [collection1]  webapp=/solr path=/update params={wt=javabin&version=2}{add=[89]} 0 0
   [junit4]   2> 691355 INFO  (qtp663889119-5681) [    x:collection1] o.a.s.u.p.LogUpdateProcessorFactory [collection1]  webapp=/solr path=/update params={wt=javabin&version=2}{add=[90]} 0 0
   [junit4]   2> 691357 INFO  (qtp663889119-5681) [    x:collection1] o.a.s.u.p.LogUpdateProcessorFactory [collection1]  webapp=/solr path=/update params={wt=javabin&version=2}{add=[91]} 0 0
   [junit4]   2> 691358 INFO  (qtp663889119-5681) [    x:collection1] o.a.s.u.p.LogUpdateProcessorFactory [collection1]  webapp=/solr path=/update params={wt=javabin&version=2}{add=[92]} 0 0
   [junit4]   2> 691360 INFO  (qtp663889119-5681) [    x:collection1] o.a.s.u.p.LogUpdateProcessorFactory [collection1]  webapp=/solr path=/update params={wt=javabin&version=2}{add=[93]} 0 0
   [junit4]   2> 691362 INFO  (qtp663889119-5681) [    x:collection1] o.a.s.u.p.LogUpdateProcessorFactory [collection1]  webapp=/solr path=/update params={wt=javabin&version=2}{add=[94]} 0 0
   [junit4]   2> 691363 INFO  (qtp663889119-5681) [    x:collection1] o.a.s.u.p.LogUpdateProcessorFactory [collection1]  webapp=/solr path=/update params={wt=javabin&version=2}{add=[95]} 0 0
   [junit4]   2> 691365 INFO  (qtp663889119-5681) [    x:collection1] o.a.s.u.p.LogUpdateProcessorFactory [collection1]  webapp=/solr path=/update params={wt=javabin&version=2}{add=[96]} 0 0
   [junit4]   2> 691366 INFO  (qtp663889119-5681) [    x:collection1] o.a.s.u.p.LogUpdateProcessorFactory [collection1]  webapp=/solr path=/update params={wt=javabin&version=2}{add=[97]} 0 0
   [junit4]   2> 691368 INFO  (qtp663889119-5681) [    x:collection1] o.a.s.u.p.LogUpdateProcessorFactory [collection1]  webapp=/solr path=/update params={wt=javabin&version=2}{add=[98]} 0 0
   [junit4]   2> 691371 INFO  (qtp663889119-5681) [    x:collection1] o.a.s.u.p.LogUpdateProcessorFactory [collection1]  webapp=/solr path=/update params={wt=javabin&version=2}{add=[99]} 0 0
   [junit4]   2> 691373 INFO  (qtp663889119-5681) [    x:collection1] o.a.s.u.p.LogUpdateProcessorFactory [collection1]  webapp=/solr path=/update params={wt=javabin&version=2}{add=[100]} 0 0
   [junit4]   2> 691375 INFO  (qtp663889119-5681) [    x:collection1] o.a.s.u.p.LogUpdateProcessorFactory [collection1]  webapp=/solr path=/update params={wt=javabin&version=2}{add=[101]} 0 0
   [junit4]   2> 691376 INFO  (qtp663889119-5681) [    x:collection1] o.a.s.u.p.LogUpdateProcessorFactory [collection1]  webapp=/solr path=/update params={wt=javabin&version=2}{add=[102]} 0 0
   [junit4]   2> 691378 INFO  (qtp663889119-5681) [    x:collection1] o.a.s.u.p.LogUpdateProcessorFactory [collection1]  webapp=/solr path=/update params={wt=javabin&version=2}{add=[103]} 0 0
   [junit4]   2> 691379 INFO  (qtp663889119-5681) [    x:collection1] o.a.s.u.p.LogUpdateProcessorFactory [collection1]  webapp=/solr path=/update params={wt=javabin&version=2}{add=[104]} 0 0
   [junit4]   2> 691381 INFO  (qtp663889119-5681) [    x:collection1] o.a.s.u.p.LogUpdateProcessorFactory [collection1]  webapp=/solr path=/update params={wt=javabin&version=2}{add=[105]} 0 0
   [junit4]   2> 691383 INFO  (qtp663889119-5681) [    x:collection1] o.a.s.u.p.LogUpdateProcessorFactory [collection1]  webapp=/solr path=/update params={wt=javabin&version=2}{add=[106]} 0 0
   [junit4]   2> 691384 INFO  (qtp663889119-5681) [    x:collection1] o.a.s.u.p.LogUpdateProcessorFactory [collection1]  webapp=/solr path=/update params={wt=javabin&version=2}{add=[107]} 0 0
   [junit4]   2> 691386 INFO  (qtp663889119-5681) [    x:collection1] o.a.s.u.p.LogUpdateProcessorFactory [collection1]  webapp=/solr path=/update params={wt=javabin&version=2}{add=[108]} 0 0
   [junit4]   2> 691388 INFO  (qtp663889119-5681) [    x:collection1] o.a.s.u.p.LogUpdateProcessorFactory [collection1]  webapp=/solr path=/update params={wt=javabin&version=2}{add=[109]} 0 0
   [junit4]   2> 691389 INFO  (qtp663889119-5681) [    x:collection1] o.a.s.u.p.LogUpdateProcessorFactory [collection1]  webapp=/solr path=/update params={wt=javabin&version=2}{add=[110]} 0 0
   [junit4]   2> 691391 INFO  (qtp663889119-5681) [    x:collection1] o.a.s.u.p.LogUpdateProcessorFactory [collection1]  webapp=/solr path=/update params={wt=javabin&version=2}{add=[111]} 0 0
   [junit4]   2> 691392 INFO  (qtp663889119-5681) [    x:collection1] o.a.s.u.p.LogUpdateProcessorFactory [collection1]  webapp=/solr path=/update params={wt=javabin&version=2}{add=[112]} 0 0
   [junit4]   2> 691394 INFO  (qtp663889119-5681) [    x:collection1] o.a.s.u.p.LogUpdateProcessorFactory [collection1]  webapp=/solr path=/update params={wt=javabin&version=2}{add=[113]} 0 0
   [junit4]   2> 691396 INFO  (qtp663889119-5681) [    x:collection1] o.a.s.u.p.LogUpdateProcessorFactory [collection1]  webapp=/solr path=/update params={wt=javabin&version=2}{add=[114]} 0 0
   [junit4]   2> 691397 INFO  (qtp663889119-5681) [    x:collection1] o.a.s.u.p.LogUpdateProcessorFactory [collection1]  webapp=/solr path=/update params={wt=javabin&version=2}{add=[115]} 0 0
   [junit4]   2> 691399 INFO  (qtp663889119-5681) [    x:collection1] o.a.s.u.p.LogUpdateProcessorFactory [collection1]  webapp=/solr path=/update params={wt=javabin&version=2}{add=[116]} 0 0
   [junit4]   2> 691400 INFO  (qtp663889119-5681) [    x:collection1] o.a.s.u.p.LogUpdateProcessorFactory [collection1]  webapp=/solr path=/update params={wt=javabin&version=2}{add=[117]} 0 0
   [junit4]   2> 691402 INFO  (qtp663889119-5681) [    x:collection1] o.a.s.u.p.LogUpdateProcessorFactory [collection1]  webapp=/solr path=/update params={wt=javabin&version=2}{add=[118]} 0 0
   [junit4]   2> 691404 INFO  (qtp663889119-5681) [    x:collection1] o.a.s.u.p.LogUpdateProcessorFactory [collection1]  webapp=/solr path=/update params={wt=javabin&version=2}{add=[119]} 0 0
   [junit4]   2> 691405 INFO  (qtp663889119-5681) [    x:collection1] o.a.s.u.p.LogUpdateProcessorFactory [collection1]  webapp=/solr path=/update params={wt=javabin&version=2}{add=[120]} 0 0
   [junit4]   2> 691407 INFO  (qtp663889119-5681) [    x:collection1] o.a.s.u.p.LogUpdateProcessorFactory [collection1]  webapp=/solr path=/update params={wt=javabin&version=2}{add=[121]} 0 0
   [junit4]   2> 691408 INFO  (qtp663889119-5681) [    x:collection1] o.a.s.u.p.LogUpdateProcessorFactory [collection1]  webapp=/solr path=/update params={wt=javabin&version=2}{add=[122]} 0 0
   [junit4]   2> 691410 INFO  (qtp663889119-5681) [    x:collection1] o.a.s.u.p.LogUpdateProcessorFactory [collection1]  webapp=/solr path=/update params={wt=javabin&version=2}{add=[123]} 0 0
   [junit4]   2> 691412 INFO  (qtp663889119-5681) [    x:collection1] o.a.s.u.p.LogUpdateProcessorFactory [collection1]  webapp=/solr path=/update params={wt=javabin&version=2}{add=[124]} 0 0
   [junit4]   2> 691413 INFO  (qtp663889119-5681) [    x:collection1] o.a.s.u.p.LogUpdateProcessorFactory [collection1]  webapp=/solr path=/update params={wt=javabin&version=2}{add=[125]} 0 0
   [junit4]   2> 691415 INFO  (qtp663889119-5681) [    x:collection1] o.a.s.u.p.LogUpdateProcessorFactory [collection1]  webapp=/solr path=/update params={wt=javabin&version=2}{add=[126]} 0 0
   [junit4]   2> 691417 INFO  (qtp663889119-5681) [    x:collection1] o.a.s.u.p.LogUpdateProcessorFactory [collection1]  webapp=/solr path=/update params={wt=javabin&version=2}{add=[127]} 0 0
   [junit4]   2> 691418 INFO  (qtp663889119-5681) [    x:collection1] o.a.s.u.p.LogUpdateProcessorFactory [collection1]  webapp=/solr path=/update params={wt=javabin&version=2}{add=[128]} 0 0
   [junit4]   2> 691420 INFO  (qtp663889119-5681) [    x:collection1] o.a.s.u.p.LogUpdateProcessorFactory [collection1]  webapp=/solr path=/update params={wt=javabin&version=2}{add=[129]} 0 0
   [junit4]   2> 691421 INFO  (qtp663889119-5681) [    x:collection1] o.a.s.u.p.LogUpdateProcessorFactory [collection1]  webapp=/solr path=/update params={wt=javabin&version=2}{add=[130]} 0 0
   [junit4]   2> 691423 INFO  (qtp663889119-5682) [    x:collection1] o.a.s.u.p.LogUpdateProcessorFactory [collection1]  webapp=/solr path=/update params={wt=javabin&version=2}{add=[131]} 0 0
   [junit4]   2> 691426 INFO  (qtp663889119-5675) [    x:collection1] o.a.s.u.p.LogUpdateProcessorFactory [collection1]  webapp=/solr path=/update params={wt=javabin&version=2}{add=[132]} 0 0
   [junit4]   2> 691427 INFO  (qtp663889119-5675) [    x:collection1] o.a.s.u.p.LogUpdateProcessorFactory [collection1]  webapp=/solr path=/update params={wt=javabin&version=2}{add=[133]} 0 0
   [junit4]   2> 691438 INFO  (qtp663889119-5675) [    x:collection1] o.a.s.u.p.LogUpdateProcessorFactory [collection1]  webapp=/solr path=/update params={wt=javabin&version=2}{add=[134]} 0 0
   [junit4]   2> 691439 INFO  (qtp663889119-5675) [    x:collection1] o.a.s.u.p.LogUpdateProcessorFactory [collection1]  webapp=/solr path=/update params={wt=javabin&version=2}{add=[135]} 0 0
   [junit4]   2> 691441 INFO  (qtp663889119-5675) [    x:collection1] o.a.s.u.p.LogUpdateProcessorFactory [collection1]  webapp=/solr path=/update params={wt=javabin&version=2}{add=[136]} 0 0
   [junit4]   2> 691443 INFO  (qtp663889119-5682) [    x:collection1] o.a.s.u.p.LogUpdateProcessorFactory [collection1]  webapp=/solr path=/update params={wt=javabin&version=2}{add=[137]} 0 0
   [junit4]   2> 691445 INFO  (qtp663889119-5676) [    x:collection1] o.a.s.u.p.LogUpdateProcessorFactory [collection1]  webapp=/solr path=/update params={wt=javabin&version=2}{add=[138]} 0 0
   [junit4]   2> 691447 INFO  (qtp663889119-5679) [    x:collection1] o.a.s.u.p.LogUpdateProcessorFactory [collection1]  webapp=/solr path=/update params={wt=javabin&version=2}{add=[139]} 0 0
   [junit4]   2> 691480 INFO  (qtp663889119-5679) [    x:collection1] o.a.s.u.p.LogUpdateProcessorFactory [collection1]  webapp=/solr path=/update params={wt=javabin&version=2}{add=[140]} 0 0
   [junit4]   2> 691486 INFO  (qtp663889119-5679) [    x:collection1] o.a.s.u.p.LogUpdateProcessorFactory [collection1]  webapp=/solr path=/update params={wt=javabin&version=2}{add=[141]} 0 0
   [junit4]   2> 691499 INFO  (qtp663889119-5675) [    x:collection1] o.a.s.u.p.LogUpdateProcessorFactory [collection1]  webapp=/solr path=/update params={wt=javabin&version=2}{add=[142]} 0 0
   [junit4]   2> 691501 INFO  (qtp663889119-5675) [    x:collection1] o.a.s.u.p.LogUpdateProcessorFactory [collection1]  webapp=/solr path=/update params={wt=javabin&version=2}{add=[143]} 0 0
   [junit4]   2> 691503 INFO  (qtp663889119-5676) [    x:collection1] o.a.s.u.p.LogUpdateProcessorFactory [collection1]  webapp=/solr path=/update params={wt=javabin&version=2}{add=[144]} 0 0
   [junit4]   2> 691505 INFO  (qtp663889119-5680) [    x:collection1] o.a.s.u.p.LogUpdateProcessorFactory [collection1]  webapp=/solr path=/update params={wt=javabin&version=2}{add=[145]} 0 0
   [junit4]   2> 691517 INFO  (qtp663889119-5680) [    x:collection1] o.a.s.u.p.LogUpdateProcessorFactory [collection1]  webapp=/solr path=/update params={wt=javabin&version=2}{add=[146]} 0 0
   [junit4]   2> 691518 INFO  (qtp663889119-5679) [    x:collection1] o.a.s.u.p.LogUpdateProcessorFactory [collection1]  webapp=/solr path=/update params={wt=javabin&version=2}{add=[147]} 0 0
   [junit4]   2> 691533 INFO  (qtp663889119-5679) [    x:collection1] o.a.s.u.p.LogUpdateProcessorFactory [collection1]  webapp=/solr path=/update params={wt=javabin&version=2}{add=[148]} 0 0
   [junit4]   2> 691544 INFO  (qtp663889119-5675) [    x:collection1] o.a.s.u.p.LogUpdateProcessorFactory [collection1]  webapp=/solr path=/update params={wt=javabin&version=2}{add=[149]} 0 0
   [junit4]   2> 691551 INFO  (qtp663889119-5676) [    x:collection1] o.a.s.u.p.LogUpdateProcessorFactory [collection1]  webapp=/solr path=/update params={wt=javabin&version=2}{add=[150]} 0 0
   [junit4]   2> 691555 INFO  (qtp663889119-5681) [    x:collection1] o.a.s.u.p.LogUpdateProcessorFactory [collection1]  webapp=/solr path=/update params={wt=javabin&version=2}{add=[151]} 0 0
   [junit4]   2> 691571 INFO  (qtp663889119-5680) [    x:collection1] o.a.s.u.p.LogUpdateProcessorFactory [collection1]  webapp=/solr path=/update params={wt=javabin&version=2}{add=[152]} 0 0
   [junit4]   2> 691579 INFO  (qtp663889119-5682) [    x:collection1] o.a.s.u.p.LogUpdateProcessorFactory [collection1]  webapp=/solr path=/update params={wt=javabin&version=2}{add=[153]} 0 0
   [junit4]   2> 691583 INFO  (qtp663889119-5679) [    x:collection1] o.a.s.u.p.LogUpdateProcessorFactory [collection1]  webapp=/solr path=/update params={wt=javabin&version=2}{add=[154]} 0 0
   [junit4]   2> 691592 INFO  (qtp663889119-5679) [    x:collection1] o.a.s.u.p.LogUpdateProcessorFactory [collection1]  webapp=/solr path=/update params={wt=javabin&version=2}{add=[155]} 0 0
   [junit4]   2> 691596 INFO  (qtp663889119-5679) [    x:collection1] o.a.s.u.p.LogUpdateProcessorFactory [collection1]  webapp=/solr path=/update params={wt=javabin&version=2}{add=[156]} 0 0
   [junit4]   2> 691598 INFO  (qtp663889119-5679) [    x:collection1] o.a.s.u.p.LogUpdateProcessorFactory [collection1]  webapp=/solr path=/update params={wt=javabin&version=2}{add=[157]} 0 0
   [junit4]   2> 691611 INFO  (qtp663889119-5680) [    x:collection1] o.a.s.u.p.LogUpdateProcessorFactory [collection1]  webapp=/solr path=/update params={wt=javabin&version=2}{add=[158]} 0 0
   [junit4]   2> 691612 INFO  (qtp663889119-5680) [    x:collection1] o.a.s.u.p.LogUpdateProcessorFactory [collection1]  webapp=/solr path=/update params={wt=javabin&version=2}{add=[159]} 0 0
   [junit4]   2> 691756 INFO  (qtp663889119-5675) [    x:collection1] o.a.s.u.p.LogUpdateProcessorFactory [collection1]  webapp=/solr path=/update params={wt=javabin&version=2}{add=[160]} 0 0
   [junit4]   2> 691806 INFO  (qtp663889119-5675) [    x:collection1] o.a.s.u.p.LogUpdateProcessorFactory [collection1]  webapp=/solr path=/update params={wt=javabin&version=2}{add=[161]} 0 0
   [junit4]   2> 691808 INFO  (qtp663889119-5675) [    x:collection1] o.a.s.u.p.LogUpdateProcessorFactory [collection1]  webapp=/solr path=/update params={wt=javabin&version=2}{add=[162]} 0 0
   [junit4]   2> 691810 INFO  (qtp663889119-5675) [    x:collection1] o.a.s.u.p.LogUpdateProcessorFactory [collection1]  webapp=/solr path=/update params={wt=javabin&version=2}{add=[163]} 0 0
   [junit4]   2> 691813 INFO  (qtp663889119-5682) [    x:collection1] o.a.s.u.p.LogUpdateProcessorFactory [collection1]  webapp=/solr path=/update params={wt=javabin&version=2}{add=[164]} 0 0
   [junit4]   2> 691816 INFO  (qtp663889119-5682) [    x:collection1] o.a.s.u.p.LogUpdateProcessorFactory [collection1]  webapp=/solr path=/update params={wt=javabin&version=2}{add=[165]} 0 0
   [junit4]   2> 691817 INFO  (qtp663889119-5682) [    x:collection1] o.a.s.u.p.LogUpdateProcessorFactory [collection1]  webapp=/solr path=/update params={wt=javabin&version=2}{add=[166]} 0 0
   [junit4]   2> 691819 INFO  (qtp663889119-5682) [    x:collection1] o.a.s.u.p.LogUpdateProcessorFactory [collection1]  webapp=/solr path=/update params={wt=javabin&version=2}{add=[167]} 0 0
   [junit4]   2> 691821 INFO  (qtp663889119-5682) [    x:collection1] o.a.s.u.p.LogUpdateProcessorFactory [collection1]  webapp=/solr path=/update params={wt=javabin&version=2}{add=[168]} 0 0
   [junit4]   2> 691823 INFO  (qtp663889119-5682) [    x:collection1] o.a.s.u.p.LogUpdateProcessorFactory [collection1]  webapp=/solr path=/update params={wt=javabin&version=2}{add=[169]} 0 0
   [junit4]   2> 691824 INFO  (qtp663889119-5682) [    x:collection1] o.a.s.u.p.LogUpdateProcessorFactory [collection1]  webapp=/solr path=/update params={wt=javabin&version=2}{add=[170]} 0 0
   [junit4]   2> 691826 INFO  (qtp663889119-5682) [    x:collection1] o.a.s.u.p.LogUpdateProcessorFactory [collection1]  webapp=/solr path=/update params={wt=javabin&version=2}{add=[171]} 0 0
   [junit4]   2> 691828 INFO  (qtp663889119-5682) [    x:collection1] o.a.s.u.p.LogUpdateProcessorFactory [collection1]  webapp=/solr path=/update params={wt=javabin&version=2}{add=[172]} 0 0
   [junit4]   2> 691830 INFO  (qtp663889119-5679) [    x:collection1] o.a.s.u.p.LogUpdateProcessorFactory [collection1]  webapp=/solr path=/update params={wt=javabin&version=2}{add=[173]} 0 0
   [junit4]   2> 691832 INFO  (qtp663889119-5679) [    x:collection1] o.a.s.u.p.LogUpdateProcessorFactory [collection1]  webapp=/solr path=/update params={wt=javabin&version=2}{add=[174]} 0 0
   [junit4]   2> 691834 INFO  (qtp663889119-5680) [    x:collection1] o.a.s.u.p.LogUpdateProcessorFactory [collection1]  webapp=/solr path=/update params={wt=javabin&version=2}{add=[175]} 0 0
   [junit4]   2> 691836 INFO  (qtp663889119-5680) [    x:collection1] o.a.s.u.p.LogUpdateProcessorFactory [collection1]  webapp=/solr path=/update params={wt=javabin&version=2}{add=[176]} 0 0
   [junit4]   2> 691838 INFO  (qtp663889119-5680) [    x:collection1] o.a.s.u.p.LogUpdateProcessorFactory [collection1]  webapp=/solr path=/update params={wt=javabin&version=2}{add=[177]} 0 0
   [junit4]   2> 691839 INFO  (qtp663889119-5680) [    x:collection1] o.a.s.u.p.LogUpdateProcessorFactory [collection1]  webapp=/solr path=/update params={wt=javabin&version=2}{add=[178]} 0 0
   [junit4]   2> 691842 INFO  (qtp663889119-5675) [    x:collection1] o.a.s.u.p.LogUpdateProcessorFactory [collection1]  webapp=/solr path=/update params={wt=javabin&version=2}{add=[179]} 0 0
   [junit4]   2> 691846 INFO  (qtp663889119-5675) [    x:collection1] o.a.s.u.p.LogUpdateProcessorFactory [collection1]  webapp=/solr path=/update params={wt=javabin&version=2}{add=[180]} 0 0
   [junit4]   2> 691849 INFO  (qtp663889119-5676) [    x:collection1] o.a.s.u.p.LogUpdateProcessorFactory [collection1]  webapp=/solr path=/update params={wt=javabin&version=2}{add=[181]} 0 0
   [junit4]   2> 691853 INFO  (qtp663889119-5676) [    x:collection1] o.a.s.u.p.LogUpdateProcessorFactory [collection1]  webapp=/solr path=/update params={wt=javabin&version=2}{add=[182]} 0 0
   [junit4]   2> 691861 INFO  (qtp663889119-5676) [    x:collection1] o.a.s.u.p.LogUpdateProcessorFactory [collection1]  webapp=/solr path=/update params={wt=javabin&version=2}{add=[183]} 0 0
   [junit4]   2> 691863 INFO  (qtp663889119-5676) [    x:collection1] o.a.s.u.p.LogUpdateProcessorFactory [collection1]  webapp=/solr path=/update params={wt=javabin&version=2}{add=[184]} 0 0
   [junit4]   2> 691865 INFO  (qtp663889119-5679) [    x:collection1] o.a.s.u.p.LogUpdateProcessorFactory [collection1]  webapp=/solr path=/update params={wt=javabin&version=2}{add=[185]} 0 0
   [junit4]   2> 691867 INFO  (qtp663889119-5679) [    x:collection1] o.a.s.u.p.LogUpdateProcessorFactory [collection1]  webapp=/solr path=/update params={wt=javabin&version=2}{add=[186]} 0 0
   [junit4]   2> 691870 INFO  (qtp663889119-5679) [    x:collection1] o.a.s.u.p.LogUpdateProcessorFactory [collection1]  webapp=/solr path=/update params={wt=javabin&version=2}{add=[187]} 0 0
   [junit4]   2> 691872 INFO  (qtp663889119-5679) [    x:collection1] o.a.s.u.p.LogUpdateProcessorFactory [collection1]  webapp=/solr path=/update params={wt=javabin&version=2}{add=[188]} 0 0
   [junit4]   2> 691876 INFO  (qtp663889119-5679) [    x:collection1] o.a.s.u.p.LogUpdateProcessorFactory [collection1]  webapp=/solr path=/update params={wt=javabin&version=2}{add=[189]} 0 0
   [junit4]   2> 691882 INFO  (qtp663889119-5676) [    x:collection1] o.a.s.u.p.LogUpdateProcessorFactory [collection1]  webapp=/solr path=/update params={wt=javabin&version=2}{add=[190]} 0 0
   [junit4]   2> 691884 INFO  (qtp663889119-5675) [    x:collection1] o.a.s.u.p.LogUpdateProcessorFactory [collection1]  webapp=/solr path=/update params={wt=javabin&version=2}{add=[191]} 0 0
   [junit4]   2> 691886 INFO  (qtp663889119-5675) [    x:collection1] o.a.s.u.p.LogUpdateProcessorFactory [collection1]  webapp=/solr path=/update params={wt=javabin&version=2}{add=[192]} 0 0
   [junit4]   2> 691888 INFO  (qtp663889119-5675) [    x:collection1] o.a.s.u.p.LogUpdateProcessorFactory [collection1]  webapp=/solr path=/update params={wt=javabin&version=2}{add=[193]} 0 0
   [junit4]   2> 691890 INFO  (qtp663889119-5675) [    x:collection1] o.a.s.u.p.LogUpdateProcessorFactory [collection1]  webapp=/solr path=/update params={wt=javabin&version=2}{add=[194]} 0 0
   [junit4]   2> 691892 INFO  (qtp663889119-5675) [    x:collection1] o.a.s.u.p.LogUpdateProcessorFactory [collection1]  webapp=/solr path=/update params={wt=javabin&version=2}{add=[195]} 0 0
   [junit4]   2> 691894 INFO  (qtp663889119-5675) [    x:collection1] o.a.s.u.p.LogUpdateProcessorFactory [collection1]  webapp=/solr path=/update params={wt=javabin&version=2}{add=[196]} 0 0
   [junit4]   2> 691896 INFO  (qtp663889119-5675) [    x:collection1] o.a.s.u.p.LogUpdateProcessorFactory [collection1]  webapp=/solr path=/update params={wt=javabin&version=2}{add=[197]} 0 0
   [junit4]   2> 691898 INFO  (qtp663889119-5675) [    x:collection1] o.a.s.u.p.LogUpdateProcessorFactory [collection1]  webapp=/solr path=/update params={wt=javabin&version=2}{add=[198]} 0 0
   [junit4]   2> 691900 INFO  (qtp663889119-5675) [    x:collection1] o.a.s.u.p.LogUpdateProcessorFactory [collection1]  webapp=/solr path=/update params={wt=javabin&version=2}{add=[199]} 0 0
   [junit4]   2> 691901 INFO  (qtp663889119-5675) [    x:collection1] o.a.s.u.p.LogUpdateProcessorFactory [collection1]  webapp=/solr path=/update params={wt=javabin&version=2}{add=[200]} 0 0
   [junit4]   2> 691903 INFO  (qtp663889119-5676) [    x:collection1] o.a.s.u.p.LogUpdateProcessorFactory [collection1]  webapp=/solr path=/update params={wt=javabin&version=2}{add=[201]} 0 0
   [junit4]   2> 691905 INFO  (qtp663889119-5681) [    x:collection1] o.a.s.u.p.LogUpdateProcessorFactory [collection1]  webapp=/solr path=/update params={wt=javabin&version=2}{add=[202]} 0 0
   [junit4]   2> 691906 INFO  (qtp663889119-5681) [    x:collection1] o.a.s.u.p.LogUpdateProcessorFactory [collection1]  webapp=/solr path=/update params={wt=javabin&version=2}{add=[203]} 0 0
   [junit4]   2> 691908 INFO  (qtp663889119-5681) [    x:collection1] o.a.s.u.p.LogUpdateProcessorFactory [collection1]  webapp=/solr path=/update params={wt=javabin&version=2}{add=[204]} 0 0
   [junit4]   2> 691909 INFO  (qtp663889119-5681) [    x:collection1] o.a.s.u.p.LogUpdateProcessorFactory [collection1]  webapp=/solr path=/update params={wt=javabin&version=2}{add=[205]} 0 0
   [junit4]   2> 691911 INFO  (qtp663889119-5681) [    x:collection1] o.a.s.u.p.LogUpdateProcessorFactory [collection1]  webapp=/solr path=/update params={wt=javabin&version=2}{add=[206]} 0 0
   [junit4]   2> 691913 INFO  (qtp663889119-5676) [    x:collection1] o.a.s.u.p.LogUpdateProcessorFactory [collection1]  webapp=/solr path=/update params={wt=javabin&version=2}{add=[207]} 0 0
   [junit4]   2> 691914 INFO  (qtp663889119-5682) [    x:collection1] o.a.s.u.p.LogUpdateProcessorFactory [collection1]  webapp=/solr path=/update params={wt=javabin&version=2}{add=[208]} 0 0
   [junit4]   2> 691916 INFO  (qtp663889119-5682) [    x:collection1] o.a.s.u.p.LogUpdateProcessorFactory [collection1]  webapp=/solr path=/update params={wt=javabin&version=2}{add=[209]} 0 0
   [junit4]   2> 691918 INFO  (qtp663889119-5682) [    x:collection1] o.a.s.u.p.LogUpdateProcessorFactory [collection1]  webapp=/solr path=/update params={wt=javabin&version=2}{add=[210]} 0 0
   [junit4]   2> 691920 INFO  (qtp663889119-5682) [    x:collection1] o.a.s.u.p.LogUpdateProcessorFactory [collection1]  webapp=/solr path=/update params={wt=javabin&version=2}{add=[211]} 0 0
   [junit4]   2> 691921 INFO  (qtp663889119-5682) [    x:collection1] o.a.s.u.p.LogUpdateProcessorFactory [collection1]  webapp=/solr path=/update params={wt=javabin&version=2}{add=[212]} 0 0
   [junit4]   2> 691923 INFO  (qtp663889119-5682) [    x:collection1] o.a.s.u.p.LogUpdateProcessorFactory [collection1]  webapp=/solr path=/update params={wt=javabin&version=2}{add=[213]} 0 0
   [junit4]   2> 691925 INFO  (qtp663889119-5682) [    x:collection1] o.a.s.u.p.LogUpdateProcessorFactory [collection1]  webapp=/solr path=/update params={wt=javabin&version=2}{add=[214]} 0 0
   [junit4]   2> 691926 INFO  (qtp663889119-5682) [    x:collection1] o.a.s.u.p.LogUpdateProcessorFactory [collection1]  webapp=/solr path=/update params={wt=javabin&version=2}{add=[215]} 0 0
   [junit4]   2> 691928 INFO  (qtp663889119-5682) [    x:collection1] o.a.s.u.p.LogUpdateProcessorFactory [collection1]  webapp=/solr path=/update params={wt=javabin&version=2}{add=[216]} 0 0
   [junit4]   2> 691930 INFO  (qtp663889119-5682) [    x:collection1] o.a.s.u.p.LogUpdateProcessorFactory [collection1]  webapp=/solr path=/update params={wt=javabin&version=2}{add=[217]} 0 0
   [junit4]   2> 691931 INFO  (qtp663889119-5682) [    x:collection1] o.a.s.u.p.LogUpdateProcessorFactory [collection1]  webapp=/solr path=/update params={wt=javabin&version=2}{add=[218]} 0 0
   [junit4]   2> 691933 INFO  (qtp663889119-5682) [    x:collection1] o.a.s.u.p.LogUpdateProcessorFactory [collection1]  webapp=/solr path=/update params={wt=javabin&version=2}{add=[219]} 0 0
   [junit4]   2> 691935 INFO  (qtp663889119-5682) [    x:collection1] o.a.s.u.p.LogUpdateProcessorFactory [collection1]  webapp=/solr path=/update params={wt=javabin&version=2}{add=[220]} 0 0
   [junit4]   2> 691937 INFO  (qtp663889119-5682) [    x:collection1] o.a.s.u.p.LogUpdateProcessorFactory [collection1]  webapp=/solr path=/update params={wt=javabin&version=2}{add=[221]} 0 0
   [junit4]   2> 691939 INFO  (qtp663889119-5682) [    x:collection1] o.a.s.u.p.LogUpdateProcessorFactory [collection1]  webapp=/solr path=/update params={wt=javabin&version=2}{add=[222]} 0 0
   [junit4]   2> 691940 INFO  (qtp663889119-5682) [    x:collection1] o.a.s.u.p.LogUpdateProcessorFactory [collection1]  webapp=/solr path=/update params={wt=javabin&version=2}{add=[223]} 0 0
   [junit4]   2> 691942 INFO  (qtp663889119-5682) [    x:collection1] o.a.s.u.p.LogUpdateProcessorFactory [collection1]  webapp=/solr path=/update params={wt=javabin&version=2}{add=[224]} 0 0
   [junit4]   2> 691943 INFO  (qtp663889119-5682) [    x:collection1] o.a.s.u.p.LogUpdateProcessorFactory [collection1]  webapp=/solr path=/update params={wt=javabin&version=2}{add=[225]} 0 0
   [junit4]   2> 691945 INFO  (qtp663889119-5682) [    x:collection1] o.a.s.u.p.LogUpdateProcessorFactory [collection1]  webapp=/solr path=/update params={wt=javabin&version=2}{add=[226]} 0 0
   [junit4]   2> 691947 INFO  (qtp663889119-5682) [    x:collection1] o.a.s.u.p.LogUpdateProcessorFactory [collection1]  webapp=/solr path=/update params={wt=javabin&version=2}{add=[227]} 0 0
   [junit4]   2> 691948 INFO  (qtp663889119-5682) [    x:collection1] o.a.s.u.p.LogUpdateProcessorFactory [collection1]  webapp=/solr path=/update params={wt=javabin&version=2}{add=[228]} 0 0
   [junit4]   2> 691950 INFO  (qtp663889119-5682) [    x:collection1] o.a.s.u.p.LogUpdateProcessorFactory [collection1]  webapp=/solr path=/update params={wt=javabin&version=2}{add=[229]} 0 0
   [junit4]   2> 691951 INFO  (qtp663889119-5682) [    x:collection1] o.a.s.u.p.LogUpdateProcessorFactory [collection1]  webapp=/solr path=/update params={wt=javabin&version=2}{add=[230]} 0 0
   [junit4]   2> 691953 INFO 

[...truncated too long message...]

lder.java:79)
   [junit4]   2> 	at org.apache.hadoop.metrics2.impl.MetricsSourceAdapter.getMetrics(MetricsSourceAdapter.java:194)
   [junit4]   2> 	at org.apache.hadoop.metrics2.impl.MetricsSourceAdapter.updateJmxCache(MetricsSourceAdapter.java:172)
   [junit4]   2> 	at org.apache.hadoop.metrics2.impl.MetricsSourceAdapter.getMBeanInfo(MetricsSourceAdapter.java:151)
   [junit4]   2> 	at com.sun.jmx.interceptor.DefaultMBeanServerInterceptor.getClassName(DefaultMBeanServerInterceptor.java:1804)
   [junit4]   2> 	at com.sun.jmx.interceptor.DefaultMBeanServerInterceptor.safeGetClassName(DefaultMBeanServerInterceptor.java:1595)
   [junit4]   2> 	at com.sun.jmx.interceptor.DefaultMBeanServerInterceptor.checkMBeanPermission(DefaultMBeanServerInterceptor.java:1813)
   [junit4]   2> 	at com.sun.jmx.interceptor.DefaultMBeanServerInterceptor.exclusiveUnregisterMBean(DefaultMBeanServerInterceptor.java:430)
   [junit4]   2> 	at com.sun.jmx.interceptor.DefaultMBeanServerInterceptor.unregisterMBean(DefaultMBeanServerInterceptor.java:415)
   [junit4]   2> 	at com.sun.jmx.mbeanserver.JmxMBeanServer.unregisterMBean(JmxMBeanServer.java:546)
   [junit4]   2> 	at org.apache.hadoop.metrics2.util.MBeans.unregister(MBeans.java:81)
   [junit4]   2> 	at org.apache.hadoop.metrics2.impl.MetricsSourceAdapter.stopMBeans(MetricsSourceAdapter.java:226)
   [junit4]   2> 	at org.apache.hadoop.metrics2.impl.MetricsSourceAdapter.stop(MetricsSourceAdapter.java:211)
   [junit4]   2> 	at org.apache.hadoop.metrics2.impl.MetricsSystemImpl.stopSources(MetricsSystemImpl.java:463)
   [junit4]   2> 	at org.apache.hadoop.metrics2.impl.MetricsSystemImpl.stop(MetricsSystemImpl.java:213)
   [junit4]   2> 	at org.apache.hadoop.metrics2.impl.MetricsSystemImpl.shutdown(MetricsSystemImpl.java:594)
   [junit4]   2> 	at org.apache.hadoop.metrics2.lib.DefaultMetricsSystem.shutdownInstance(DefaultMetricsSystem.java:72)
   [junit4]   2> 	at org.apache.hadoop.metrics2.lib.DefaultMetricsSystem.shutdown(DefaultMetricsSystem.java:68)
   [junit4]   2> 	at org.apache.hadoop.hdfs.server.namenode.metrics.NameNodeMetrics.shutdown(NameNodeMetrics.java:171)
   [junit4]   2> 	at org.apache.hadoop.hdfs.server.namenode.NameNode.stop(NameNode.java:872)
   [junit4]   2> 	at org.apache.hadoop.hdfs.MiniDFSCluster.shutdown(MiniDFSCluster.java:1726)
   [junit4]   2> 	at org.apache.hadoop.hdfs.MiniDFSCluster.shutdown(MiniDFSCluster.java:1705)
   [junit4]   2> 	at org.apache.solr.cloud.hdfs.HdfsTestUtil.teardownClass(HdfsTestUtil.java:198)
   [junit4]   2> 	at org.apache.solr.cloud.hdfs.HdfsCollectionsAPIDistributedZkTest.teardownClass(HdfsCollectionsAPIDistributedZkTest.java:52)
   [junit4]   2> 	at sun.reflect.NativeMethodAccessorImpl.invoke0(Native Method)
   [junit4]   2> 	at sun.reflect.NativeMethodAccessorImpl.invoke(NativeMethodAccessorImpl.java:62)
   [junit4]   2> 	at sun.reflect.DelegatingMethodAccessorImpl.invoke(DelegatingMethodAccessorImpl.java:43)
   [junit4]   2> 	at java.lang.reflect.Method.invoke(Method.java:498)
   [junit4]   2> 	at com.carrotsearch.randomizedtesting.RandomizedRunner.invoke(RandomizedRunner.java:1713)
   [junit4]   2> 	at com.carrotsearch.randomizedtesting.RandomizedRunner$7.evaluate(RandomizedRunner.java:870)
   [junit4]   2> 	at com.carrotsearch.randomizedtesting.rules.StatementAdapter.evaluate(StatementAdapter.java:36)
   [junit4]   2> 	at com.carrotsearch.randomizedtesting.rules.SystemPropertiesRestoreRule$1.evaluate(SystemPropertiesRestoreRule.java:57)
   [junit4]   2> 	at org.apache.lucene.util.AbstractBeforeAfterRule$1.evaluate(AbstractBeforeAfterRule.java:45)
   [junit4]   2> 	at com.carrotsearch.randomizedtesting.rules.StatementAdapter.evaluate(StatementAdapter.java:36)
   [junit4]   2> 	at org.apache.lucene.util.TestRuleStoreClassName$1.evaluate(TestRuleStoreClassName.java:41)
   [junit4]   2> 	at com.carrotsearch.randomizedtesting.rules.NoShadowingOrOverridesOnMethodsRule$1.evaluate(NoShadowingOrOverridesOnMethodsRule.java:40)
   [junit4]   2> 	at com.carrotsearch.randomizedtesting.rules.NoShadowingOrOverridesOnMethodsRule$1.evaluate(NoShadowingOrOverridesOnMethodsRule.java:40)
   [junit4]   2> 	at com.carrotsearch.randomizedtesting.rules.StatementAdapter.evaluate(StatementAdapter.java:36)
   [junit4]   2> 	at com.carrotsearch.randomizedtesting.rules.StatementAdapter.evaluate(StatementAdapter.java:36)
   [junit4]   2> 	at com.carrotsearch.randomizedtesting.rules.StatementAdapter.evaluate(StatementAdapter.java:36)
   [junit4]   2> 	at org.apache.lucene.util.TestRuleAssertionsRequired$1.evaluate(TestRuleAssertionsRequired.java:53)
   [junit4]   2> 	at org.apache.lucene.util.TestRuleMarkFailure$1.evaluate(TestRuleMarkFailure.java:47)
   [junit4]   2> 	at org.apache.lucene.util.TestRuleIgnoreAfterMaxFailures$1.evaluate(TestRuleIgnoreAfterMaxFailures.java:64)
   [junit4]   2> 	at org.apache.lucene.util.TestRuleIgnoreTestSuites$1.evaluate(TestRuleIgnoreTestSuites.java:54)
   [junit4]   2> 	at com.carrotsearch.randomizedtesting.rules.StatementAdapter.evaluate(StatementAdapter.java:36)
   [junit4]   2> 	at com.carrotsearch.randomizedtesting.ThreadLeakControl$StatementRunner.run(ThreadLeakControl.java:367)
   [junit4]   2> 	at java.lang.Thread.run(Thread.java:745)
   [junit4]   2> Caused by: java.lang.NullPointerException
   [junit4]   2> 	at org.apache.hadoop.hdfs.server.blockmanagement.BlocksMap.size(BlocksMap.java:203)
   [junit4]   2> 	at org.apache.hadoop.hdfs.server.blockmanagement.BlockManager.getTotalBlocks(BlockManager.java:3370)
   [junit4]   2> 	at org.apache.hadoop.hdfs.server.namenode.FSNamesystem.getBlocksTotal(FSNamesystem.java:5729)
   [junit4]   2> 	... 54 more
   [junit4]   2> 4101803 INFO  (SUITE-HdfsCollectionsAPIDistributedZkTest-seed#[A18CB334F5F66975]-worker) [    ] o.a.s.c.ZkTestServer connecting to 127.0.0.1:51715 51715
   [junit4]   2> 4101804 INFO  (SUITE-HdfsCollectionsAPIDistributedZkTest-seed#[A18CB334F5F66975]-worker) [    ] o.a.s.SolrTestCaseJ4 ###deleteCore
   [junit4]   2> NOTE: leaving temporary files on disk at: /x1/jenkins/jenkins-slave/workspace/Lucene-Solr-NightlyTests-6.x/checkout/solr/build/solr-core/test/J0/temp/solr.cloud.hdfs.HdfsCollectionsAPIDistributedZkTest_A18CB334F5F66975-001
   [junit4]   2> Dec 10, 2016 2:12:26 PM com.carrotsearch.randomizedtesting.ThreadLeakControl checkThreadLeaks
   [junit4]   2> WARNING: Will linger awaiting termination of 35 leaked thread(s).
   [junit4]   2> NOTE: test params are: codec=Asserting(Lucene62): {}, docValues:{}, maxPointsInLeafNode=1801, maxMBSortInHeap=6.398344828408142, sim=RandomSimilarity(queryNorm=false,coord=crazy): {}, locale=en, timezone=Asia/Irkutsk
   [junit4]   2> NOTE: Linux 3.13.0-85-generic amd64/Oracle Corporation 1.8.0_102 (64-bit)/cpus=4,threads=2,free=223069520,total=520093696
   [junit4]   2> NOTE: All tests run in this JVM: [TestStressLucene, TestConfigReload, DistributedSpellCheckComponentTest, ClassificationUpdateProcessorTest, RollingRestartTest, TestRealTimeGet, ExitableDirectoryReaderTest, IgnoreCommitOptimizeUpdateProcessorFactoryTest, SpatialHeatmapFacetsTest, ReturnFieldsTest, LeaderFailureAfterFreshStartTest, TestBinaryResponseWriter, TestSmileRequest, TestUnifiedSolrHighlighter, CreateCollectionCleanupTest, TestCodecSupport, TestTrackingShardHandlerFactory, TestPseudoReturnFields, TestReplicationHandler, TestOverriddenPrefixQueryForCustomFieldType, TestManagedResourceStorage, TestHdfsUpdateLog, BasicDistributedZkTest, HdfsRestartWhileUpdatingTest, BlockJoinFacetRandomTest, TestXmlQParser, RankQueryTest, ConcurrentDeleteAndCreateCollectionTest, NumericFieldsTest, TestSchemaVersionResource, NotRequiredUniqueKeyTest, TestJsonFacets, TestScoreJoinQPNoScore, TestGeoJSONResponseWriter, CachingDirectoryFactoryTest, ReplaceNodeTest, TimerUtilsTest, TestSolrDeletionPolicy2, TestDocumentBuilder, TestReplicaProperties, DisMaxRequestHandlerTest, TestSolrQueryParserResource, TestStressCloudBlindAtomicUpdates, CursorPagingTest, UUIDUpdateProcessorFallbackTest, EnumFieldTest, TestJmxIntegration, TestLocalFSCloudBackupRestore, TestFaceting, DefaultValueUpdateProcessorTest, TestFunctionQuery, BasicZkTest, ResourceLoaderTest, CacheHeaderTest, HdfsTlogReplayBufferedWhileIndexingTest, SignatureUpdateProcessorFactoryTest, AlternateDirectoryTest, TestPHPSerializedResponseWriter, TestManagedSynonymFilterFactory, HLLSerializationTest, TestRandomFaceting, HighlighterConfigTest, TestHighlightDedupGrouping, TestLeaderElectionWithEmptyReplica, SolrCoreTest, TestSSLRandomization, TestRemoteStreaming, DistributedQueryElevationComponentTest, ActionThrottleTest, TestMaxScoreQueryParser, AnalysisErrorHandlingTest, TestReqParamsAPI, DistribDocExpirationUpdateProcessorTest, TestUseDocValuesAsStored, QueryElevationComponentTest, TestSolrCloudWithDelegationTokens, ScriptEngineTest, TestMacros, TestFoldingMultitermQuery, AnalyticsQueryTest, TestFastLRUCache, TestAuthorizationFramework, TestCryptoKeys, TestSortByMinMaxFunction, TestSubQueryTransformerCrossCore, TestConfigSetsAPI, OverriddenZkACLAndCredentialsProvidersTest, RequiredFieldsTest, RegexBoostProcessorTest, TestBackupRepositoryFactory, OutputWriterTest, TestDistributedStatsComponentCardinality, CloudMLTQParserTest, TestAtomicUpdateErrorCases, DeleteLastCustomShardedReplicaTest, TestIBSimilarityFactory, ConjunctionSolrSpellCheckerTest, ChaosMonkeyNothingIsSafeTest, InfoHandlerTest, TestSolrQueryResponse, TestDynamicFieldCollectionResource, TestFieldCacheWithThreads, BlockCacheTest, FacetPivotSmallTest, TestBulkSchemaConcurrent, ReplicationFactorTest, SaslZkACLProviderTest, ShardSplitTest, TestRandomRequestDistribution, TestRebalanceLeaders, TestRequestForwarding, TestRequestStatusCollectionAPI, TestSolrCloudWithKerberosAlt, TestSolrCloudWithSecureImpersonation, TestStressLiveNodes, VMParamsZkACLAndCredentialsProvidersTest, HdfsBasicDistributedZk2Test, HdfsCollectionsAPIDistributedZkTest]
   [junit4] Completed [533/660 (3!)] on J0 in 167.86s, 20 tests, 1 failure, 1 error <<< FAILURES!

[...truncated 62780 lines...]



Mime
View raw message