lucene-dev mailing list archives

Site index · List index
Message view « Date » · « Thread »
Top « Date » · « Thread »
From Apache Jenkins Server <jenk...@builds.apache.org>
Subject [JENKINS] Lucene-Solr-NightlyTests-6.x - Build # 227 - Still Unstable
Date Wed, 14 Dec 2016 07:26:49 GMT
Build: https://builds.apache.org/job/Lucene-Solr-NightlyTests-6.x/227/

4 tests failed.
FAILED:  org.apache.solr.TestDistributedSearch.test

Error Message:
Expected to find shardAddress in the up shard info

Stack Trace:
java.lang.AssertionError: Expected to find shardAddress in the up shard info
	at __randomizedtesting.SeedInfo.seed([BA2AB614EBF0E90B:327E89CE450C84F3]:0)
	at org.junit.Assert.fail(Assert.java:93)
	at org.junit.Assert.assertTrue(Assert.java:43)
	at org.apache.solr.TestDistributedSearch.comparePartialResponses(TestDistributedSearch.java:1162)
	at org.apache.solr.TestDistributedSearch.queryPartialResults(TestDistributedSearch.java:1103)
	at org.apache.solr.TestDistributedSearch.test(TestDistributedSearch.java:963)
	at sun.reflect.NativeMethodAccessorImpl.invoke0(Native Method)
	at sun.reflect.NativeMethodAccessorImpl.invoke(NativeMethodAccessorImpl.java:62)
	at sun.reflect.DelegatingMethodAccessorImpl.invoke(DelegatingMethodAccessorImpl.java:43)
	at java.lang.reflect.Method.invoke(Method.java:498)
	at com.carrotsearch.randomizedtesting.RandomizedRunner.invoke(RandomizedRunner.java:1713)
	at com.carrotsearch.randomizedtesting.RandomizedRunner$8.evaluate(RandomizedRunner.java:907)
	at com.carrotsearch.randomizedtesting.RandomizedRunner$9.evaluate(RandomizedRunner.java:943)
	at com.carrotsearch.randomizedtesting.RandomizedRunner$10.evaluate(RandomizedRunner.java:957)
	at org.apache.solr.BaseDistributedSearchTestCase$ShardsRepeatRule$ShardsRepeatStatement.callStatement(BaseDistributedSearchTestCase.java:1018)
	at org.apache.solr.BaseDistributedSearchTestCase$ShardsRepeatRule$ShardsStatement.evaluate(BaseDistributedSearchTestCase.java:967)
	at com.carrotsearch.randomizedtesting.rules.SystemPropertiesRestoreRule$1.evaluate(SystemPropertiesRestoreRule.java:57)
	at org.apache.lucene.util.TestRuleSetupTeardownChained$1.evaluate(TestRuleSetupTeardownChained.java:49)
	at org.apache.lucene.util.AbstractBeforeAfterRule$1.evaluate(AbstractBeforeAfterRule.java:45)
	at org.apache.lucene.util.TestRuleThreadAndTestName$1.evaluate(TestRuleThreadAndTestName.java:48)
	at org.apache.lucene.util.TestRuleIgnoreAfterMaxFailures$1.evaluate(TestRuleIgnoreAfterMaxFailures.java:64)
	at org.apache.lucene.util.TestRuleMarkFailure$1.evaluate(TestRuleMarkFailure.java:47)
	at com.carrotsearch.randomizedtesting.rules.StatementAdapter.evaluate(StatementAdapter.java:36)
	at com.carrotsearch.randomizedtesting.ThreadLeakControl$StatementRunner.run(ThreadLeakControl.java:367)
	at com.carrotsearch.randomizedtesting.ThreadLeakControl.forkTimeoutingTask(ThreadLeakControl.java:811)
	at com.carrotsearch.randomizedtesting.ThreadLeakControl$3.evaluate(ThreadLeakControl.java:462)
	at com.carrotsearch.randomizedtesting.RandomizedRunner.runSingleTest(RandomizedRunner.java:916)
	at com.carrotsearch.randomizedtesting.RandomizedRunner$5.evaluate(RandomizedRunner.java:802)
	at com.carrotsearch.randomizedtesting.RandomizedRunner$6.evaluate(RandomizedRunner.java:852)
	at com.carrotsearch.randomizedtesting.RandomizedRunner$7.evaluate(RandomizedRunner.java:863)
	at com.carrotsearch.randomizedtesting.rules.StatementAdapter.evaluate(StatementAdapter.java:36)
	at com.carrotsearch.randomizedtesting.rules.SystemPropertiesRestoreRule$1.evaluate(SystemPropertiesRestoreRule.java:57)
	at org.apache.lucene.util.AbstractBeforeAfterRule$1.evaluate(AbstractBeforeAfterRule.java:45)
	at com.carrotsearch.randomizedtesting.rules.StatementAdapter.evaluate(StatementAdapter.java:36)
	at org.apache.lucene.util.TestRuleStoreClassName$1.evaluate(TestRuleStoreClassName.java:41)
	at com.carrotsearch.randomizedtesting.rules.NoShadowingOrOverridesOnMethodsRule$1.evaluate(NoShadowingOrOverridesOnMethodsRule.java:40)
	at com.carrotsearch.randomizedtesting.rules.NoShadowingOrOverridesOnMethodsRule$1.evaluate(NoShadowingOrOverridesOnMethodsRule.java:40)
	at com.carrotsearch.randomizedtesting.rules.StatementAdapter.evaluate(StatementAdapter.java:36)
	at com.carrotsearch.randomizedtesting.rules.StatementAdapter.evaluate(StatementAdapter.java:36)
	at com.carrotsearch.randomizedtesting.rules.StatementAdapter.evaluate(StatementAdapter.java:36)
	at org.apache.lucene.util.TestRuleAssertionsRequired$1.evaluate(TestRuleAssertionsRequired.java:53)
	at org.apache.lucene.util.TestRuleMarkFailure$1.evaluate(TestRuleMarkFailure.java:47)
	at org.apache.lucene.util.TestRuleIgnoreAfterMaxFailures$1.evaluate(TestRuleIgnoreAfterMaxFailures.java:64)
	at org.apache.lucene.util.TestRuleIgnoreTestSuites$1.evaluate(TestRuleIgnoreTestSuites.java:54)
	at com.carrotsearch.randomizedtesting.rules.StatementAdapter.evaluate(StatementAdapter.java:36)
	at com.carrotsearch.randomizedtesting.ThreadLeakControl$StatementRunner.run(ThreadLeakControl.java:367)
	at java.lang.Thread.run(Thread.java:745)


FAILED:  org.apache.solr.handler.TestReplicationHandler.doTestReplicateAfterCoreReload

Error Message:
expected:<[{indexVersion=1481695959012,generation=2,filelist=[_2io.cfe, _2io.cfs, _2io.si, _2iy.fdt, _2iy.fdx, _2iy.fnm, _2iy.nvd, _2iy.nvm, _2iy.si, _2iy_FSTOrd50_0.doc, _2iy_FSTOrd50_0.tbk, _2iy_FSTOrd50_0.tix, _2j3.fdt, _2j3.fdx, _2j3.fnm, _2j3.nvd, _2j3.nvm, _2j3.si, _2j3_FSTOrd50_0.doc, _2j3_FSTOrd50_0.tbk, _2j3_FSTOrd50_0.tix, _2j4.fdt, _2j4.fdx, _2j4.fnm, _2j4.nvd, _2j4.nvm, _2j4.si, _2j4_FSTOrd50_0.doc, _2j4_FSTOrd50_0.tbk, _2j4_FSTOrd50_0.tix, _2j5.fdt, _2j5.fdx, _2j5.fnm, _2j5.nvd, _2j5.nvm, _2j5.si, _2j5_FSTOrd50_0.doc, _2j5_FSTOrd50_0.tbk, _2j5_FSTOrd50_0.tix, _2j6.fdt, _2j6.fdx, _2j6.fnm, _2j6.nvd, _2j6.nvm, _2j6.si, _2j6_FSTOrd50_0.doc, _2j6_FSTOrd50_0.tbk, _2j6_FSTOrd50_0.tix, _2j8.fdt, _2j8.fdx, _2j8.fnm, _2j8.nvd, _2j8.nvm, _2j8.si, _2j8_FSTOrd50_0.doc, _2j8_FSTOrd50_0.tbk, _2j8_FSTOrd50_0.tix, _2j9.fdt, _2j9.fdx, _2j9.fnm, _2j9.nvd, _2j9.nvm, _2j9.si, _2j9_FSTOrd50_0.doc, _2j9_FSTOrd50_0.tbk, _2j9_FSTOrd50_0.tix, _2ja.fdt, _2ja.fdx, _2ja.fnm, _2ja.nvd, _2ja.nvm, _2ja.si, _2ja_FSTOrd50_0.doc, _2ja_FSTOrd50_0.tbk, _2ja_FSTOrd50_0.tix, _2jb.cfe, _2jb.cfs, _2jb.si, _2jc.fdt, _2jc.fdx, _2jc.fnm, _2jc.nvd, _2jc.nvm, _2jc.si, _2jc_FSTOrd50_0.doc, _2jc_FSTOrd50_0.tbk, _2jc_FSTOrd50_0.tix, _2jd.fdt, _2jd.fdx, _2jd.fnm, _2jd.nvd, _2jd.nvm, _2jd.si, _2jd_FSTOrd50_0.doc, _2jd_FSTOrd50_0.tbk, _2jd_FSTOrd50_0.tix, _2je.fdt, _2je.fdx, _2je.fnm, _2je.nvd, _2je.nvm, _2je.si, _2je_FSTOrd50_0.doc, _2je_FSTOrd50_0.tbk, _2je_FSTOrd50_0.tix, _2jf.fdt, _2jf.fdx, _2jf.fnm, _2jf.nvd, _2jf.nvm, _2jf.si, _2jf_FSTOrd50_0.doc, _2jf_FSTOrd50_0.tbk, _2jf_FSTOrd50_0.tix, _2jg.fdt, _2jg.fdx, _2jg.fnm, _2jg.nvd, _2jg.nvm, _2jg.si, _2jg_FSTOrd50_0.doc, _2jg_FSTOrd50_0.tbk, _2jg_FSTOrd50_0.tix, _2jh.fdt, _2jh.fdx, _2jh.fnm, _2jh.nvd, _2jh.nvm, _2jh.si, _2jh_FSTOrd50_0.doc, _2jh_FSTOrd50_0.tbk, _2jh_FSTOrd50_0.tix, _2jj.fdt, _2jj.fdx, _2jj.fnm, _2jj.nvd, _2jj.nvm, _2jj.si, _2jj_FSTOrd50_0.doc, _2jj_FSTOrd50_0.tbk, _2jj_FSTOrd50_0.tix, _2jk.fdt, _2jk.fdx, _2jk.fnm, _2jk.nvd, _2jk.nvm, _2jk.si, _2jk_FSTOrd50_0.doc, _2jk_FSTOrd50_0.tbk, _2jk_FSTOrd50_0.tix, _2jm.fdt, _2jm.fdx, _2jm.fnm, _2jm.nvd, _2jm.nvm, _2jm.si, _2jm_FSTOrd50_0.doc, _2jm_FSTOrd50_0.tbk, _2jm_FSTOrd50_0.tix, _2jo.fdt, _2jo.fdx, _2jo.fnm, _2jo.nvd, _2jo.nvm, _2jo.si, _2jo_FSTOrd50_0.doc, _2jo_FSTOrd50_0.tbk, _2jo_FSTOrd50_0.tix, _2jp.cfe, _2jp.cfs, _2jp.si, _2jq.fdt, _2jq.fdx, _2jq.fnm, _2jq.nvd, _2jq.nvm, _2jq.si, _2jq_FSTOrd50_0.doc, _2jq_FSTOrd50_0.tbk, _2jq_FSTOrd50_0.tix, _2jr.fdt, _2jr.fdx, _2jr.fnm, _2jr.nvd, _2jr.nvm, _2jr.si, _2jr_FSTOrd50_0.doc, _2jr_FSTOrd50_0.tbk, _2jr_FSTOrd50_0.tix, segments_2]}]> but was:<[{indexVersion=1481695959012,generation=2,filelist=[_2io.cfe, _2io.cfs, _2io.si, _2iy.fdt, _2iy.fdx, _2iy.fnm, _2iy.nvd, _2iy.nvm, _2iy.si, _2iy_FSTOrd50_0.doc, _2iy_FSTOrd50_0.tbk, _2iy_FSTOrd50_0.tix, _2j3.fdt, _2j3.fdx, _2j3.fnm, _2j3.nvd, _2j3.nvm, _2j3.si, _2j3_FSTOrd50_0.doc, _2j3_FSTOrd50_0.tbk, _2j3_FSTOrd50_0.tix, _2j4.fdt, _2j4.fdx, _2j4.fnm, _2j4.nvd, _2j4.nvm, _2j4.si, _2j4_FSTOrd50_0.doc, _2j4_FSTOrd50_0.tbk, _2j4_FSTOrd50_0.tix, _2j5.fdt, _2j5.fdx, _2j5.fnm, _2j5.nvd, _2j5.nvm, _2j5.si, _2j5_FSTOrd50_0.doc, _2j5_FSTOrd50_0.tbk, _2j5_FSTOrd50_0.tix, _2j6.fdt, _2j6.fdx, _2j6.fnm, _2j6.nvd, _2j6.nvm, _2j6.si, _2j6_FSTOrd50_0.doc, _2j6_FSTOrd50_0.tbk, _2j6_FSTOrd50_0.tix, _2j8.fdt, _2j8.fdx, _2j8.fnm, _2j8.nvd, _2j8.nvm, _2j8.si, _2j8_FSTOrd50_0.doc, _2j8_FSTOrd50_0.tbk, _2j8_FSTOrd50_0.tix, _2j9.fdt, _2j9.fdx, _2j9.fnm, _2j9.nvd, _2j9.nvm, _2j9.si, _2j9_FSTOrd50_0.doc, _2j9_FSTOrd50_0.tbk, _2j9_FSTOrd50_0.tix, _2ja.fdt, _2ja.fdx, _2ja.fnm, _2ja.nvd, _2ja.nvm, _2ja.si, _2ja_FSTOrd50_0.doc, _2ja_FSTOrd50_0.tbk, _2ja_FSTOrd50_0.tix, _2jb.cfe, _2jb.cfs, _2jb.si, _2jc.fdt, _2jc.fdx, _2jc.fnm, _2jc.nvd, _2jc.nvm, _2jc.si, _2jc_FSTOrd50_0.doc, _2jc_FSTOrd50_0.tbk, _2jc_FSTOrd50_0.tix, _2jd.fdt, _2jd.fdx, _2jd.fnm, _2jd.nvd, _2jd.nvm, _2jd.si, _2jd_FSTOrd50_0.doc, _2jd_FSTOrd50_0.tbk, _2jd_FSTOrd50_0.tix, _2je.fdt, _2je.fdx, _2je.fnm, _2je.nvd, _2je.nvm, _2je.si, _2je_FSTOrd50_0.doc, _2je_FSTOrd50_0.tbk, _2je_FSTOrd50_0.tix, _2jf.fdt, _2jf.fdx, _2jf.fnm, _2jf.nvd, _2jf.nvm, _2jf.si, _2jf_FSTOrd50_0.doc, _2jf_FSTOrd50_0.tbk, _2jf_FSTOrd50_0.tix, _2jg.fdt, _2jg.fdx, _2jg.fnm, _2jg.nvd, _2jg.nvm, _2jg.si, _2jg_FSTOrd50_0.doc, _2jg_FSTOrd50_0.tbk, _2jg_FSTOrd50_0.tix, _2jh.fdt, _2jh.fdx, _2jh.fnm, _2jh.nvd, _2jh.nvm, _2jh.si, _2jh_FSTOrd50_0.doc, _2jh_FSTOrd50_0.tbk, _2jh_FSTOrd50_0.tix, _2jj.fdt, _2jj.fdx, _2jj.fnm, _2jj.nvd, _2jj.nvm, _2jj.si, _2jj_FSTOrd50_0.doc, _2jj_FSTOrd50_0.tbk, _2jj_FSTOrd50_0.tix, _2jk.fdt, _2jk.fdx, _2jk.fnm, _2jk.nvd, _2jk.nvm, _2jk.si, _2jk_FSTOrd50_0.doc, _2jk_FSTOrd50_0.tbk, _2jk_FSTOrd50_0.tix, _2jm.fdt, _2jm.fdx, _2jm.fnm, _2jm.nvd, _2jm.nvm, _2jm.si, _2jm_FSTOrd50_0.doc, _2jm_FSTOrd50_0.tbk, _2jm_FSTOrd50_0.tix, _2jo.fdt, _2jo.fdx, _2jo.fnm, _2jo.nvd, _2jo.nvm, _2jo.si, _2jo_FSTOrd50_0.doc, _2jo_FSTOrd50_0.tbk, _2jo_FSTOrd50_0.tix, _2jp.cfe, _2jp.cfs, _2jp.si, _2jq.fdt, _2jq.fdx, _2jq.fnm, _2jq.nvd, _2jq.nvm, _2jq.si, _2jq_FSTOrd50_0.doc, _2jq_FSTOrd50_0.tbk, _2jq_FSTOrd50_0.tix, _2jr.fdt, _2jr.fdx, _2jr.fnm, _2jr.nvd, _2jr.nvm, _2jr.si, _2jr_FSTOrd50_0.doc, _2jr_FSTOrd50_0.tbk, _2jr_FSTOrd50_0.tix, segments_2]}, {indexVersion=1481695959012,generation=3,filelist=[_2j3.fdt, _2j3.fdx, _2j3.fnm, _2j3.nvd, _2j3.nvm, _2j3.si, _2j3_FSTOrd50_0.doc, _2j3_FSTOrd50_0.tbk, _2j3_FSTOrd50_0.tix, _2jc.fdt, _2jc.fdx, _2jc.fnm, _2jc.nvd, _2jc.nvm, _2jc.si, _2jc_FSTOrd50_0.doc, _2jc_FSTOrd50_0.tbk, _2jc_FSTOrd50_0.tix, _2jh.fdt, _2jh.fdx, _2jh.fnm, _2jh.nvd, _2jh.nvm, _2jh.si, _2jh_FSTOrd50_0.doc, _2jh_FSTOrd50_0.tbk, _2jh_FSTOrd50_0.tix, _2jk.fdt, _2jk.fdx, _2jk.fnm, _2jk.nvd, _2jk.nvm, _2jk.si, _2jk_FSTOrd50_0.doc, _2jk_FSTOrd50_0.tbk, _2jk_FSTOrd50_0.tix, _2jl.cfe, _2jl.cfs, _2jl.si, _2jm.fdt, _2jm.fdx, _2jm.fnm, _2jm.nvd, _2jm.nvm, _2jm.si, _2jm_FSTOrd50_0.doc, _2jm_FSTOrd50_0.tbk, _2jm_FSTOrd50_0.tix, _2jo.fdt, _2jo.fdx, _2jo.fnm, _2jo.nvd, _2jo.nvm, _2jo.si, _2jo_FSTOrd50_0.doc, _2jo_FSTOrd50_0.tbk, _2jo_FSTOrd50_0.tix, _2js.cfe, _2js.cfs, _2js.si, segments_3]}]>

Stack Trace:
java.lang.AssertionError: expected:<[{indexVersion=1481695959012,generation=2,filelist=[_2io.cfe, _2io.cfs, _2io.si, _2iy.fdt, _2iy.fdx, _2iy.fnm, _2iy.nvd, _2iy.nvm, _2iy.si, _2iy_FSTOrd50_0.doc, _2iy_FSTOrd50_0.tbk, _2iy_FSTOrd50_0.tix, _2j3.fdt, _2j3.fdx, _2j3.fnm, _2j3.nvd, _2j3.nvm, _2j3.si, _2j3_FSTOrd50_0.doc, _2j3_FSTOrd50_0.tbk, _2j3_FSTOrd50_0.tix, _2j4.fdt, _2j4.fdx, _2j4.fnm, _2j4.nvd, _2j4.nvm, _2j4.si, _2j4_FSTOrd50_0.doc, _2j4_FSTOrd50_0.tbk, _2j4_FSTOrd50_0.tix, _2j5.fdt, _2j5.fdx, _2j5.fnm, _2j5.nvd, _2j5.nvm, _2j5.si, _2j5_FSTOrd50_0.doc, _2j5_FSTOrd50_0.tbk, _2j5_FSTOrd50_0.tix, _2j6.fdt, _2j6.fdx, _2j6.fnm, _2j6.nvd, _2j6.nvm, _2j6.si, _2j6_FSTOrd50_0.doc, _2j6_FSTOrd50_0.tbk, _2j6_FSTOrd50_0.tix, _2j8.fdt, _2j8.fdx, _2j8.fnm, _2j8.nvd, _2j8.nvm, _2j8.si, _2j8_FSTOrd50_0.doc, _2j8_FSTOrd50_0.tbk, _2j8_FSTOrd50_0.tix, _2j9.fdt, _2j9.fdx, _2j9.fnm, _2j9.nvd, _2j9.nvm, _2j9.si, _2j9_FSTOrd50_0.doc, _2j9_FSTOrd50_0.tbk, _2j9_FSTOrd50_0.tix, _2ja.fdt, _2ja.fdx, _2ja.fnm, _2ja.nvd, _2ja.nvm, _2ja.si, _2ja_FSTOrd50_0.doc, _2ja_FSTOrd50_0.tbk, _2ja_FSTOrd50_0.tix, _2jb.cfe, _2jb.cfs, _2jb.si, _2jc.fdt, _2jc.fdx, _2jc.fnm, _2jc.nvd, _2jc.nvm, _2jc.si, _2jc_FSTOrd50_0.doc, _2jc_FSTOrd50_0.tbk, _2jc_FSTOrd50_0.tix, _2jd.fdt, _2jd.fdx, _2jd.fnm, _2jd.nvd, _2jd.nvm, _2jd.si, _2jd_FSTOrd50_0.doc, _2jd_FSTOrd50_0.tbk, _2jd_FSTOrd50_0.tix, _2je.fdt, _2je.fdx, _2je.fnm, _2je.nvd, _2je.nvm, _2je.si, _2je_FSTOrd50_0.doc, _2je_FSTOrd50_0.tbk, _2je_FSTOrd50_0.tix, _2jf.fdt, _2jf.fdx, _2jf.fnm, _2jf.nvd, _2jf.nvm, _2jf.si, _2jf_FSTOrd50_0.doc, _2jf_FSTOrd50_0.tbk, _2jf_FSTOrd50_0.tix, _2jg.fdt, _2jg.fdx, _2jg.fnm, _2jg.nvd, _2jg.nvm, _2jg.si, _2jg_FSTOrd50_0.doc, _2jg_FSTOrd50_0.tbk, _2jg_FSTOrd50_0.tix, _2jh.fdt, _2jh.fdx, _2jh.fnm, _2jh.nvd, _2jh.nvm, _2jh.si, _2jh_FSTOrd50_0.doc, _2jh_FSTOrd50_0.tbk, _2jh_FSTOrd50_0.tix, _2jj.fdt, _2jj.fdx, _2jj.fnm, _2jj.nvd, _2jj.nvm, _2jj.si, _2jj_FSTOrd50_0.doc, _2jj_FSTOrd50_0.tbk, _2jj_FSTOrd50_0.tix, _2jk.fdt, _2jk.fdx, _2jk.fnm, _2jk.nvd, _2jk.nvm, _2jk.si, _2jk_FSTOrd50_0.doc, _2jk_FSTOrd50_0.tbk, _2jk_FSTOrd50_0.tix, _2jm.fdt, _2jm.fdx, _2jm.fnm, _2jm.nvd, _2jm.nvm, _2jm.si, _2jm_FSTOrd50_0.doc, _2jm_FSTOrd50_0.tbk, _2jm_FSTOrd50_0.tix, _2jo.fdt, _2jo.fdx, _2jo.fnm, _2jo.nvd, _2jo.nvm, _2jo.si, _2jo_FSTOrd50_0.doc, _2jo_FSTOrd50_0.tbk, _2jo_FSTOrd50_0.tix, _2jp.cfe, _2jp.cfs, _2jp.si, _2jq.fdt, _2jq.fdx, _2jq.fnm, _2jq.nvd, _2jq.nvm, _2jq.si, _2jq_FSTOrd50_0.doc, _2jq_FSTOrd50_0.tbk, _2jq_FSTOrd50_0.tix, _2jr.fdt, _2jr.fdx, _2jr.fnm, _2jr.nvd, _2jr.nvm, _2jr.si, _2jr_FSTOrd50_0.doc, _2jr_FSTOrd50_0.tbk, _2jr_FSTOrd50_0.tix, segments_2]}]> but was:<[{indexVersion=1481695959012,generation=2,filelist=[_2io.cfe, _2io.cfs, _2io.si, _2iy.fdt, _2iy.fdx, _2iy.fnm, _2iy.nvd, _2iy.nvm, _2iy.si, _2iy_FSTOrd50_0.doc, _2iy_FSTOrd50_0.tbk, _2iy_FSTOrd50_0.tix, _2j3.fdt, _2j3.fdx, _2j3.fnm, _2j3.nvd, _2j3.nvm, _2j3.si, _2j3_FSTOrd50_0.doc, _2j3_FSTOrd50_0.tbk, _2j3_FSTOrd50_0.tix, _2j4.fdt, _2j4.fdx, _2j4.fnm, _2j4.nvd, _2j4.nvm, _2j4.si, _2j4_FSTOrd50_0.doc, _2j4_FSTOrd50_0.tbk, _2j4_FSTOrd50_0.tix, _2j5.fdt, _2j5.fdx, _2j5.fnm, _2j5.nvd, _2j5.nvm, _2j5.si, _2j5_FSTOrd50_0.doc, _2j5_FSTOrd50_0.tbk, _2j5_FSTOrd50_0.tix, _2j6.fdt, _2j6.fdx, _2j6.fnm, _2j6.nvd, _2j6.nvm, _2j6.si, _2j6_FSTOrd50_0.doc, _2j6_FSTOrd50_0.tbk, _2j6_FSTOrd50_0.tix, _2j8.fdt, _2j8.fdx, _2j8.fnm, _2j8.nvd, _2j8.nvm, _2j8.si, _2j8_FSTOrd50_0.doc, _2j8_FSTOrd50_0.tbk, _2j8_FSTOrd50_0.tix, _2j9.fdt, _2j9.fdx, _2j9.fnm, _2j9.nvd, _2j9.nvm, _2j9.si, _2j9_FSTOrd50_0.doc, _2j9_FSTOrd50_0.tbk, _2j9_FSTOrd50_0.tix, _2ja.fdt, _2ja.fdx, _2ja.fnm, _2ja.nvd, _2ja.nvm, _2ja.si, _2ja_FSTOrd50_0.doc, _2ja_FSTOrd50_0.tbk, _2ja_FSTOrd50_0.tix, _2jb.cfe, _2jb.cfs, _2jb.si, _2jc.fdt, _2jc.fdx, _2jc.fnm, _2jc.nvd, _2jc.nvm, _2jc.si, _2jc_FSTOrd50_0.doc, _2jc_FSTOrd50_0.tbk, _2jc_FSTOrd50_0.tix, _2jd.fdt, _2jd.fdx, _2jd.fnm, _2jd.nvd, _2jd.nvm, _2jd.si, _2jd_FSTOrd50_0.doc, _2jd_FSTOrd50_0.tbk, _2jd_FSTOrd50_0.tix, _2je.fdt, _2je.fdx, _2je.fnm, _2je.nvd, _2je.nvm, _2je.si, _2je_FSTOrd50_0.doc, _2je_FSTOrd50_0.tbk, _2je_FSTOrd50_0.tix, _2jf.fdt, _2jf.fdx, _2jf.fnm, _2jf.nvd, _2jf.nvm, _2jf.si, _2jf_FSTOrd50_0.doc, _2jf_FSTOrd50_0.tbk, _2jf_FSTOrd50_0.tix, _2jg.fdt, _2jg.fdx, _2jg.fnm, _2jg.nvd, _2jg.nvm, _2jg.si, _2jg_FSTOrd50_0.doc, _2jg_FSTOrd50_0.tbk, _2jg_FSTOrd50_0.tix, _2jh.fdt, _2jh.fdx, _2jh.fnm, _2jh.nvd, _2jh.nvm, _2jh.si, _2jh_FSTOrd50_0.doc, _2jh_FSTOrd50_0.tbk, _2jh_FSTOrd50_0.tix, _2jj.fdt, _2jj.fdx, _2jj.fnm, _2jj.nvd, _2jj.nvm, _2jj.si, _2jj_FSTOrd50_0.doc, _2jj_FSTOrd50_0.tbk, _2jj_FSTOrd50_0.tix, _2jk.fdt, _2jk.fdx, _2jk.fnm, _2jk.nvd, _2jk.nvm, _2jk.si, _2jk_FSTOrd50_0.doc, _2jk_FSTOrd50_0.tbk, _2jk_FSTOrd50_0.tix, _2jm.fdt, _2jm.fdx, _2jm.fnm, _2jm.nvd, _2jm.nvm, _2jm.si, _2jm_FSTOrd50_0.doc, _2jm_FSTOrd50_0.tbk, _2jm_FSTOrd50_0.tix, _2jo.fdt, _2jo.fdx, _2jo.fnm, _2jo.nvd, _2jo.nvm, _2jo.si, _2jo_FSTOrd50_0.doc, _2jo_FSTOrd50_0.tbk, _2jo_FSTOrd50_0.tix, _2jp.cfe, _2jp.cfs, _2jp.si, _2jq.fdt, _2jq.fdx, _2jq.fnm, _2jq.nvd, _2jq.nvm, _2jq.si, _2jq_FSTOrd50_0.doc, _2jq_FSTOrd50_0.tbk, _2jq_FSTOrd50_0.tix, _2jr.fdt, _2jr.fdx, _2jr.fnm, _2jr.nvd, _2jr.nvm, _2jr.si, _2jr_FSTOrd50_0.doc, _2jr_FSTOrd50_0.tbk, _2jr_FSTOrd50_0.tix, segments_2]}, {indexVersion=1481695959012,generation=3,filelist=[_2j3.fdt, _2j3.fdx, _2j3.fnm, _2j3.nvd, _2j3.nvm, _2j3.si, _2j3_FSTOrd50_0.doc, _2j3_FSTOrd50_0.tbk, _2j3_FSTOrd50_0.tix, _2jc.fdt, _2jc.fdx, _2jc.fnm, _2jc.nvd, _2jc.nvm, _2jc.si, _2jc_FSTOrd50_0.doc, _2jc_FSTOrd50_0.tbk, _2jc_FSTOrd50_0.tix, _2jh.fdt, _2jh.fdx, _2jh.fnm, _2jh.nvd, _2jh.nvm, _2jh.si, _2jh_FSTOrd50_0.doc, _2jh_FSTOrd50_0.tbk, _2jh_FSTOrd50_0.tix, _2jk.fdt, _2jk.fdx, _2jk.fnm, _2jk.nvd, _2jk.nvm, _2jk.si, _2jk_FSTOrd50_0.doc, _2jk_FSTOrd50_0.tbk, _2jk_FSTOrd50_0.tix, _2jl.cfe, _2jl.cfs, _2jl.si, _2jm.fdt, _2jm.fdx, _2jm.fnm, _2jm.nvd, _2jm.nvm, _2jm.si, _2jm_FSTOrd50_0.doc, _2jm_FSTOrd50_0.tbk, _2jm_FSTOrd50_0.tix, _2jo.fdt, _2jo.fdx, _2jo.fnm, _2jo.nvd, _2jo.nvm, _2jo.si, _2jo_FSTOrd50_0.doc, _2jo_FSTOrd50_0.tbk, _2jo_FSTOrd50_0.tix, _2js.cfe, _2js.cfs, _2js.si, segments_3]}]>
	at __randomizedtesting.SeedInfo.seed([BA2AB614EBF0E90B:9FFDAD249BB8E708]:0)
	at org.junit.Assert.fail(Assert.java:93)
	at org.junit.Assert.failNotEquals(Assert.java:647)
	at org.junit.Assert.assertEquals(Assert.java:128)
	at org.junit.Assert.assertEquals(Assert.java:147)
	at org.apache.solr.handler.TestReplicationHandler.doTestReplicateAfterCoreReload(TestReplicationHandler.java:1229)
	at sun.reflect.NativeMethodAccessorImpl.invoke0(Native Method)
	at sun.reflect.NativeMethodAccessorImpl.invoke(NativeMethodAccessorImpl.java:62)
	at sun.reflect.DelegatingMethodAccessorImpl.invoke(DelegatingMethodAccessorImpl.java:43)
	at java.lang.reflect.Method.invoke(Method.java:498)
	at com.carrotsearch.randomizedtesting.RandomizedRunner.invoke(RandomizedRunner.java:1713)
	at com.carrotsearch.randomizedtesting.RandomizedRunner$8.evaluate(RandomizedRunner.java:907)
	at com.carrotsearch.randomizedtesting.RandomizedRunner$9.evaluate(RandomizedRunner.java:943)
	at com.carrotsearch.randomizedtesting.RandomizedRunner$10.evaluate(RandomizedRunner.java:957)
	at com.carrotsearch.randomizedtesting.rules.SystemPropertiesRestoreRule$1.evaluate(SystemPropertiesRestoreRule.java:57)
	at org.apache.lucene.util.TestRuleSetupTeardownChained$1.evaluate(TestRuleSetupTeardownChained.java:49)
	at org.apache.lucene.util.AbstractBeforeAfterRule$1.evaluate(AbstractBeforeAfterRule.java:45)
	at org.apache.lucene.util.TestRuleThreadAndTestName$1.evaluate(TestRuleThreadAndTestName.java:48)
	at org.apache.lucene.util.TestRuleIgnoreAfterMaxFailures$1.evaluate(TestRuleIgnoreAfterMaxFailures.java:64)
	at org.apache.lucene.util.TestRuleMarkFailure$1.evaluate(TestRuleMarkFailure.java:47)
	at com.carrotsearch.randomizedtesting.rules.StatementAdapter.evaluate(StatementAdapter.java:36)
	at com.carrotsearch.randomizedtesting.ThreadLeakControl$StatementRunner.run(ThreadLeakControl.java:367)
	at com.carrotsearch.randomizedtesting.ThreadLeakControl.forkTimeoutingTask(ThreadLeakControl.java:811)
	at com.carrotsearch.randomizedtesting.ThreadLeakControl$3.evaluate(ThreadLeakControl.java:462)
	at com.carrotsearch.randomizedtesting.RandomizedRunner.runSingleTest(RandomizedRunner.java:916)
	at com.carrotsearch.randomizedtesting.RandomizedRunner$5.evaluate(RandomizedRunner.java:802)
	at com.carrotsearch.randomizedtesting.RandomizedRunner$6.evaluate(RandomizedRunner.java:852)
	at com.carrotsearch.randomizedtesting.RandomizedRunner$7.evaluate(RandomizedRunner.java:863)
	at com.carrotsearch.randomizedtesting.rules.StatementAdapter.evaluate(StatementAdapter.java:36)
	at com.carrotsearch.randomizedtesting.rules.SystemPropertiesRestoreRule$1.evaluate(SystemPropertiesRestoreRule.java:57)
	at org.apache.lucene.util.AbstractBeforeAfterRule$1.evaluate(AbstractBeforeAfterRule.java:45)
	at com.carrotsearch.randomizedtesting.rules.StatementAdapter.evaluate(StatementAdapter.java:36)
	at org.apache.lucene.util.TestRuleStoreClassName$1.evaluate(TestRuleStoreClassName.java:41)
	at com.carrotsearch.randomizedtesting.rules.NoShadowingOrOverridesOnMethodsRule$1.evaluate(NoShadowingOrOverridesOnMethodsRule.java:40)
	at com.carrotsearch.randomizedtesting.rules.NoShadowingOrOverridesOnMethodsRule$1.evaluate(NoShadowingOrOverridesOnMethodsRule.java:40)
	at com.carrotsearch.randomizedtesting.rules.StatementAdapter.evaluate(StatementAdapter.java:36)
	at com.carrotsearch.randomizedtesting.rules.StatementAdapter.evaluate(StatementAdapter.java:36)
	at com.carrotsearch.randomizedtesting.rules.StatementAdapter.evaluate(StatementAdapter.java:36)
	at org.apache.lucene.util.TestRuleAssertionsRequired$1.evaluate(TestRuleAssertionsRequired.java:53)
	at org.apache.lucene.util.TestRuleMarkFailure$1.evaluate(TestRuleMarkFailure.java:47)
	at org.apache.lucene.util.TestRuleIgnoreAfterMaxFailures$1.evaluate(TestRuleIgnoreAfterMaxFailures.java:64)
	at org.apache.lucene.util.TestRuleIgnoreTestSuites$1.evaluate(TestRuleIgnoreTestSuites.java:54)
	at com.carrotsearch.randomizedtesting.rules.StatementAdapter.evaluate(StatementAdapter.java:36)
	at com.carrotsearch.randomizedtesting.ThreadLeakControl$StatementRunner.run(ThreadLeakControl.java:367)
	at java.lang.Thread.run(Thread.java:745)


FAILED:  org.apache.solr.cloud.hdfs.HdfsCollectionsAPIDistributedZkTest.testCollectionsAPI

Error Message:
Expected to see collection awhollynewcollection_0 null Last available state: DocCollection(awhollynewcollection_0//collections/awhollynewcollection_0/state.json/4)={   "replicationFactor":"3",   "shards":{"shard1":{       "range":"80000000-7fffffff",       "state":"active",       "replicas":{}}},   "router":{"name":"compositeId"},   "maxShardsPerNode":"1",   "autoAddReplicas":"false"}

Stack Trace:
java.lang.AssertionError: Expected to see collection awhollynewcollection_0
null
Last available state: DocCollection(awhollynewcollection_0//collections/awhollynewcollection_0/state.json/4)={
  "replicationFactor":"3",
  "shards":{"shard1":{
      "range":"80000000-7fffffff",
      "state":"active",
      "replicas":{}}},
  "router":{"name":"compositeId"},
  "maxShardsPerNode":"1",
  "autoAddReplicas":"false"}
	at __randomizedtesting.SeedInfo.seed([BA2AB614EBF0E90B:F25FC2A0EDC3C69E]:0)
	at org.junit.Assert.fail(Assert.java:93)
	at org.apache.solr.cloud.SolrCloudTestCase.waitForState(SolrCloudTestCase.java:237)
	at org.apache.solr.cloud.CollectionsAPIDistributedZkTest.testCollectionsAPI(CollectionsAPIDistributedZkTest.java:496)
	at sun.reflect.NativeMethodAccessorImpl.invoke0(Native Method)
	at sun.reflect.NativeMethodAccessorImpl.invoke(NativeMethodAccessorImpl.java:62)
	at sun.reflect.DelegatingMethodAccessorImpl.invoke(DelegatingMethodAccessorImpl.java:43)
	at java.lang.reflect.Method.invoke(Method.java:498)
	at com.carrotsearch.randomizedtesting.RandomizedRunner.invoke(RandomizedRunner.java:1713)
	at com.carrotsearch.randomizedtesting.RandomizedRunner$8.evaluate(RandomizedRunner.java:907)
	at com.carrotsearch.randomizedtesting.RandomizedRunner$9.evaluate(RandomizedRunner.java:943)
	at com.carrotsearch.randomizedtesting.RandomizedRunner$10.evaluate(RandomizedRunner.java:957)
	at com.carrotsearch.randomizedtesting.rules.SystemPropertiesRestoreRule$1.evaluate(SystemPropertiesRestoreRule.java:57)
	at org.apache.lucene.util.TestRuleSetupTeardownChained$1.evaluate(TestRuleSetupTeardownChained.java:49)
	at org.apache.lucene.util.AbstractBeforeAfterRule$1.evaluate(AbstractBeforeAfterRule.java:45)
	at org.apache.lucene.util.TestRuleThreadAndTestName$1.evaluate(TestRuleThreadAndTestName.java:48)
	at org.apache.lucene.util.TestRuleIgnoreAfterMaxFailures$1.evaluate(TestRuleIgnoreAfterMaxFailures.java:64)
	at org.apache.lucene.util.TestRuleMarkFailure$1.evaluate(TestRuleMarkFailure.java:47)
	at com.carrotsearch.randomizedtesting.rules.StatementAdapter.evaluate(StatementAdapter.java:36)
	at com.carrotsearch.randomizedtesting.ThreadLeakControl$StatementRunner.run(ThreadLeakControl.java:367)
	at com.carrotsearch.randomizedtesting.ThreadLeakControl.forkTimeoutingTask(ThreadLeakControl.java:811)
	at com.carrotsearch.randomizedtesting.ThreadLeakControl$3.evaluate(ThreadLeakControl.java:462)
	at com.carrotsearch.randomizedtesting.RandomizedRunner.runSingleTest(RandomizedRunner.java:916)
	at com.carrotsearch.randomizedtesting.RandomizedRunner$5.evaluate(RandomizedRunner.java:802)
	at com.carrotsearch.randomizedtesting.RandomizedRunner$6.evaluate(RandomizedRunner.java:852)
	at com.carrotsearch.randomizedtesting.RandomizedRunner$7.evaluate(RandomizedRunner.java:863)
	at com.carrotsearch.randomizedtesting.rules.StatementAdapter.evaluate(StatementAdapter.java:36)
	at com.carrotsearch.randomizedtesting.rules.SystemPropertiesRestoreRule$1.evaluate(SystemPropertiesRestoreRule.java:57)
	at org.apache.lucene.util.AbstractBeforeAfterRule$1.evaluate(AbstractBeforeAfterRule.java:45)
	at com.carrotsearch.randomizedtesting.rules.StatementAdapter.evaluate(StatementAdapter.java:36)
	at org.apache.lucene.util.TestRuleStoreClassName$1.evaluate(TestRuleStoreClassName.java:41)
	at com.carrotsearch.randomizedtesting.rules.NoShadowingOrOverridesOnMethodsRule$1.evaluate(NoShadowingOrOverridesOnMethodsRule.java:40)
	at com.carrotsearch.randomizedtesting.rules.NoShadowingOrOverridesOnMethodsRule$1.evaluate(NoShadowingOrOverridesOnMethodsRule.java:40)
	at com.carrotsearch.randomizedtesting.rules.StatementAdapter.evaluate(StatementAdapter.java:36)
	at com.carrotsearch.randomizedtesting.rules.StatementAdapter.evaluate(StatementAdapter.java:36)
	at com.carrotsearch.randomizedtesting.rules.StatementAdapter.evaluate(StatementAdapter.java:36)
	at org.apache.lucene.util.TestRuleAssertionsRequired$1.evaluate(TestRuleAssertionsRequired.java:53)
	at org.apache.lucene.util.TestRuleMarkFailure$1.evaluate(TestRuleMarkFailure.java:47)
	at org.apache.lucene.util.TestRuleIgnoreAfterMaxFailures$1.evaluate(TestRuleIgnoreAfterMaxFailures.java:64)
	at org.apache.lucene.util.TestRuleIgnoreTestSuites$1.evaluate(TestRuleIgnoreTestSuites.java:54)
	at com.carrotsearch.randomizedtesting.rules.StatementAdapter.evaluate(StatementAdapter.java:36)
	at com.carrotsearch.randomizedtesting.ThreadLeakControl$StatementRunner.run(ThreadLeakControl.java:367)
	at java.lang.Thread.run(Thread.java:745)


FAILED:  org.apache.solr.cloud.hdfs.HdfsCollectionsAPIDistributedZkTest.testSpecificConfigsets

Error Message:
KeeperErrorCode = NoNode for /collections/withconfigset2

Stack Trace:
org.apache.zookeeper.KeeperException$NoNodeException: KeeperErrorCode = NoNode for /collections/withconfigset2
	at __randomizedtesting.SeedInfo.seed([BA2AB614EBF0E90B:9754F94E1CD45307]:0)
	at org.apache.zookeeper.KeeperException.create(KeeperException.java:111)
	at org.apache.zookeeper.KeeperException.create(KeeperException.java:51)
	at org.apache.zookeeper.ZooKeeper.getData(ZooKeeper.java:1155)
	at org.apache.solr.common.cloud.SolrZkClient$7.execute(SolrZkClient.java:356)
	at org.apache.solr.common.cloud.SolrZkClient$7.execute(SolrZkClient.java:353)
	at org.apache.solr.common.cloud.ZkCmdExecutor.retryOperation(ZkCmdExecutor.java:60)
	at org.apache.solr.common.cloud.SolrZkClient.getData(SolrZkClient.java:353)
	at org.apache.solr.cloud.CollectionsAPIDistributedZkTest.testSpecificConfigsets(CollectionsAPIDistributedZkTest.java:425)
	at sun.reflect.NativeMethodAccessorImpl.invoke0(Native Method)
	at sun.reflect.NativeMethodAccessorImpl.invoke(NativeMethodAccessorImpl.java:62)
	at sun.reflect.DelegatingMethodAccessorImpl.invoke(DelegatingMethodAccessorImpl.java:43)
	at java.lang.reflect.Method.invoke(Method.java:498)
	at com.carrotsearch.randomizedtesting.RandomizedRunner.invoke(RandomizedRunner.java:1713)
	at com.carrotsearch.randomizedtesting.RandomizedRunner$8.evaluate(RandomizedRunner.java:907)
	at com.carrotsearch.randomizedtesting.RandomizedRunner$9.evaluate(RandomizedRunner.java:943)
	at com.carrotsearch.randomizedtesting.RandomizedRunner$10.evaluate(RandomizedRunner.java:957)
	at com.carrotsearch.randomizedtesting.rules.SystemPropertiesRestoreRule$1.evaluate(SystemPropertiesRestoreRule.java:57)
	at org.apache.lucene.util.TestRuleSetupTeardownChained$1.evaluate(TestRuleSetupTeardownChained.java:49)
	at org.apache.lucene.util.AbstractBeforeAfterRule$1.evaluate(AbstractBeforeAfterRule.java:45)
	at org.apache.lucene.util.TestRuleThreadAndTestName$1.evaluate(TestRuleThreadAndTestName.java:48)
	at org.apache.lucene.util.TestRuleIgnoreAfterMaxFailures$1.evaluate(TestRuleIgnoreAfterMaxFailures.java:64)
	at org.apache.lucene.util.TestRuleMarkFailure$1.evaluate(TestRuleMarkFailure.java:47)
	at com.carrotsearch.randomizedtesting.rules.StatementAdapter.evaluate(StatementAdapter.java:36)
	at com.carrotsearch.randomizedtesting.ThreadLeakControl$StatementRunner.run(ThreadLeakControl.java:367)
	at com.carrotsearch.randomizedtesting.ThreadLeakControl.forkTimeoutingTask(ThreadLeakControl.java:811)
	at com.carrotsearch.randomizedtesting.ThreadLeakControl$3.evaluate(ThreadLeakControl.java:462)
	at com.carrotsearch.randomizedtesting.RandomizedRunner.runSingleTest(RandomizedRunner.java:916)
	at com.carrotsearch.randomizedtesting.RandomizedRunner$5.evaluate(RandomizedRunner.java:802)
	at com.carrotsearch.randomizedtesting.RandomizedRunner$6.evaluate(RandomizedRunner.java:852)
	at com.carrotsearch.randomizedtesting.RandomizedRunner$7.evaluate(RandomizedRunner.java:863)
	at com.carrotsearch.randomizedtesting.rules.StatementAdapter.evaluate(StatementAdapter.java:36)
	at com.carrotsearch.randomizedtesting.rules.SystemPropertiesRestoreRule$1.evaluate(SystemPropertiesRestoreRule.java:57)
	at org.apache.lucene.util.AbstractBeforeAfterRule$1.evaluate(AbstractBeforeAfterRule.java:45)
	at com.carrotsearch.randomizedtesting.rules.StatementAdapter.evaluate(StatementAdapter.java:36)
	at org.apache.lucene.util.TestRuleStoreClassName$1.evaluate(TestRuleStoreClassName.java:41)
	at com.carrotsearch.randomizedtesting.rules.NoShadowingOrOverridesOnMethodsRule$1.evaluate(NoShadowingOrOverridesOnMethodsRule.java:40)
	at com.carrotsearch.randomizedtesting.rules.NoShadowingOrOverridesOnMethodsRule$1.evaluate(NoShadowingOrOverridesOnMethodsRule.java:40)
	at com.carrotsearch.randomizedtesting.rules.StatementAdapter.evaluate(StatementAdapter.java:36)
	at com.carrotsearch.randomizedtesting.rules.StatementAdapter.evaluate(StatementAdapter.java:36)
	at com.carrotsearch.randomizedtesting.rules.StatementAdapter.evaluate(StatementAdapter.java:36)
	at org.apache.lucene.util.TestRuleAssertionsRequired$1.evaluate(TestRuleAssertionsRequired.java:53)
	at org.apache.lucene.util.TestRuleMarkFailure$1.evaluate(TestRuleMarkFailure.java:47)
	at org.apache.lucene.util.TestRuleIgnoreAfterMaxFailures$1.evaluate(TestRuleIgnoreAfterMaxFailures.java:64)
	at org.apache.lucene.util.TestRuleIgnoreTestSuites$1.evaluate(TestRuleIgnoreTestSuites.java:54)
	at com.carrotsearch.randomizedtesting.rules.StatementAdapter.evaluate(StatementAdapter.java:36)
	at com.carrotsearch.randomizedtesting.ThreadLeakControl$StatementRunner.run(ThreadLeakControl.java:367)
	at java.lang.Thread.run(Thread.java:745)




Build Log:
[...truncated 12205 lines...]
   [junit4] Suite: org.apache.solr.TestDistributedSearch
   [junit4]   2> Creating dataDir: /x1/jenkins/jenkins-slave/workspace/Lucene-Solr-NightlyTests-6.x/checkout/solr/build/solr-core/test/J2/temp/solr.TestDistributedSearch_BA2AB614EBF0E90B-001/init-core-data-001
   [junit4]   2> 1857046 INFO  (SUITE-TestDistributedSearch-seed#[BA2AB614EBF0E90B]-worker) [    ] o.a.s.SolrTestCaseJ4 Randomized ssl (false) and clientAuth (false) via: @org.apache.solr.SolrTestCaseJ4$SuppressSSL(bugUrl=https://issues.apache.org/jira/browse/SOLR-9061)
   [junit4]   2> 1857047 INFO  (SUITE-TestDistributedSearch-seed#[BA2AB614EBF0E90B]-worker) [    ] o.a.s.BaseDistributedSearchTestCase Setting hostContext system property: /xk_v/
   [junit4]   2> 1857158 INFO  (TEST-TestDistributedSearch.test-seed#[BA2AB614EBF0E90B]) [    ] o.a.s.SolrTestCaseJ4 Writing core.properties file to /x1/jenkins/jenkins-slave/workspace/Lucene-Solr-NightlyTests-6.x/checkout/solr/build/solr-core/test/J2/temp/solr.TestDistributedSearch_BA2AB614EBF0E90B-001/tempDir-001/control/cores/collection1
   [junit4]   2> 1857159 INFO  (TEST-TestDistributedSearch.test-seed#[BA2AB614EBF0E90B]) [    ] o.e.j.s.Server jetty-9.3.14.v20161028
   [junit4]   2> 1857163 INFO  (TEST-TestDistributedSearch.test-seed#[BA2AB614EBF0E90B]) [    ] o.e.j.s.h.ContextHandler Started o.e.j.s.ServletContextHandler@3a42d1f9{/xk_v,null,AVAILABLE}
   [junit4]   2> 1857164 INFO  (TEST-TestDistributedSearch.test-seed#[BA2AB614EBF0E90B]) [    ] o.e.j.s.AbstractConnector Started ServerConnector@47360f5d{HTTP/1.1,[http/1.1]}{127.0.0.1:41233}
   [junit4]   2> 1857164 INFO  (TEST-TestDistributedSearch.test-seed#[BA2AB614EBF0E90B]) [    ] o.e.j.s.Server Started @1861416ms
   [junit4]   2> 1857164 INFO  (TEST-TestDistributedSearch.test-seed#[BA2AB614EBF0E90B]) [    ] o.a.s.c.s.e.JettySolrRunner Jetty properties: {hostContext=/xk_v, hostPort=41233, coreRootDirectory=/x1/jenkins/jenkins-slave/workspace/Lucene-Solr-NightlyTests-6.x/checkout/solr/build/solr-core/test/J2/temp/solr.TestDistributedSearch_BA2AB614EBF0E90B-001/tempDir-001/control/cores}
   [junit4]   2> 1857164 ERROR (TEST-TestDistributedSearch.test-seed#[BA2AB614EBF0E90B]) [    ] o.a.s.s.StartupLoggingUtils Missing Java Option solr.log.dir. Logging may be missing or incomplete.
   [junit4]   2> 1857164 INFO  (TEST-TestDistributedSearch.test-seed#[BA2AB614EBF0E90B]) [    ] o.a.s.s.SolrDispatchFilter  ___      _       Welcome to Apache Solr? version 6.4.0
   [junit4]   2> 1857164 INFO  (TEST-TestDistributedSearch.test-seed#[BA2AB614EBF0E90B]) [    ] o.a.s.s.SolrDispatchFilter / __| ___| |_ _   Starting in standalone mode on port null
   [junit4]   2> 1857164 INFO  (TEST-TestDistributedSearch.test-seed#[BA2AB614EBF0E90B]) [    ] o.a.s.s.SolrDispatchFilter \__ \/ _ \ | '_|  Install dir: null
   [junit4]   2> 1857164 INFO  (TEST-TestDistributedSearch.test-seed#[BA2AB614EBF0E90B]) [    ] o.a.s.s.SolrDispatchFilter |___/\___/_|_|    Start time: 2016-12-14T06:03:46.713Z
   [junit4]   2> 1857165 INFO  (TEST-TestDistributedSearch.test-seed#[BA2AB614EBF0E90B]) [    ] o.a.s.c.SolrXmlConfig Loading container configuration from /x1/jenkins/jenkins-slave/workspace/Lucene-Solr-NightlyTests-6.x/checkout/solr/build/solr-core/test/J2/temp/solr.TestDistributedSearch_BA2AB614EBF0E90B-001/tempDir-001/control/solr.xml
   [junit4]   2> 1857183 INFO  (TEST-TestDistributedSearch.test-seed#[BA2AB614EBF0E90B]) [    ] o.a.s.u.UpdateShardHandler Creating UpdateShardHandler HTTP client with params: socketTimeout=340000&connTimeout=45000&retry=true
   [junit4]   2> 1857185 INFO  (TEST-TestDistributedSearch.test-seed#[BA2AB614EBF0E90B]) [    ] o.a.s.c.CorePropertiesLocator Found 1 core definitions underneath /x1/jenkins/jenkins-slave/workspace/Lucene-Solr-NightlyTests-6.x/checkout/solr/build/solr-core/test/J2/temp/solr.TestDistributedSearch_BA2AB614EBF0E90B-001/tempDir-001/control/cores
   [junit4]   2> 1857185 INFO  (TEST-TestDistributedSearch.test-seed#[BA2AB614EBF0E90B]) [    ] o.a.s.c.CorePropertiesLocator Cores are: [collection1]
   [junit4]   2> 1857186 INFO  (coreLoadExecutor-4008-thread-1) [    x:collection1] o.a.s.c.SolrResourceLoader [null] Added 2 libs to classloader, from paths: [/x1/jenkins/jenkins-slave/workspace/Lucene-Solr-NightlyTests-6.x/checkout/solr/core/src/test-files/solr/collection1/lib, /x1/jenkins/jenkins-slave/workspace/Lucene-Solr-NightlyTests-6.x/checkout/solr/core/src/test-files/solr/collection1/lib/classes]
   [junit4]   2> 1857223 INFO  (coreLoadExecutor-4008-thread-1) [    x:collection1] o.a.s.c.SolrConfig Using Lucene MatchVersion: 6.4.0
   [junit4]   2> 1857246 INFO  (coreLoadExecutor-4008-thread-1) [    x:collection1] o.a.s.s.IndexSchema [collection1] Schema name=test
   [junit4]   2> 1857472 WARN  (coreLoadExecutor-4008-thread-1) [    x:collection1] o.a.s.s.IndexSchema [collection1] default search field in schema is text. WARNING: Deprecated, please use 'df' on request instead.
   [junit4]   2> 1857475 INFO  (coreLoadExecutor-4008-thread-1) [    x:collection1] o.a.s.s.IndexSchema Loaded schema test/1.0 with uniqueid field id
   [junit4]   2> 1857482 INFO  (coreLoadExecutor-4008-thread-1) [    x:collection1] o.a.s.c.CoreContainer Creating SolrCore 'collection1' using configuration from configset /x1/jenkins/jenkins-slave/workspace/Lucene-Solr-NightlyTests-6.x/checkout/solr/core/src/test-files/solr/collection1
   [junit4]   2> 1857482 INFO  (coreLoadExecutor-4008-thread-1) [    x:collection1] o.a.s.c.SolrCore [[collection1] ] Opening new SolrCore at [/x1/jenkins/jenkins-slave/workspace/Lucene-Solr-NightlyTests-6.x/checkout/solr/core/src/test-files/solr/collection1], dataDir=[/x1/jenkins/jenkins-slave/workspace/Lucene-Solr-NightlyTests-6.x/checkout/solr/build/solr-core/test/J2/temp/solr.TestDistributedSearch_BA2AB614EBF0E90B-001/tempDir-001/control/cores/collection1/data/]
   [junit4]   2> 1857482 INFO  (coreLoadExecutor-4008-thread-1) [    x:collection1] o.a.s.c.JmxMonitoredMap JMX monitoring is enabled. Adding Solr mbeans to JMX Server: com.sun.jmx.mbeanserver.JmxMBeanServer@372744bc
   [junit4]   2> 1857483 INFO  (coreLoadExecutor-4008-thread-1) [    x:collection1] o.a.s.u.RandomMergePolicy RandomMergePolicy wrapping class org.apache.lucene.index.TieredMergePolicy: [TieredMergePolicy: maxMergeAtOnce=40, maxMergeAtOnceExplicit=42, maxMergedSegmentMB=2.14453125, floorSegmentMB=0.546875, forceMergeDeletesPctAllowed=15.595046442789211, segmentsPerTier=24.0, maxCFSSegmentSizeMB=8.796093022207999E12, noCFSRatio=0.5225518953895274
   [junit4]   2> 1857496 INFO  (coreLoadExecutor-4008-thread-1) [    x:collection1] o.a.s.u.CommitTracker Hard AutoCommit: disabled
   [junit4]   2> 1857496 INFO  (coreLoadExecutor-4008-thread-1) [    x:collection1] o.a.s.u.CommitTracker Soft AutoCommit: disabled
   [junit4]   2> 1857497 INFO  (coreLoadExecutor-4008-thread-1) [    x:collection1] o.a.s.u.RandomMergePolicy RandomMergePolicy wrapping class org.apache.lucene.index.TieredMergePolicy: [TieredMergePolicy: maxMergeAtOnce=14, maxMergeAtOnceExplicit=19, maxMergedSegmentMB=95.69921875, floorSegmentMB=1.3271484375, forceMergeDeletesPctAllowed=2.5942331965865053, segmentsPerTier=19.0, maxCFSSegmentSizeMB=8.796093022207999E12, noCFSRatio=0.6219155831562324
   [junit4]   2> 1857497 INFO  (coreLoadExecutor-4008-thread-1) [    x:collection1] o.a.s.s.SolrIndexSearcher Opening [Searcher@48a06abc[collection1] main]
   [junit4]   2> 1857497 INFO  (coreLoadExecutor-4008-thread-1) [    x:collection1] o.a.s.h.c.SpellCheckComponent Initializing spell checkers
   [junit4]   2> 1857518 INFO  (coreLoadExecutor-4008-thread-1) [    x:collection1] o.a.s.s.DirectSolrSpellChecker init: {name=direct,classname=DirectSolrSpellChecker,field=lowerfilt,minQueryLength=3}
   [junit4]   2> 1857560 INFO  (coreLoadExecutor-4008-thread-1) [    x:collection1] o.a.s.h.ReplicationHandler Commits will be reserved for  10000
   [junit4]   2> 1857561 INFO  (searcherExecutor-4009-thread-1-processing-x:collection1) [    x:collection1] o.a.s.h.c.SpellCheckComponent Loading spell index for spellchecker: default
   [junit4]   2> 1857561 INFO  (searcherExecutor-4009-thread-1-processing-x:collection1) [    x:collection1] o.a.s.h.c.SpellCheckComponent Loading spell index for spellchecker: direct
   [junit4]   2> 1857561 INFO  (searcherExecutor-4009-thread-1-processing-x:collection1) [    x:collection1] o.a.s.h.c.SpellCheckComponent Loading spell index for spellchecker: wordbreak
   [junit4]   2> 1857561 INFO  (searcherExecutor-4009-thread-1-processing-x:collection1) [    x:collection1] o.a.s.h.c.SpellCheckComponent Loading spell index for spellchecker: multipleFields
   [junit4]   2> 1857562 INFO  (searcherExecutor-4009-thread-1-processing-x:collection1) [    x:collection1] o.a.s.h.c.SpellCheckComponent Loading spell index for spellchecker: jarowinkler
   [junit4]   2> 1857562 INFO  (searcherExecutor-4009-thread-1-processing-x:collection1) [    x:collection1] o.a.s.h.c.SpellCheckComponent Loading spell index for spellchecker: external
   [junit4]   2> 1857562 INFO  (searcherExecutor-4009-thread-1-processing-x:collection1) [    x:collection1] o.a.s.h.c.SpellCheckComponent Loading spell index for spellchecker: freq
   [junit4]   2> 1857562 INFO  (searcherExecutor-4009-thread-1-processing-x:collection1) [    x:collection1] o.a.s.h.c.SpellCheckComponent Loading spell index for spellchecker: fqcn
   [junit4]   2> 1857562 INFO  (searcherExecutor-4009-thread-1-processing-x:collection1) [    x:collection1] o.a.s.h.c.SpellCheckComponent Loading spell index for spellchecker: perDict
   [junit4]   2> 1857563 INFO  (searcherExecutor-4009-thread-1-processing-x:collection1) [    x:collection1] o.a.s.c.SolrCore [collection1] Registered new searcher Searcher@48a06abc[collection1] main{ExitableDirectoryReader(UninvertingDirectoryReader())}
   [junit4]   2> 1857822 INFO  (TEST-TestDistributedSearch.test-seed#[BA2AB614EBF0E90B]) [    ] o.a.s.SolrTestCaseJ4 Writing core.properties file to /x1/jenkins/jenkins-slave/workspace/Lucene-Solr-NightlyTests-6.x/checkout/solr/build/solr-core/test/J2/temp/solr.TestDistributedSearch_BA2AB614EBF0E90B-001/tempDir-001/shard0/cores/collection1
   [junit4]   2> 1857826 INFO  (TEST-TestDistributedSearch.test-seed#[BA2AB614EBF0E90B]) [    ] o.e.j.s.Server jetty-9.3.14.v20161028
   [junit4]   2> 1857953 INFO  (TEST-TestDistributedSearch.test-seed#[BA2AB614EBF0E90B]) [    ] o.e.j.s.h.ContextHandler Started o.e.j.s.ServletContextHandler@6a0be0ec{/xk_v,null,AVAILABLE}
   [junit4]   2> 1857954 INFO  (TEST-TestDistributedSearch.test-seed#[BA2AB614EBF0E90B]) [    ] o.e.j.s.AbstractConnector Started ServerConnector@6b424674{HTTP/1.1,[http/1.1]}{127.0.0.1:43757}
   [junit4]   2> 1857954 INFO  (TEST-TestDistributedSearch.test-seed#[BA2AB614EBF0E90B]) [    ] o.e.j.s.Server Started @1862206ms
   [junit4]   2> 1857954 INFO  (TEST-TestDistributedSearch.test-seed#[BA2AB614EBF0E90B]) [    ] o.a.s.c.s.e.JettySolrRunner Jetty properties: {hostContext=/xk_v, hostPort=43757, coreRootDirectory=/x1/jenkins/jenkins-slave/workspace/Lucene-Solr-NightlyTests-6.x/checkout/solr/build/solr-core/test/J2/temp/solr.TestDistributedSearch_BA2AB614EBF0E90B-001/tempDir-001/shard0/cores}
   [junit4]   2> 1857954 ERROR (TEST-TestDistributedSearch.test-seed#[BA2AB614EBF0E90B]) [    ] o.a.s.s.StartupLoggingUtils Missing Java Option solr.log.dir. Logging may be missing or incomplete.
   [junit4]   2> 1857955 INFO  (TEST-TestDistributedSearch.test-seed#[BA2AB614EBF0E90B]) [    ] o.a.s.s.SolrDispatchFilter  ___      _       Welcome to Apache Solr? version 6.4.0
   [junit4]   2> 1857955 INFO  (TEST-TestDistributedSearch.test-seed#[BA2AB614EBF0E90B]) [    ] o.a.s.s.SolrDispatchFilter / __| ___| |_ _   Starting in standalone mode on port null
   [junit4]   2> 1857955 INFO  (TEST-TestDistributedSearch.test-seed#[BA2AB614EBF0E90B]) [    ] o.a.s.s.SolrDispatchFilter \__ \/ _ \ | '_|  Install dir: null
   [junit4]   2> 1857955 INFO  (TEST-TestDistributedSearch.test-seed#[BA2AB614EBF0E90B]) [    ] o.a.s.s.SolrDispatchFilter |___/\___/_|_|    Start time: 2016-12-14T06:03:47.504Z
   [junit4]   2> 1857980 INFO  (TEST-TestDistributedSearch.test-seed#[BA2AB614EBF0E90B]) [    ] o.a.s.c.SolrXmlConfig Loading container configuration from /x1/jenkins/jenkins-slave/workspace/Lucene-Solr-NightlyTests-6.x/checkout/solr/build/solr-core/test/J2/temp/solr.TestDistributedSearch_BA2AB614EBF0E90B-001/tempDir-001/shard0/solr.xml
   [junit4]   2> 1857988 INFO  (TEST-TestDistributedSearch.test-seed#[BA2AB614EBF0E90B]) [    ] o.a.s.u.UpdateShardHandler Creating UpdateShardHandler HTTP client with params: socketTimeout=340000&connTimeout=45000&retry=true
   [junit4]   2> 1857992 INFO  (TEST-TestDistributedSearch.test-seed#[BA2AB614EBF0E90B]) [    ] o.a.s.c.CorePropertiesLocator Found 1 core definitions underneath /x1/jenkins/jenkins-slave/workspace/Lucene-Solr-NightlyTests-6.x/checkout/solr/build/solr-core/test/J2/temp/solr.TestDistributedSearch_BA2AB614EBF0E90B-001/tempDir-001/shard0/cores
   [junit4]   2> 1857992 INFO  (TEST-TestDistributedSearch.test-seed#[BA2AB614EBF0E90B]) [    ] o.a.s.c.CorePropertiesLocator Cores are: [collection1]
   [junit4]   2> 1857996 INFO  (coreLoadExecutor-4018-thread-1) [    x:collection1] o.a.s.c.SolrResourceLoader [null] Added 2 libs to classloader, from paths: [/x1/jenkins/jenkins-slave/workspace/Lucene-Solr-NightlyTests-6.x/checkout/solr/core/src/test-files/solr/collection1/lib, /x1/jenkins/jenkins-slave/workspace/Lucene-Solr-NightlyTests-6.x/checkout/solr/core/src/test-files/solr/collection1/lib/classes]
   [junit4]   2> 1858066 INFO  (coreLoadExecutor-4018-thread-1) [    x:collection1] o.a.s.c.SolrConfig Using Lucene MatchVersion: 6.4.0
   [junit4]   2> 1858125 INFO  (coreLoadExecutor-4018-thread-1) [    x:collection1] o.a.s.s.IndexSchema [collection1] Schema name=test
   [junit4]   2> 1858314 WARN  (coreLoadExecutor-4018-thread-1) [    x:collection1] o.a.s.s.IndexSchema [collection1] default search field in schema is text. WARNING: Deprecated, please use 'df' on request instead.
   [junit4]   2> 1858317 INFO  (coreLoadExecutor-4018-thread-1) [    x:collection1] o.a.s.s.IndexSchema Loaded schema test/1.0 with uniqueid field id
   [junit4]   2> 1858335 INFO  (coreLoadExecutor-4018-thread-1) [    x:collection1] o.a.s.c.CoreContainer Creating SolrCore 'collection1' using configuration from configset /x1/jenkins/jenkins-slave/workspace/Lucene-Solr-NightlyTests-6.x/checkout/solr/core/src/test-files/solr/collection1
   [junit4]   2> 1858335 INFO  (coreLoadExecutor-4018-thread-1) [    x:collection1] o.a.s.c.SolrCore [[collection1] ] Opening new SolrCore at [/x1/jenkins/jenkins-slave/workspace/Lucene-Solr-NightlyTests-6.x/checkout/solr/core/src/test-files/solr/collection1], dataDir=[/x1/jenkins/jenkins-slave/workspace/Lucene-Solr-NightlyTests-6.x/checkout/solr/build/solr-core/test/J2/temp/solr.TestDistributedSearch_BA2AB614EBF0E90B-001/tempDir-001/shard0/cores/collection1/data/]
   [junit4]   2> 1858336 INFO  (coreLoadExecutor-4018-thread-1) [    x:collection1] o.a.s.c.JmxMonitoredMap JMX monitoring is enabled. Adding Solr mbeans to JMX Server: com.sun.jmx.mbeanserver.JmxMBeanServer@372744bc
   [junit4]   2> 1858337 INFO  (coreLoadExecutor-4018-thread-1) [    x:collection1] o.a.s.u.RandomMergePolicy RandomMergePolicy wrapping class org.apache.lucene.index.TieredMergePolicy: [TieredMergePolicy: maxMergeAtOnce=40, maxMergeAtOnceExplicit=42, maxMergedSegmentMB=2.14453125, floorSegmentMB=0.546875, forceMergeDeletesPctAllowed=15.595046442789211, segmentsPerTier=24.0, maxCFSSegmentSizeMB=8.796093022207999E12, noCFSRatio=0.5225518953895274
   [junit4]   2> 1858377 INFO  (coreLoadExecutor-4018-thread-1) [    x:collection1] o.a.s.u.CommitTracker Hard AutoCommit: disabled
   [junit4]   2> 1858377 INFO  (coreLoadExecutor-4018-thread-1) [    x:collection1] o.a.s.u.CommitTracker Soft AutoCommit: disabled
   [junit4]   2> 1858377 INFO  (coreLoadExecutor-4018-thread-1) [    x:collection1] o.a.s.u.RandomMergePolicy RandomMergePolicy wrapping class org.apache.lucene.index.TieredMergePolicy: [TieredMergePolicy: maxMergeAtOnce=14, maxMergeAtOnceExplicit=19, maxMergedSegmentMB=95.69921875, floorSegmentMB=1.3271484375, forceMergeDeletesPctAllowed=2.5942331965865053, segmentsPerTier=19.0, maxCFSSegmentSizeMB=8.796093022207999E12, noCFSRatio=0.6219155831562324
   [junit4]   2> 1858378 INFO  (coreLoadExecutor-4018-thread-1) [    x:collection1] o.a.s.s.SolrIndexSearcher Opening [Searcher@4ad54a12[collection1] main]
   [junit4]   2> 1858378 INFO  (coreLoadExecutor-4018-thread-1) [    x:collection1] o.a.s.h.c.SpellCheckComponent Initializing spell checkers
   [junit4]   2> 1858387 INFO  (coreLoadExecutor-4018-thread-1) [    x:collection1] o.a.s.s.DirectSolrSpellChecker init: {name=direct,classname=DirectSolrSpellChecker,field=lowerfilt,minQueryLength=3}
   [junit4]   2> 1858526 INFO  (coreLoadExecutor-4018-thread-1) [    x:collection1] o.a.s.h.ReplicationHandler Commits will be reserved for  10000
   [junit4]   2> 1858526 INFO  (searcherExecutor-4019-thread-1-processing-x:collection1) [    x:collection1] o.a.s.h.c.SpellCheckComponent Loading spell index for spellchecker: default
   [junit4]   2> 1858526 INFO  (searcherExecutor-4019-thread-1-processing-x:collection1) [    x:collection1] o.a.s.h.c.SpellCheckComponent Loading spell index for spellchecker: direct
   [junit4]   2> 1858526 INFO  (searcherExecutor-4019-thread-1-processing-x:collection1) [    x:collection1] o.a.s.h.c.SpellCheckComponent Loading spell index for spellchecker: wordbreak
   [junit4]   2> 1858526 INFO  (searcherExecutor-4019-thread-1-processing-x:collection1) [    x:collection1] o.a.s.h.c.SpellCheckComponent Loading spell index for spellchecker: multipleFields
   [junit4]   2> 1858527 INFO  (searcherExecutor-4019-thread-1-processing-x:collection1) [    x:collection1] o.a.s.h.c.SpellCheckComponent Loading spell index for spellchecker: jarowinkler
   [junit4]   2> 1858527 INFO  (searcherExecutor-4019-thread-1-processing-x:collection1) [    x:collection1] o.a.s.h.c.SpellCheckComponent Loading spell index for spellchecker: external
   [junit4]   2> 1858527 INFO  (searcherExecutor-4019-thread-1-processing-x:collection1) [    x:collection1] o.a.s.h.c.SpellCheckComponent Loading spell index for spellchecker: freq
   [junit4]   2> 1858527 INFO  (searcherExecutor-4019-thread-1-processing-x:collection1) [    x:collection1] o.a.s.h.c.SpellCheckComponent Loading spell index for spellchecker: fqcn
   [junit4]   2> 1858527 INFO  (searcherExecutor-4019-thread-1-processing-x:collection1) [    x:collection1] o.a.s.h.c.SpellCheckComponent Loading spell index for spellchecker: perDict
   [junit4]   2> 1858528 INFO  (searcherExecutor-4019-thread-1-processing-x:collection1) [    x:collection1] o.a.s.c.SolrCore [collection1] Registered new searcher Searcher@4ad54a12[collection1] main{ExitableDirectoryReader(UninvertingDirectoryReader())}
   [junit4]   2> 1859026 INFO  (TEST-TestDistributedSearch.test-seed#[BA2AB614EBF0E90B]) [    ] o.a.s.SolrTestCaseJ4 ###Starting test
   [junit4]   2> 1859035 INFO  (qtp488607139-51295) [    x:collection1] o.a.s.u.DirectUpdateHandler2 [collection1] REMOVING ALL DOCUMENTS FROM INDEX
   [junit4]   2> 1859043 INFO  (qtp488607139-51295) [    x:collection1] o.a.s.u.p.LogUpdateProcessorFactory [collection1]  webapp=/xk_v path=/update params={wt=javabin&version=2}{deleteByQuery=*:*} 0 8
   [junit4]   2> 1859056 INFO  (qtp1369025570-51312) [    x:collection1] o.a.s.u.DirectUpdateHandler2 [collection1] REMOVING ALL DOCUMENTS FROM INDEX
   [junit4]   2> 1859064 INFO  (qtp1369025570-51312) [    x:collection1] o.a.s.u.p.LogUpdateProcessorFactory [collection1]  webapp=/xk_v path=/update params={wt=javabin&version=2}{deleteByQuery=*:*} 0 7
   [junit4]   2> 1859068 INFO  (qtp488607139-51296) [    x:collection1] o.a.s.u.p.LogUpdateProcessorFactory [collection1]  webapp=/xk_v path=/update params={wt=javabin&version=2}{add=[1]} 0 2
   [junit4]   2> 1859074 INFO  (qtp1369025570-51313) [    x:collection1] o.a.s.u.p.LogUpdateProcessorFactory [collection1]  webapp=/xk_v path=/update params={wt=javabin&version=2}{add=[1]} 0 3
   [junit4]   2> 1859081 INFO  (qtp488607139-51297) [    x:collection1] o.a.s.u.p.LogUpdateProcessorFactory [collection1]  webapp=/xk_v path=/update params={wt=javabin&version=2}{add=[2]} 0 0
   [junit4]   2> 1859083 INFO  (qtp1369025570-51314) [    x:collection1] o.a.s.u.p.LogUpdateProcessorFactory [collection1]  webapp=/xk_v path=/update params={wt=javabin&version=2}{add=[2]} 0 0
   [junit4]   2> 1859085 INFO  (qtp488607139-51297) [    x:collection1] o.a.s.u.p.LogUpdateProcessorFactory [collection1]  webapp=/xk_v path=/update params={wt=javabin&version=2}{add=[3]} 0 0
   [junit4]   2> 1859087 INFO  (qtp1369025570-51314) [    x:collection1] o.a.s.u.p.LogUpdateProcessorFactory [collection1]  webapp=/xk_v path=/update params={wt=javabin&version=2}{add=[3]} 0 0
   [junit4]   2> 1859089 INFO  (qtp488607139-51297) [    x:collection1] o.a.s.u.p.LogUpdateProcessorFactory [collection1]  webapp=/xk_v path=/update params={wt=javabin&version=2}{add=[4]} 0 0
   [junit4]   2> 1859092 INFO  (qtp1369025570-51314) [    x:collection1] o.a.s.u.p.LogUpdateProcessorFactory [collection1]  webapp=/xk_v path=/update params={wt=javabin&version=2}{add=[4]} 0 0
   [junit4]   2> 1859095 INFO  (qtp488607139-51297) [    x:collection1] o.a.s.u.p.LogUpdateProcessorFactory [collection1]  webapp=/xk_v path=/update params={wt=javabin&version=2}{add=[5]} 0 0
   [junit4]   2> 1859097 INFO  (qtp1369025570-51314) [    x:collection1] o.a.s.u.p.LogUpdateProcessorFactory [collection1]  webapp=/xk_v path=/update params={wt=javabin&version=2}{add=[5]} 0 0
   [junit4]   2> 1859099 INFO  (qtp488607139-51297) [    x:collection1] o.a.s.u.p.LogUpdateProcessorFactory [collection1]  webapp=/xk_v path=/update params={wt=javabin&version=2}{add=[6]} 0 0
   [junit4]   2> 1859102 INFO  (qtp1369025570-51312) [    x:collection1] o.a.s.u.p.LogUpdateProcessorFactory [collection1]  webapp=/xk_v path=/update params={wt=javabin&version=2}{add=[6]} 0 0
   [junit4]   2> 1859104 INFO  (qtp488607139-51297) [    x:collection1] o.a.s.u.p.LogUpdateProcessorFactory [collection1]  webapp=/xk_v path=/update params={wt=javabin&version=2}{add=[7]} 0 0
   [junit4]   2> 1859106 INFO  (qtp1369025570-51313) [    x:collection1] o.a.s.u.p.LogUpdateProcessorFactory [collection1]  webapp=/xk_v path=/update params={wt=javabin&version=2}{add=[7]} 0 0
   [junit4]   2> 1859111 INFO  (qtp488607139-51297) [    x:collection1] o.a.s.u.p.LogUpdateProcessorFactory [collection1]  webapp=/xk_v path=/update params={wt=javabin&version=2}{add=[8]} 0 0
   [junit4]   2> 1859114 INFO  (qtp1369025570-51315) [    x:collection1] o.a.s.u.p.LogUpdateProcessorFactory [collection1]  webapp=/xk_v path=/update params={wt=javabin&version=2}{add=[8]} 0 0
   [junit4]   2> 1859118 INFO  (qtp488607139-51299) [    x:collection1] o.a.s.u.p.LogUpdateProcessorFactory [collection1]  webapp=/xk_v path=/update params={wt=javabin&version=2}{add=[9]} 0 0
   [junit4]   2> 1859120 INFO  (qtp1369025570-51315) [    x:collection1] o.a.s.u.p.LogUpdateProcessorFactory [collection1]  webapp=/xk_v path=/update params={wt=javabin&version=2}{add=[9]} 0 0
   [junit4]   2> 1859121 INFO  (qtp488607139-51299) [    x:collection1] o.a.s.u.DirectUpdateHandler2 start commit{,optimize=false,openSearcher=true,waitSearcher=true,expungeDeletes=false,softCommit=false,prepareCommit=false}
   [junit4]   2> 1859121 INFO  (qtp488607139-51299) [    x:collection1] o.a.s.u.SolrIndexWriter Calling setCommitData with IW:org.apache.solr.update.SolrIndexWriter@45e15da4
   [junit4]   2> 1859146 INFO  (qtp488607139-51299) [    x:collection1] o.a.s.s.SolrIndexSearcher Opening [Searcher@4d0cfb3b[collection1] main]
   [junit4]   2> 1859146 INFO  (qtp488607139-51299) [    x:collection1] o.a.s.u.DirectUpdateHandler2 end_commit_flush
   [junit4]   2> 1859147 INFO  (searcherExecutor-4009-thread-1-processing-x:collection1) [    x:collection1] o.a.s.c.SolrCore [collection1] Registered new searcher Searcher@4d0cfb3b[collection1] main{ExitableDirectoryReader(UninvertingDirectoryReader(Uninverting(_0(6.4.0):c9)))}
   [junit4]   2> 1859148 INFO  (qtp488607139-51299) [    x:collection1] o.a.s.u.p.LogUpdateProcessorFactory [collection1]  webapp=/xk_v path=/update params={waitSearcher=true&commit=true&softCommit=false&wt=javabin&version=2}{commit=} 0 26
   [junit4]   2> 1859149 INFO  (qtp1369025570-51315) [    x:collection1] o.a.s.u.DirectUpdateHandler2 start commit{,optimize=false,openSearcher=true,waitSearcher=true,expungeDeletes=false,softCommit=false,prepareCommit=false}
   [junit4]   2> 1859149 INFO  (qtp1369025570-51315) [    x:collection1] o.a.s.u.SolrIndexWriter Calling setCommitData with IW:org.apache.solr.update.SolrIndexWriter@24954d0e
   [junit4]   2> 1859161 INFO  (qtp1369025570-51315) [    x:collection1] o.a.s.s.SolrIndexSearcher Opening [Searcher@669f95c4[collection1] main]
   [junit4]   2> 1859161 INFO  (qtp1369025570-51315) [    x:collection1] o.a.s.u.DirectUpdateHandler2 end_commit_flush
   [junit4]   2> 1859162 INFO  (searcherExecutor-4019-thread-1-processing-x:collection1) [    x:collection1] o.a.s.c.SolrCore [collection1] Registered new searcher Searcher@669f95c4[collection1] main{ExitableDirectoryReader(UninvertingDirectoryReader(Uninverting(_0(6.4.0):c9)))}
   [junit4]   2> 1859168 INFO  (qtp1369025570-51315) [    x:collection1] o.a.s.u.p.LogUpdateProcessorFactory [collection1]  webapp=/xk_v path=/update params={waitSearcher=true&commit=true&softCommit=false&wt=javabin&version=2}{commit=} 0 18
   [junit4]   2> 1859171 INFO  (qtp488607139-51295) [    x:collection1] o.a.s.u.p.LogUpdateProcessorFactory [collection1]  webapp=/xk_v path=/update params={wt=javabin&version=2}{add=[10]} 0 1
   [junit4]   2> 1859174 INFO  (qtp1369025570-51314) [    x:collection1] o.a.s.u.p.LogUpdateProcessorFactory [collection1]  webapp=/xk_v path=/update params={wt=javabin&version=2}{add=[10]} 0 1
   [junit4]   2> 1859177 INFO  (qtp488607139-51296) [    x:collection1] o.a.s.u.p.LogUpdateProcessorFactory [collection1]  webapp=/xk_v path=/update params={wt=javabin&version=2}{add=[11]} 0 0
   [junit4]   2> 1859227 INFO  (qtp1369025570-51312) [    x:collection1] o.a.s.u.p.LogUpdateProcessorFactory [collection1]  webapp=/xk_v path=/update params={wt=javabin&version=2}{add=[11]} 0 48
   [junit4]   2> 1859230 INFO  (qtp488607139-51296) [    x:collection1] o.a.s.u.p.LogUpdateProcessorFactory [collection1]  webapp=/xk_v path=/update params={wt=javabin&version=2}{add=[12]} 0 0
   [junit4]   2> 1859236 INFO  (qtp1369025570-51313) [    x:collection1] o.a.s.u.p.LogUpdateProcessorFactory [collection1]  webapp=/xk_v path=/update params={wt=javabin&version=2}{add=[12]} 0 0
   [junit4]   2> 1859238 INFO  (qtp488607139-51296) [    x:collection1] o.a.s.u.p.LogUpdateProcessorFactory [collection1]  webapp=/xk_v path=/update params={wt=javabin&version=2}{add=[13]} 0 0
   [junit4]   2> 1859256 INFO  (qtp1369025570-51313) [    x:collection1] o.a.s.u.p.LogUpdateProcessorFactory [collection1]  webapp=/xk_v path=/update params={wt=javabin&version=2}{add=[13]} 0 0
   [junit4]   2> 1859259 INFO  (qtp488607139-51296) [    x:collection1] o.a.s.u.p.LogUpdateProcessorFactory [collection1]  webapp=/xk_v path=/update params={wt=javabin&version=2}{add=[1001]} 0 0
   [junit4]   2> 1859266 INFO  (qtp1369025570-51309) [    x:collection1] o.a.s.u.p.LogUpdateProcessorFactory [collection1]  webapp=/xk_v path=/update params={wt=javabin&version=2}{add=[1001]} 0 0
   [junit4]   2> 1859268 INFO  (qtp488607139-51296) [    x:collection1] o.a.s.u.p.LogUpdateProcessorFactory [collection1]  webapp=/xk_v path=/update params={wt=javabin&version=2}{add=[14]} 0 0
   [junit4]   2> 1859270 INFO  (qtp1369025570-51309) [    x:collection1] o.a.s.u.p.LogUpdateProcessorFactory [collection1]  webapp=/xk_v path=/update params={wt=javabin&version=2}{add=[14]} 0 0
   [junit4]   2> 1859272 INFO  (qtp488607139-51295) [    x:collection1] o.a.s.u.p.LogUpdateProcessorFactory [collection1]  webapp=/xk_v path=/update params={wt=javabin&version=2}{add=[15]} 0 0
   [junit4]   2> 1859275 INFO  (qtp1369025570-51314) [    x:collection1] o.a.s.u.p.LogUpdateProcessorFactory [collection1]  webapp=/xk_v path=/update params={wt=javabin&version=2}{add=[15]} 0 0
   [junit4]   2> 1859277 INFO  (qtp488607139-51295) [    x:collection1] o.a.s.u.p.LogUpdateProcessorFactory [collection1]  webapp=/xk_v path=/update params={wt=javabin&version=2}{add=[16]} 0 0
   [junit4]   2> 1859288 INFO  (qtp1369025570-51312) [    x:collection1] o.a.s.u.p.LogUpdateProcessorFactory [collection1]  webapp=/xk_v path=/update params={wt=javabin&version=2}{add=[16]} 0 0
   [junit4]   2> 1859291 INFO  (qtp488607139-51295) [    x:collection1] o.a.s.u.p.LogUpdateProcessorFactory [collection1]  webapp=/xk_v path=/update params={wt=javabin&version=2}{add=[17]} 0 0
   [junit4]   2> 1859292 INFO  (qtp1369025570-51312) [    x:collection1] o.a.s.u.p.LogUpdateProcessorFactory [collection1]  webapp=/xk_v path=/update params={wt=javabin&version=2}{add=[17]} 0 0
   [junit4]   2> 1859294 INFO  (qtp488607139-51295) [    x:collection1] o.a.s.u.p.LogUpdateProcessorFactory [collection1]  webapp=/xk_v path=/update params={wt=javabin&version=2}{add=[100]} 0 0
   [junit4]   2> 1859296 INFO  (qtp1369025570-51312) [    x:collection1] o.a.s.u.p.LogUpdateProcessorFactory [collection1]  webapp=/xk_v path=/update params={wt=javabin&version=2}{add=[100]} 0 0
   [junit4]   2> 1859314 INFO  (qtp488607139-51295) [    x:collection1] o.a.s.u.p.LogUpdateProcessorFactory [collection1]  webapp=/xk_v path=/update params={wt=javabin&version=2}{add=[101]} 0 0
   [junit4]   2> 1859316 INFO  (qtp1369025570-51312) [    x:collection1] o.a.s.u.p.LogUpdateProcessorFactory [collection1]  webapp=/xk_v path=/update params={wt=javabin&version=2}{add=[101]} 0 0
   [junit4]   2> 1859317 INFO  (qtp488607139-51295) [    x:collection1] o.a.s.u.p.LogUpdateProcessorFactory [collection1]  webapp=/xk_v path=/update params={wt=javabin&version=2}{add=[102]} 0 0
   [junit4]   2> 1859319 INFO  (qtp1369025570-51312) [    x:collection1] o.a.s.u.p.LogUpdateProcessorFactory [collection1]  webapp=/xk_v path=/update params={wt=javabin&version=2}{add=[102]} 0 0
   [junit4]   2> 1859321 INFO  (qtp488607139-51295) [    x:collection1] o.a.s.u.p.LogUpdateProcessorFactory [collection1]  webapp=/xk_v path=/update params={wt=javabin&version=2}{add=[103]} 0 0
   [junit4]   2> 1859323 INFO  (qtp1369025570-51312) [    x:collection1] o.a.s.u.p.LogUpdateProcessorFactory [collection1]  webapp=/xk_v path=/update params={wt=javabin&version=2}{add=[103]} 0 0
   [junit4]   2> 1859325 INFO  (qtp488607139-51295) [    x:collection1] o.a.s.u.p.LogUpdateProcessorFactory [collection1]  webapp=/xk_v path=/update params={wt=javabin&version=2}{add=[104]} 0 0
   [junit4]   2> 1859327 INFO  (qtp1369025570-51312) [    x:collection1] o.a.s.u.p.LogUpdateProcessorFactory [collection1]  webapp=/xk_v path=/update params={wt=javabin&version=2}{add=[104]} 0 0
   [junit4]   2> 1859329 INFO  (qtp488607139-51295) [    x:collection1] o.a.s.u.p.LogUpdateProcessorFactory [collection1]  webapp=/xk_v path=/update params={wt=javabin&version=2}{add=[105]} 0 0
   [junit4]   2> 1859331 INFO  (qtp1369025570-51312) [    x:collection1] o.a.s.u.p.LogUpdateProcessorFactory [collection1]  webapp=/xk_v path=/update params={wt=javabin&version=2}{add=[105]} 0 0
   [junit4]   2> 1859333 INFO  (qtp488607139-51295) [    x:collection1] o.a.s.u.p.LogUpdateProcessorFactory [collection1]  webapp=/xk_v path=/update params={wt=javabin&version=2}{add=[106]} 0 0
   [junit4]   2> 1859334 INFO  (qtp1369025570-51315) [    x:collection1] o.a.s.u.p.LogUpdateProcessorFactory [collection1]  webapp=/xk_v path=/update params={wt=javabin&version=2}{add=[106]} 0 0
   [junit4]   2> 1859336 INFO  (qtp488607139-51295) [    x:collection1] o.a.s.u.p.LogUpdateProcessorFactory [collection1]  webapp=/xk_v path=/update params={wt=javabin&version=2}{add=[107]} 0 0
   [junit4]   2> 1859338 INFO  (qtp1369025570-51309) [    x:collection1] o.a.s.u.p.LogUpdateProcessorFactory [collection1]  webapp=/xk_v path=/update params={wt=javabin&version=2}{add=[107]} 0 0
   [junit4]   2> 1859341 INFO  (qtp488607139-51295) [    x:collection1] o.a.s.u.p.LogUpdateProcessorFactory [collection1]  webapp=/xk_v path=/update params={wt=javabin&version=2}{add=[108]} 0 0
   [junit4]   2> 1859344 INFO  (qtp1369025570-51309) [    x:collection1] o.a.s.u.p.LogUpdateProcessorFactory [collection1]  webapp=/xk_v path=/update params={wt=javabin&version=2}{add=[108]} 0 0
   [junit4]   2> 1859346 INFO  (qtp488607139-51295) [    x:collection1] o.a.s.u.p.LogUpdateProcessorFactory [collection1]  webapp=/xk_v path=/update params={wt=javabin&version=2}{add=[109]} 0 0
   [junit4]   2> 1859348 INFO  (qtp1369025570-51309) [    x:collection1] o.a.s.u.p.LogUpdateProcessorFactory [collection1]  webapp=/xk_v path=/update params={wt=javabin&version=2}{add=[109]} 0 0
   [junit4]   2> 1859350 INFO  (qtp488607139-51295) [    x:collection1] o.a.s.u.p.LogUpdateProcessorFactory [collection1]  webapp=/xk_v path=/update params={wt=javabin&version=2}{add=[110]} 0 0
   [junit4]   2> 1859351 INFO  (qtp1369025570-51309) [    x:collection1] o.a.s.u.p.LogUpdateProcessorFactory [collection1]  webapp=/xk_v path=/update params={wt=javabin&version=2}{add=[110]} 0 0
   [junit4]   2> 1859353 INFO  (qtp488607139-51295) [    x:collection1] o.a.s.u.p.LogUpdateProcessorFactory [collection1]  webapp=/xk_v path=/update params={wt=javabin&version=2}{add=[111]} 0 0
   [junit4]   2> 1859355 INFO  (qtp1369025570-51309) [    x:collection1] o.a.s.u.p.LogUpdateProcessorFactory [collection1]  webapp=/xk_v path=/update params={wt=javabin&version=2}{add=[111]} 0 0
   [junit4]   2> 1859357 INFO  (qtp488607139-51295) [    x:collection1] o.a.s.u.p.LogUpdateProcessorFactory [collection1]  webapp=/xk_v path=/update params={wt=javabin&version=2}{add=[112]} 0 0
   [junit4]   2> 1859359 INFO  (qtp1369025570-51315) [    x:collection1] o.a.s.u.p.LogUpdateProcessorFactory [collection1]  webapp=/xk_v path=/update params={wt=javabin&version=2}{add=[112]} 0 0
   [junit4]   2> 1859361 INFO  (qtp488607139-51295) [    x:collection1] o.a.s.u.p.LogUpdateProcessorFactory [collection1]  webapp=/xk_v path=/update params={wt=javabin&version=2}{add=[113]} 0 0
   [junit4]   2> 1859363 INFO  (qtp1369025570-51314) [    x:collection1] o.a.s.u.p.LogUpdateProcessorFactory [collection1]  webapp=/xk_v path=/update params={wt=javabin&version=2}{add=[113]} 0 0
   [junit4]   2> 1859365 INFO  (qtp488607139-51295) [    x:collection1] o.a.s.u.p.LogUpdateProcessorFactory [collection1]  webapp=/xk_v path=/update params={wt=javabin&version=2}{add=[114]} 0 0
   [junit4]   2> 1859367 INFO  (qtp1369025570-51314) [    x:collection1] o.a.s.u.p.LogUpdateProcessorFactory [collection1]  webapp=/xk_v path=/update params={wt=javabin&version=2}{add=[114]} 0 0
   [junit4]   2> 1859368 INFO  (qtp488607139-51295) [    x:collection1] o.a.s.u.p.LogUpdateProcessorFactory [collection1]  webapp=/xk_v path=/update params={wt=javabin&version=2}{add=[115]} 0 0
   [junit4]   2> 1859370 INFO  (qtp1369025570-51314) [    x:collection1] o.a.s.u.p.LogUpdateProcessorFactory [collection1]  webapp=/xk_v path=/update params={wt=javabin&version=2}{add=[115]} 0 0
   [junit4]   2> 1859372 INFO  (qtp488607139-51295) [    x:collection1] o.a.s.u.p.LogUpdateProcessorFactory [collection1]  webapp=/xk_v path=/update params={wt=javabin&version=2}{add=[116]} 0 0
   [junit4]   2> 1859374 INFO  (qtp1369025570-51314) [    x:collection1] o.a.s.u.p.LogUpdateProcessorFactory [collection1]  webapp=/xk_v path=/update params={wt=javabin&version=2}{add=[116]} 0 0
   [junit4]   2> 1859376 INFO  (qtp488607139-51295) [    x:collection1] o.a.s.u.p.LogUpdateProcessorFactory [collection1]  webapp=/xk_v path=/update params={wt=javabin&version=2}{add=[117]} 0 0
   [junit4]   2> 1859378 INFO  (qtp1369025570-51314) [    x:collection1] o.a.s.u.p.LogUpdateProcessorFactory [collection1]  webapp=/xk_v path=/update params={wt=javabin&version=2}{add=[117]} 0 0
   [junit4]   2> 1859379 INFO  (qtp488607139-51298) [    x:collection1] o.a.s.u.p.LogUpdateProcessorFactory [collection1]  webapp=/xk_v path=/update params={wt=javabin&version=2}{add=[118]} 0 0
   [junit4]   2> 1859381 INFO  (qtp1369025570-51315) [    x:collection1] o.a.s.u.p.LogUpdateProcessorFactory [collection1]  webapp=/xk_v path=/update params={wt=javabin&version=2}{add=[118]} 0 0
   [junit4]   2> 1859383 INFO  (qtp488607139-51298) [    x:collection1] o.a.s.u.p.LogUpdateProcessorFactory [collection1]  webapp=/xk_v path=/update params={wt=javabin&version=2}{add=[119]} 0 0
   [junit4]   2> 1859385 INFO  (qtp1369025570-51316) [    x:collection1] o.a.s.u.p.LogUpdateProcessorFactory [collection1]  webapp=/xk_v path=/update params={wt=javabin&version=2}{add=[119]} 0 0
   [junit4]   2> 1859476 INFO  (qtp488607139-51298) [    x:collection1] o.a.s.u.p.LogUpdateProcessorFactory [collection1]  webapp=/xk_v path=/update params={wt=javabin&version=2}{add=[120]} 0 0
   [junit4]   2> 1859479 INFO  (qtp1369025570-51316) [    x:collection1] o.a.s.u.p.LogUpdateProcessorFactory [collection1]  webapp=/xk_v path=/update params={wt=javabin&version=2}{add=[120]} 0 0
   [junit4]   2> 1859481 INFO  (qtp488607139-51299) [    x:collection1] o.a.s.u.p.LogUpdateProcessorFactory [collection1]  webapp=/xk_v path=/update params={wt=javabin&version=2}{add=[121]} 0 0
   [junit4]   2> 1859482 INFO  (qtp1369025570-51316) [    x:collection1] o.a.s.u.p.LogUpdateProcessorFactory [collection1]  webapp=/xk_v path=/update params={wt=javabin&version=2}{add=[121]} 0 0
   [junit4]   2> 1859484 INFO  (qtp488607139-51299) [    x:collection1] o.a.s.u.p.LogUpdateProcessorFactory [collection1]  webapp=/xk_v path=/update params={wt=javabin&version=2}{add=[122]} 0 0
   [junit4]   2> 1859486 INFO  (qtp1369025570-51316) [    x:collection1] o.a.s.u.p.LogUpdateProcessorFactory [collection1]  webapp=/xk_v path=/update params={wt=javabin&version=2}{add=[122]} 0 0
   [junit4]   2> 1859488 INFO  (qtp488607139-51299) [    x:collection1] o.a.s.u.p.LogUpdateProcessorFactory [collection1]  webapp=/xk_v path=/update params={wt=javabin&version=2}{add=[123]} 0 0
   [junit4]   2> 1859490 INFO  (qtp1369025570-51316) [    x:collection1] o.a.s.u.p.LogUpdateProcessorFactory [collection1]  webapp=/xk_v path=/update params={wt=javabin&version=2}{add=[123]} 0 0
   [junit4]   2> 1859492 INFO  (qtp488607139-51299) [    x:collection1] o.a.s.u.p.LogUpdateProcessorFactory [collection1]  webapp=/xk_v path=/update params={wt=javabin&version=2}{add=[124]} 0 0
   [junit4]   2> 1859494 INFO  (qtp1369025570-51315) [    x:collection1] o.a.s.u.p.LogUpdateProcessorFactory [collection1]  webapp=/xk_v path=/update params={wt=javabin&version=2}{add=[124]} 0 0
   [junit4]   2> 1859496 INFO  (qtp488607139-51299) [    x:collection1] o.a.s.u.p.LogUpdateProcessorFactory [collection1]  webapp=/xk_v path=/update params={wt=javabin&version=2}{add=[125]} 0 0
   [junit4]   2> 1859498 INFO  (qtp1369025570-51315) [    x:collection1] o.a.s.u.p.LogUpdateProcessorFactory [collection1]  webapp=/xk_v path=/update params={wt=javabin&version=2}{add=[125]} 0 0
   [junit4]   2> 1859500 INFO  (qtp488607139-51299) [    x:collection1] o.a.s.u.p.LogUpdateProcessorFactory [collection1]  webapp=/xk_v path=/update params={wt=javabin&version=2}{add=[126]} 0 0
   [junit4]   2> 1859502 INFO  (qtp1369025570-51315) [    x:collection1] o.a.s.u.p.LogUpdateProcessorFactory [collection1]  webapp=/xk_v path=/update params={wt=javabin&version=2}{add=[126]} 0 0
   [junit4]   2> 1859504 INFO  (qtp488607139-51299) [    x:collection1] o.a.s.u.p.LogUpdateProcessorFactory [collection1]  webapp=/xk_v path=/update params={wt=javabin&version=2}{add=[127]} 0 0
   [junit4]   2> 1859506 INFO  (qtp1369025570-51309) [    x:collection1] o.a.s.u.p.LogUpdateProcessorFactory [collection1]  webapp=/xk_v path=/update params={wt=javabin&version=2}{add=[127]} 0 0
   [junit4]   2> 1859508 INFO  (qtp488607139-51299) [    x:collection1] o.a.s.u.p.LogUpdateProcessorFactory [collection1]  webapp=/xk_v path=/update params={wt=javabin&version=2}{add=[128]} 0 0
   [junit4]   2> 1859510 INFO  (qtp1369025570-51314) [    x:collection1] o.a.s.u.p.LogUpdateProcessorFactory [collection1]  webapp=/xk_v path=/update params={wt=javabin&version=2}{add=[128]} 0 0
   [junit4]   2> 1859511 INFO  (qtp488607139-51299) [    x:collection1] o.a.s.u.p.LogUpdateProcessorFactory [collection1]  webapp=/xk_v path=/update params={wt=javabin&version=2}{add=[129]} 0 0
   [junit4]   2> 1859513 INFO  (qtp1369025570-51314) [    x:collection1] o.a.s.u.p.LogUpdateProcessorFactory [collection1]  webapp=/xk_v path=/update params={wt=javabin&version=2}{add=[129]} 0 0
   [junit4]   2> 1859518 INFO  (qtp488607139-51292) [    x:collection1] o.a.s.u.p.LogUpdateProcessorFactory [collection1]  webapp=/xk_v path=/update params={wt=javabin&version=2}{add=[130]} 0 0
   [junit4]   2> 1859520 INFO  (qtp1369025570-51313) [    x:collection1] o.a.s.u.p.LogUpdateProcessorFactory [collection1]  webapp=/xk_v path=/update params={wt=javabin&version=2}{add=[130]} 0 0
   [junit4]   2> 1859522 INFO  (qtp488607139-51292) [    x:collection1] o.a.s.u.p.LogUpdateProcessorFactory [collection1]  webapp=/xk_v path=/update params={wt=javabin&version=2}{add=[131]} 0 0
   [junit4]   2> 1859524 INFO  (qtp1369025570-51312) [    x:collection1] o.a.s.u.p.LogUpdateProcessorFactory [collection1]  webapp=/xk_v path=/update params={wt=javabin&version=2}{add=[131]} 0 0
   [junit4]   2> 1859527 INFO  (qtp488607139-51292) [    x:collection1] o.a.s.u.p.LogUpdateProcessorFactory [collection1]  webapp=/xk_v path=/update params={wt=javabin&version=2}{add=[132]} 0 0
   [junit4]   2> 1859529 INFO  (qtp1369025570-51312) [    x:collection1] o.a.s.u.p.LogUpdateProcessorFactory [collection1]  webapp=/xk_v path=/update params={wt=javabin&version=2}{add=[132]} 0 0
   [junit4]   2> 1859531 INFO  (qtp488607139-51292) [    x:collection1] o.a.s.u.p.LogUpdateProcessorFactory [collection1]  webapp=/xk_v path=/update params={wt=javabin&version=2}{add=[133]} 0 0
   [junit4]   2> 1859533 INFO  (qtp1369025570-51312) [    x:collection1] o.a.s.u.p.LogUpdateProcessorFactory [collection1]  webapp=/xk_v path=/update params={wt=javabin&version=2}{add=[133]} 0 0
   [junit4]   2> 1859535 INFO  (qtp488607139-51292) [    x:collection1] o.a.s.u.p.LogUpdateProcessorFactory [collection1]  webapp=/xk_v path=/update params={wt=javabin&version=2}{add=[134]} 0 0
   [junit4]   2> 1859537 INFO  (qtp1369025570-51316) [    x:collection1] o.a.s.u.p.LogUpdateProcessorFactory [collection1]  webapp=/xk_v path=/update params={wt=javabin&version=2}{add=[134]} 0 0
   [junit4]   2> 1859539 INFO  (qtp488607139-51292) [    x:collection1] o.a.s.u.p.LogUpdateProcessorFactory [collection1]  webapp=/xk_v path=/update params={wt=javabin&version=2}{add=[135]} 0 0
   [junit4]   2> 1859541 INFO  (qtp1369025570-51316) [    x:collection1] o.a.s.u.p.LogUpdateProcessorFactory [collection1]  webapp=/xk_v path=/update params={wt=javabin&version=2}{add=[135]} 0 0
   [junit4]   2> 1859543 INFO  (qtp488607139-51292) [    x:collection1] o.a.s.u.p.LogUpdateProcessorFactory [collection1]  webapp=/xk_v path=/update params={wt=javabin&version=2}{add=[136]} 0 0
   [junit4]   2> 1859545 INFO  (qtp1369025570-51313) [    x:collection1] o.a.s.u.p.LogUpdateProcessorFactory [collection1]  webapp=/xk_v path=/update params={wt=javabin&version=2}{add=[136]} 0 0
   [junit4]   2> 1859547 INFO  (qtp488607139-51292) [    x:collection1] o.a.s.u.p.LogUpdateProcessorFactory [collection1]  webapp=/xk_v path=/update params={wt=javabin&version=2}{add=[137]} 0 0
   [junit4]   2> 1859549 INFO  (qtp1369025570-51313) [    x:collection1] o.a.s.u.p.LogUpdateProcessorFactory [collection1]  webapp=/xk_v path=/update params={wt=javabin&version=2}{add=[137]} 0 0
   [junit4]   2> 1859551 INFO  (qtp488607139-51292) [    x:collection1] o.a.s.u.p.LogUpdateProcessorFactory [collection1]  webapp=/xk_v path=/update params={wt=javabin&version=2}{add=[138]} 0 0
   [junit4]   2> 1859553 INFO  (qtp1369025570-51313) [    x:collection1] o.a.s.u.p.LogUpdateProcessorFactory [collection1]  webapp=/xk_v path=/update params={wt=javabin&version=2}{add=[138]} 0 0
   [junit4]   2> 1859555 INFO  (qtp488607139-51292) [    x:collection1] o.a.s.u.p.LogUpdateProcessorFactory [collection1]  webapp=/xk_v path=/update params={wt=javabin&version=2}{add=[139]} 0 0
   [junit4]   2> 1859557 INFO  (qtp1369025570-51313) [    x:collection1] o.a.s.u.p.LogUpdateProcessorFactory [collection1]  webapp=/xk_v path=/update params={wt=javabin&version=2}{add=[139]} 0 0
   [junit4]   2> 1859559 INFO  (qtp488607139-51292) [    x:collection1] o.a.s.u.p.LogUpdateProcessorFactory [collection1]  webapp=/xk_v path=/update params={wt=javabin&version=2}{add=[140]} 0 0
   [junit4]   2> 1859562 INFO  (qtp1369025570-51313) [    x:collection1] o.a.s.u.p.LogUpdateProcessorFactory [collection1]  webapp=/xk_v path=/update params={wt=javabin&version=2}{add=[140]} 0 0
   [junit4]   2> 1859564 INFO  (qtp488607139-51292) [    x:collection1] o.a.s.u.p.LogUpdateProcessorFactory [collection1]  webapp=/xk_v path=/update params={wt=javabin&version=2}{add=[141]} 0 0
   [junit4]   2> 1859566 INFO  (qtp1369025570-51316) [    x:collection1] o.a.s.u.p.LogUpdateProcessorFactory [collection1]  webapp=/xk_v path=/update params={wt=javabin&version=2}{add=[141]} 0 0
   [junit4]   2> 1859568 INFO  (qtp488607139-51292) [    x:collection1] o.a.s.u.p.LogUpdateProcessorFactory [collection1]  webapp=/xk_v path=/update params={wt=javabin&version=2}{add=[142]} 0 0
   [junit4]   2> 1859570 INFO  (qtp1369025570-51315) [    x:collection1] o.a.s.u.p.LogUpdateProcessorFactory [collection1]  webapp=/xk_v path=/update params={wt=javabin&version=2}{add=[142]} 0 0
   [junit4]   2> 1859572 INFO  (qtp488607139-51292) [    x:collection1] o.a.s.u.p.LogUpdateProcessorFactory [collection1]  webapp=/xk_v path=/update params={wt=javabin&version=2}{add=[143]} 0 0
   [junit4]   2> 1859574 INFO  (qtp1369025570-51315) [    x:collection1] o.a.s.u.p.LogUpdateProcessorFactory [collection1]  webapp=/xk_v path=/update params={wt=javabin&version=2}{add=[143]} 0 0
   [junit4]   2> 1859577 INFO  (qtp488607139-51292) [    x:collection1] o.a.s.u.p.LogUpdateProcessorFactory [collection1]  webapp=/xk_v path=/update params={wt=javabin&version=2}{add=[144]} 0 0
   [junit4]   2> 1859578 INFO  (qtp1369025570-51315) [    x:collection1] o.a.s.u.p.LogUpdateProcessorFactory [collection1]  webapp=/xk_v path=/update params={wt=javabin&version=2}{add=[144]} 0 0
   [junit4]   2> 1859580 INFO  (qtp488607139-51292) [    x:collection1] o.a.s.u.p.LogUpdateProcessorFactory [collection1]  webapp=/xk_v path=/update params={wt=javabin&version=2}{add=[145]} 0 0
   [junit4]   2> 1859582 INFO  (qtp1369025570-51315) [    x:collection1] o.a.s.u.p.LogUpdateProcessorFactory [collection1]  webapp=/xk_v path=/update params={wt=javabin&version=2}{add=[145]} 0 0
   [junit4]   2> 1859585 INFO  (qtp488607139-51292) [    x:collection1] o.a.s.u.p.LogUpdateProcessorFactory [collection1]  webapp=/xk_v path=/update params={wt=javabin&version=2}{add=[146]} 0 0
   [junit4]   2> 1859586 INFO  (qtp1369025570-51315) [    x:collection1] o.a.s.u.p.LogUpdateProcessorFactory [collection1]  webapp=/xk_v path=/update params={wt=javabin&version=2}{add=[146]} 0 0
   [junit4]   2> 1859588 INFO  (qtp488607139-51292) [    x:collection1] o.a.s.u.p.LogUpdateProcessorFactory [collection1]  webapp=/xk_v path=/update params={wt=javabin&version=2}{add=[147]} 0 0
   [junit4]   2> 1859590 INFO  (qtp1369025570-51316) [    x:collection1] o.a.s.u.p.LogUpdateProcessorFactory [collection1]  webapp=/xk_v path=/update params={wt=javabin&version=2}{add=[147]} 0 0
   [junit4]   2> 1859592 INFO  (qtp488607139-51292) [    x:collection1] o.a.s.u.p.LogUpdateProcessorFactory [collection1]  webapp=/xk_v path=/update params={wt=javabin&version=2}{add=[148]} 0 0
   [junit4]   2> 1859594 INFO  (qtp1369025570-51309) [    x:collection1] o.a.s.u.p.LogUpdateProcessorFactory [collection1]  webapp=/xk_v path=/update params={wt=javabin&version=2}{add=[148]} 0 0
   [junit4]   2> 1859596 INFO  (qtp488607139-51292) [    x:collection1] o.a.s.u.p.LogUpdateProcessorFactory [collection1]  webapp=/xk_v path=/update params={wt=javabin&version=2}{add=[149]} 0 0
   [junit4]   2> 1859598 INFO  (qtp1369025570-51309) [    x:collection1] o.a.s.u.p.LogUpdateProcessorFactory [collection1]  webapp=/xk_v path=/update params={wt=javabin&version=2}{add=[149]} 0 0
   [junit4]   2> 1859599 INFO  (qtp488607139-51292) [    x:collection1] o.a.s.u.DirectUpdateHandler2 start commit{,optimize=false,openSearcher=true,waitSearcher=true,expungeDeletes=false,softCommit=false,prepareCommit=false}
   [junit4]   2> 1859601 INFO  (qtp488607139-51292) [    x:collection1] o.a.s.u.SolrIndexWriter Calling setCommitData with IW:org.apache.solr.update.SolrIndexWriter@45e15da4
   [junit4]   2> 1859624 INFO  (qtp488607139-51292) [    x:collection1] o.a.s.s.SolrIndexSearcher Opening [Searcher@410986c5[collection1] main]
   [junit4]   2> 1859625 INFO  (searcherExecutor-4009-thread-1-processing-x:collection1) [    x:collection1] o.a.s.c.SolrCore [collection1] Registered new searcher Searcher@410986c5[collection1] main{ExitableDirectoryReader(UninvertingDirectoryReader(Uninverting(_0(6.4.0):c9) Uninverting(_1(6.4.0):c59)))}
   [junit4]   2> 1859625 INFO  (qtp488607139-51292) [    x:collection1] o.a.s.u.DirectUpdateHandler2 end_commit_flush
   [junit4]   2> 1859625 INFO  (qtp488607139-51292) [    x:collection1] o.a.s.u.p.LogUpdateProcessorFactory [collection1]  webapp=/xk_v path=/update params={waitSearcher=true&commit=true&softCommit=false&wt=javabin&version=2}{commit=} 0 25
   [junit4]   2> 1859627 INFO  (qtp1369025570-51309) [    x:collection1] o.a.s.u.DirectUpdateHandler2 start commit{,optimize=false,openSearcher=true,waitSearcher=true,expungeDeletes=false,softCommit=false,prepareCommit=false}
   [junit4]   2> 1859628 INFO  (qtp1369025570-51309) [    x:collection1] o.a.s.u.SolrIndexWriter Calling setCommitData with IW:org.apache.solr.update.SolrIndexWriter@24954d0e
   [junit4]   2> 1859672 INFO  (qtp1369025570-51309) [    x:collection1] o.a.s.s.SolrIndexSearcher Opening [Searcher@64163d88[collection1] main]
   [junit4]   2> 1859673 INFO  (searcherExecutor-4019-thread-1-processing-x:collection1) [    x:collection1] o.a.s.c.SolrCore [collection1] Registered new searcher Searcher@64163d88[collection1] main{ExitableDirectoryReader(UninvertingDirectoryReader(Uninverting(_0(6.4.0):c9) Uninverting(_1(6.4.0):c59)))}
   [junit4]   2> 1859673 INFO  (qtp1369025570-51309) [    x:collection1] o.a.s.u.DirectUpdateHandler2 end_commit_flush
   [junit4]   2> 1859673 INFO  (qtp1369025570-51309) [    x:collection1] o.a.s.u.p.LogUpdateProcessorFactory [collection1]  webapp=/xk_v path=/update params={waitSearcher=true&commit=true&softCommit=false&wt=javabin&version=2}{commit=} 0 46
   [junit4]   2> 1859676 INFO  (qtp488607139-51298) [    x:collection1] o.a.s.h.RequestHandlerBase Ignoring exception matching parameter cannot be negative
   [junit4]   2> 1859676 INFO  (qtp488607139-51298) [    x:collection1] o.a.s.c.S.Request [collection1]  webapp=/xk_v path=/select params={q=*&distrib=false&start=-1&wt=javabin&version=2} status=400 QTime=0
   [junit4]   2> 1859678 INFO  (qtp488607139-51296) [    x:collection1] o.a.s.h.RequestHandlerBase Ignoring exception matching parameter cannot be negative
   [junit4]   2> 1859678 INFO  (qtp488607139-51296) [    x:collection1] o.a.s.c.S.Request [collection1]  webapp=/xk_v path=/select params={q=*&distrib=false&start=0&rows=-1&wt=javabin&version=2} status=400 QTime=0
   [junit4]   2> 1859680 INFO  (qtp488607139-51296) [    x:collection1] o.a.s.c.S.Request [collection1]  webapp=/xk_v path=/select params={q=*:*&distrib=false&sort=n_ti1+desc&wt=javabin&version=2} hits=68 status=0 QTime=0
   [junit4]   2> 1859741 INFO  (qtp1369025570-51310) [    x:collection1] o.a.s.c.S.Request [collection1]  webapp=/xk_v path=/select params={distrib=false&fl=id&shards.purpose=4&start=0&fsv=true&sort=n_ti1+desc&shard.url=[ff01::114]:33332/xk_v|http://127.0.0.1:43757/xk_v/collection1&rows=10&version=2&q=*:*&NOW=1481695429232&isShard=true&wt=javabin} hits=68 status=0 QTime=0
   [junit4]   2> 1859747 INFO  (qtp1369025570-51316) [    x:collection1] o.a.s.c.S.Request [collection1]  webapp=/xk_v path=/select params={q=*:*&distrib=false&shards.purpose=64&NOW=1481695429232&ids=100,111,12,112,114,137,6,17,140,141&isShard=true&shard.url=[ff01::114]:33332/xk_v|http://127.0.0.1:43757/xk_v/collection1&wt=javabin&version=2} status=0 QTime=0
   [junit4]   2> 1859754 INFO  (qtp1369025570-51313) [    x:collection1] o.a.s.c.S.Request [collection1]  webapp=/xk_v path=/select params={q=*:*&shards=[ff01::114]:33332/xk_v|http://127.0.0.1:43757/xk_v/collection1&sort=n_ti1+desc&wt=javabin&version=2} hits=68 status=0 QTime=70
   [junit4]   2> 1859754 INFO  (TEST-TestDistributedSearch.test-seed#[BA2AB614EBF0E90B]) [    ] o.a.s.BaseDistributedSearchTestCase starting stress...
   [junit4]   2> 1859789 INFO  (qtp1369025570-51314) [    x:collection1] o.a.s.c.S.Request [collection1]  webapp=/xk_v path=/select params={distrib=false&fl=id&shards.purpose=4&start=0&fsv=true&sort=n_ti1+desc&shard.url=[ff01::114]:33332/xk_v|http://127.0.0.1:43757/xk_v/collection1&rows=10&version=2&q=*:*&NOW=1481695429334&isShard=true&wt=javabin} hits=68 status=0 QTime=0
   [junit4]   2> 1859791 INFO  (qtp1369025570-51314) [    x:collection1] o.a.s.c.S.Request [collection1]  webapp=/xk_v path=/select params={q=*:*&distrib=false&shards.purpose=64&NOW=1481695429334&ids=100,111,12,112,114,137,6,17,140,141&isShard=true&shard.url=[ff01::114]:33332/xk_v|http://127.0.0.1:43757/xk_v/collection1&wt=javabin&version=2} status=0 QTime=0
   [junit4]   2> 1859793 INFO  (qtp1369025570-51312) [    x:collection1] o.a.s.c.S.Request [collection1]  webapp=/xk_v path=/select params={q=*:*&shards=[ff01::114]:33332/xk_v|http://127.0.0.1:43757/xk_v/collection1&sort=n_ti1+desc&wt=javabin&version=2} hits=68 status=0 QTime=7
   [junit4]   2> 1859796 INFO  (qtp1369025570-51313) [    x:collection1] o.a.s.c.S.Request [collection1]  webapp=/xk_v path=/select params={distrib=false&fl=id&shards.purpose=4&start=0&fsv=true&sort=n_ti1+desc&shard.url=[ff01::114]:33332/xk_v|http://127.0.0.1:43757/xk_v/collection1&rows=10&version=2&q=*:*&NOW=1481695429344&isShard=true&wt=javabin} hits=68 status=0 QTime=0
   [junit4]   2> 1859799 INFO  (qtp1369025570-51313) [    x:collection1] o.a.s.c.S.Request [collection1]  webapp=/xk_v path=/select params={q=*:*&distrib=false&shards.purpose=64&NOW=1481695429344&ids=100,111,12,112,114,137,6,17,140,141&isShard=true&shard.url=[ff01::114]:33332/xk_v|http://127.0.0.1:43757/xk_v/collection1&wt=javabin&version=2} status=0 QTime=0
   [junit4]   2> 1859800 INFO  (qtp1369025570-51316) [    x:collection1] o.a.s.c.S.Request [collection1]  webapp=/xk_v path=/select params={q=*:*&shards=[ff01::114]:33332/xk_v|http://127.0.0.1:43757/xk_v/collection1&sort=n_ti1+desc&wt=javabin&version=2} hits=68 status=0 QTime=5
   [junit4]   2> 1859811 INFO  (qtp1369025570-51310) [    x:collection1] o.a.s.c.S.Request [collection1]  webapp=/xk_v path=/select params={distrib=false&fl=id&shards.purpose=4&start=0&fsv=true&sort=n_ti1+desc&shard.url=[ff01::114]:33332/xk_v|http://127.0.0.1:43757/xk_v/collection1&rows=10&version=2&q=*:*&NOW=1481695429358&isShard=true&wt=javabin} hits=68 status=0 QTime=0
   [junit4]   2> 1859812 INFO  (qtp1369025570-51309) [    x:collection1] o.a.s.c.S.Request [collection1]  webapp=/xk_v path=/select params={distrib=false&fl=id&shards.purpose=4&start=0&fsv=true&sort=n_ti1+desc&shard.url=[ff01::114]:33332/xk_v|http://127.0.0.1:43757/xk_v/collection1&rows=10&version=2&q=*:*&NOW=1481695429339&isShard=true&wt=javabin} hits=68 status=0 QTime=0
   [junit4]   2> 1859813 INFO  (qtp1369025570-51310) [    x:collection1] o.a.s.c.S.Request [collection1]  webapp=/xk_v path=/select params={q=*:*&distrib=false&shards.purpose=64&NOW=1481695429358&ids=100,111,12,112,114,137,6,17,140,141&isShard=true&shard.url=[ff01::114]:33332/xk_v|http://127.0.0.1:43757/xk_v/collection1&wt=javabin&version=2} status=0 QTime=0
   [junit4]   2> 1859813 INFO  (qtp1369025570-51312) [    x:collection1] o.a.s.c.S.Request [collection1]  webapp=/xk_v path=/select params={q=*:*&shards=[ff01::114]:33332/xk_v|http://127.0.0.1:43757/xk_v/collection1&sort=n_ti1+desc&wt=javabin&version=2} hits=68 status=0 QTime=4
   [junit4]   2> 1859816 INFO  (qtp1369025570-51310) [    x:collection1] o.a.s.c.S.Request [collection1]  webapp=/xk_v path=/select params={q=*:*&distrib=false&shards.purpose=64&NOW=1481695429339&ids=100,111,12,112,114,137,6,17,140,141&isShard=true&shard.url=[ff01::114]:33332/xk_v|http://127.0.0.1:43757/xk_v/collection1&wt=javabin&version=2} status=0 QTime=0
   [junit4]   2> 1859817 INFO  (qtp1369025570-51315) [    x:collection1] o.a.s.c.S.Request [collection1]  webapp=/xk_v path=/select params={q=*:*&shards=[ff01::114]:33332/xk_v|http://127.0.0.1:43757/xk_v/collection1&sort=n_ti1+desc&wt=javabin&version=2} hits=68 status=0 QTime=26
   [junit4]   2> 1859817 INFO  (qtp1369025570-51316) [    x:collection1] o.a.s.c.S.Request [collection1]  webapp=/xk_v path=/select params={distrib=false&fl=id&shards.purpose=4&start=0&fsv=true&sort=n_ti1+desc&shard.url=[ff01::114]:33332/xk_v|http://127.0.0.1:43757/xk_v/collection1&rows=10&version=2&q=*:*&NOW=1481695429364&isShard=true&wt=javabin} hits=68 status=0 QTime=0
   [junit4]   2> 1859819 INFO  (qtp1369025570-51316) [    x:collection1] o.a.s.c.S.Request [collection1]  webapp=/xk_v path=/select params={q=*:*&distrib=false&shards.purpose=64&NOW=1481695429364&ids=100,111,12,112,114,137,6,17,140,141&isShard=true&shard.url=[ff01::114]:33332/xk_v|http://127.0.0.1:43757/xk_v/collection1&wt=javabin&version=2} status=0 QTime=0
   [junit4]   2> 1859820 INFO  (qtp1369025570-51309) [    x:collection1] o.a.s.c.S.Request [collection1]  webapp=/xk_v path=/select params={q=*:*&shards=[ff01::114]:33332/xk_v|http://127.0.0.1:43757/xk_v/collection1&sort=n_ti1+desc&wt=javabin&version=2} hits=68 status=0 QTime=4
   [junit4]   2> 1859826 INFO  (qtp1369025570-51316) [    x:collection1] o.a.s.c.S.Request [collection1]  webapp=/xk_v path=/select params={distrib=false&fl=id&shards.purpose=4&start=0&fsv=true&sort=n_ti1+desc&shard.url=[ff01::114]:33332/xk_v|http://127.0.0.1:43757/xk_v/collection1&rows=10&version=2&q=*:*&NOW=1481695429367&isShard=true&wt=javabin} hits=68 status=0 QTime=0
   [junit4]   2> 1859829 INFO  (qtp1369025570-51315) [    x:collection1] o.a.s.c.S.Request [collection1]  webapp=/xk_v path=/select params={q=*:*&distrib=false&shards.purpose=64&NOW=1481695429367&ids=100,111,12,112,114,137,6,17,140,141&isShard=true&shard.url=[ff01::114]:33332/xk_v|http://127.0.0.1:43757/xk_v/collection1&wt=javabin&version=2} status=0 QTime=0
   [junit4]   2> 1859829 INFO  (qtp1369025570-51310) [    x:collection1] o.a.s.c.S.Request [

[...truncated too long message...]

GetClassName(DefaultMBeanServerInterceptor.java:1595)
   [junit4]   2> 	at com.sun.jmx.interceptor.DefaultMBeanServerInterceptor.checkMBeanPermission(DefaultMBeanServerInterceptor.java:1813)
   [junit4]   2> 	at com.sun.jmx.interceptor.DefaultMBeanServerInterceptor.exclusiveUnregisterMBean(DefaultMBeanServerInterceptor.java:430)
   [junit4]   2> 	at com.sun.jmx.interceptor.DefaultMBeanServerInterceptor.unregisterMBean(DefaultMBeanServerInterceptor.java:415)
   [junit4]   2> 	at com.sun.jmx.mbeanserver.JmxMBeanServer.unregisterMBean(JmxMBeanServer.java:546)
   [junit4]   2> 	at org.apache.hadoop.metrics2.util.MBeans.unregister(MBeans.java:81)
   [junit4]   2> 	at org.apache.hadoop.metrics2.impl.MetricsSourceAdapter.stopMBeans(MetricsSourceAdapter.java:226)
   [junit4]   2> 	at org.apache.hadoop.metrics2.impl.MetricsSourceAdapter.stop(MetricsSourceAdapter.java:211)
   [junit4]   2> 	at org.apache.hadoop.metrics2.impl.MetricsSystemImpl.stopSources(MetricsSystemImpl.java:463)
   [junit4]   2> 	at org.apache.hadoop.metrics2.impl.MetricsSystemImpl.stop(MetricsSystemImpl.java:213)
   [junit4]   2> 	at org.apache.hadoop.metrics2.impl.MetricsSystemImpl.shutdown(MetricsSystemImpl.java:594)
   [junit4]   2> 	at org.apache.hadoop.metrics2.lib.DefaultMetricsSystem.shutdownInstance(DefaultMetricsSystem.java:72)
   [junit4]   2> 	at org.apache.hadoop.metrics2.lib.DefaultMetricsSystem.shutdown(DefaultMetricsSystem.java:68)
   [junit4]   2> 	at org.apache.hadoop.hdfs.server.namenode.metrics.NameNodeMetrics.shutdown(NameNodeMetrics.java:171)
   [junit4]   2> 	at org.apache.hadoop.hdfs.server.namenode.NameNode.stop(NameNode.java:872)
   [junit4]   2> 	at org.apache.hadoop.hdfs.MiniDFSCluster.shutdown(MiniDFSCluster.java:1726)
   [junit4]   2> 	at org.apache.hadoop.hdfs.MiniDFSCluster.shutdown(MiniDFSCluster.java:1705)
   [junit4]   2> 	at org.apache.solr.cloud.hdfs.HdfsTestUtil.teardownClass(HdfsTestUtil.java:198)
   [junit4]   2> 	at org.apache.solr.cloud.hdfs.HdfsCollectionsAPIDistributedZkTest.teardownClass(HdfsCollectionsAPIDistributedZkTest.java:52)
   [junit4]   2> 	at sun.reflect.NativeMethodAccessorImpl.invoke0(Native Method)
   [junit4]   2> 	at sun.reflect.NativeMethodAccessorImpl.invoke(NativeMethodAccessorImpl.java:62)
   [junit4]   2> 	at sun.reflect.DelegatingMethodAccessorImpl.invoke(DelegatingMethodAccessorImpl.java:43)
   [junit4]   2> 	at java.lang.reflect.Method.invoke(Method.java:498)
   [junit4]   2> 	at com.carrotsearch.randomizedtesting.RandomizedRunner.invoke(RandomizedRunner.java:1713)
   [junit4]   2> 	at com.carrotsearch.randomizedtesting.RandomizedRunner$7.evaluate(RandomizedRunner.java:870)
   [junit4]   2> 	at com.carrotsearch.randomizedtesting.rules.StatementAdapter.evaluate(StatementAdapter.java:36)
   [junit4]   2> 	at com.carrotsearch.randomizedtesting.rules.SystemPropertiesRestoreRule$1.evaluate(SystemPropertiesRestoreRule.java:57)
   [junit4]   2> 	at org.apache.lucene.util.AbstractBeforeAfterRule$1.evaluate(AbstractBeforeAfterRule.java:45)
   [junit4]   2> 	at com.carrotsearch.randomizedtesting.rules.StatementAdapter.evaluate(StatementAdapter.java:36)
   [junit4]   2> 	at org.apache.lucene.util.TestRuleStoreClassName$1.evaluate(TestRuleStoreClassName.java:41)
   [junit4]   2> 	at com.carrotsearch.randomizedtesting.rules.NoShadowingOrOverridesOnMethodsRule$1.evaluate(NoShadowingOrOverridesOnMethodsRule.java:40)
   [junit4]   2> 	at com.carrotsearch.randomizedtesting.rules.NoShadowingOrOverridesOnMethodsRule$1.evaluate(NoShadowingOrOverridesOnMethodsRule.java:40)
   [junit4]   2> 	at com.carrotsearch.randomizedtesting.rules.StatementAdapter.evaluate(StatementAdapter.java:36)
   [junit4]   2> 	at com.carrotsearch.randomizedtesting.rules.StatementAdapter.evaluate(StatementAdapter.java:36)
   [junit4]   2> 	at com.carrotsearch.randomizedtesting.rules.StatementAdapter.evaluate(StatementAdapter.java:36)
   [junit4]   2> 	at org.apache.lucene.util.TestRuleAssertionsRequired$1.evaluate(TestRuleAssertionsRequired.java:53)
   [junit4]   2> 	at org.apache.lucene.util.TestRuleMarkFailure$1.evaluate(TestRuleMarkFailure.java:47)
   [junit4]   2> 	at org.apache.lucene.util.TestRuleIgnoreAfterMaxFailures$1.evaluate(TestRuleIgnoreAfterMaxFailures.java:64)
   [junit4]   2> 	at org.apache.lucene.util.TestRuleIgnoreTestSuites$1.evaluate(TestRuleIgnoreTestSuites.java:54)
   [junit4]   2> 	at com.carrotsearch.randomizedtesting.rules.StatementAdapter.evaluate(StatementAdapter.java:36)
   [junit4]   2> 	at com.carrotsearch.randomizedtesting.ThreadLeakControl$StatementRunner.run(ThreadLeakControl.java:367)
   [junit4]   2> 	at java.lang.Thread.run(Thread.java:745)
   [junit4]   2> Caused by: java.lang.NullPointerException
   [junit4]   2> 	at org.apache.hadoop.hdfs.server.blockmanagement.BlocksMap.size(BlocksMap.java:203)
   [junit4]   2> 	at org.apache.hadoop.hdfs.server.blockmanagement.BlockManager.getTotalBlocks(BlockManager.java:3370)
   [junit4]   2> 	at org.apache.hadoop.hdfs.server.namenode.FSNamesystem.getBlocksTotal(FSNamesystem.java:5729)
   [junit4]   2> 	... 54 more
   [junit4]   2> 4788235 INFO  (SUITE-HdfsCollectionsAPIDistributedZkTest-seed#[BA2AB614EBF0E90B]-worker) [    ] o.a.s.c.ZkTestServer connecting to 127.0.0.1:43782 43782
   [junit4]   2> 4788236 INFO  (SUITE-HdfsCollectionsAPIDistributedZkTest-seed#[BA2AB614EBF0E90B]-worker) [    ] o.a.s.SolrTestCaseJ4 ###deleteCore
   [junit4]   2> NOTE: leaving temporary files on disk at: /x1/jenkins/jenkins-slave/workspace/Lucene-Solr-NightlyTests-6.x/checkout/solr/build/solr-core/test/J0/temp/solr.cloud.hdfs.HdfsCollectionsAPIDistributedZkTest_BA2AB614EBF0E90B-001
   [junit4]   2> Dec 14, 2016 6:52:37 AM com.carrotsearch.randomizedtesting.ThreadLeakControl checkThreadLeaks
   [junit4]   2> WARNING: Will linger awaiting termination of 35 leaked thread(s).
   [junit4]   2> NOTE: test params are: codec=Asserting(Lucene62): {}, docValues:{}, maxPointsInLeafNode=113, maxMBSortInHeap=5.99697859537842, sim=RandomSimilarity(queryNorm=true,coord=yes): {}, locale=el, timezone=Brazil/Acre
   [junit4]   2> NOTE: Linux 3.13.0-85-generic amd64/Oracle Corporation 1.8.0_102 (64-bit)/cpus=4,threads=2,free=340725008,total=520093696
   [junit4]   2> NOTE: All tests run in this JVM: [DocumentAnalysisRequestHandlerTest, TestCryptoKeys, RegexBoostProcessorTest, TestRangeQuery, HdfsNNFailoverTest, TestRealTimeGet, BigEndianAscendingWordSerializerTest, ChangedSchemaMergeTest, CursorPagingTest, HdfsRestartWhileUpdatingTest, ClusterStateTest, PolyFieldTest, TestAtomicUpdateErrorCases, TestLeaderElectionWithEmptyReplica, CachingDirectoryFactoryTest, AnalysisAfterCoreReloadTest, AnalyticsMergeStrategyTest, BufferStoreTest, TestOrdValues, ReplaceNodeTest, ReturnFieldsTest, TestBackupRepositoryFactory, CloudExitableDirectoryReaderTest, CreateCollectionCleanupTest, DeleteLastCustomShardedReplicaTest, ResponseHeaderTest, TestFunctionQuery, TestReloadAndDeleteDocs, PathHierarchyTokenizerFactoryTest, TestFieldCacheSanityChecker, TestHighFrequencyDictionaryFactory, OverseerRolesTest, TestPHPSerializedResponseWriter, CacheHeaderTest, DistributedVersionInfoTest, RollingRestartTest, RulesTest, TestComponentsName, MigrateRouteKeyTest, TestSolrCloudWithDelegationTokens, TestNumericTerms32, DefaultValueUpdateProcessorTest, DistributedQueryComponentCustomSortTest, ZkNodePropsTest, SimpleCollectionCreateDeleteTest, TestDistributedStatsComponentCardinality, TestValueSourceCache, AlternateDirectoryTest, TestRandomFaceting, TestFaceting, TestFastWriter, CurrencyFieldOpenExchangeTest, NumericFieldsTest, HighlighterConfigTest, TestStressLucene, ConcurrentDeleteAndCreateCollectionTest, TestMacros, TestHighlightDedupGrouping, DistributedFacetPivotSmallAdvancedTest, TestPseudoReturnFields, NotRequiredUniqueKeyTest, TestPushWriter, CheckHdfsIndexTest, DistributedSpellCheckComponentTest, SignatureUpdateProcessorFactoryTest, TestDocTermOrds, DocExpirationUpdateProcessorFactoryTest, TestIBSimilarityFactory, TestConfigSetProperties, MergeStrategyTest, TestJsonFacetRefinement, DistributedQueryElevationComponentTest, TestGeoJSONResponseWriter, TestFastLRUCache, TestSolrCoreSnapshots, TestRecoveryHdfs, LeaderFailureAfterFreshStartTest, PeerSyncTest, TestComplexPhraseQParserPlugin, ScriptEngineTest, AddSchemaFieldsUpdateProcessorFactoryTest, PreAnalyzedUpdateProcessorTest, UUIDFieldTest, XsltUpdateRequestHandlerTest, BlockJoinFacetDistribTest, TestSolrDynamicMBean, TestBlendedInfixSuggestions, ExitableDirectoryReaderTest, TestTrackingShardHandlerFactory, TestDocSet, RequiredFieldsTest, StressHdfsTest, TestUnifiedSolrHighlighter, BasicDistributedZkTest, LeaderElectionIntegrationTest, TestInitQParser, TestSQLHandlerNonCloud, TestSchemaVersionResource, ShardSplitTest, TestCrossCoreJoin, TestTrieFacet, FullHLLTest, AsyncCallRequestStatusResponseTest, SyncSliceTest, ExternalFileFieldSortTest, TestTolerantSearch, TestEmbeddedSolrServerConstructors, TestJettySolrRunner, ConnectionReuseTest, CdcrVersionReplicationTest, CollectionTooManyReplicasTest, DeleteShardTest, DistribDocExpirationUpdateProcessorTest, DocValuesNotIndexedTest, HttpPartitionTest, OverseerStatusTest, PeerSyncReplicationTest, SharedFSAutoReplicaFailoverTest, SharedFSAutoReplicaFailoverUtilsTest, SolrCLIZkUtilsTest, SolrXmlInZkTest, TestAuthenticationFramework, TestCloudInspectUtil, TestCloudPivotFacet, TestCloudPseudoReturnFields, TestCollectionAPI, TestDistribDocBasedVersion, TestLeaderElectionZkExpiry, TestLeaderInitiatedRecoveryThread, TestMiniSolrCloudClusterSSL, TestOnReconnectListenerSupport, TestRandomRequestDistribution, TestReplicaProperties, TestRequestForwarding, TestSSLRandomization, TestShortCircuitedRequests, TestStressCloudBlindAtomicUpdates, VMParamsZkACLAndCredentialsProvidersTest, HdfsBasicDistributedZk2Test, HdfsChaosMonkeyNothingIsSafeTest, HdfsChaosMonkeySafeLeaderTest, HdfsCollectionsAPIDistributedZkTest]
   [junit4] Completed [523/661 (3!)] on J0 in 166.26s, 20 tests, 1 failure, 1 error <<< FAILURES!

[...truncated 62819 lines...]



Mime
View raw message