lucene-dev mailing list archives

Site index · List index
Message view « Date » · « Thread »
Top « Date » · « Thread »
From Policeman Jenkins Server <jenk...@thetaphi.de>
Subject [JENKINS] Lucene-Solr-master-Solaris (64bit/jdk1.8.0) - Build # 985 - Unstable!
Date Fri, 02 Dec 2016 08:42:22 GMT
Build: https://jenkins.thetaphi.de/job/Lucene-Solr-master-Solaris/985/
Java: 64bit/jdk1.8.0 -XX:-UseCompressedOops -XX:+UseG1GC

1 tests failed.
FAILED:  org.apache.solr.cloud.TestSolrCloudWithDelegationTokens.testDelegationTokenCancelFail

Error Message:
expected:<200> but was:<404>

Stack Trace:
java.lang.AssertionError: expected:<200> but was:<404>
	at __randomizedtesting.SeedInfo.seed([46FCE90E215BFF23:2E43DC24F1C1EDCF]:0)
	at org.junit.Assert.fail(Assert.java:93)
	at org.junit.Assert.failNotEquals(Assert.java:647)
	at org.junit.Assert.assertEquals(Assert.java:128)
	at org.junit.Assert.assertEquals(Assert.java:472)
	at org.junit.Assert.assertEquals(Assert.java:456)
	at org.apache.solr.cloud.TestSolrCloudWithDelegationTokens.cancelDelegationToken(TestSolrCloudWithDelegationTokens.java:140)
	at org.apache.solr.cloud.TestSolrCloudWithDelegationTokens.testDelegationTokenCancelFail(TestSolrCloudWithDelegationTokens.java:294)
	at sun.reflect.NativeMethodAccessorImpl.invoke0(Native Method)
	at sun.reflect.NativeMethodAccessorImpl.invoke(NativeMethodAccessorImpl.java:62)
	at sun.reflect.DelegatingMethodAccessorImpl.invoke(DelegatingMethodAccessorImpl.java:43)
	at java.lang.reflect.Method.invoke(Method.java:498)
	at com.carrotsearch.randomizedtesting.RandomizedRunner.invoke(RandomizedRunner.java:1713)
	at com.carrotsearch.randomizedtesting.RandomizedRunner$8.evaluate(RandomizedRunner.java:907)
	at com.carrotsearch.randomizedtesting.RandomizedRunner$9.evaluate(RandomizedRunner.java:943)
	at com.carrotsearch.randomizedtesting.RandomizedRunner$10.evaluate(RandomizedRunner.java:957)
	at com.carrotsearch.randomizedtesting.rules.SystemPropertiesRestoreRule$1.evaluate(SystemPropertiesRestoreRule.java:57)
	at org.apache.lucene.util.TestRuleSetupTeardownChained$1.evaluate(TestRuleSetupTeardownChained.java:49)
	at org.apache.lucene.util.AbstractBeforeAfterRule$1.evaluate(AbstractBeforeAfterRule.java:45)
	at org.apache.lucene.util.TestRuleThreadAndTestName$1.evaluate(TestRuleThreadAndTestName.java:48)
	at org.apache.lucene.util.TestRuleIgnoreAfterMaxFailures$1.evaluate(TestRuleIgnoreAfterMaxFailures.java:64)
	at org.apache.lucene.util.TestRuleMarkFailure$1.evaluate(TestRuleMarkFailure.java:47)
	at com.carrotsearch.randomizedtesting.rules.StatementAdapter.evaluate(StatementAdapter.java:36)
	at com.carrotsearch.randomizedtesting.ThreadLeakControl$StatementRunner.run(ThreadLeakControl.java:367)
	at com.carrotsearch.randomizedtesting.ThreadLeakControl.forkTimeoutingTask(ThreadLeakControl.java:811)
	at com.carrotsearch.randomizedtesting.ThreadLeakControl$3.evaluate(ThreadLeakControl.java:462)
	at com.carrotsearch.randomizedtesting.RandomizedRunner.runSingleTest(RandomizedRunner.java:916)
	at com.carrotsearch.randomizedtesting.RandomizedRunner$5.evaluate(RandomizedRunner.java:802)
	at com.carrotsearch.randomizedtesting.RandomizedRunner$6.evaluate(RandomizedRunner.java:852)
	at com.carrotsearch.randomizedtesting.RandomizedRunner$7.evaluate(RandomizedRunner.java:863)
	at com.carrotsearch.randomizedtesting.rules.StatementAdapter.evaluate(StatementAdapter.java:36)
	at com.carrotsearch.randomizedtesting.rules.SystemPropertiesRestoreRule$1.evaluate(SystemPropertiesRestoreRule.java:57)
	at org.apache.lucene.util.AbstractBeforeAfterRule$1.evaluate(AbstractBeforeAfterRule.java:45)
	at com.carrotsearch.randomizedtesting.rules.StatementAdapter.evaluate(StatementAdapter.java:36)
	at org.apache.lucene.util.TestRuleStoreClassName$1.evaluate(TestRuleStoreClassName.java:41)
	at com.carrotsearch.randomizedtesting.rules.NoShadowingOrOverridesOnMethodsRule$1.evaluate(NoShadowingOrOverridesOnMethodsRule.java:40)
	at com.carrotsearch.randomizedtesting.rules.NoShadowingOrOverridesOnMethodsRule$1.evaluate(NoShadowingOrOverridesOnMethodsRule.java:40)
	at com.carrotsearch.randomizedtesting.rules.StatementAdapter.evaluate(StatementAdapter.java:36)
	at com.carrotsearch.randomizedtesting.rules.StatementAdapter.evaluate(StatementAdapter.java:36)
	at com.carrotsearch.randomizedtesting.rules.StatementAdapter.evaluate(StatementAdapter.java:36)
	at org.apache.lucene.util.TestRuleAssertionsRequired$1.evaluate(TestRuleAssertionsRequired.java:53)
	at org.apache.lucene.util.TestRuleMarkFailure$1.evaluate(TestRuleMarkFailure.java:47)
	at org.apache.lucene.util.TestRuleIgnoreAfterMaxFailures$1.evaluate(TestRuleIgnoreAfterMaxFailures.java:64)
	at org.apache.lucene.util.TestRuleIgnoreTestSuites$1.evaluate(TestRuleIgnoreTestSuites.java:54)
	at com.carrotsearch.randomizedtesting.rules.StatementAdapter.evaluate(StatementAdapter.java:36)
	at com.carrotsearch.randomizedtesting.ThreadLeakControl$StatementRunner.run(ThreadLeakControl.java:367)
	at java.lang.Thread.run(Thread.java:745)




Build Log:
[...truncated 12194 lines...]
   [junit4] Suite: org.apache.solr.cloud.TestSolrCloudWithDelegationTokens
   [junit4]   2> Creating dataDir: /export/home/jenkins/workspace/Lucene-Solr-master-Solaris/solr/build/solr-core/test/J1/temp/solr.cloud.TestSolrCloudWithDelegationTokens_46FCE90E215BFF23-001/init-core-data-001
   [junit4]   2> 2236904 INFO  (SUITE-TestSolrCloudWithDelegationTokens-seed#[46FCE90E215BFF23]-worker)
[    ] o.a.s.SolrTestCaseJ4 Randomized ssl (false) and clientAuth (false) via: @org.apache.solr.util.RandomizeSSL(reason=,
value=NaN, ssl=NaN, clientAuth=NaN)
   [junit4]   2> 2236907 INFO  (SUITE-TestSolrCloudWithDelegationTokens-seed#[46FCE90E215BFF23]-worker)
[    ] o.a.s.c.MiniSolrCloudCluster Starting cluster of 2 servers in /export/home/jenkins/workspace/Lucene-Solr-master-Solaris/solr/build/solr-core/test/J1/temp/solr.cloud.TestSolrCloudWithDelegationTokens_46FCE90E215BFF23-001/tempDir-001
   [junit4]   2> 2236907 INFO  (SUITE-TestSolrCloudWithDelegationTokens-seed#[46FCE90E215BFF23]-worker)
[    ] o.a.s.c.ZkTestServer STARTING ZK TEST SERVER
   [junit4]   2> 2236907 INFO  (Thread-9301) [    ] o.a.s.c.ZkTestServer client port:0.0.0.0/0.0.0.0:0
   [junit4]   2> 2236908 INFO  (Thread-9301) [    ] o.a.s.c.ZkTestServer Starting server
   [junit4]   2> 2237010 INFO  (SUITE-TestSolrCloudWithDelegationTokens-seed#[46FCE90E215BFF23]-worker)
[    ] o.a.s.c.ZkTestServer start zk server on port:62687
   [junit4]   2> 2237019 INFO  (jetty-launcher-3505-thread-2) [    ] o.e.j.s.Server jetty-9.3.14.v20161028
   [junit4]   2> 2237019 INFO  (jetty-launcher-3505-thread-1) [    ] o.e.j.s.Server jetty-9.3.14.v20161028
   [junit4]   2> 2237021 INFO  (jetty-launcher-3505-thread-2) [    ] o.e.j.s.h.ContextHandler
Started o.e.j.s.ServletContextHandler@537dcde8{/solr,null,AVAILABLE}
   [junit4]   2> 2237022 INFO  (jetty-launcher-3505-thread-1) [    ] o.e.j.s.h.ContextHandler
Started o.e.j.s.ServletContextHandler@fc2dc29{/solr,null,AVAILABLE}
   [junit4]   2> 2237023 INFO  (jetty-launcher-3505-thread-1) [    ] o.e.j.s.AbstractConnector
Started ServerConnector@7c68bd3{HTTP/1.1,[http/1.1]}{127.0.0.1:47301}
   [junit4]   2> 2237023 INFO  (jetty-launcher-3505-thread-1) [    ] o.e.j.s.Server Started
@2240614ms
   [junit4]   2> 2237023 INFO  (jetty-launcher-3505-thread-2) [    ] o.e.j.s.AbstractConnector
Started ServerConnector@63a1c3e4{HTTP/1.1,[http/1.1]}{127.0.0.1:65115}
   [junit4]   2> 2237023 INFO  (jetty-launcher-3505-thread-1) [    ] o.a.s.c.s.e.JettySolrRunner
Jetty properties: {hostContext=/solr, hostPort=47301}
   [junit4]   2> 2237023 INFO  (jetty-launcher-3505-thread-2) [    ] o.e.j.s.Server Started
@2240615ms
   [junit4]   2> 2237024 INFO  (jetty-launcher-3505-thread-2) [    ] o.a.s.c.s.e.JettySolrRunner
Jetty properties: {hostContext=/solr, hostPort=65115}
   [junit4]   2> 2237024 ERROR (jetty-launcher-3505-thread-1) [    ] o.a.s.s.StartupLoggingUtils
Missing Java Option solr.log.dir. Logging may be missing or incomplete.
   [junit4]   2> 2237024 ERROR (jetty-launcher-3505-thread-2) [    ] o.a.s.s.StartupLoggingUtils
Missing Java Option solr.log.dir. Logging may be missing or incomplete.
   [junit4]   2> 2237024 INFO  (jetty-launcher-3505-thread-1) [    ] o.a.s.s.SolrDispatchFilter
 ___      _       Welcome to Apache Solr™ version 7.0.0
   [junit4]   2> 2237024 INFO  (jetty-launcher-3505-thread-2) [    ] o.a.s.s.SolrDispatchFilter
 ___      _       Welcome to Apache Solr™ version 7.0.0
   [junit4]   2> 2237024 INFO  (jetty-launcher-3505-thread-1) [    ] o.a.s.s.SolrDispatchFilter
/ __| ___| |_ _   Starting in cloud mode on port null
   [junit4]   2> 2237024 INFO  (jetty-launcher-3505-thread-2) [    ] o.a.s.s.SolrDispatchFilter
/ __| ___| |_ _   Starting in cloud mode on port null
   [junit4]   2> 2237024 INFO  (jetty-launcher-3505-thread-1) [    ] o.a.s.s.SolrDispatchFilter
\__ \/ _ \ | '_|  Install dir: null
   [junit4]   2> 2237024 INFO  (jetty-launcher-3505-thread-2) [    ] o.a.s.s.SolrDispatchFilter
\__ \/ _ \ | '_|  Install dir: null
   [junit4]   2> 2237024 INFO  (jetty-launcher-3505-thread-1) [    ] o.a.s.s.SolrDispatchFilter
|___/\___/_|_|    Start time: 2016-12-02T08:15:13.399Z
   [junit4]   2> 2237024 INFO  (jetty-launcher-3505-thread-2) [    ] o.a.s.s.SolrDispatchFilter
|___/\___/_|_|    Start time: 2016-12-02T08:15:13.399Z
   [junit4]   2> 2237028 INFO  (jetty-launcher-3505-thread-1) [    ] o.a.s.s.SolrDispatchFilter
solr.xml found in ZooKeeper. Loading...
   [junit4]   2> 2237028 INFO  (jetty-launcher-3505-thread-2) [    ] o.a.s.s.SolrDispatchFilter
solr.xml found in ZooKeeper. Loading...
   [junit4]   2> 2237036 INFO  (jetty-launcher-3505-thread-2) [    ] o.a.s.c.ZkContainer
Zookeeper client=127.0.0.1:62687/solr
   [junit4]   2> 2237037 INFO  (jetty-launcher-3505-thread-1) [    ] o.a.s.c.ZkContainer
Zookeeper client=127.0.0.1:62687/solr
   [junit4]   2> 2237042 WARN  (NIOServerCxn.Factory:0.0.0.0/0.0.0.0:0) [    ] o.a.z.s.NIOServerCnxn
caught end of stream exception
   [junit4]   2> EndOfStreamException: Unable to read additional data from client sessionid
0x158be99ff850003, likely client has closed socket
   [junit4]   2> 	at org.apache.zookeeper.server.NIOServerCnxn.doIO(NIOServerCnxn.java:228)
   [junit4]   2> 	at org.apache.zookeeper.server.NIOServerCnxnFactory.run(NIOServerCnxnFactory.java:208)
   [junit4]   2> 	at java.lang.Thread.run(Thread.java:745)
   [junit4]   2> 2237043 WARN  (NIOServerCxn.Factory:0.0.0.0/0.0.0.0:0) [    ] o.a.z.s.NIOServerCnxn
caught end of stream exception
   [junit4]   2> EndOfStreamException: Unable to read additional data from client sessionid
0x158be99ff850004, likely client has closed socket
   [junit4]   2> 	at org.apache.zookeeper.server.NIOServerCnxn.doIO(NIOServerCnxn.java:228)
   [junit4]   2> 	at org.apache.zookeeper.server.NIOServerCnxnFactory.run(NIOServerCnxnFactory.java:208)
   [junit4]   2> 	at java.lang.Thread.run(Thread.java:745)
   [junit4]   2> 2237078 INFO  (jetty-launcher-3505-thread-1) [n:127.0.0.1:47301_solr 
  ] o.a.s.c.OverseerElectionContext I am going to be the leader 127.0.0.1:47301_solr
   [junit4]   2> 2237079 INFO  (jetty-launcher-3505-thread-2) [n:127.0.0.1:65115_solr 
  ] o.a.s.c.ZkController Register node as live in ZooKeeper:/live_nodes/127.0.0.1:65115_solr
   [junit4]   2> 2237080 INFO  (jetty-launcher-3505-thread-1) [n:127.0.0.1:47301_solr 
  ] o.a.s.c.Overseer Overseer (id=97036960614645765-127.0.0.1:47301_solr-n_0000000000) starting
   [junit4]   2> 2237081 INFO  (zkCallback-3516-thread-1-processing-n:127.0.0.1:47301_solr)
[n:127.0.0.1:47301_solr    ] o.a.s.c.c.ZkStateReader Updated live nodes from ZooKeeper...
(0) -> (1)
   [junit4]   2> 2237081 INFO  (zkCallback-3515-thread-1-processing-n:127.0.0.1:65115_solr)
[n:127.0.0.1:65115_solr    ] o.a.s.c.c.ZkStateReader Updated live nodes from ZooKeeper...
(0) -> (1)
   [junit4]   2> 2237097 INFO  (jetty-launcher-3505-thread-1) [n:127.0.0.1:47301_solr 
  ] o.a.s.c.ZkController Register node as live in ZooKeeper:/live_nodes/127.0.0.1:47301_solr
   [junit4]   2> 2237100 INFO  (zkCallback-3515-thread-1-processing-n:127.0.0.1:65115_solr)
[n:127.0.0.1:65115_solr    ] o.a.s.c.c.ZkStateReader Updated live nodes from ZooKeeper...
(1) -> (2)
   [junit4]   2> 2237100 INFO  (zkCallback-3516-thread-1-processing-n:127.0.0.1:47301_solr)
[n:127.0.0.1:47301_solr    ] o.a.s.c.c.ZkStateReader Updated live nodes from ZooKeeper...
(1) -> (2)
   [junit4]   2> 2237158 INFO  (jetty-launcher-3505-thread-1) [n:127.0.0.1:47301_solr 
  ] o.a.s.c.CoreContainer Initializing authentication plugin: org.apache.solr.security.HttpParamDelegationTokenPlugin
   [junit4]   2> 2237170 INFO  (jetty-launcher-3505-thread-1) [n:127.0.0.1:47301_solr 
  ] o.a.s.s.KerberosPlugin Params: {token.valid=30, delegation-token.token-kind=solr-dt, cookie.domain=127.0.0.1,
cookie.path=/, zk-dt-secret-manager.znodeWorkingPath=solr/security/zkdtsm, token.validity=36000,
signer.secret.provider.zookeeper.path=/token, type=kerberos, zk-dt-secret-manager.enable=true,
kerberos.name.rules=DEFAULT, signer.secret.provider=zookeeper}
   [junit4]   2> 2237192 INFO  (jetty-launcher-3505-thread-2) [n:127.0.0.1:65115_solr 
  ] o.a.s.c.CoreContainer Initializing authentication plugin: org.apache.solr.security.HttpParamDelegationTokenPlugin
   [junit4]   2> 2237192 INFO  (jetty-launcher-3505-thread-2) [n:127.0.0.1:65115_solr 
  ] o.a.s.s.KerberosPlugin Params: {token.valid=30, delegation-token.token-kind=solr-dt, cookie.domain=127.0.0.1,
cookie.path=/, zk-dt-secret-manager.znodeWorkingPath=solr/security/zkdtsm, token.validity=36000,
signer.secret.provider.zookeeper.path=/token, type=kerberos, zk-dt-secret-manager.enable=true,
kerberos.name.rules=DEFAULT, signer.secret.provider=zookeeper}
   [junit4]   2> 2237263 INFO  (jetty-launcher-3505-thread-2) [n:127.0.0.1:65115_solr 
  ] o.a.c.f.i.CuratorFrameworkImpl Starting
   [junit4]   2> 2237263 INFO  (jetty-launcher-3505-thread-1) [n:127.0.0.1:47301_solr 
  ] o.a.c.f.i.CuratorFrameworkImpl Starting
   [junit4]   2> 2237299 INFO  (jetty-launcher-3505-thread-2-EventThread) [n:127.0.0.1:65115_solr
   ] o.a.c.f.s.ConnectionStateManager State change: CONNECTED
   [junit4]   2> 2237299 INFO  (jetty-launcher-3505-thread-1-EventThread) [n:127.0.0.1:47301_solr
   ] o.a.c.f.s.ConnectionStateManager State change: CONNECTED
   [junit4]   2> 2237439 INFO  (jetty-launcher-3505-thread-2) [n:127.0.0.1:65115_solr 
  ] o.a.s.c.CorePropertiesLocator Found 0 core definitions underneath /export/home/jenkins/workspace/Lucene-Solr-master-Solaris/solr/build/solr-core/test/J1/temp/solr.cloud.TestSolrCloudWithDelegationTokens_46FCE90E215BFF23-001/tempDir-001/node2/.
   [junit4]   2> 2237440 INFO  (jetty-launcher-3505-thread-1) [n:127.0.0.1:47301_solr 
  ] o.a.s.c.CorePropertiesLocator Found 0 core definitions underneath /export/home/jenkins/workspace/Lucene-Solr-master-Solaris/solr/build/solr-core/test/J1/temp/solr.cloud.TestSolrCloudWithDelegationTokens_46FCE90E215BFF23-001/tempDir-001/node1/.
   [junit4]   2> 2237456 WARN  (NIOServerCxn.Factory:0.0.0.0/0.0.0.0:0) [    ] o.a.z.s.NIOServerCnxn
caught end of stream exception
   [junit4]   2> EndOfStreamException: Unable to read additional data from client sessionid
0x158be99ff850009, likely client has closed socket
   [junit4]   2> 	at org.apache.zookeeper.server.NIOServerCnxn.doIO(NIOServerCnxn.java:228)
   [junit4]   2> 	at org.apache.zookeeper.server.NIOServerCnxnFactory.run(NIOServerCnxnFactory.java:208)
   [junit4]   2> 	at java.lang.Thread.run(Thread.java:745)
   [junit4]   2> 2237491 INFO  (TEST-TestSolrCloudWithDelegationTokens.testDelegationTokenVerify-seed#[46FCE90E215BFF23])
[    ] o.a.s.SolrTestCaseJ4 ###Starting testDelegationTokenVerify
   [junit4]   2> 2237565 INFO  (qtp1634451348-24735) [n:127.0.0.1:65115_solr    ] o.a.s.h.a.CollectionsHandler
Invoked Collection Action :list with params action=LIST&delegation=GgADYmFyA2JhcgCKAVi-mgHdigFY4qaF3QEDFFJnyubyRDn9ydvrfqt5y9g8ALueB3NvbHItZHQA&wt=javabin&version=2
and sendToOCPQueue=true
   [junit4]   2> 2237565 INFO  (qtp1634451348-24735) [n:127.0.0.1:65115_solr    ] o.a.s.s.HttpSolrCall
[admin] webapp=null path=/admin/collections params={action=LIST&delegation=GgADYmFyA2JhcgCKAVi-mgHdigFY4qaF3QEDFFJnyubyRDn9ydvrfqt5y9g8ALueB3NvbHItZHQA&wt=javabin&version=2}
status=0 QTime=0
   [junit4]   2> 2237572 INFO  (TEST-TestSolrCloudWithDelegationTokens.testDelegationTokenVerify-seed#[46FCE90E215BFF23])
[    ] o.a.s.c.c.ZkStateReader Updated live nodes from ZooKeeper... (0) -> (2)
   [junit4]   2> 2237574 INFO  (TEST-TestSolrCloudWithDelegationTokens.testDelegationTokenVerify-seed#[46FCE90E215BFF23])
[    ] o.a.s.c.s.i.ZkClientClusterStateProvider Cluster at 127.0.0.1:62687/solr ready
   [junit4]   2> 2237586 INFO  (qtp1225018710-24740) [n:127.0.0.1:47301_solr    ] o.a.s.h.a.CollectionsHandler
Invoked Collection Action :list with params action=LIST&delegation=GgADYmFyA2JhcgCKAVi-mgHdigFY4qaF3QEDFFJnyubyRDn9ydvrfqt5y9g8ALueB3NvbHItZHQA&wt=javabin&version=2
and sendToOCPQueue=true
   [junit4]   2> 2237586 INFO  (qtp1225018710-24740) [n:127.0.0.1:47301_solr    ] o.a.s.s.HttpSolrCall
[admin] webapp=null path=/admin/collections params={action=LIST&delegation=GgADYmFyA2JhcgCKAVi-mgHdigFY4qaF3QEDFFJnyubyRDn9ydvrfqt5y9g8ALueB3NvbHItZHQA&wt=javabin&version=2}
status=0 QTime=0
   [junit4]   2> 2237592 INFO  (TEST-TestSolrCloudWithDelegationTokens.testDelegationTokenVerify-seed#[46FCE90E215BFF23])
[    ] o.a.s.c.c.ZkStateReader Updated live nodes from ZooKeeper... (0) -> (2)
   [junit4]   2> 2237594 INFO  (TEST-TestSolrCloudWithDelegationTokens.testDelegationTokenVerify-seed#[46FCE90E215BFF23])
[    ] o.a.s.c.s.i.ZkClientClusterStateProvider Cluster at 127.0.0.1:62687/solr ready
   [junit4]   2> 2237598 INFO  (TEST-TestSolrCloudWithDelegationTokens.testDelegationTokenVerify-seed#[46FCE90E215BFF23])
[    ] o.a.s.SolrTestCaseJ4 ###Ending testDelegationTokenVerify
   [junit4]   2> 2237631 INFO  (TEST-TestSolrCloudWithDelegationTokens.testDelegationTokenCancelFail-seed#[46FCE90E215BFF23])
[    ] o.a.s.SolrTestCaseJ4 ###Starting testDelegationTokenCancelFail
   [junit4]   2> 2237674 INFO  (TEST-TestSolrCloudWithDelegationTokens.testDelegationTokenCancelFail-seed#[46FCE90E215BFF23])
[    ] o.a.s.SolrTestCaseJ4 ###Ending testDelegationTokenCancelFail
   [junit4]   2> NOTE: reproduce with: ant test  -Dtestcase=TestSolrCloudWithDelegationTokens
-Dtests.method=testDelegationTokenCancelFail -Dtests.seed=46FCE90E215BFF23 -Dtests.slow=true
-Dtests.locale=en-ZA -Dtests.timezone=Pacific/Tarawa -Dtests.asserts=true -Dtests.file.encoding=UTF-8
   [junit4] FAILURE 0.08s J1 | TestSolrCloudWithDelegationTokens.testDelegationTokenCancelFail
<<<
   [junit4]    > Throwable #1: java.lang.AssertionError: expected:<200> but was:<404>
   [junit4]    > 	at __randomizedtesting.SeedInfo.seed([46FCE90E215BFF23:2E43DC24F1C1EDCF]:0)
   [junit4]    > 	at org.apache.solr.cloud.TestSolrCloudWithDelegationTokens.cancelDelegationToken(TestSolrCloudWithDelegationTokens.java:140)
   [junit4]    > 	at org.apache.solr.cloud.TestSolrCloudWithDelegationTokens.testDelegationTokenCancelFail(TestSolrCloudWithDelegationTokens.java:294)
   [junit4]    > 	at java.lang.Thread.run(Thread.java:745)
   [junit4]   2> 2237750 INFO  (TEST-TestSolrCloudWithDelegationTokens.testDelegationTokenRenew-seed#[46FCE90E215BFF23])
[    ] o.a.s.SolrTestCaseJ4 ###Starting testDelegationTokenRenew
   [junit4]   2> 2237769 INFO  (TEST-TestSolrCloudWithDelegationTokens.testDelegationTokenRenew-seed#[46FCE90E215BFF23])
[    ] o.a.s.c.c.ZkStateReader Updated live nodes from ZooKeeper... (0) -> (2)
   [junit4]   2> 2237771 INFO  (TEST-TestSolrCloudWithDelegationTokens.testDelegationTokenRenew-seed#[46FCE90E215BFF23])
[    ] o.a.s.c.s.i.ZkClientClusterStateProvider Cluster at 127.0.0.1:62687/solr ready
   [junit4]   2> 2237773 INFO  (qtp1634451348-24737) [n:127.0.0.1:65115_solr    ] o.a.s.h.a.CollectionsHandler
Invoked Collection Action :list with params action=LIST&delegation=GgADYmFyA2JhcgCKAVi-mgLNigFY4qaGzQMDFJLh_HTouaNgKuV-dZneRTIyebUPB3NvbHItZHQA&wt=javabin&version=2
and sendToOCPQueue=true
   [junit4]   2> 2237773 INFO  (qtp1634451348-24737) [n:127.0.0.1:65115_solr    ] o.a.s.s.HttpSolrCall
[admin] webapp=null path=/admin/collections params={action=LIST&delegation=GgADYmFyA2JhcgCKAVi-mgLNigFY4qaGzQMDFJLh_HTouaNgKuV-dZneRTIyebUPB3NvbHItZHQA&wt=javabin&version=2}
status=0 QTime=0
   [junit4]   2> 2237778 INFO  (TEST-TestSolrCloudWithDelegationTokens.testDelegationTokenRenew-seed#[46FCE90E215BFF23])
[    ] o.a.s.c.c.ZkStateReader Updated live nodes from ZooKeeper... (0) -> (2)
   [junit4]   2> 2237780 INFO  (TEST-TestSolrCloudWithDelegationTokens.testDelegationTokenRenew-seed#[46FCE90E215BFF23])
[    ] o.a.s.c.s.i.ZkClientClusterStateProvider Cluster at 127.0.0.1:62687/solr ready
   [junit4]   2> 2237789 INFO  (qtp1225018710-24731) [n:127.0.0.1:47301_solr    ] o.a.s.h.a.CollectionsHandler
Invoked Collection Action :list with params action=LIST&delegation=GgADYmFyA2JhcgCKAVi-mgLNigFY4qaGzQMDFJLh_HTouaNgKuV-dZneRTIyebUPB3NvbHItZHQA&wt=javabin&version=2
and sendToOCPQueue=true
   [junit4]   2> 2237789 INFO  (qtp1225018710-24731) [n:127.0.0.1:47301_solr    ] o.a.s.s.HttpSolrCall
[admin] webapp=null path=/admin/collections params={action=LIST&delegation=GgADYmFyA2JhcgCKAVi-mgLNigFY4qaGzQMDFJLh_HTouaNgKuV-dZneRTIyebUPB3NvbHItZHQA&wt=javabin&version=2}
status=0 QTime=0
   [junit4]   2> 2237813 INFO  (qtp1634451348-24736) [n:127.0.0.1:65115_solr    ] o.a.s.h.a.CollectionsHandler
Invoked Collection Action :list with params action=LIST&delegation=GgADYmFyA2JhcgCKAVi-mgL4igFY4qaG-AQDFC-obeIIWDvf2iUSsnFlomA0dx95B3NvbHItZHQA&wt=javabin&version=2
and sendToOCPQueue=true
   [junit4]   2> 2237813 INFO  (qtp1634451348-24736) [n:127.0.0.1:65115_solr    ] o.a.s.s.HttpSolrCall
[admin] webapp=null path=/admin/collections params={action=LIST&delegation=GgADYmFyA2JhcgCKAVi-mgL4igFY4qaG-AQDFC-obeIIWDvf2iUSsnFlomA0dx95B3NvbHItZHQA&wt=javabin&version=2}
status=0 QTime=0
   [junit4]   2> 2237821 INFO  (TEST-TestSolrCloudWithDelegationTokens.testDelegationTokenRenew-seed#[46FCE90E215BFF23])
[    ] o.a.s.c.c.ZkStateReader Updated live nodes from ZooKeeper... (0) -> (2)
   [junit4]   2> 2237823 INFO  (TEST-TestSolrCloudWithDelegationTokens.testDelegationTokenRenew-seed#[46FCE90E215BFF23])
[    ] o.a.s.c.s.i.ZkClientClusterStateProvider Cluster at 127.0.0.1:62687/solr ready
   [junit4]   2> 2237829 INFO  (qtp1225018710-24745) [n:127.0.0.1:47301_solr    ] o.a.s.h.a.CollectionsHandler
Invoked Collection Action :list with params action=LIST&delegation=GgADYmFyA2JhcgCKAVi-mgL4igFY4qaG-AQDFC-obeIIWDvf2iUSsnFlomA0dx95B3NvbHItZHQA&wt=javabin&version=2
and sendToOCPQueue=true
   [junit4]   2> 2237829 INFO  (qtp1225018710-24745) [n:127.0.0.1:47301_solr    ] o.a.s.s.HttpSolrCall
[admin] webapp=null path=/admin/collections params={action=LIST&delegation=GgADYmFyA2JhcgCKAVi-mgL4igFY4qaG-AQDFC-obeIIWDvf2iUSsnFlomA0dx95B3NvbHItZHQA&wt=javabin&version=2}
status=0 QTime=0
   [junit4]   2> 2237850 INFO  (TEST-TestSolrCloudWithDelegationTokens.testDelegationTokenRenew-seed#[46FCE90E215BFF23])
[    ] o.a.s.c.c.ZkStateReader Updated live nodes from ZooKeeper... (0) -> (2)
   [junit4]   2> 2237851 INFO  (TEST-TestSolrCloudWithDelegationTokens.testDelegationTokenRenew-seed#[46FCE90E215BFF23])
[    ] o.a.s.c.s.i.ZkClientClusterStateProvider Cluster at 127.0.0.1:62687/solr ready
   [junit4]   2> 2237853 INFO  (qtp1634451348-24732) [n:127.0.0.1:65115_solr    ] o.a.s.h.a.CollectionsHandler
Invoked Collection Action :list with params action=LIST&delegation=GgADYmFyA2JhcgCKAVi-mgMhigFY4qaHIQUDFEzKmMzwrotARF8KgiMtjaB269dmB3NvbHItZHQA&wt=javabin&version=2
and sendToOCPQueue=true
   [junit4]   2> 2237853 INFO  (qtp1634451348-24732) [n:127.0.0.1:65115_solr    ] o.a.s.s.HttpSolrCall
[admin] webapp=null path=/admin/collections params={action=LIST&delegation=GgADYmFyA2JhcgCKAVi-mgMhigFY4qaHIQUDFEzKmMzwrotARF8KgiMtjaB269dmB3NvbHItZHQA&wt=javabin&version=2}
status=0 QTime=0
   [junit4]   2> 2237862 INFO  (TEST-TestSolrCloudWithDelegationTokens.testDelegationTokenRenew-seed#[46FCE90E215BFF23])
[    ] o.a.s.c.c.ZkStateReader Updated live nodes from ZooKeeper... (0) -> (2)
   [junit4]   2> 2237864 INFO  (TEST-TestSolrCloudWithDelegationTokens.testDelegationTokenRenew-seed#[46FCE90E215BFF23])
[    ] o.a.s.c.s.i.ZkClientClusterStateProvider Cluster at 127.0.0.1:62687/solr ready
   [junit4]   2> 2237865 INFO  (qtp1634451348-24736) [n:127.0.0.1:65115_solr    ] o.a.s.h.a.CollectionsHandler
Invoked Collection Action :list with params action=LIST&delegation=GgADYmFyA2JhcgCKAVi-mgMhigFY4qaHIQUDFEzKmMzwrotARF8KgiMtjaB269dmB3NvbHItZHQA&wt=javabin&version=2
and sendToOCPQueue=true
   [junit4]   2> 2237865 INFO  (qtp1634451348-24736) [n:127.0.0.1:65115_solr    ] o.a.s.s.HttpSolrCall
[admin] webapp=null path=/admin/collections params={action=LIST&delegation=GgADYmFyA2JhcgCKAVi-mgMhigFY4qaHIQUDFEzKmMzwrotARF8KgiMtjaB269dmB3NvbHItZHQA&wt=javabin&version=2}
status=0 QTime=0
   [junit4]   2> 2237889 INFO  (qtp1634451348-24729) [n:127.0.0.1:65115_solr    ] o.a.s.h.a.CollectionsHandler
Invoked Collection Action :list with params action=LIST&delegation=GgADYmFyA2JhcgCKAVi-mgNFigFY4qaHRQYDFHEeaYiZCz08dH2qLR1DjOyxmdbCB3NvbHItZHQA&wt=javabin&version=2
and sendToOCPQueue=true
   [junit4]   2> 2237889 INFO  (qtp1634451348-24729) [n:127.0.0.1:65115_solr    ] o.a.s.s.HttpSolrCall
[admin] webapp=null path=/admin/collections params={action=LIST&delegation=GgADYmFyA2JhcgCKAVi-mgNFigFY4qaHRQYDFHEeaYiZCz08dH2qLR1DjOyxmdbCB3NvbHItZHQA&wt=javabin&version=2}
status=0 QTime=0
   [junit4]   2> 2237897 INFO  (TEST-TestSolrCloudWithDelegationTokens.testDelegationTokenRenew-seed#[46FCE90E215BFF23])
[    ] o.a.s.c.c.ZkStateReader Updated live nodes from ZooKeeper... (0) -> (2)
   [junit4]   2> 2237899 INFO  (TEST-TestSolrCloudWithDelegationTokens.testDelegationTokenRenew-seed#[46FCE90E215BFF23])
[    ] o.a.s.c.s.i.ZkClientClusterStateProvider Cluster at 127.0.0.1:62687/solr ready
   [junit4]   2> 2237906 INFO  (qtp1225018710-24745) [n:127.0.0.1:47301_solr    ] o.a.s.h.a.CollectionsHandler
Invoked Collection Action :list with params action=LIST&delegation=GgADYmFyA2JhcgCKAVi-mgNFigFY4qaHRQYDFHEeaYiZCz08dH2qLR1DjOyxmdbCB3NvbHItZHQA&wt=javabin&version=2
and sendToOCPQueue=true
   [junit4]   2> 2237906 INFO  (qtp1225018710-24745) [n:127.0.0.1:47301_solr    ] o.a.s.s.HttpSolrCall
[admin] webapp=null path=/admin/collections params={action=LIST&delegation=GgADYmFyA2JhcgCKAVi-mgNFigFY4qaHRQYDFHEeaYiZCz08dH2qLR1DjOyxmdbCB3NvbHItZHQA&wt=javabin&version=2}
status=0 QTime=0
   [junit4]   2> 2237910 INFO  (TEST-TestSolrCloudWithDelegationTokens.testDelegationTokenRenew-seed#[46FCE90E215BFF23])
[    ] o.a.s.SolrTestCaseJ4 ###Ending testDelegationTokenRenew
   [junit4]   2> 2237965 INFO  (TEST-TestSolrCloudWithDelegationTokens.testDelegationTokenRenewFail-seed#[46FCE90E215BFF23])
[    ] o.a.s.SolrTestCaseJ4 ###Starting testDelegationTokenRenewFail
   [junit4]   2> 2237972 WARN  (qtp1634451348-24735) [n:127.0.0.1:65115_solr    ] o.a.h.s.a.s.AuthenticationFilter
Authentication exception: org.apache.hadoop.security.AccessControlException: foo tries to
renew a token with renewer bar
   [junit4]   2> 2237972 WARN  (qtp1634451348-24735) [n:127.0.0.1:65115_solr    ] o.a.s.s.KerberosPlugin
Could not find org.apache.solr.security.kerberosplugin.requestcontinues
   [junit4]   2> 2237973 WARN  (qtp1225018710-24742) [    ] o.a.h.s.a.s.AuthenticationFilter
Authentication exception: org.apache.hadoop.security.AccessControlException: foo tries to
renew a token with renewer bar
   [junit4]   2> 2237974 WARN  (qtp1225018710-24742) [    ] o.a.s.s.KerberosPlugin Could
not find org.apache.solr.security.kerberosplugin.requestcontinues
   [junit4]   2> 2237979 WARN  (qtp1634451348-24737) [n:127.0.0.1:65115_solr    ] o.a.h.s.a.s.AuthenticationFilter
Authentication exception: org.apache.hadoop.security.AccessControlException: notRenewUser
tries to renew a token with renewer renewUser
   [junit4]   2> 2237979 WARN  (qtp1634451348-24737) [n:127.0.0.1:65115_solr    ] o.a.s.s.KerberosPlugin
Could not find org.apache.solr.security.kerberosplugin.requestcontinues
   [junit4]   2> 2237981 WARN  (qtp1225018710-24745) [n:127.0.0.1:47301_solr    ] o.a.h.s.a.s.AuthenticationFilter
Authentication exception: org.apache.hadoop.security.AccessControlException: notRenewUser
tries to renew a token with renewer renewUser
   [junit4]   2> 2237981 WARN  (qtp1225018710-24745) [n:127.0.0.1:47301_solr    ] o.a.s.s.KerberosPlugin
Could not find org.apache.solr.security.kerberosplugin.requestcontinues
   [junit4]   2> 2237982 INFO  (TEST-TestSolrCloudWithDelegationTokens.testDelegationTokenRenewFail-seed#[46FCE90E215BFF23])
[    ] o.a.s.SolrTestCaseJ4 ###Ending testDelegationTokenRenewFail
   [junit4]   2> 2238021 INFO  (TEST-TestSolrCloudWithDelegationTokens.testDelegationTokenSolrClient-seed#[46FCE90E215BFF23])
[    ] o.a.s.SolrTestCaseJ4 ###Starting testDelegationTokenSolrClient
   [junit4]   2> 2238031 INFO  (qtp1634451348-24736) [n:127.0.0.1:65115_solr    ] o.a.s.h.a.CollectionsHandler
Invoked Collection Action :list with params action=LIST&delegation=GgADYmFyA2JhcgCKAVi-mgPcigFY4qaH3AkDFLU1aNrMHrw6Alh2wN_g_xglRMFnB3NvbHItZHQA&wt=javabin&version=2
and sendToOCPQueue=true
   [junit4]   2> 2238031 INFO  (qtp1634451348-24736) [n:127.0.0.1:65115_solr    ] o.a.s.s.HttpSolrCall
[admin] webapp=null path=/admin/collections params={action=LIST&delegation=GgADYmFyA2JhcgCKAVi-mgPcigFY4qaH3AkDFLU1aNrMHrw6Alh2wN_g_xglRMFnB3NvbHItZHQA&wt=javabin&version=2}
status=0 QTime=0
   [junit4]   2> 2238032 INFO  (TEST-TestSolrCloudWithDelegationTokens.testDelegationTokenSolrClient-seed#[46FCE90E215BFF23])
[    ] o.a.s.SolrTestCaseJ4 ###Ending testDelegationTokenSolrClient
   [junit4]   2> 2238075 INFO  (TEST-TestSolrCloudWithDelegationTokens.testDelegationTokenCancel-seed#[46FCE90E215BFF23])
[    ] o.a.s.SolrTestCaseJ4 ###Starting testDelegationTokenCancel
   [junit4]   2> 2238089 ERROR (qtp1634451348-24729) [n:127.0.0.1:65115_solr    ] o.a.h.s.t.d.ZKDelegationTokenSecretManager
No node in path [/ZKDTSMTokensRoot/DT_10]
   [junit4]   2> 2238098 INFO  (TEST-TestSolrCloudWithDelegationTokens.testDelegationTokenCancel-seed#[46FCE90E215BFF23])
[    ] o.a.s.c.c.ZkStateReader Updated live nodes from ZooKeeper... (0) -> (2)
   [junit4]   2> 2238100 INFO  (TEST-TestSolrCloudWithDelegationTokens.testDelegationTokenCancel-seed#[46FCE90E215BFF23])
[    ] o.a.s.c.s.i.ZkClientClusterStateProvider Cluster at 127.0.0.1:62687/solr ready
   [junit4]   2> 2238107 INFO  (TEST-TestSolrCloudWithDelegationTokens.testDelegationTokenCancel-seed#[46FCE90E215BFF23])
[    ] o.a.s.c.c.ZkStateReader Updated live nodes from ZooKeeper... (0) -> (2)
   [junit4]   2> 2238109 INFO  (TEST-TestSolrCloudWithDelegationTokens.testDelegationTokenCancel-seed#[46FCE90E215BFF23])
[    ] o.a.s.c.s.i.ZkClientClusterStateProvider Cluster at 127.0.0.1:62687/solr ready
   [junit4]   2> 2238124 INFO  (TEST-TestSolrCloudWithDelegationTokens.testDelegationTokenCancel-seed#[46FCE90E215BFF23])
[    ] o.a.s.c.c.ZkStateReader Updated live nodes from ZooKeeper... (0) -> (2)
   [junit4]   2> 2238125 INFO  (TEST-TestSolrCloudWithDelegationTokens.testDelegationTokenCancel-seed#[46FCE90E215BFF23])
[    ] o.a.s.c.s.i.ZkClientClusterStateProvider Cluster at 127.0.0.1:62687/solr ready
   [junit4]   2> 2238127 ERROR (qtp1634451348-24736) [n:127.0.0.1:65115_solr    ] o.a.h.s.t.d.ZKDelegationTokenSecretManager
No node in path [/ZKDTSMTokensRoot/DT_11]
   [junit4]   2> 2238136 INFO  (TEST-TestSolrCloudWithDelegationTokens.testDelegationTokenCancel-seed#[46FCE90E215BFF23])
[    ] o.a.s.c.c.ZkStateReader Updated live nodes from ZooKeeper... (0) -> (2)
   [junit4]   2> 2238137 INFO  (TEST-TestSolrCloudWithDelegationTokens.testDelegationTokenCancel-seed#[46FCE90E215BFF23])
[    ] o.a.s.c.s.i.ZkClientClusterStateProvider Cluster at 127.0.0.1:62687/solr ready
   [junit4]   2> 2238143 INFO  (TEST-TestSolrCloudWithDelegationTokens.testDelegationTokenCancel-seed#[46FCE90E215BFF23])
[    ] o.a.s.SolrTestCaseJ4 ###Ending testDelegationTokenCancel
   [junit4]   2> 2238174 INFO  (TEST-TestSolrCloudWithDelegationTokens.testZNodePaths-seed#[46FCE90E215BFF23])
[    ] o.a.s.SolrTestCaseJ4 ###Starting testZNodePaths
   [junit4]   2> 2238182 INFO  (TEST-TestSolrCloudWithDelegationTokens.testZNodePaths-seed#[46FCE90E215BFF23])
[    ] o.a.s.SolrTestCaseJ4 ###Ending testZNodePaths
   [junit4]   2> 2238215 INFO  (TEST-TestSolrCloudWithDelegationTokens.testDelegationOtherOp-seed#[46FCE90E215BFF23])
[    ] o.a.s.SolrTestCaseJ4 ###Starting testDelegationOtherOp
   [junit4]   2> 2238219 INFO  (TEST-TestSolrCloudWithDelegationTokens.testDelegationOtherOp-seed#[46FCE90E215BFF23])
[    ] o.a.s.c.c.ZkStateReader Updated live nodes from ZooKeeper... (0) -> (2)
   [junit4]   2> 2238221 INFO  (TEST-TestSolrCloudWithDelegationTokens.testDelegationOtherOp-seed#[46FCE90E215BFF23])
[    ] o.a.s.c.s.i.ZkClientClusterStateProvider Cluster at 127.0.0.1:62687/solr ready
   [junit4]   2> 2238223 INFO  (qtp1634451348-24735) [n:127.0.0.1:65115_solr    ] o.a.s.h.a.CollectionsHandler
Invoked Collection Action :list with params op=someSolrOperation&action=LIST&wt=javabin&version=2
and sendToOCPQueue=true
   [junit4]   2> 2238223 INFO  (qtp1634451348-24735) [n:127.0.0.1:65115_solr    ] o.a.s.s.HttpSolrCall
[admin] webapp=null path=/admin/collections params={op=someSolrOperation&action=LIST&wt=javabin&version=2}
status=0 QTime=0
   [junit4]   2> 2238225 INFO  (TEST-TestSolrCloudWithDelegationTokens.testDelegationOtherOp-seed#[46FCE90E215BFF23])
[    ] o.a.s.SolrTestCaseJ4 ###Ending testDelegationOtherOp
   [junit4]   2> 2238227 INFO  (jetty-launcher-3505-thread-1) [    ] o.e.j.s.AbstractConnector
Stopped ServerConnector@63a1c3e4{HTTP/1.1,[http/1.1]}{127.0.0.1:0}
   [junit4]   2> 2238227 INFO  (jetty-launcher-3505-thread-2) [    ] o.e.j.s.AbstractConnector
Stopped ServerConnector@7c68bd3{HTTP/1.1,[http/1.1]}{127.0.0.1:0}
   [junit4]   2> 2238228 INFO  (jetty-launcher-3505-thread-2) [    ] o.a.s.c.CoreContainer
Shutting down CoreContainer instance=2011606263
   [junit4]   2> 2238228 INFO  (jetty-launcher-3505-thread-1) [    ] o.a.s.c.CoreContainer
Shutting down CoreContainer instance=697437269
   [junit4]   2> 2238235 INFO  (jetty-launcher-3505-thread-2) [    ] o.a.s.c.Overseer Overseer
(id=97036960614645765-127.0.0.1:47301_solr-n_0000000000) closing
   [junit4]   2> 2238236 INFO  (OverseerStateUpdate-97036960614645765-127.0.0.1:47301_solr-n_0000000000)
[n:127.0.0.1:47301_solr    ] o.a.s.c.Overseer Overseer Loop exiting : 127.0.0.1:47301_solr
   [junit4]   2> 2238237 INFO  (zkCallback-3516-thread-2-processing-n:127.0.0.1:47301_solr)
[n:127.0.0.1:47301_solr    ] o.a.s.c.c.ZkStateReader Updated live nodes from ZooKeeper...
(2) -> (1)
   [junit4]   2> 2238238 WARN  (zkCallback-3516-thread-2-processing-n:127.0.0.1:47301_solr)
[n:127.0.0.1:47301_solr    ] o.a.s.c.c.ZkStateReader ZooKeeper watch triggered, but Solr cannot
talk to ZK: [KeeperErrorCode = Session expired for /live_nodes]
   [junit4]   2> 2238239 ERROR (Thread[Thread-9320,5,TGRP-TestSolrCloudWithDelegationTokens])
[n:127.0.0.1:47301_solr    ] o.a.h.s.t.d.AbstractDelegationTokenSecretManager ExpiredTokenRemover
received java.lang.InterruptedException: sleep interrupted
   [junit4]   2> 2238249 INFO  (jetty-launcher-3505-thread-2) [    ] o.e.j.s.h.ContextHandler
Stopped o.e.j.s.ServletContextHandler@fc2dc29{/solr,null,UNAVAILABLE}
   [junit4]   2> 2239737 WARN  (zkCallback-3515-thread-1-processing-n:127.0.0.1:65115_solr)
[n:127.0.0.1:65115_solr    ] o.a.s.c.c.ZkStateReader ZooKeeper watch triggered, but Solr cannot
talk to ZK: [KeeperErrorCode = Session expired for /live_nodes]
   [junit4]   2> 2239737 ERROR (Thread[Thread-9318,5,TGRP-TestSolrCloudWithDelegationTokens])
[n:127.0.0.1:65115_solr    ] o.a.h.s.t.d.AbstractDelegationTokenSecretManager ExpiredTokenRemover
received java.lang.InterruptedException: sleep interrupted
   [junit4]   2> 2239742 INFO  (jetty-launcher-3505-thread-1) [    ] o.e.j.s.h.ContextHandler
Stopped o.e.j.s.ServletContextHandler@537dcde8{/solr,null,UNAVAILABLE}
   [junit4]   2> 2239744 INFO  (SUITE-TestSolrCloudWithDelegationTokens-seed#[46FCE90E215BFF23]-worker)
[    ] o.a.s.c.ZkTestServer connecting to 127.0.0.1:62687 62687
   [junit4]   2> 2239808 INFO  (Thread-9301) [    ] o.a.s.c.ZkTestServer connecting to
127.0.0.1:62687 62687
   [junit4]   2> 2239809 WARN  (Thread-9301) [    ] o.a.s.c.ZkTestServer Watch limit violations:

   [junit4]   2> Maximum concurrent create/delete watches above limit:
   [junit4]   2> 
   [junit4]   2> 	15	/solr/aliases.json
   [junit4]   2> 	15	/solr/clusterprops.json
   [junit4]   2> 	2	/solr/security.json
   [junit4]   2> 
   [junit4]   2> Maximum concurrent data watches above limit:
   [junit4]   2> 
   [junit4]   2> 	15	/solr/clusterstate.json
   [junit4]   2> 	3	/solr/security/zkdtsm/ZKDTSMRoot/ZKDTSMKeyIdRoot
   [junit4]   2> 	2	/solr/security/zkdtsm/ZKDTSMRoot/ZKDTSMTokensRoot/DT_7
   [junit4]   2> 	2	/solr/security/zkdtsm/ZKDTSMRoot/ZKDTSMTokensRoot/DT_6
   [junit4]   2> 	2	/solr/security/zkdtsm/ZKDTSMRoot/ZKDTSMTokensRoot/DT_9
   [junit4]   2> 	2	/solr/security/zkdtsm/ZKDTSMRoot/ZKDTSMTokensRoot/DT_8
   [junit4]   2> 	2	/solr/security/zkdtsm/ZKDTSMRoot/ZKDTSMMasterKeyRoot/DK_1
   [junit4]   2> 	2	/solr/security/zkdtsm/ZKDTSMRoot/ZKDTSMTokensRoot/DT_1
   [junit4]   2> 	2	/solr/security/zkdtsm/ZKDTSMRoot/ZKDTSMMasterKeyRoot/DK_3
   [junit4]   2> 	2	/solr/security/zkdtsm/ZKDTSMRoot/ZKDTSMTokensRoot/DT_3
   [junit4]   2> 	2	/solr/security/zkdtsm/ZKDTSMRoot/ZKDTSMMasterKeyRoot/DK_2
   [junit4]   2> 	2	/solr/security/zkdtsm/ZKDTSMRoot/ZKDTSMTokensRoot/DT_2
   [junit4]   2> 	2	/solr/security/zkdtsm/ZKDTSMRoot/ZKDTSMTokensRoot/DT_5
   [junit4]   2> 	2	/solr/security/zkdtsm/ZKDTSMRoot/ZKDTSMMasterKeyRoot/DK_4
   [junit4]   2> 	2	/solr/security/zkdtsm/ZKDTSMRoot/ZKDTSMTokensRoot/DT_4
   [junit4]   2> 	2	/solr/security/zkdtsm/ZKDTSMRoot/ZKDTSMTokensRoot/DT_12
   [junit4]   2> 	2	/solr/security/zkdtsm/ZKDTSMRoot/ZKDTSMSeqNumRoot
   [junit4]   2> 	2	/solr/security/zkdtsm/ZKDTSMRoot/ZKDTSMTokensRoot/DT_10
   [junit4]   2> 
   [junit4]   2> Maximum concurrent children watches above limit:
   [junit4]   2> 
   [junit4]   2> 	15	/solr/live_nodes
   [junit4]   2> 	15	/solr/collections
   [junit4]   2> 	3	/solr/overseer/queue
   [junit4]   2> 	2	/solr/security/zkdtsm/ZKDTSMRoot/ZKDTSMMasterKeyRoot
   [junit4]   2> 	2	/solr/overseer/queue-work
   [junit4]   2> 	2	/solr/security/zkdtsm/ZKDTSMRoot/ZKDTSMTokensRoot
   [junit4]   2> 
   [junit4]   2> 2239810 INFO  (SUITE-TestSolrCloudWithDelegationTokens-seed#[46FCE90E215BFF23]-worker)
[    ] o.a.s.SolrTestCaseJ4 ###deleteCore
   [junit4]   2> NOTE: leaving temporary files on disk at: /export/home/jenkins/workspace/Lucene-Solr-master-Solaris/solr/build/solr-core/test/J1/temp/solr.cloud.TestSolrCloudWithDelegationTokens_46FCE90E215BFF23-001
   [junit4]   2> Dec 02, 2016 8:15:16 AM com.carrotsearch.randomizedtesting.ThreadLeakControl
checkThreadLeaks
   [junit4]   2> WARNING: Will linger awaiting termination of 2 leaked thread(s).
   [junit4]   2> NOTE: test params are: codec=Asserting(Lucene70): {}, docValues:{}, maxPointsInLeafNode=388,
maxMBSortInHeap=6.677701509962285, sim=RandomSimilarity(queryNorm=false): {}, locale=en-ZA,
timezone=Pacific/Tarawa
   [junit4]   2> NOTE: SunOS 5.11 amd64/Oracle Corporation 1.8.0_102 (64-bit)/cpus=3,threads=1,free=317849560,total=536870912
   [junit4]   2> NOTE: All tests run in this JVM: [ReplicationFactorTest, PeerSyncReplicationTest,
NotRequiredUniqueKeyTest, DistributedIntervalFacetingTest, JavabinLoaderTest, ParsingFieldUpdateProcessorsTest,
BlockJoinFacetDistribTest, TestBadConfig, TestSchemaNameResource, TestPHPSerializedResponseWriter,
TestConfigSetsAPIZkFailure, TestBulkSchemaConcurrent, TestUseDocValuesAsStored2, TestQueryTypes,
TestReqParamsAPI, TestSubQueryTransformerDistrib, TestDistributedGrouping, TestCodecSupport,
CreateCollectionCleanupTest, TestRecoveryHdfs, MinimalSchemaTest, TestUninvertingReader, AnalysisErrorHandlingTest,
ReturnFieldsTest, CoreAdminHandlerTest, SliceStateTest, DateMathParserTest, TestMinMaxOnMultiValuedField,
TestCopyFieldCollectionResource, SimpleMLTQParserTest, TestImplicitCoreProperties, TestBlobHandler,
TestClusterProperties, TestCloudInspectUtil, ConvertedLegacyTest, LeaderElectionContextKeyTest,
LukeRequestHandlerTest, SharedFSAutoReplicaFailoverTest, TestFieldCacheWithThreads, BasicAuthStandaloneTest,
TestRuleBasedAuthorizationPlugin, TestSchemaManager, ClassificationUpdateProcessorTest, TestPivotHelperCode,
DistanceUnitsTest, TlogReplayBufferedWhileIndexingTest, TestMacros, OverseerModifyCollectionTest,
SuggesterTest, RuleEngineTest, TestAnalyzedSuggestions, TestIndexingPerformance, TestDistributedMissingSort,
DistributedFacetPivotSmallAdvancedTest, CdcrReplicationHandlerTest, DistributedTermsComponentTest,
TestSolrDeletionPolicy2, URLClassifyProcessorTest, ShardRoutingCustomTest, TestReloadAndDeleteDocs,
UpdateParamsTest, UUIDFieldTest, ShufflingReplicaListTransformerTest, TestSolrXml, FacetPivotSmallTest,
TestFuzzyAnalyzedSuggestions, SuggesterTSTTest, HdfsTlogReplayBufferedWhileIndexingTest, TestInitQParser,
TestNoOpRegenerator, TestSolrFieldCacheMBean, TestRangeQuery, DocExpirationUpdateProcessorFactoryTest,
TestFastWriter, DirectoryFactoryTest, PreAnalyzedFieldManagedSchemaCloudTest, TestMaxScoreQueryParser,
DistanceFunctionTest, PreAnalyzedFieldTest, CdcrBootstrapTest, CollectionsAPISolrJTest, SortByFunctionTest,
FullHLLTest, TestHdfsCloudBackupRestore, TestFiltering, TestDownShardTolerantSearch, SecurityConfHandlerTest,
DebugComponentTest, StatsComponentTest, TestUtils, TestQueryUtils, TestConfig, TestFieldCacheSanityChecker,
TestMiniSolrCloudCluster, CollectionsAPIDistributedZkTest, TestManagedResourceStorage, ShowFileRequestHandlerTest,
ConnectionReuseTest, TestDFRSimilarityFactory, DistribCursorPagingTest, TestCrossCoreJoin,
TestComplexPhraseQParserPlugin, TestReversedWildcardFilterFactory, TestSearcherReuse, TestSerializedLuceneMatchVersion,
DirectUpdateHandlerOptimizeTest, WrapperMergePolicyFactoryTest, TestJoin, ForceLeaderTest,
BadIndexSchemaTest, TestScoreJoinQPNoScore, AddSchemaFieldsUpdateProcessorFactoryTest, DistributedExpandComponentTest,
ResourceLoaderTest, DeleteInactiveReplicaTest, LoggingHandlerTest, HdfsLockFactoryTest, ZkStateWriterTest,
SignatureUpdateProcessorFactoryTest, BufferStoreTest, TestSystemIdResolver, TestSizeLimitedDistributedMap,
TestLRUStatsCache, TestGraphTermsQParserPlugin, TestFieldCache, TestLeaderElectionZkExpiry,
CleanupOldIndexTest, TestClusterStateMutator, SpellPossibilityIteratorTest, SuggesterWFSTTest,
CoreMergeIndexesAdminHandlerTest, SaslZkACLProviderTest, TestFoldingMultitermQuery, ChangedSchemaMergeTest,
TestRecovery, TestJavabinTupleStreamParser, UpdateRequestProcessorFactoryTest, RAMDirectoryFactoryTest,
TermVectorComponentDistributedTest, SimpleCollectionCreateDeleteTest, TestManagedSchemaAPI,
ResponseLogComponentTest, TestRealTimeGet, TestDFISimilarityFactory, CurrencyFieldOpenExchangeTest,
TestRequestForwarding, TestReload, BlobRepositoryCloudTest, ConfigSetsAPITest, BlockCacheTest,
HdfsRecoveryZkTest, TestMiniSolrCloudClusterSSL, TestEmbeddedSolrServerConstructors, BitVectorTest,
DataDrivenBlockJoinTest, TestOmitPositions, HdfsDirectoryFactoryTest, TestCustomStream, CircularListTest,
ChaosMonkeySafeLeaderTest, BasicDistributedZk2Test, SyncSliceTest, OpenCloseCoreStressTest,
OverseerTest, LeaderElectionIntegrationTest, BasicZkTest, RecoveryZkTest, FullSolrCloudDistribCmdsTest,
TestReplicationHandler, ClusterStateUpdateTest, TestRandomFaceting, LeaderElectionTest, TestZkChroot,
TestFaceting, ZkControllerTest, TestCoreContainer, SimpleFacetsTest, TestSolr4Spatial, SpellCheckComponentTest,
TestSort, TestFunctionQuery, TestIndexSearcher, SimplePostToolTest, AnalysisAfterCoreReloadTest,
SuggesterFSTTest, SolrRequestParserTest, TestTrie, SpatialFilterTest, NoCacheHeaderTest, WordBreakSolrSpellCheckerTest,
SolrCoreCheckLockOnStartupTest, TestPseudoReturnFields, TestUpdate, FieldMutatingUpdateProcessorTest,
TestAtomicUpdateErrorCases, QueryEqualityTest, DefaultValueUpdateProcessorTest, StatelessScriptUpdateProcessorFactoryTest,
TestSolrDeletionPolicy1, SolrInfoMBeanTest, CacheHeaderTest, IndexBasedSpellCheckerTest, TestWriterPerf,
DocumentAnalysisRequestHandlerTest, PrimitiveFieldTypeTest, FileBasedSpellCheckerTest, XmlUpdateRequestHandlerTest,
DocumentBuilderTest, PathHierarchyTokenizerFactoryTest, MoreLikeThisHandlerTest, FieldAnalysisRequestHandlerTest,
RegexBoostProcessorTest, IndexSchemaTest, MBeansHandlerTest, UniqFieldsUpdateProcessorFactoryTest,
CSVRequestHandlerTest, TestComponentsName, TestLFUCache, TestMergePolicyConfig, MultiTermTest,
SampleTest, TestDocSet, NumericFieldsTest, TestElisionMultitermQuery, ExternalFileFieldSortTest,
TestPostingsSolrHighlighter, TestLuceneMatchVersion, TestXIncludeConfig, EchoParamsTest, TestLMJelinekMercerSimilarityFactory,
ScriptEngineTest, PluginInfoTest, PrimUtilsTest, TestSuggestSpellingConverter, DateFieldTest,
SpellingQueryConverterTest, DOMUtilTest, ClusterStateTest, ZkNodePropsTest, SystemInfoHandlerTest,
DistributedMLTComponentTest, TestRTGBase, TestCursorMarkWithoutUniqueKey, TestSimpleTrackingShardHandler,
AliasIntegrationTest, AsyncCallRequestStatusResponseTest, CdcrReplicationDistributedZkTest,
CdcrRequestHandlerTest, CdcrVersionReplicationTest, CollectionTooManyReplicasTest, DistribJoinFromCollectionTest,
DistributedVersionInfoTest, LeaderFailureAfterFreshStartTest, LeaderInitiatedRecoveryOnCommitTest,
LeaderInitiatedRecoveryOnShardRestartTest, MultiThreadedOCPTest, OverseerStatusTest, RecoveryAfterSoftCommitTest,
SSLMigrationTest, SharedFSAutoReplicaFailoverUtilsTest, SolrCloudExampleTest, TestCloudPivotFacet,
TestConfigSetsAPI, TestConfigSetsAPIExclusivity, TestDeleteCollectionOnDownNodes, TestDistribDocBasedVersion,
TestLeaderInitiatedRecoveryThread, TestOnReconnectListenerSupport, TestSSLRandomization, TestSolrCloudWithDelegationTokens]
   [junit4] Completed [502/658 (1!)] on J1 in 3.93s, 8 tests, 1 failure <<< FAILURES!

[...truncated 62870 lines...]


Mime
View raw message