lucene-dev mailing list archives

Site index · List index
Message view « Date » · « Thread »
Top « Date » · « Thread »
From Apache Jenkins Server <jenk...@builds.apache.org>
Subject [JENKINS] Lucene-Solr-NightlyTests-6.x - Build # 243 - Still Unstable
Date Sat, 31 Dec 2016 18:30:43 GMT
Build: https://builds.apache.org/job/Lucene-Solr-NightlyTests-6.x/243/

7 tests failed.
FAILED:  org.apache.solr.metrics.reporters.SolrGangliaReporterTest.testReporter

Error Message:


Stack Trace:
java.util.ConcurrentModificationException
	at __randomizedtesting.SeedInfo.seed([5D25608316BF2D04:2C14DB47DB3BE41]:0)
	at java.util.ArrayList$Itr.checkForComodification(ArrayList.java:901)
	at java.util.ArrayList$Itr.next(ArrayList.java:851)
	at org.apache.solr.metrics.reporters.SolrGangliaReporterTest.testReporter(SolrGangliaReporterTest.java:76)
	at sun.reflect.NativeMethodAccessorImpl.invoke0(Native Method)
	at sun.reflect.NativeMethodAccessorImpl.invoke(NativeMethodAccessorImpl.java:62)
	at sun.reflect.DelegatingMethodAccessorImpl.invoke(DelegatingMethodAccessorImpl.java:43)
	at java.lang.reflect.Method.invoke(Method.java:498)
	at com.carrotsearch.randomizedtesting.RandomizedRunner.invoke(RandomizedRunner.java:1713)
	at com.carrotsearch.randomizedtesting.RandomizedRunner$8.evaluate(RandomizedRunner.java:907)
	at com.carrotsearch.randomizedtesting.RandomizedRunner$9.evaluate(RandomizedRunner.java:943)
	at com.carrotsearch.randomizedtesting.RandomizedRunner$10.evaluate(RandomizedRunner.java:957)
	at com.carrotsearch.randomizedtesting.rules.SystemPropertiesRestoreRule$1.evaluate(SystemPropertiesRestoreRule.java:57)
	at org.apache.lucene.util.TestRuleSetupTeardownChained$1.evaluate(TestRuleSetupTeardownChained.java:49)
	at org.apache.lucene.util.AbstractBeforeAfterRule$1.evaluate(AbstractBeforeAfterRule.java:45)
	at org.apache.lucene.util.TestRuleThreadAndTestName$1.evaluate(TestRuleThreadAndTestName.java:48)
	at org.apache.lucene.util.TestRuleIgnoreAfterMaxFailures$1.evaluate(TestRuleIgnoreAfterMaxFailures.java:64)
	at org.apache.lucene.util.TestRuleMarkFailure$1.evaluate(TestRuleMarkFailure.java:47)
	at com.carrotsearch.randomizedtesting.rules.StatementAdapter.evaluate(StatementAdapter.java:36)
	at com.carrotsearch.randomizedtesting.ThreadLeakControl$StatementRunner.run(ThreadLeakControl.java:367)
	at com.carrotsearch.randomizedtesting.ThreadLeakControl.forkTimeoutingTask(ThreadLeakControl.java:811)
	at com.carrotsearch.randomizedtesting.ThreadLeakControl$3.evaluate(ThreadLeakControl.java:462)
	at com.carrotsearch.randomizedtesting.RandomizedRunner.runSingleTest(RandomizedRunner.java:916)
	at com.carrotsearch.randomizedtesting.RandomizedRunner$5.evaluate(RandomizedRunner.java:802)
	at com.carrotsearch.randomizedtesting.RandomizedRunner$6.evaluate(RandomizedRunner.java:852)
	at com.carrotsearch.randomizedtesting.RandomizedRunner$7.evaluate(RandomizedRunner.java:863)
	at com.carrotsearch.randomizedtesting.rules.StatementAdapter.evaluate(StatementAdapter.java:36)
	at com.carrotsearch.randomizedtesting.rules.SystemPropertiesRestoreRule$1.evaluate(SystemPropertiesRestoreRule.java:57)
	at org.apache.lucene.util.AbstractBeforeAfterRule$1.evaluate(AbstractBeforeAfterRule.java:45)
	at com.carrotsearch.randomizedtesting.rules.StatementAdapter.evaluate(StatementAdapter.java:36)
	at org.apache.lucene.util.TestRuleStoreClassName$1.evaluate(TestRuleStoreClassName.java:41)
	at com.carrotsearch.randomizedtesting.rules.NoShadowingOrOverridesOnMethodsRule$1.evaluate(NoShadowingOrOverridesOnMethodsRule.java:40)
	at com.carrotsearch.randomizedtesting.rules.NoShadowingOrOverridesOnMethodsRule$1.evaluate(NoShadowingOrOverridesOnMethodsRule.java:40)
	at com.carrotsearch.randomizedtesting.rules.StatementAdapter.evaluate(StatementAdapter.java:36)
	at com.carrotsearch.randomizedtesting.rules.StatementAdapter.evaluate(StatementAdapter.java:36)
	at com.carrotsearch.randomizedtesting.rules.StatementAdapter.evaluate(StatementAdapter.java:36)
	at org.apache.lucene.util.TestRuleAssertionsRequired$1.evaluate(TestRuleAssertionsRequired.java:53)
	at org.apache.lucene.util.TestRuleMarkFailure$1.evaluate(TestRuleMarkFailure.java:47)
	at org.apache.lucene.util.TestRuleIgnoreAfterMaxFailures$1.evaluate(TestRuleIgnoreAfterMaxFailures.java:64)
	at org.apache.lucene.util.TestRuleIgnoreTestSuites$1.evaluate(TestRuleIgnoreTestSuites.java:54)
	at com.carrotsearch.randomizedtesting.rules.StatementAdapter.evaluate(StatementAdapter.java:36)
	at com.carrotsearch.randomizedtesting.ThreadLeakControl$StatementRunner.run(ThreadLeakControl.java:367)
	at java.lang.Thread.run(Thread.java:745)


FAILED:  org.apache.solr.update.AutoCommitTest.testMaxTime

Error Message:
Exception during query

Stack Trace:
java.lang.RuntimeException: Exception during query
	at __randomizedtesting.SeedInfo.seed([5D25608316BF2D04:C7D11D618825B138]:0)
	at org.apache.solr.SolrTestCaseJ4.assertQ(SolrTestCaseJ4.java:818)
	at org.apache.solr.update.AutoCommitTest.testMaxTime(AutoCommitTest.java:270)
	at sun.reflect.NativeMethodAccessorImpl.invoke0(Native Method)
	at sun.reflect.NativeMethodAccessorImpl.invoke(NativeMethodAccessorImpl.java:62)
	at sun.reflect.DelegatingMethodAccessorImpl.invoke(DelegatingMethodAccessorImpl.java:43)
	at java.lang.reflect.Method.invoke(Method.java:498)
	at com.carrotsearch.randomizedtesting.RandomizedRunner.invoke(RandomizedRunner.java:1713)
	at com.carrotsearch.randomizedtesting.RandomizedRunner$8.evaluate(RandomizedRunner.java:907)
	at com.carrotsearch.randomizedtesting.RandomizedRunner$9.evaluate(RandomizedRunner.java:943)
	at com.carrotsearch.randomizedtesting.RandomizedRunner$10.evaluate(RandomizedRunner.java:957)
	at com.carrotsearch.randomizedtesting.rules.SystemPropertiesRestoreRule$1.evaluate(SystemPropertiesRestoreRule.java:57)
	at org.apache.lucene.util.TestRuleSetupTeardownChained$1.evaluate(TestRuleSetupTeardownChained.java:49)
	at org.apache.lucene.util.AbstractBeforeAfterRule$1.evaluate(AbstractBeforeAfterRule.java:45)
	at org.apache.lucene.util.TestRuleThreadAndTestName$1.evaluate(TestRuleThreadAndTestName.java:48)
	at org.apache.lucene.util.TestRuleIgnoreAfterMaxFailures$1.evaluate(TestRuleIgnoreAfterMaxFailures.java:64)
	at org.apache.lucene.util.TestRuleMarkFailure$1.evaluate(TestRuleMarkFailure.java:47)
	at com.carrotsearch.randomizedtesting.rules.StatementAdapter.evaluate(StatementAdapter.java:36)
	at com.carrotsearch.randomizedtesting.ThreadLeakControl$StatementRunner.run(ThreadLeakControl.java:367)
	at com.carrotsearch.randomizedtesting.ThreadLeakControl.forkTimeoutingTask(ThreadLeakControl.java:811)
	at com.carrotsearch.randomizedtesting.ThreadLeakControl$3.evaluate(ThreadLeakControl.java:462)
	at com.carrotsearch.randomizedtesting.RandomizedRunner.runSingleTest(RandomizedRunner.java:916)
	at com.carrotsearch.randomizedtesting.RandomizedRunner$5.evaluate(RandomizedRunner.java:802)
	at com.carrotsearch.randomizedtesting.RandomizedRunner$6.evaluate(RandomizedRunner.java:852)
	at com.carrotsearch.randomizedtesting.RandomizedRunner$7.evaluate(RandomizedRunner.java:863)
	at com.carrotsearch.randomizedtesting.rules.StatementAdapter.evaluate(StatementAdapter.java:36)
	at com.carrotsearch.randomizedtesting.rules.SystemPropertiesRestoreRule$1.evaluate(SystemPropertiesRestoreRule.java:57)
	at org.apache.lucene.util.AbstractBeforeAfterRule$1.evaluate(AbstractBeforeAfterRule.java:45)
	at com.carrotsearch.randomizedtesting.rules.StatementAdapter.evaluate(StatementAdapter.java:36)
	at org.apache.lucene.util.TestRuleStoreClassName$1.evaluate(TestRuleStoreClassName.java:41)
	at com.carrotsearch.randomizedtesting.rules.NoShadowingOrOverridesOnMethodsRule$1.evaluate(NoShadowingOrOverridesOnMethodsRule.java:40)
	at com.carrotsearch.randomizedtesting.rules.NoShadowingOrOverridesOnMethodsRule$1.evaluate(NoShadowingOrOverridesOnMethodsRule.java:40)
	at com.carrotsearch.randomizedtesting.rules.StatementAdapter.evaluate(StatementAdapter.java:36)
	at com.carrotsearch.randomizedtesting.rules.StatementAdapter.evaluate(StatementAdapter.java:36)
	at com.carrotsearch.randomizedtesting.rules.StatementAdapter.evaluate(StatementAdapter.java:36)
	at org.apache.lucene.util.TestRuleAssertionsRequired$1.evaluate(TestRuleAssertionsRequired.java:53)
	at org.apache.lucene.util.TestRuleMarkFailure$1.evaluate(TestRuleMarkFailure.java:47)
	at org.apache.lucene.util.TestRuleIgnoreAfterMaxFailures$1.evaluate(TestRuleIgnoreAfterMaxFailures.java:64)
	at org.apache.lucene.util.TestRuleIgnoreTestSuites$1.evaluate(TestRuleIgnoreTestSuites.java:54)
	at com.carrotsearch.randomizedtesting.rules.StatementAdapter.evaluate(StatementAdapter.java:36)
	at com.carrotsearch.randomizedtesting.ThreadLeakControl$StatementRunner.run(ThreadLeakControl.java:367)
	at java.lang.Thread.run(Thread.java:745)
Caused by: java.lang.RuntimeException: REQUEST FAILED: xpath=//result[@numFound=1]
	xml response was: <?xml version="1.0" encoding="UTF-8"?>
<response>
<lst name="responseHeader"><int name="status">0</int><int name="QTime">0</int></lst><result name="response" numFound="0" start="0"></result>
</response>

	request was:q=id:529&qt=standard&start=0&rows=20&version=2.2
	at org.apache.solr.SolrTestCaseJ4.assertQ(SolrTestCaseJ4.java:811)
	... 40 more


FAILED:  junit.framework.TestSuite.org.apache.solr.cloud.hdfs.HdfsRecoveryZkTest

Error Message:
ObjectTracker found 1 object(s) that were not released!!! [HdfsTransactionLog] org.apache.solr.common.util.ObjectReleaseTracker$ObjectTrackerException  at org.apache.solr.common.util.ObjectReleaseTracker.track(ObjectReleaseTracker.java:43)  at org.apache.solr.update.HdfsTransactionLog.<init>(HdfsTransactionLog.java:130)  at org.apache.solr.update.HdfsUpdateLog.init(HdfsUpdateLog.java:202)  at org.apache.solr.update.UpdateHandler.<init>(UpdateHandler.java:137)  at org.apache.solr.update.UpdateHandler.<init>(UpdateHandler.java:94)  at org.apache.solr.update.DirectUpdateHandler2.<init>(DirectUpdateHandler2.java:102)  at sun.reflect.GeneratedConstructorAccessor179.newInstance(Unknown Source)  at sun.reflect.DelegatingConstructorAccessorImpl.newInstance(DelegatingConstructorAccessorImpl.java:45)  at java.lang.reflect.Constructor.newInstance(Constructor.java:423)  at org.apache.solr.core.SolrCore.createInstance(SolrCore.java:729)  at org.apache.solr.core.SolrCore.createUpdateHandler(SolrCore.java:791)  at org.apache.solr.core.SolrCore.initUpdateHandler(SolrCore.java:1042)  at org.apache.solr.core.SolrCore.<init>(SolrCore.java:907)  at org.apache.solr.core.SolrCore.<init>(SolrCore.java:799)  at org.apache.solr.core.CoreContainer.create(CoreContainer.java:877)  at org.apache.solr.core.CoreContainer.lambda$load$3(CoreContainer.java:529)  at java.util.concurrent.FutureTask.run(FutureTask.java:266)  at org.apache.solr.common.util.ExecutorUtil$MDCAwareThreadPoolExecutor.lambda$execute$0(ExecutorUtil.java:229)  at java.util.concurrent.ThreadPoolExecutor.runWorker(ThreadPoolExecutor.java:1142)  at java.util.concurrent.ThreadPoolExecutor$Worker.run(ThreadPoolExecutor.java:617)  at java.lang.Thread.run(Thread.java:745)  

Stack Trace:
java.lang.AssertionError: ObjectTracker found 1 object(s) that were not released!!! [HdfsTransactionLog]
org.apache.solr.common.util.ObjectReleaseTracker$ObjectTrackerException
	at org.apache.solr.common.util.ObjectReleaseTracker.track(ObjectReleaseTracker.java:43)
	at org.apache.solr.update.HdfsTransactionLog.<init>(HdfsTransactionLog.java:130)
	at org.apache.solr.update.HdfsUpdateLog.init(HdfsUpdateLog.java:202)
	at org.apache.solr.update.UpdateHandler.<init>(UpdateHandler.java:137)
	at org.apache.solr.update.UpdateHandler.<init>(UpdateHandler.java:94)
	at org.apache.solr.update.DirectUpdateHandler2.<init>(DirectUpdateHandler2.java:102)
	at sun.reflect.GeneratedConstructorAccessor179.newInstance(Unknown Source)
	at sun.reflect.DelegatingConstructorAccessorImpl.newInstance(DelegatingConstructorAccessorImpl.java:45)
	at java.lang.reflect.Constructor.newInstance(Constructor.java:423)
	at org.apache.solr.core.SolrCore.createInstance(SolrCore.java:729)
	at org.apache.solr.core.SolrCore.createUpdateHandler(SolrCore.java:791)
	at org.apache.solr.core.SolrCore.initUpdateHandler(SolrCore.java:1042)
	at org.apache.solr.core.SolrCore.<init>(SolrCore.java:907)
	at org.apache.solr.core.SolrCore.<init>(SolrCore.java:799)
	at org.apache.solr.core.CoreContainer.create(CoreContainer.java:877)
	at org.apache.solr.core.CoreContainer.lambda$load$3(CoreContainer.java:529)
	at java.util.concurrent.FutureTask.run(FutureTask.java:266)
	at org.apache.solr.common.util.ExecutorUtil$MDCAwareThreadPoolExecutor.lambda$execute$0(ExecutorUtil.java:229)
	at java.util.concurrent.ThreadPoolExecutor.runWorker(ThreadPoolExecutor.java:1142)
	at java.util.concurrent.ThreadPoolExecutor$Worker.run(ThreadPoolExecutor.java:617)
	at java.lang.Thread.run(Thread.java:745)


	at __randomizedtesting.SeedInfo.seed([5D25608316BF2D04]:0)
	at org.junit.Assert.fail(Assert.java:93)
	at org.junit.Assert.assertTrue(Assert.java:43)
	at org.junit.Assert.assertNull(Assert.java:551)
	at org.apache.solr.SolrTestCaseJ4.teardownTestCases(SolrTestCaseJ4.java:266)
	at sun.reflect.GeneratedMethodAccessor24.invoke(Unknown Source)
	at sun.reflect.DelegatingMethodAccessorImpl.invoke(DelegatingMethodAccessorImpl.java:43)
	at java.lang.reflect.Method.invoke(Method.java:498)
	at com.carrotsearch.randomizedtesting.RandomizedRunner.invoke(RandomizedRunner.java:1713)
	at com.carrotsearch.randomizedtesting.RandomizedRunner$7.evaluate(RandomizedRunner.java:870)
	at com.carrotsearch.randomizedtesting.rules.StatementAdapter.evaluate(StatementAdapter.java:36)
	at com.carrotsearch.randomizedtesting.rules.SystemPropertiesRestoreRule$1.evaluate(SystemPropertiesRestoreRule.java:57)
	at org.apache.lucene.util.AbstractBeforeAfterRule$1.evaluate(AbstractBeforeAfterRule.java:45)
	at com.carrotsearch.randomizedtesting.rules.StatementAdapter.evaluate(StatementAdapter.java:36)
	at org.apache.lucene.util.TestRuleStoreClassName$1.evaluate(TestRuleStoreClassName.java:41)
	at com.carrotsearch.randomizedtesting.rules.NoShadowingOrOverridesOnMethodsRule$1.evaluate(NoShadowingOrOverridesOnMethodsRule.java:40)
	at com.carrotsearch.randomizedtesting.rules.NoShadowingOrOverridesOnMethodsRule$1.evaluate(NoShadowingOrOverridesOnMethodsRule.java:40)
	at com.carrotsearch.randomizedtesting.rules.StatementAdapter.evaluate(StatementAdapter.java:36)
	at com.carrotsearch.randomizedtesting.rules.StatementAdapter.evaluate(StatementAdapter.java:36)
	at com.carrotsearch.randomizedtesting.rules.StatementAdapter.evaluate(StatementAdapter.java:36)
	at org.apache.lucene.util.TestRuleAssertionsRequired$1.evaluate(TestRuleAssertionsRequired.java:53)
	at org.apache.lucene.util.TestRuleMarkFailure$1.evaluate(TestRuleMarkFailure.java:47)
	at org.apache.lucene.util.TestRuleIgnoreAfterMaxFailures$1.evaluate(TestRuleIgnoreAfterMaxFailures.java:64)
	at org.apache.lucene.util.TestRuleIgnoreTestSuites$1.evaluate(TestRuleIgnoreTestSuites.java:54)
	at com.carrotsearch.randomizedtesting.rules.StatementAdapter.evaluate(StatementAdapter.java:36)
	at com.carrotsearch.randomizedtesting.ThreadLeakControl$StatementRunner.run(ThreadLeakControl.java:367)
	at java.lang.Thread.run(Thread.java:745)


FAILED:  org.apache.lucene.search.TestFuzzyQuery.testRandom

Error Message:
Test abandoned because suite timeout was reached.

Stack Trace:
java.lang.Exception: Test abandoned because suite timeout was reached.
	at __randomizedtesting.SeedInfo.seed([271F30BB87F52C4]:0)


FAILED:  junit.framework.TestSuite.org.apache.lucene.search.TestFuzzyQuery

Error Message:
Suite timeout exceeded (>= 7200000 msec).

Stack Trace:
java.lang.Exception: Suite timeout exceeded (>= 7200000 msec).
	at __randomizedtesting.SeedInfo.seed([271F30BB87F52C4]:0)


FAILED:  org.apache.solr.cloud.hdfs.HdfsCollectionsAPIDistributedZkTest.testCollectionsAPI

Error Message:
Expected to see collection awhollynewcollection_0 null Last available state: DocCollection(awhollynewcollection_0//collections/awhollynewcollection_0/state.json/7)={   "replicationFactor":"3",   "shards":{     "shard1":{       "range":"80000000-d554ffff",       "state":"active",       "replicas":{}},     "shard2":{       "range":"d5550000-2aa9ffff",       "state":"active",       "replicas":{}},     "shard3":{       "range":"2aaa0000-7fffffff",       "state":"active",       "replicas":{}}},   "router":{"name":"compositeId"},   "maxShardsPerNode":"3",   "autoAddReplicas":"false"}

Stack Trace:
java.lang.AssertionError: Expected to see collection awhollynewcollection_0
null
Last available state: DocCollection(awhollynewcollection_0//collections/awhollynewcollection_0/state.json/7)={
  "replicationFactor":"3",
  "shards":{
    "shard1":{
      "range":"80000000-d554ffff",
      "state":"active",
      "replicas":{}},
    "shard2":{
      "range":"d5550000-2aa9ffff",
      "state":"active",
      "replicas":{}},
    "shard3":{
      "range":"2aaa0000-7fffffff",
      "state":"active",
      "replicas":{}}},
  "router":{"name":"compositeId"},
  "maxShardsPerNode":"3",
  "autoAddReplicas":"false"}
	at __randomizedtesting.SeedInfo.seed([5D25608316BF2D04:15501437108C0291]:0)
	at org.junit.Assert.fail(Assert.java:93)
	at org.apache.solr.cloud.SolrCloudTestCase.waitForState(SolrCloudTestCase.java:265)
	at org.apache.solr.cloud.CollectionsAPIDistributedZkTest.testCollectionsAPI(CollectionsAPIDistributedZkTest.java:496)
	at sun.reflect.NativeMethodAccessorImpl.invoke0(Native Method)
	at sun.reflect.NativeMethodAccessorImpl.invoke(NativeMethodAccessorImpl.java:62)
	at sun.reflect.DelegatingMethodAccessorImpl.invoke(DelegatingMethodAccessorImpl.java:43)
	at java.lang.reflect.Method.invoke(Method.java:498)
	at com.carrotsearch.randomizedtesting.RandomizedRunner.invoke(RandomizedRunner.java:1713)
	at com.carrotsearch.randomizedtesting.RandomizedRunner$8.evaluate(RandomizedRunner.java:907)
	at com.carrotsearch.randomizedtesting.RandomizedRunner$9.evaluate(RandomizedRunner.java:943)
	at com.carrotsearch.randomizedtesting.RandomizedRunner$10.evaluate(RandomizedRunner.java:957)
	at com.carrotsearch.randomizedtesting.rules.SystemPropertiesRestoreRule$1.evaluate(SystemPropertiesRestoreRule.java:57)
	at org.apache.lucene.util.TestRuleSetupTeardownChained$1.evaluate(TestRuleSetupTeardownChained.java:49)
	at org.apache.lucene.util.AbstractBeforeAfterRule$1.evaluate(AbstractBeforeAfterRule.java:45)
	at org.apache.lucene.util.TestRuleThreadAndTestName$1.evaluate(TestRuleThreadAndTestName.java:48)
	at org.apache.lucene.util.TestRuleIgnoreAfterMaxFailures$1.evaluate(TestRuleIgnoreAfterMaxFailures.java:64)
	at org.apache.lucene.util.TestRuleMarkFailure$1.evaluate(TestRuleMarkFailure.java:47)
	at com.carrotsearch.randomizedtesting.rules.StatementAdapter.evaluate(StatementAdapter.java:36)
	at com.carrotsearch.randomizedtesting.ThreadLeakControl$StatementRunner.run(ThreadLeakControl.java:367)
	at com.carrotsearch.randomizedtesting.ThreadLeakControl.forkTimeoutingTask(ThreadLeakControl.java:811)
	at com.carrotsearch.randomizedtesting.ThreadLeakControl$3.evaluate(ThreadLeakControl.java:462)
	at com.carrotsearch.randomizedtesting.RandomizedRunner.runSingleTest(RandomizedRunner.java:916)
	at com.carrotsearch.randomizedtesting.RandomizedRunner$5.evaluate(RandomizedRunner.java:802)
	at com.carrotsearch.randomizedtesting.RandomizedRunner$6.evaluate(RandomizedRunner.java:852)
	at com.carrotsearch.randomizedtesting.RandomizedRunner$7.evaluate(RandomizedRunner.java:863)
	at com.carrotsearch.randomizedtesting.rules.StatementAdapter.evaluate(StatementAdapter.java:36)
	at com.carrotsearch.randomizedtesting.rules.SystemPropertiesRestoreRule$1.evaluate(SystemPropertiesRestoreRule.java:57)
	at org.apache.lucene.util.AbstractBeforeAfterRule$1.evaluate(AbstractBeforeAfterRule.java:45)
	at com.carrotsearch.randomizedtesting.rules.StatementAdapter.evaluate(StatementAdapter.java:36)
	at org.apache.lucene.util.TestRuleStoreClassName$1.evaluate(TestRuleStoreClassName.java:41)
	at com.carrotsearch.randomizedtesting.rules.NoShadowingOrOverridesOnMethodsRule$1.evaluate(NoShadowingOrOverridesOnMethodsRule.java:40)
	at com.carrotsearch.randomizedtesting.rules.NoShadowingOrOverridesOnMethodsRule$1.evaluate(NoShadowingOrOverridesOnMethodsRule.java:40)
	at com.carrotsearch.randomizedtesting.rules.StatementAdapter.evaluate(StatementAdapter.java:36)
	at com.carrotsearch.randomizedtesting.rules.StatementAdapter.evaluate(StatementAdapter.java:36)
	at com.carrotsearch.randomizedtesting.rules.StatementAdapter.evaluate(StatementAdapter.java:36)
	at org.apache.lucene.util.TestRuleAssertionsRequired$1.evaluate(TestRuleAssertionsRequired.java:53)
	at org.apache.lucene.util.TestRuleMarkFailure$1.evaluate(TestRuleMarkFailure.java:47)
	at org.apache.lucene.util.TestRuleIgnoreAfterMaxFailures$1.evaluate(TestRuleIgnoreAfterMaxFailures.java:64)
	at org.apache.lucene.util.TestRuleIgnoreTestSuites$1.evaluate(TestRuleIgnoreTestSuites.java:54)
	at com.carrotsearch.randomizedtesting.rules.StatementAdapter.evaluate(StatementAdapter.java:36)
	at com.carrotsearch.randomizedtesting.ThreadLeakControl$StatementRunner.run(ThreadLeakControl.java:367)
	at java.lang.Thread.run(Thread.java:745)


FAILED:  org.apache.solr.cloud.hdfs.HdfsCollectionsAPIDistributedZkTest.testSpecificConfigsets

Error Message:
KeeperErrorCode = NoNode for /collections/withconfigset2

Stack Trace:
org.apache.zookeeper.KeeperException$NoNodeException: KeeperErrorCode = NoNode for /collections/withconfigset2
	at __randomizedtesting.SeedInfo.seed([5D25608316BF2D04:705B2FD9E19B9708]:0)
	at org.apache.zookeeper.KeeperException.create(KeeperException.java:111)
	at org.apache.zookeeper.KeeperException.create(KeeperException.java:51)
	at org.apache.zookeeper.ZooKeeper.getData(ZooKeeper.java:1155)
	at org.apache.solr.common.cloud.SolrZkClient$7.execute(SolrZkClient.java:356)
	at org.apache.solr.common.cloud.SolrZkClient$7.execute(SolrZkClient.java:353)
	at org.apache.solr.common.cloud.ZkCmdExecutor.retryOperation(ZkCmdExecutor.java:60)
	at org.apache.solr.common.cloud.SolrZkClient.getData(SolrZkClient.java:353)
	at org.apache.solr.cloud.CollectionsAPIDistributedZkTest.testSpecificConfigsets(CollectionsAPIDistributedZkTest.java:425)
	at sun.reflect.NativeMethodAccessorImpl.invoke0(Native Method)
	at sun.reflect.NativeMethodAccessorImpl.invoke(NativeMethodAccessorImpl.java:62)
	at sun.reflect.DelegatingMethodAccessorImpl.invoke(DelegatingMethodAccessorImpl.java:43)
	at java.lang.reflect.Method.invoke(Method.java:498)
	at com.carrotsearch.randomizedtesting.RandomizedRunner.invoke(RandomizedRunner.java:1713)
	at com.carrotsearch.randomizedtesting.RandomizedRunner$8.evaluate(RandomizedRunner.java:907)
	at com.carrotsearch.randomizedtesting.RandomizedRunner$9.evaluate(RandomizedRunner.java:943)
	at com.carrotsearch.randomizedtesting.RandomizedRunner$10.evaluate(RandomizedRunner.java:957)
	at com.carrotsearch.randomizedtesting.rules.SystemPropertiesRestoreRule$1.evaluate(SystemPropertiesRestoreRule.java:57)
	at org.apache.lucene.util.TestRuleSetupTeardownChained$1.evaluate(TestRuleSetupTeardownChained.java:49)
	at org.apache.lucene.util.AbstractBeforeAfterRule$1.evaluate(AbstractBeforeAfterRule.java:45)
	at org.apache.lucene.util.TestRuleThreadAndTestName$1.evaluate(TestRuleThreadAndTestName.java:48)
	at org.apache.lucene.util.TestRuleIgnoreAfterMaxFailures$1.evaluate(TestRuleIgnoreAfterMaxFailures.java:64)
	at org.apache.lucene.util.TestRuleMarkFailure$1.evaluate(TestRuleMarkFailure.java:47)
	at com.carrotsearch.randomizedtesting.rules.StatementAdapter.evaluate(StatementAdapter.java:36)
	at com.carrotsearch.randomizedtesting.ThreadLeakControl$StatementRunner.run(ThreadLeakControl.java:367)
	at com.carrotsearch.randomizedtesting.ThreadLeakControl.forkTimeoutingTask(ThreadLeakControl.java:811)
	at com.carrotsearch.randomizedtesting.ThreadLeakControl$3.evaluate(ThreadLeakControl.java:462)
	at com.carrotsearch.randomizedtesting.RandomizedRunner.runSingleTest(RandomizedRunner.java:916)
	at com.carrotsearch.randomizedtesting.RandomizedRunner$5.evaluate(RandomizedRunner.java:802)
	at com.carrotsearch.randomizedtesting.RandomizedRunner$6.evaluate(RandomizedRunner.java:852)
	at com.carrotsearch.randomizedtesting.RandomizedRunner$7.evaluate(RandomizedRunner.java:863)
	at com.carrotsearch.randomizedtesting.rules.StatementAdapter.evaluate(StatementAdapter.java:36)
	at com.carrotsearch.randomizedtesting.rules.SystemPropertiesRestoreRule$1.evaluate(SystemPropertiesRestoreRule.java:57)
	at org.apache.lucene.util.AbstractBeforeAfterRule$1.evaluate(AbstractBeforeAfterRule.java:45)
	at com.carrotsearch.randomizedtesting.rules.StatementAdapter.evaluate(StatementAdapter.java:36)
	at org.apache.lucene.util.TestRuleStoreClassName$1.evaluate(TestRuleStoreClassName.java:41)
	at com.carrotsearch.randomizedtesting.rules.NoShadowingOrOverridesOnMethodsRule$1.evaluate(NoShadowingOrOverridesOnMethodsRule.java:40)
	at com.carrotsearch.randomizedtesting.rules.NoShadowingOrOverridesOnMethodsRule$1.evaluate(NoShadowingOrOverridesOnMethodsRule.java:40)
	at com.carrotsearch.randomizedtesting.rules.StatementAdapter.evaluate(StatementAdapter.java:36)
	at com.carrotsearch.randomizedtesting.rules.StatementAdapter.evaluate(StatementAdapter.java:36)
	at com.carrotsearch.randomizedtesting.rules.StatementAdapter.evaluate(StatementAdapter.java:36)
	at org.apache.lucene.util.TestRuleAssertionsRequired$1.evaluate(TestRuleAssertionsRequired.java:53)
	at org.apache.lucene.util.TestRuleMarkFailure$1.evaluate(TestRuleMarkFailure.java:47)
	at org.apache.lucene.util.TestRuleIgnoreAfterMaxFailures$1.evaluate(TestRuleIgnoreAfterMaxFailures.java:64)
	at org.apache.lucene.util.TestRuleIgnoreTestSuites$1.evaluate(TestRuleIgnoreTestSuites.java:54)
	at com.carrotsearch.randomizedtesting.rules.StatementAdapter.evaluate(StatementAdapter.java:36)
	at com.carrotsearch.randomizedtesting.ThreadLeakControl$StatementRunner.run(ThreadLeakControl.java:367)
	at java.lang.Thread.run(Thread.java:745)




Build Log:
[...truncated 1821 lines...]
   [junit4] Suite: org.apache.lucene.search.TestFuzzyQuery
   [junit4]   2> dic 31, 2016 4:57:59 AM com.carrotsearch.randomizedtesting.ThreadLeakControl$2 evaluate
   [junit4]   2> WARNING: Suite execution timed out: org.apache.lucene.search.TestFuzzyQuery
   [junit4]   2>    1) Thread[id=1, name=main, state=WAITING, group=main]
   [junit4]   2>         at java.lang.Object.wait(Native Method)
   [junit4]   2>         at java.lang.Thread.join(Thread.java:1249)
   [junit4]   2>         at java.lang.Thread.join(Thread.java:1323)
   [junit4]   2>         at com.carrotsearch.randomizedtesting.RandomizedRunner.runSuite(RandomizedRunner.java:608)
   [junit4]   2>         at com.carrotsearch.randomizedtesting.RandomizedRunner.run(RandomizedRunner.java:457)
   [junit4]   2>         at com.carrotsearch.ant.tasks.junit4.slave.SlaveMain.execute(SlaveMain.java:243)
   [junit4]   2>         at com.carrotsearch.ant.tasks.junit4.slave.SlaveMain.main(SlaveMain.java:354)
   [junit4]   2>         at com.carrotsearch.ant.tasks.junit4.slave.SlaveMainSafe.main(SlaveMainSafe.java:10)
   [junit4]   2>    2) Thread[id=9, name=JUnit4-serializer-daemon, state=TIMED_WAITING, group=main]
   [junit4]   2>         at java.lang.Thread.sleep(Native Method)
   [junit4]   2>         at com.carrotsearch.ant.tasks.junit4.events.Serializer$1.run(Serializer.java:50)
   [junit4]   2>    3) Thread[id=4785, name=TEST-TestFuzzyQuery.testRandom-seed#[271F30BB87F52C4], state=RUNNABLE, group=TGRP-TestFuzzyQuery]
   [junit4]   2>         at com.carrotsearch.randomizedtesting.RandomizedContext.context(RandomizedContext.java:239)
   [junit4]   2>         at com.carrotsearch.randomizedtesting.RandomizedContext.current(RandomizedContext.java:134)
   [junit4]   2>         at org.apache.lucene.util.LuceneTestCase.random(LuceneTestCase.java:747)
   [junit4]   2>         at org.apache.lucene.search.TestFuzzyQuery.randomSimpleString(TestFuzzyQuery.java:506)
   [junit4]   2>         at org.apache.lucene.search.TestFuzzyQuery.testRandom(TestFuzzyQuery.java:517)
   [junit4]   2>         at sun.reflect.NativeMethodAccessorImpl.invoke0(Native Method)
   [junit4]   2>         at sun.reflect.NativeMethodAccessorImpl.invoke(NativeMethodAccessorImpl.java:62)
   [junit4]   2>         at sun.reflect.DelegatingMethodAccessorImpl.invoke(DelegatingMethodAccessorImpl.java:43)
   [junit4]   2>         at java.lang.reflect.Method.invoke(Method.java:498)
   [junit4]   2>         at com.carrotsearch.randomizedtesting.RandomizedRunner.invoke(RandomizedRunner.java:1713)
   [junit4]   2>         at com.carrotsearch.randomizedtesting.RandomizedRunner$8.evaluate(RandomizedRunner.java:907)
   [junit4]   2>         at com.carrotsearch.randomizedtesting.RandomizedRunner$9.evaluate(RandomizedRunner.java:943)
   [junit4]   2>         at com.carrotsearch.randomizedtesting.RandomizedRunner$10.evaluate(RandomizedRunner.java:957)
   [junit4]   2>         at org.apache.lucene.util.TestRuleSetupTeardownChained$1.evaluate(TestRuleSetupTeardownChained.java:49)
   [junit4]   2>         at org.apache.lucene.util.AbstractBeforeAfterRule$1.evaluate(AbstractBeforeAfterRule.java:45)
   [junit4]   2>         at org.apache.lucene.util.TestRuleThreadAndTestName$1.evaluate(TestRuleThreadAndTestName.java:48)
   [junit4]   2>         at org.apache.lucene.util.TestRuleIgnoreAfterMaxFailures$1.evaluate(TestRuleIgnoreAfterMaxFailures.java:64)
   [junit4]   2>         at org.apache.lucene.util.TestRuleMarkFailure$1.evaluate(TestRuleMarkFailure.java:47)
   [junit4]   2>         at com.carrotsearch.randomizedtesting.rules.StatementAdapter.evaluate(StatementAdapter.java:36)
   [junit4]   2>         at com.carrotsearch.randomizedtesting.ThreadLeakControl$StatementRunner.run(ThreadLeakControl.java:367)
   [junit4]   2>         at com.carrotsearch.randomizedtesting.ThreadLeakControl.forkTimeoutingTask(ThreadLeakControl.java:811)
   [junit4]   2>         at com.carrotsearch.randomizedtesting.ThreadLeakControl$3.evaluate(ThreadLeakControl.java:462)
   [junit4]   2>         at com.carrotsearch.randomizedtesting.RandomizedRunner.runSingleTest(RandomizedRunner.java:916)
   [junit4]   2>         at com.carrotsearch.randomizedtesting.RandomizedRunner$5.evaluate(RandomizedRunner.java:802)
   [junit4]   2>         at com.carrotsearch.randomizedtesting.RandomizedRunner$6.evaluate(RandomizedRunner.java:852)
   [junit4]   2>         at com.carrotsearch.randomizedtesting.RandomizedRunner$7.evaluate(RandomizedRunner.java:863)
   [junit4]   2>         at org.apache.lucene.util.AbstractBeforeAfterRule$1.evaluate(AbstractBeforeAfterRule.java:45)
   [junit4]   2>         at com.carrotsearch.randomizedtesting.rules.StatementAdapter.evaluate(StatementAdapter.java:36)
   [junit4]   2>         at org.apache.lucene.util.TestRuleStoreClassName$1.evaluate(TestRuleStoreClassName.java:41)
   [junit4]   2>         at com.carrotsearch.randomizedtesting.rules.NoShadowingOrOverridesOnMethodsRule$1.evaluate(NoShadowingOrOverridesOnMethodsRule.java:40)
   [junit4]   2>         at com.carrotsearch.randomizedtesting.rules.NoShadowingOrOverridesOnMethodsRule$1.evaluate(NoShadowingOrOverridesOnMethodsRule.java:40)
   [junit4]   2>         at com.carrotsearch.randomizedtesting.rules.StatementAdapter.evaluate(StatementAdapter.java:36)
   [junit4]   2>         at com.carrotsearch.randomizedtesting.rules.StatementAdapter.evaluate(StatementAdapter.java:36)
   [junit4]   2>         at com.carrotsearch.randomizedtesting.rules.StatementAdapter.evaluate(StatementAdapter.java:36)
   [junit4]   2>         at org.apache.lucene.util.TestRuleAssertionsRequired$1.evaluate(TestRuleAssertionsRequired.java:53)
   [junit4]   2>         at org.apache.lucene.util.TestRuleMarkFailure$1.evaluate(TestRuleMarkFailure.java:47)
   [junit4]   2>         at org.apache.lucene.util.TestRuleIgnoreAfterMaxFailures$1.evaluate(TestRuleIgnoreAfterMaxFailures.java:64)
   [junit4]   2>         at org.apache.lucene.util.TestRuleIgnoreTestSuites$1.evaluate(TestRuleIgnoreTestSuites.java:54)
   [junit4]   2>         at com.carrotsearch.randomizedtesting.rules.StatementAdapter.evaluate(StatementAdapter.java:36)
   [junit4]   2>         at com.carrotsearch.randomizedtesting.ThreadLeakControl$StatementRunner.run(ThreadLeakControl.java:367)
   [junit4]   2>         at java.lang.Thread.run(Thread.java:745)
   [junit4]   2>    4) Thread[id=4784, name=SUITE-TestFuzzyQuery-seed#[271F30BB87F52C4], state=RUNNABLE, group=TGRP-TestFuzzyQuery]
   [junit4]   2>         at java.lang.Thread.getStackTrace(Thread.java:1556)
   [junit4]   2>         at com.carrotsearch.randomizedtesting.ThreadLeakControl$4.run(ThreadLeakControl.java:690)
   [junit4]   2>         at com.carrotsearch.randomizedtesting.ThreadLeakControl$4.run(ThreadLeakControl.java:687)
   [junit4]   2>         at java.security.AccessController.doPrivileged(Native Method)
   [junit4]   2>         at com.carrotsearch.randomizedtesting.ThreadLeakControl.getStackTrace(ThreadLeakControl.java:687)
   [junit4]   2>         at com.carrotsearch.randomizedtesting.ThreadLeakControl.getThreadsWithTraces(ThreadLeakControl.java:703)
   [junit4]   2>         at com.carrotsearch.randomizedtesting.ThreadLeakControl.formatThreadStacksFull(ThreadLeakControl.java:683)
   [junit4]   2>         at com.carrotsearch.randomizedtesting.ThreadLeakControl.access$1000(ThreadLeakControl.java:64)
   [junit4]   2>         at com.carrotsearch.randomizedtesting.ThreadLeakControl$2.evaluate(ThreadLeakControl.java:415)
   [junit4]   2>         at com.carrotsearch.randomizedtesting.RandomizedRunner.runSuite(RandomizedRunner.java:678)
   [junit4]   2>         at com.carrotsearch.randomizedtesting.RandomizedRunner.access$200(RandomizedRunner.java:140)
   [junit4]   2>         at com.carrotsearch.randomizedtesting.RandomizedRunner$2.run(RandomizedRunner.java:598)
   [junit4]   2> NOTE: download the large Jenkins line-docs file by running 'ant get-jenkins-line-docs' in the lucene directory.
   [junit4]   2> NOTE: reproduce with: ant test  -Dtestcase=TestFuzzyQuery -Dtests.method=testRandom -Dtests.seed=271F30BB87F52C4 -Dtests.multiplier=2 -Dtests.nightly=true -Dtests.slow=true -Dtests.linedocsfile=/home/jenkins/jenkins-slave/workspace/Lucene-Solr-NightlyTests-6.x/test-data/enwiki.random.lines.txt -Dtests.locale=es-MX -Dtests.timezone=Pacific/Rarotonga -Dtests.asserts=true -Dtests.file.encoding=UTF-8
   [junit4] ERROR   7200s J2 | TestFuzzyQuery.testRandom <<<
   [junit4]    > Throwable #1: java.lang.Exception: Test abandoned because suite timeout was reached.
   [junit4]    > 	at __randomizedtesting.SeedInfo.seed([271F30BB87F52C4]:0)
   [junit4]   2> dic 31, 2016 4:57:59 AM com.carrotsearch.randomizedtesting.ThreadLeakControl checkThreadLeaks
   [junit4]   2> WARNING: Will linger awaiting termination of 1 leaked thread(s).
   [junit4]   2> dic 31, 2016 4:58:19 AM com.carrotsearch.randomizedtesting.ThreadLeakControl checkThreadLeaks
   [junit4]   2> SEVERE: 1 thread leaked from SUITE scope at org.apache.lucene.search.TestFuzzyQuery: 
   [junit4]   2>    1) Thread[id=4785, name=TEST-TestFuzzyQuery.testRandom-seed#[271F30BB87F52C4], state=RUNNABLE, group=TGRP-TestFuzzyQuery]
   [junit4]   2>         at java.lang.System.identityHashCode(Native Method)
   [junit4]   2>         at java.util.IdentityHashMap.hash(IdentityHashMap.java:294)
   [junit4]   2>         at java.util.IdentityHashMap.get(IdentityHashMap.java:328)
   [junit4]   2>         at com.carrotsearch.randomizedtesting.RandomizedContext.context(RandomizedContext.java:239)
   [junit4]   2>         at com.carrotsearch.randomizedtesting.RandomizedContext.current(RandomizedContext.java:134)
   [junit4]   2>         at org.apache.lucene.util.LuceneTestCase.random(LuceneTestCase.java:747)
   [junit4]   2>         at org.apache.lucene.search.TestFuzzyQuery.randomSimpleString(TestFuzzyQuery.java:503)
   [junit4]   2>         at org.apache.lucene.search.TestFuzzyQuery.testRandom(TestFuzzyQuery.java:517)
   [junit4]   2>         at sun.reflect.NativeMethodAccessorImpl.invoke0(Native Method)
   [junit4]   2>         at sun.reflect.NativeMethodAccessorImpl.invoke(NativeMethodAccessorImpl.java:62)
   [junit4]   2>         at sun.reflect.DelegatingMethodAccessorImpl.invoke(DelegatingMethodAccessorImpl.java:43)
   [junit4]   2>         at java.lang.reflect.Method.invoke(Method.java:498)
   [junit4]   2>         at com.carrotsearch.randomizedtesting.RandomizedRunner.invoke(RandomizedRunner.java:1713)
   [junit4]   2>         at com.carrotsearch.randomizedtesting.RandomizedRunner$8.evaluate(RandomizedRunner.java:907)
   [junit4]   2>         at com.carrotsearch.randomizedtesting.RandomizedRunner$9.evaluate(RandomizedRunner.java:943)
   [junit4]   2>         at com.carrotsearch.randomizedtesting.RandomizedRunner$10.evaluate(RandomizedRunner.java:957)
   [junit4]   2>         at org.apache.lucene.util.TestRuleSetupTeardownChained$1.evaluate(TestRuleSetupTeardownChained.java:49)
   [junit4]   2>         at org.apache.lucene.util.AbstractBeforeAfterRule$1.evaluate(AbstractBeforeAfterRule.java:45)
   [junit4]   2>         at org.apache.lucene.util.TestRuleThreadAndTestName$1.evaluate(TestRuleThreadAndTestName.java:48)
   [junit4]   2>         at org.apache.lucene.util.TestRuleIgnoreAfterMaxFailures$1.evaluate(TestRuleIgnoreAfterMaxFailures.java:64)
   [junit4]   2>         at org.apache.lucene.util.TestRuleMarkFailure$1.evaluate(TestRuleMarkFailure.java:47)
   [junit4]   2>         at com.carrotsearch.randomizedtesting.rules.StatementAdapter.evaluate(StatementAdapter.java:36)
   [junit4]   2>         at com.carrotsearch.randomizedtesting.ThreadLeakControl$StatementRunner.run(ThreadLeakControl.java:367)
   [junit4]   2>         at com.carrotsearch.randomizedtesting.ThreadLeakControl.forkTimeoutingTask(ThreadLeakControl.java:811)
   [junit4]   2>         at com.carrotsearch.randomizedtesting.ThreadLeakControl$3.evaluate(ThreadLeakControl.java:462)
   [junit4]   2>         at com.carrotsearch.randomizedtesting.RandomizedRunner.runSingleTest(RandomizedRunner.java:916)
   [junit4]   2>         at com.carrotsearch.randomizedtesting.RandomizedRunner$5.evaluate(RandomizedRunner.java:802)
   [junit4]   2>         at com.carrotsearch.randomizedtesting.RandomizedRunner$6.evaluate(RandomizedRunner.java:852)
   [junit4]   2>         at com.carrotsearch.randomizedtesting.RandomizedRunner$7.evaluate(RandomizedRunner.java:863)
   [junit4]   2>         at org.apache.lucene.util.AbstractBeforeAfterRule$1.evaluate(AbstractBeforeAfterRule.java:45)
   [junit4]   2>         at com.carrotsearch.randomizedtesting.rules.StatementAdapter.evaluate(StatementAdapter.java:36)
   [junit4]   2>         at org.apache.lucene.util.TestRuleStoreClassName$1.evaluate(TestRuleStoreClassName.java:41)
   [junit4]   2>         at com.carrotsearch.randomizedtesting.rules.NoShadowingOrOverridesOnMethodsRule$1.evaluate(NoShadowingOrOverridesOnMethodsRule.java:40)
   [junit4]   2>         at com.carrotsearch.randomizedtesting.rules.NoShadowingOrOverridesOnMethodsRule$1.evaluate(NoShadowingOrOverridesOnMethodsRule.java:40)
   [junit4]   2>         at com.carrotsearch.randomizedtesting.rules.StatementAdapter.evaluate(StatementAdapter.java:36)
   [junit4]   2>         at com.carrotsearch.randomizedtesting.rules.StatementAdapter.evaluate(StatementAdapter.java:36)
   [junit4]   2>         at com.carrotsearch.randomizedtesting.rules.StatementAdapter.evaluate(StatementAdapter.java:36)
   [junit4]   2>         at org.apache.lucene.util.TestRuleAssertionsRequired$1.evaluate(TestRuleAssertionsRequired.java:53)
   [junit4]   2>         at org.apache.lucene.util.TestRuleMarkFailure$1.evaluate(TestRuleMarkFailure.java:47)
   [junit4]   2>         at org.apache.lucene.util.TestRuleIgnoreAfterMaxFailures$1.evaluate(TestRuleIgnoreAfterMaxFailures.java:64)
   [junit4]   2>         at org.apache.lucene.util.TestRuleIgnoreTestSuites$1.evaluate(TestRuleIgnoreTestSuites.java:54)
   [junit4]   2>         at com.carrotsearch.randomizedtesting.rules.StatementAdapter.evaluate(StatementAdapter.java:36)
   [junit4]   2>         at com.carrotsearch.randomizedtesting.ThreadLeakControl$StatementRunner.run(ThreadLeakControl.java:367)
   [junit4]   2>         at java.lang.Thread.run(Thread.java:745)
   [junit4]   2> dic 31, 2016 4:58:19 AM com.carrotsearch.randomizedtesting.ThreadLeakControl tryToInterruptAll
   [junit4]   2> INFO: Starting to interrupt leaked threads:
   [junit4]   2>    1) Thread[id=4785, name=TEST-TestFuzzyQuery.testRandom-seed#[271F30BB87F52C4], state=RUNNABLE, group=TGRP-TestFuzzyQuery]
   [junit4]   2> dic 31, 2016 4:58:22 AM com.carrotsearch.randomizedtesting.ThreadLeakControl tryToInterruptAll
   [junit4]   2> SEVERE: There are still zombie threads that couldn't be terminated:
   [junit4]   2>    1) Thread[id=4785, name=TEST-TestFuzzyQuery.testRandom-seed#[271F30BB87F52C4], state=RUNNABLE, group=TGRP-TestFuzzyQuery]
   [junit4]   2>         at java.lang.Object.hashCode(Native Method)
   [junit4]   2>         at java.util.WeakHashMap.hash(WeakHashMap.java:298)
   [junit4]   2>         at java.util.WeakHashMap.get(WeakHashMap.java:396)
   [junit4]   2>         at com.carrotsearch.randomizedtesting.RandomizedContext.getPerThread(RandomizedContext.java:319)
   [junit4]   2>         at com.carrotsearch.randomizedtesting.RandomizedContext.getRandomness(RandomizedContext.java:92)
   [junit4]   2>         at com.carrotsearch.randomizedtesting.RandomizedContext.getRandom(RandomizedContext.java:114)
   [junit4]   2>         at org.apache.lucene.util.LuceneTestCase.random(LuceneTestCase.java:747)
   [junit4]   2>         at org.apache.lucene.search.TestFuzzyQuery.randomSimpleString(TestFuzzyQuery.java:506)
   [junit4]   2>         at org.apache.lucene.search.TestFuzzyQuery.testRandom(TestFuzzyQuery.java:517)
   [junit4]   2>         at sun.reflect.NativeMethodAccessorImpl.invoke0(Native Method)
   [junit4]   2>         at sun.reflect.NativeMethodAccessorImpl.invoke(NativeMethodAccessorImpl.java:62)
   [junit4]   2>         at sun.reflect.DelegatingMethodAccessorImpl.invoke(DelegatingMethodAccessorImpl.java:43)
   [junit4]   2>         at java.lang.reflect.Method.invoke(Method.java:498)
   [junit4]   2>         at com.carrotsearch.randomizedtesting.RandomizedRunner.invoke(RandomizedRunner.java:1713)
   [junit4]   2>         at com.carrotsearch.randomizedtesting.RandomizedRunner$8.evaluate(RandomizedRunner.java:907)
   [junit4]   2>         at com.carrotsearch.randomizedtesting.RandomizedRunner$9.evaluate(RandomizedRunner.java:943)
   [junit4]   2>         at com.carrotsearch.randomizedtesting.RandomizedRunner$10.evaluate(RandomizedRunner.java:957)
   [junit4]   2>         at org.apache.lucene.util.TestRuleSetupTeardownChained$1.evaluate(TestRuleSetupTeardownChained.java:49)
   [junit4]   2>         at org.apache.lucene.util.AbstractBeforeAfterRule$1.evaluate(AbstractBeforeAfterRule.java:45)
   [junit4]   2>         at org.apache.lucene.util.TestRuleThreadAndTestName$1.evaluate(TestRuleThreadAndTestName.java:48)
   [junit4]   2>         at org.apache.lucene.util.TestRuleIgnoreAfterMaxFailures$1.evaluate(TestRuleIgnoreAfterMaxFailures.java:64)
   [junit4]   2>         at org.apache.lucene.util.TestRuleMarkFailure$1.evaluate(TestRuleMarkFailure.java:47)
   [junit4]   2>         at com.carrotsearch.randomizedtesting.rules.StatementAdapter.evaluate(StatementAdapter.java:36)
   [junit4]   2>         at com.carrotsearch.randomizedtesting.ThreadLeakControl$StatementRunner.run(ThreadLeakControl.java:367)
   [junit4]   2>         at com.carrotsearch.randomizedtesting.ThreadLeakControl.forkTimeoutingTask(ThreadLeakControl.java:811)
   [junit4]   2>         at com.carrotsearch.randomizedtesting.ThreadLeakControl$3.evaluate(ThreadLeakControl.java:462)
   [junit4]   2>         at com.carrotsearch.randomizedtesting.RandomizedRunner.runSingleTest(RandomizedRunner.java:916)
   [junit4]   2>         at com.carrotsearch.randomizedtesting.RandomizedRunner$5.evaluate(RandomizedRunner.java:802)
   [junit4]   2>         at com.carrotsearch.randomizedtesting.RandomizedRunner$6.evaluate(RandomizedRunner.java:852)
   [junit4]   2>         at com.carrotsearch.randomizedtesting.RandomizedRunner$7.evaluate(RandomizedRunner.java:863)
   [junit4]   2>         at org.apache.lucene.util.AbstractBeforeAfterRule$1.evaluate(AbstractBeforeAfterRule.java:45)
   [junit4]   2>         at com.carrotsearch.randomizedtesting.rules.StatementAdapter.evaluate(StatementAdapter.java:36)
   [junit4]   2>         at org.apache.lucene.util.TestRuleStoreClassName$1.evaluate(TestRuleStoreClassName.java:41)
   [junit4]   2>         at com.carrotsearch.randomizedtesting.rules.NoShadowingOrOverridesOnMethodsRule$1.evaluate(NoShadowingOrOverridesOnMethodsRule.java:40)
   [junit4]   2>         at com.carrotsearch.randomizedtesting.rules.NoShadowingOrOverridesOnMethodsRule$1.evaluate(NoShadowingOrOverridesOnMethodsRule.java:40)
   [junit4]   2>         at com.carrotsearch.randomizedtesting.rules.StatementAdapter.evaluate(StatementAdapter.java:36)
   [junit4]   2>         at com.carrotsearch.randomizedtesting.rules.StatementAdapter.evaluate(StatementAdapter.java:36)
   [junit4]   2>         at com.carrotsearch.randomizedtesting.rules.StatementAdapter.evaluate(StatementAdapter.java:36)
   [junit4]   2>         at org.apache.lucene.util.TestRuleAssertionsRequired$1.evaluate(TestRuleAssertionsRequired.java:53)
   [junit4]   2>         at org.apache.lucene.util.TestRuleMarkFailure$1.evaluate(TestRuleMarkFailure.java:47)
   [junit4]   2>         at org.apache.lucene.util.TestRuleIgnoreAfterMaxFailures$1.evaluate(TestRuleIgnoreAfterMaxFailures.java:64)
   [junit4]   2>         at org.apache.lucene.util.TestRuleIgnoreTestSuites$1.evaluate(TestRuleIgnoreTestSuites.java:54)
   [junit4]   2>         at com.carrotsearch.randomizedtesting.rules.StatementAdapter.evaluate(StatementAdapter.java:36)
   [junit4]   2>         at com.carrotsearch.randomizedtesting.ThreadLeakControl$StatementRunner.run(ThreadLeakControl.java:367)
   [junit4]   2>         at java.lang.Thread.run(Thread.java:745)
   [junit4]   2> NOTE: test params are: codec=Asserting(Lucene62), sim=RandomSimilarity(queryNorm=true,coord=no): {field=DFR I(ne)L3(800.0)}, locale=es-MX, timezone=Pacific/Rarotonga
   [junit4]   2> NOTE: Linux 3.13.0-85-generic amd64/Oracle Corporation 1.8.0_102 (64-bit)/cpus=4,threads=2,free=81614264,total=360185856
   [junit4]   2> NOTE: All tests run in this JVM: [Test2BPostings, TestNamedSPILoader, TestMatchNoDocsQuery, TestForceMergeForever, TestUpgradeIndexMergePolicy, TestMaxTermFrequency, TestCustomSearcherSort, TestFastDecompressionMode, TestSortedSetSelector, TestIndexWriterMerging, TestIndexCommit, TestDocBoost, TestSpanExplanationsOfNonMatches, TestBufferedChecksum, TestAtomicUpdate, Test2BPoints, TestNRTThreads, TestSpanContainQuery, TestSumDocFreq, TestTermsEnum2, TestIndexWriterReader, TestLongPostings, TestBinaryDocValuesUpdates, TestTermQuery, TestBytesRefArray, TestDirectMonotonic, TestFilterSpans, TestRegExp, TestComplexExplanationsOfNonMatches, TestVirtualMethod, TestMultiPhraseEnum, TestCharsRef, TestMultiLevelSkipList, TestStressDeletes, TestElevationComparator, TestMixedCodecs, TestPointQueries, TestCodecHoldsOpenFiles, TestTermVectorsWriter, TestMultiTermsEnum, TestDocInverterPerFieldErrorInfo, TestDisjunctionMaxQuery, TestMultiTermConstantScore, TestFilterDirectoryReader, TestSameScoresWithThreads, TestLucene62SegmentInfoFormat, TestForUtil, TestAutomatonQuery, TestInPlaceMergeSorter, TestDirectoryReader, TestTopDocsCollector, TestBytesStore, TestUTF32ToUTF8, TestSpanExplanations, TestMSBRadixSorter, TestSegmentTermEnum, TestCollectionUtil, TestBinaryDocument, TestIndexSearcher, TestIOUtils, TestConsistentFieldNumbers, TestTimeLimitingCollector, TestSPIClassIterator, TestDocumentsWriterStallControl, TestMergeSchedulerExternal, TestParallelTermEnum, TestIndexWriterMaxDocs, TestBooleanOr, TestIndexWriterThreadsToSegments, TestIndexFileDeleter, TestRateLimiter, TestEarlyTermination, Test2BBinaryDocValues, TestSpanSearchEquivalence, TestMultiMMap, TestSearcherManager, TestStressIndexing2, TestMultiPhraseQuery, TestLazyProxSkipping, TestDeterminism, TestBagOfPostings, TestStressNRT, TestIndexInput, TestOmitTf, TestNearSpansOrdered, TestDocumentWriter, TestForTooMuchCloning, TestFuzzyQuery]
   [junit4]   2> NOTE: download the large Jenkins line-docs file by running 'ant get-jenkins-line-docs' in the lucene directory.
   [junit4]   2> NOTE: reproduce with: ant test  -Dtestcase=TestFuzzyQuery -Dtests.seed=271F30BB87F52C4 -Dtests.multiplier=2 -Dtests.nightly=true -Dtests.slow=true -Dtests.linedocsfile=/home/jenkins/jenkins-slave/workspace/Lucene-Solr-NightlyTests-6.x/test-data/enwiki.random.lines.txt -Dtests.locale=es-MX -Dtests.timezone=Pacific/Rarotonga -Dtests.asserts=true -Dtests.file.encoding=UTF-8
   [junit4] ERROR   0.00s J2 | TestFuzzyQuery (suite) <<<
   [junit4]    > Throwable #1: java.lang.Exception: Suite timeout exceeded (>= 7200000 msec).
   [junit4]    > 	at __randomizedtesting.SeedInfo.seed([271F30BB87F52C4]:0)
   [junit4] Completed [444/444 (1!)] on J2 in 7223.21s, 3 tests, 2 errors <<< FAILURES!

[...truncated 10337 lines...]
   [junit4] Suite: org.apache.solr.cloud.hdfs.HdfsCollectionsAPIDistributedZkTest
   [junit4]   2> Creating dataDir: /x1/jenkins/jenkins-slave/workspace/Lucene-Solr-NightlyTests-6.x/checkout/solr/build/solr-core/test/J0/temp/solr.cloud.hdfs.HdfsCollectionsAPIDistributedZkTest_5D25608316BF2D04-001/init-core-data-001
   [junit4]   2> 1514477 INFO  (SUITE-HdfsCollectionsAPIDistributedZkTest-seed#[5D25608316BF2D04]-worker) [    ] o.a.s.SolrTestCaseJ4 Randomized ssl (true) and clientAuth (false) via: @org.apache.solr.util.RandomizeSSL(reason=, ssl=NaN, value=NaN, clientAuth=NaN)
   [junit4]   2> 1514478 INFO  (SUITE-HdfsCollectionsAPIDistributedZkTest-seed#[5D25608316BF2D04]-worker) [    ] o.a.s.c.MiniSolrCloudCluster Starting cluster of 4 servers in /x1/jenkins/jenkins-slave/workspace/Lucene-Solr-NightlyTests-6.x/checkout/solr/build/solr-core/test/J0/temp/solr.cloud.hdfs.HdfsCollectionsAPIDistributedZkTest_5D25608316BF2D04-001/tempDir-001
   [junit4]   2> 1514478 INFO  (SUITE-HdfsCollectionsAPIDistributedZkTest-seed#[5D25608316BF2D04]-worker) [    ] o.a.s.c.ZkTestServer STARTING ZK TEST SERVER
   [junit4]   2> 1514478 INFO  (Thread-49106) [    ] o.a.s.c.ZkTestServer client port:0.0.0.0/0.0.0.0:0
   [junit4]   2> 1514478 INFO  (Thread-49106) [    ] o.a.s.c.ZkTestServer Starting server
   [junit4]   2> 1514578 INFO  (SUITE-HdfsCollectionsAPIDistributedZkTest-seed#[5D25608316BF2D04]-worker) [    ] o.a.s.c.ZkTestServer start zk server on port:39974
   [junit4]   2> 1514583 WARN  (NIOServerCxn.Factory:0.0.0.0/0.0.0.0:0) [    ] o.a.z.s.NIOServerCnxn caught end of stream exception
   [junit4]   2> EndOfStreamException: Unable to read additional data from client sessionid 0x15955e731cd0000, likely client has closed socket
   [junit4]   2> 	at org.apache.zookeeper.server.NIOServerCnxn.doIO(NIOServerCnxn.java:228)
   [junit4]   2> 	at org.apache.zookeeper.server.NIOServerCnxnFactory.run(NIOServerCnxnFactory.java:208)
   [junit4]   2> 	at java.lang.Thread.run(Thread.java:745)
   [junit4]   2> 1514585 INFO  (jetty-launcher-968-thread-1) [    ] o.e.j.s.Server jetty-9.3.14.v20161028
   [junit4]   2> 1514588 INFO  (jetty-launcher-968-thread-2) [    ] o.e.j.s.Server jetty-9.3.14.v20161028
   [junit4]   2> 1514590 INFO  (jetty-launcher-968-thread-3) [    ] o.e.j.s.Server jetty-9.3.14.v20161028
   [junit4]   2> 1514591 INFO  (jetty-launcher-968-thread-2) [    ] o.e.j.s.h.ContextHandler Started o.e.j.s.ServletContextHandler@53e42fd9{/solr,null,AVAILABLE}
   [junit4]   2> 1514591 INFO  (jetty-launcher-968-thread-4) [    ] o.e.j.s.Server jetty-9.3.14.v20161028
   [junit4]   2> 1514592 INFO  (jetty-launcher-968-thread-4) [    ] o.e.j.s.h.ContextHandler Started o.e.j.s.ServletContextHandler@2329b051{/solr,null,AVAILABLE}
   [junit4]   2> 1514592 INFO  (jetty-launcher-968-thread-2) [    ] o.e.j.s.AbstractConnector Started ServerConnector@6caf5d61{SSL,[ssl, http/1.1]}{127.0.0.1:48149}
   [junit4]   2> 1514592 INFO  (jetty-launcher-968-thread-2) [    ] o.e.j.s.Server Started @1518493ms
   [junit4]   2> 1514592 INFO  (jetty-launcher-968-thread-2) [    ] o.a.s.c.s.e.JettySolrRunner Jetty properties: {hostContext=/solr, hostPort=48149}
   [junit4]   2> 1514592 ERROR (jetty-launcher-968-thread-2) [    ] o.a.s.s.StartupLoggingUtils Missing Java Option solr.log.dir. Logging may be missing or incomplete.
   [junit4]   2> 1514593 INFO  (jetty-launcher-968-thread-2) [    ] o.a.s.s.SolrDispatchFilter  ___      _       Welcome to Apache Solr™ version 6.4.0
   [junit4]   2> 1514593 INFO  (jetty-launcher-968-thread-2) [    ] o.a.s.s.SolrDispatchFilter / __| ___| |_ _   Starting in cloud mode on port null
   [junit4]   2> 1514593 INFO  (jetty-launcher-968-thread-2) [    ] o.a.s.s.SolrDispatchFilter \__ \/ _ \ | '_|  Install dir: null
   [junit4]   2> 1514593 INFO  (jetty-launcher-968-thread-2) [    ] o.a.s.s.SolrDispatchFilter |___/\___/_|_|    Start time: 2016-12-31T17:22:12.159Z
   [junit4]   2> 1514595 INFO  (jetty-launcher-968-thread-3) [    ] o.e.j.s.h.ContextHandler Started o.e.j.s.ServletContextHandler@2d38020f{/solr,null,AVAILABLE}
   [junit4]   2> 1514596 INFO  (jetty-launcher-968-thread-3) [    ] o.e.j.s.AbstractConnector Started ServerConnector@69e10df6{SSL,[ssl, http/1.1]}{127.0.0.1:59222}
   [junit4]   2> 1514596 INFO  (jetty-launcher-968-thread-3) [    ] o.e.j.s.Server Started @1518496ms
   [junit4]   2> 1514596 INFO  (jetty-launcher-968-thread-3) [    ] o.a.s.c.s.e.JettySolrRunner Jetty properties: {hostContext=/solr, hostPort=59222}
   [junit4]   2> 1514596 ERROR (jetty-launcher-968-thread-3) [    ] o.a.s.s.StartupLoggingUtils Missing Java Option solr.log.dir. Logging may be missing or incomplete.
   [junit4]   2> 1514596 INFO  (jetty-launcher-968-thread-3) [    ] o.a.s.s.SolrDispatchFilter  ___      _       Welcome to Apache Solr™ version 6.4.0
   [junit4]   2> 1514596 INFO  (jetty-launcher-968-thread-3) [    ] o.a.s.s.SolrDispatchFilter / __| ___| |_ _   Starting in cloud mode on port null
   [junit4]   2> 1514596 INFO  (jetty-launcher-968-thread-3) [    ] o.a.s.s.SolrDispatchFilter \__ \/ _ \ | '_|  Install dir: null
   [junit4]   2> 1514596 INFO  (jetty-launcher-968-thread-3) [    ] o.a.s.s.SolrDispatchFilter |___/\___/_|_|    Start time: 2016-12-31T17:22:12.162Z
   [junit4]   2> 1514597 INFO  (jetty-launcher-968-thread-1) [    ] o.e.j.s.h.ContextHandler Started o.e.j.s.ServletContextHandler@cefd6cd{/solr,null,AVAILABLE}
   [junit4]   2> 1514598 INFO  (jetty-launcher-968-thread-1) [    ] o.e.j.s.AbstractConnector Started ServerConnector@2b600a6{SSL,[ssl, http/1.1]}{127.0.0.1:52023}
   [junit4]   2> 1514598 INFO  (jetty-launcher-968-thread-1) [    ] o.e.j.s.Server Started @1518499ms
   [junit4]   2> 1514599 INFO  (jetty-launcher-968-thread-1) [    ] o.a.s.c.s.e.JettySolrRunner Jetty properties: {hostContext=/solr, hostPort=52023}
   [junit4]   2> 1514599 ERROR (jetty-launcher-968-thread-1) [    ] o.a.s.s.StartupLoggingUtils Missing Java Option solr.log.dir. Logging may be missing or incomplete.
   [junit4]   2> 1514599 INFO  (jetty-launcher-968-thread-1) [    ] o.a.s.s.SolrDispatchFilter  ___      _       Welcome to Apache Solr™ version 6.4.0
   [junit4]   2> 1514599 INFO  (jetty-launcher-968-thread-1) [    ] o.a.s.s.SolrDispatchFilter / __| ___| |_ _   Starting in cloud mode on port null
   [junit4]   2> 1514599 INFO  (jetty-launcher-968-thread-1) [    ] o.a.s.s.SolrDispatchFilter \__ \/ _ \ | '_|  Install dir: null
   [junit4]   2> 1514599 INFO  (jetty-launcher-968-thread-1) [    ] o.a.s.s.SolrDispatchFilter |___/\___/_|_|    Start time: 2016-12-31T17:22:12.165Z
   [junit4]   2> 1514599 INFO  (jetty-launcher-968-thread-4) [    ] o.e.j.s.AbstractConnector Started ServerConnector@5cb9153c{SSL,[ssl, http/1.1]}{127.0.0.1:46880}
   [junit4]   2> 1514599 INFO  (jetty-launcher-968-thread-4) [    ] o.e.j.s.Server Started @1518500ms
   [junit4]   2> 1514599 INFO  (jetty-launcher-968-thread-4) [    ] o.a.s.c.s.e.JettySolrRunner Jetty properties: {hostContext=/solr, hostPort=46880}
   [junit4]   2> 1514600 ERROR (jetty-launcher-968-thread-4) [    ] o.a.s.s.StartupLoggingUtils Missing Java Option solr.log.dir. Logging may be missing or incomplete.
   [junit4]   2> 1514600 INFO  (jetty-launcher-968-thread-4) [    ] o.a.s.s.SolrDispatchFilter  ___      _       Welcome to Apache Solr™ version 6.4.0
   [junit4]   2> 1514600 INFO  (jetty-launcher-968-thread-4) [    ] o.a.s.s.SolrDispatchFilter / __| ___| |_ _   Starting in cloud mode on port null
   [junit4]   2> 1514600 INFO  (jetty-launcher-968-thread-4) [    ] o.a.s.s.SolrDispatchFilter \__ \/ _ \ | '_|  Install dir: null
   [junit4]   2> 1514600 INFO  (jetty-launcher-968-thread-4) [    ] o.a.s.s.SolrDispatchFilter |___/\___/_|_|    Start time: 2016-12-31T17:22:12.166Z
   [junit4]   2> 1514601 INFO  (jetty-launcher-968-thread-2) [    ] o.a.s.s.SolrDispatchFilter solr.xml found in ZooKeeper. Loading...
   [junit4]   2> 1514603 INFO  (jetty-launcher-968-thread-3) [    ] o.a.s.s.SolrDispatchFilter solr.xml found in ZooKeeper. Loading...
   [junit4]   2> 1514603 INFO  (jetty-launcher-968-thread-1) [    ] o.a.s.s.SolrDispatchFilter solr.xml found in ZooKeeper. Loading...
   [junit4]   2> 1514603 INFO  (jetty-launcher-968-thread-4) [    ] o.a.s.s.SolrDispatchFilter solr.xml found in ZooKeeper. Loading...
   [junit4]   2> 1514613 INFO  (jetty-launcher-968-thread-3) [    ] o.a.s.u.UpdateShardHandler Creating UpdateShardHandler HTTP client with params: socketTimeout=340000&connTimeout=45000&retry=true
   [junit4]   2> 1514614 INFO  (jetty-launcher-968-thread-1) [    ] o.a.s.u.UpdateShardHandler Creating UpdateShardHandler HTTP client with params: socketTimeout=340000&connTimeout=45000&retry=true
   [junit4]   2> 1514614 INFO  (jetty-launcher-968-thread-4) [    ] o.a.s.u.UpdateShardHandler Creating UpdateShardHandler HTTP client with params: socketTimeout=340000&connTimeout=45000&retry=true
   [junit4]   2> 1514614 INFO  (jetty-launcher-968-thread-3) [    ] o.a.s.c.ZkContainer Zookeeper client=127.0.0.1:39974/solr
   [junit4]   2> 1514615 INFO  (jetty-launcher-968-thread-4) [    ] o.a.s.c.ZkContainer Zookeeper client=127.0.0.1:39974/solr
   [junit4]   2> 1514615 INFO  (jetty-launcher-968-thread-2) [    ] o.a.s.u.UpdateShardHandler Creating UpdateShardHandler HTTP client with params: socketTimeout=340000&connTimeout=45000&retry=true
   [junit4]   2> 1514616 INFO  (jetty-launcher-968-thread-2) [    ] o.a.s.c.ZkContainer Zookeeper client=127.0.0.1:39974/solr
   [junit4]   2> 1514617 INFO  (jetty-launcher-968-thread-1) [    ] o.a.s.c.ZkContainer Zookeeper client=127.0.0.1:39974/solr
   [junit4]   2> 1514625 WARN  (NIOServerCxn.Factory:0.0.0.0/0.0.0.0:0) [    ] o.a.z.s.NIOServerCnxn caught end of stream exception
   [junit4]   2> EndOfStreamException: Unable to read additional data from client sessionid 0x15955e731cd0007, likely client has closed socket
   [junit4]   2> 	at org.apache.zookeeper.server.NIOServerCnxn.doIO(NIOServerCnxn.java:228)
   [junit4]   2> 	at org.apache.zookeeper.server.NIOServerCnxnFactory.run(NIOServerCnxnFactory.java:208)
   [junit4]   2> 	at java.lang.Thread.run(Thread.java:745)
   [junit4]   2> 1514629 WARN  (NIOServerCxn.Factory:0.0.0.0/0.0.0.0:0) [    ] o.a.z.s.NIOServerCnxn caught end of stream exception
   [junit4]   2> EndOfStreamException: Unable to read additional data from client sessionid 0x15955e731cd0009, likely client has closed socket
   [junit4]   2> 	at org.apache.zookeeper.server.NIOServerCnxn.doIO(NIOServerCnxn.java:228)
   [junit4]   2> 	at org.apache.zookeeper.server.NIOServerCnxnFactory.run(NIOServerCnxnFactory.java:208)
   [junit4]   2> 	at java.lang.Thread.run(Thread.java:745)
   [junit4]   2> 1514636 INFO  (jetty-launcher-968-thread-3) [n:127.0.0.1:59222_solr    ] o.a.s.c.OverseerElectionContext I am going to be the leader 127.0.0.1:59222_solr
   [junit4]   2> 1514637 INFO  (jetty-launcher-968-thread-3) [n:127.0.0.1:59222_solr    ] o.a.s.c.Overseer Overseer (id=97203318426501131-127.0.0.1:59222_solr-n_0000000000) starting
   [junit4]   2> 1514639 INFO  (jetty-launcher-968-thread-1) [n:127.0.0.1:52023_solr    ] o.a.s.c.ZkController Register node as live in ZooKeeper:/live_nodes/127.0.0.1:52023_solr
   [junit4]   2> 1514643 INFO  (zkCallback-986-thread-1-processing-n:127.0.0.1:46880_solr) [n:127.0.0.1:46880_solr    ] o.a.s.c.c.ZkStateReader Updated live nodes from ZooKeeper... (0) -> (1)
   [junit4]   2> 1514644 INFO  (zkCallback-988-thread-1-processing-n:127.0.0.1:59222_solr) [n:127.0.0.1:59222_solr    ] o.a.s.c.c.ZkStateReader Updated live nodes from ZooKeeper... (0) -> (1)
   [junit4]   2> 1514644 INFO  (zkCallback-991-thread-1-processing-n:127.0.0.1:52023_solr) [n:127.0.0.1:52023_solr    ] o.a.s.c.c.ZkStateReader Updated live nodes from ZooKeeper... (0) -> (1)
   [junit4]   2> 1514644 INFO  (jetty-launcher-968-thread-2) [n:127.0.0.1:48149_solr    ] o.a.s.c.c.ZkStateReader Updated live nodes from ZooKeeper... (0) -> (1)
   [junit4]   2> 1514645 INFO  (jetty-launcher-968-thread-4) [n:127.0.0.1:46880_solr    ] o.a.s.c.ZkController Register node as live in ZooKeeper:/live_nodes/127.0.0.1:46880_solr
   [junit4]   2> 1514646 INFO  (zkCallback-991-thread-1-processing-n:127.0.0.1:52023_solr) [n:127.0.0.1:52023_solr    ] o.a.s.c.c.ZkStateReader Updated live nodes from ZooKeeper... (1) -> (2)
   [junit4]   2> 1514646 INFO  (zkCallback-986-thread-1-processing-n:127.0.0.1:46880_solr) [n:127.0.0.1:46880_solr    ] o.a.s.c.c.ZkStateReader Updated live nodes from ZooKeeper... (1) -> (2)
   [junit4]   2> 1514650 INFO  (zkCallback-988-thread-1-processing-n:127.0.0.1:59222_solr) [n:127.0.0.1:59222_solr    ] o.a.s.c.c.ZkStateReader Updated live nodes from ZooKeeper... (1) -> (2)
   [junit4]   2> 1514651 INFO  (zkCallback-987-thread-1-processing-n:127.0.0.1:48149_solr) [n:127.0.0.1:48149_solr    ] o.a.s.c.c.ZkStateReader Updated live nodes from ZooKeeper... (1) -> (2)
   [junit4]   2> 1514652 INFO  (jetty-launcher-968-thread-2) [n:127.0.0.1:48149_solr    ] o.a.s.c.ZkController Register node as live in ZooKeeper:/live_nodes/127.0.0.1:48149_solr
   [junit4]   2> 1514653 INFO  (zkCallback-986-thread-1-processing-n:127.0.0.1:46880_solr) [n:127.0.0.1:46880_solr    ] o.a.s.c.c.ZkStateReader Updated live nodes from ZooKeeper... (2) -> (3)
   [junit4]   2> 1514653 INFO  (zkCallback-991-thread-1-processing-n:127.0.0.1:52023_solr) [n:127.0.0.1:52023_solr    ] o.a.s.c.c.ZkStateReader Updated live nodes from ZooKeeper... (2) -> (3)
   [junit4]   2> 1514653 INFO  (zkCallback-987-thread-1-processing-n:127.0.0.1:48149_solr) [n:127.0.0.1:48149_solr    ] o.a.s.c.c.ZkStateReader Updated live nodes from ZooKeeper... (2) -> (3)
   [junit4]   2> 1514654 INFO  (zkCallback-988-thread-1-processing-n:127.0.0.1:59222_solr) [n:127.0.0.1:59222_solr    ] o.a.s.c.c.ZkStateReader Updated live nodes from ZooKeeper... (2) -> (3)
   [junit4]   2> 1514677 INFO  (jetty-launcher-968-thread-3) [n:127.0.0.1:59222_solr    ] o.a.s.c.ZkController Register node as live in ZooKeeper:/live_nodes/127.0.0.1:59222_solr
   [junit4]   2> 1514679 INFO  (zkCallback-987-thread-1-processing-n:127.0.0.1:48149_solr) [n:127.0.0.1:48149_solr    ] o.a.s.c.c.ZkStateReader Updated live nodes from ZooKeeper... (3) -> (4)
   [junit4]   2> 1514679 INFO  (zkCallback-988-thread-1-processing-n:127.0.0.1:59222_solr) [n:127.0.0.1:59222_solr    ] o.a.s.c.c.ZkStateReader Updated live nodes from ZooKeeper... (3) -> (4)
   [junit4]   2> 1514679 INFO  (zkCallback-991-thread-1-processing-n:127.0.0.1:52023_solr) [n:127.0.0.1:52023_solr    ] o.a.s.c.c.ZkStateReader Updated live nodes from ZooKeeper... (3) -> (4)
   [junit4]   2> 1514679 INFO  (zkCallback-986-thread-1-processing-n:127.0.0.1:46880_solr) [n:127.0.0.1:46880_solr    ] o.a.s.c.c.ZkStateReader Updated live nodes from ZooKeeper... (3) -> (4)
   [junit4]   2> 1514696 INFO  (jetty-launcher-968-thread-2) [n:127.0.0.1:48149_solr    ] o.a.s.c.CorePropertiesLocator Found 0 core definitions underneath /x1/jenkins/jenkins-slave/workspace/Lucene-Solr-NightlyTests-6.x/checkout/solr/build/solr-core/test/J0/temp/solr.cloud.hdfs.HdfsCollectionsAPIDistributedZkTest_5D25608316BF2D04-001/tempDir-001/node2/.
   [junit4]   2> 1514698 INFO  (jetty-launcher-968-thread-1) [n:127.0.0.1:52023_solr    ] o.a.s.c.CorePropertiesLocator Found 0 core definitions underneath /x1/jenkins/jenkins-slave/workspace/Lucene-Solr-NightlyTests-6.x/checkout/solr/build/solr-core/test/J0/temp/solr.cloud.hdfs.HdfsCollectionsAPIDistributedZkTest_5D25608316BF2D04-001/tempDir-001/node1/.
   [junit4]   2> 1514710 INFO  (jetty-launcher-968-thread-3) [n:127.0.0.1:59222_solr    ] o.a.s.c.CorePropertiesLocator Found 0 core definitions underneath /x1/jenkins/jenkins-slave/workspace/Lucene-Solr-NightlyTests-6.x/checkout/solr/build/solr-core/test/J0/temp/solr.cloud.hdfs.HdfsCollectionsAPIDistributedZkTest_5D25608316BF2D04-001/tempDir-001/node3/.
   [junit4]   2> 1514742 INFO  (jetty-launcher-968-thread-4) [n:127.0.0.1:46880_solr    ] o.a.s.c.CorePropertiesLocator Found 0 core definitions underneath /x1/jenkins/jenkins-slave/workspace/Lucene-Solr-NightlyTests-6.x/checkout/solr/build/solr-core/test/J0/temp/solr.cloud.hdfs.HdfsCollectionsAPIDistributedZkTest_5D25608316BF2D04-001/tempDir-001/node4/.
   [junit4]   2> 1515024 INFO  (SUITE-HdfsCollectionsAPIDistributedZkTest-seed#[5D25608316BF2D04]-worker) [    ] o.a.s.c.c.ZkStateReader Updated live nodes from ZooKeeper... (0) -> (4)
   [junit4]   2> 1515025 INFO  (SUITE-HdfsCollectionsAPIDistributedZkTest-seed#[5D25608316BF2D04]-worker) [    ] o.a.s.c.s.i.ZkClientClusterStateProvider Cluster at 127.0.0.1:39974/solr ready
   [junit4]   2> 1515475 WARN  (SUITE-HdfsCollectionsAPIDistributedZkTest-seed#[5D25608316BF2D04]-worker) [    ] o.a.h.u.NativeCodeLoader Unable to load native-hadoop library for your platform... using builtin-java classes where applicable
   [junit4]   1> Formatting using clusterid: testClusterID
   [junit4]   2> 1515962 WARN  (SUITE-HdfsCollectionsAPIDistributedZkTest-seed#[5D25608316BF2D04]-worker) [    ] o.a.h.m.i.MetricsConfig Cannot locate configuration: tried hadoop-metrics2-namenode.properties,hadoop-metrics2.properties
   [junit4]   2> 1516119 INFO  (SUITE-HdfsCollectionsAPIDistributedZkTest-seed#[5D25608316BF2D04]-worker) [    ] o.m.log Logging to org.slf4j.impl.Log4jLoggerAdapter(org.mortbay.log) via org.mortbay.log.Slf4jLog
   [junit4]   2> 1516150 WARN  (SUITE-HdfsCollectionsAPIDistributedZkTest-seed#[5D25608316BF2D04]-worker) [    ] o.a.h.h.HttpRequestLog Jetty request log can only be enabled using Log4j
   [junit4]   2> 1516207 INFO  (SUITE-HdfsCollectionsAPIDistributedZkTest-seed#[5D25608316BF2D04]-worker) [    ] o.m.log jetty-6.1.26
   [junit4]   2> 1516260 INFO  (SUITE-HdfsCollectionsAPIDistributedZkTest-seed#[5D25608316BF2D04]-worker) [    ] o.m.log Extract jar:file:/x1/jenkins/.ivy2/cache/org.apache.hadoop/hadoop-hdfs/tests/hadoop-hdfs-2.7.2-tests.jar!/webapps/hdfs to ./temp/Jetty_localhost_59786_hdfs____ou3gb/webapp
   [junit4]   2> 1517018 INFO  (SUITE-HdfsCollectionsAPIDistributedZkTest-seed#[5D25608316BF2D04]-worker) [    ] o.m.log Started HttpServer2$SelectChannelConnectorWithSafeStartup@localhost:59786
   [junit4]   2> 1517623 WARN  (SUITE-HdfsCollectionsAPIDistributedZkTest-seed#[5D25608316BF2D04]-worker) [    ] o.a.h.h.HttpRequestLog Jetty request log can only be enabled using Log4j
   [junit4]   2> 1517627 INFO  (SUITE-HdfsCollectionsAPIDistributedZkTest-seed#[5D25608316BF2D04]-worker) [    ] o.m.log jetty-6.1.26
   [junit4]   2> 1517641 INFO  (SUITE-HdfsCollectionsAPIDistributedZkTest-seed#[5D25608316BF2D04]-worker) [    ] o.m.log Extract jar:file:/x1/jenkins/.ivy2/cache/org.apache.hadoop/hadoop-hdfs/tests/hadoop-hdfs-2.7.2-tests.jar!/webapps/datanode to ./temp/Jetty_localhost_46421_datanode____.ueacbs/webapp
   [junit4]   2> 1518072 INFO  (SUITE-HdfsCollectionsAPIDistributedZkTest-seed#[5D25608316BF2D04]-worker) [    ] o.m.log Started HttpServer2$SelectChannelConnectorWithSafeStartup@localhost:46421
   [junit4]   2> 1518464 WARN  (SUITE-HdfsCollectionsAPIDistributedZkTest-seed#[5D25608316BF2D04]-worker) [    ] o.a.h.h.HttpRequestLog Jetty request log can only be enabled using Log4j
   [junit4]   2> 1518466 INFO  (SUITE-HdfsCollectionsAPIDistributedZkTest-seed#[5D25608316BF2D04]-worker) [    ] o.m.log jetty-6.1.26
   [junit4]   2> 1518480 INFO  (SUITE-HdfsCollectionsAPIDistributedZkTest-seed#[5D25608316BF2D04]-worker) [    ] o.m.log Extract jar:file:/x1/jenkins/.ivy2/cache/org.apache.hadoop/hadoop-hdfs/tests/hadoop-hdfs-2.7.2-tests.jar!/webapps/datanode to ./temp/Jetty_localhost_45068_datanode____o0020o/webapp
   [junit4]   2> 1518921 INFO  (SUITE-HdfsCollectionsAPIDistributedZkTest-seed#[5D25608316BF2D04]-worker) [    ] o.m.log Started HttpServer2$SelectChannelConnectorWithSafeStartup@localhost:45068
   [junit4]   2> 1520069 INFO  (IPC Server handler 5 on 41663) [    ] BlockStateChange BLOCK* processReport: from storage DS-bbe705e1-287e-4f21-8109-c33bd7ca8d76 node DatanodeRegistration(127.0.0.1:52771, datanodeUuid=8ea48357-a53d-499b-93b1-e9661f1921d8, infoPort=40610, infoSecurePort=0, ipcPort=44446, storageInfo=lv=-56;cid=testClusterID;nsid=818636275;c=0), blocks: 0, hasStaleStorage: true, processing time: 0 msecs
   [junit4]   2> 1520069 INFO  (IPC Server handler 5 on 41663) [    ] BlockStateChange BLOCK* processReport: from storage DS-25d01932-3a75-4573-b9e2-1dab42f17e42 node DatanodeRegistration(127.0.0.1:52771, datanodeUuid=8ea48357-a53d-499b-93b1-e9661f1921d8, infoPort=40610, infoSecurePort=0, ipcPort=44446, storageInfo=lv=-56;cid=testClusterID;nsid=818636275;c=0), blocks: 0, hasStaleStorage: false, processing time: 0 msecs
   [junit4]   2> 1520081 INFO  (IPC Server handler 6 on 41663) [    ] BlockStateChange BLOCK* processReport: from storage DS-29c7ceeb-a34f-4536-9fb2-fd0d73f8b97e node DatanodeRegistration(127.0.0.1:60552, datanodeUuid=dbe7b234-72f5-4ba8-a0ae-3263e6f26908, infoPort=46257, infoSecurePort=0, ipcPort=59959, storageInfo=lv=-56;cid=testClusterID;nsid=818636275;c=0), blocks: 0, hasStaleStorage: true, processing time: 2 msecs
   [junit4]   2> 1520081 INFO  (IPC Server handler 6 on 41663) [    ] BlockStateChange BLOCK* processReport: from storage DS-7959be55-ac1d-4e00-b4cf-8f1f1316517a node DatanodeRegistration(127.0.0.1:60552, datanodeUuid=dbe7b234-72f5-4ba8-a0ae-3263e6f26908, infoPort=46257, infoSecurePort=0, ipcPort=59959, storageInfo=lv=-56;cid=testClusterID;nsid=818636275;c=0), blocks: 0, hasStaleStorage: false, processing time: 0 msecs
   [junit4]   2> 1520226 INFO  (TEST-HdfsCollectionsAPIDistributedZkTest.testCoresAreDistributedAcrossNodes-seed#[5D25608316BF2D04]) [    ] o.a.s.SolrTestCaseJ4 ###Starting testCoresAreDistributedAcrossNodes
   [junit4]   2> 1520227 INFO  (TEST-HdfsCollectionsAPIDistributedZkTest.testCoresAreDistributedAcrossNodes-seed#[5D25608316BF2D04]) [    ] o.a.s.c.c.ZkStateReader Updated live nodes from ZooKeeper... (0) -> (4)
   [junit4]   2> 1520291 INFO  (qtp192093847-53873) [n:127.0.0.1:48149_solr    ] o.a.s.h.a.CollectionsHandler Invoked Collection Action :create with params replicationFactor=2&collection.configName=conf&name=nodes_used_collection&action=CREATE&numShards=2&wt=javabin&version=2 and sendToOCPQueue=true
   [junit4]   2> 1520293 INFO  (OverseerThreadFactory-3327-thread-1-processing-n:127.0.0.1:59222_solr) [n:127.0.0.1:59222_solr    ] o.a.s.c.CreateCollectionCmd Create collection nodes_used_collection
   [junit4]   2> 1520437 INFO  (qtp192093847-53869) [n:127.0.0.1:48149_solr    ] o.a.s.h.a.CoreAdminOperation core create command qt=/admin/cores&collection.configName=conf&newCollection=true&name=nodes_used_collection_shard1_replica1&action=CREATE&numShards=2&collection=nodes_used_collection&shard=shard1&wt=javabin&version=2
   [junit4]   2> 1520476 INFO  (qtp528479911-53905) [n:127.0.0.1:52023_solr    ] o.a.s.h.a.CoreAdminOperation core create command qt=/admin/cores&collection.configName=conf&newCollection=true&name=nodes_used_collection_shard2_replica1&action=CREATE&numShards=2&collection=nodes_used_collection&shard=shard2&wt=javabin&version=2
   [junit4]   2> 1520478 INFO  (qtp1982501886-53882) [n:127.0.0.1:46880_solr    ] o.a.s.h.a.CoreAdminOperation core create command qt=/admin/cores&collection.configName=conf&newCollection=true&name=nodes_used_collection_shard1_replica2&action=CREATE&numShards=2&collection=nodes_used_collection&shard=shard1&wt=javabin&version=2
   [junit4]   2> 1520486 INFO  (qtp1950465760-53893) [n:127.0.0.1:59222_solr    ] o.a.s.h.a.CoreAdminOperation core create command qt=/admin/cores&collection.configName=conf&newCollection=true&name=nodes_used_collection_shard2_replica2&action=CREATE&numShards=2&collection=nodes_used_collection&shard=shard2&wt=javabin&version=2
   [junit4]   2> 1520590 INFO  (zkCallback-987-thread-1-processing-n:127.0.0.1:48149_solr) [n:127.0.0.1:48149_solr    ] o.a.s.c.c.ZkStateReader A cluster state change: [WatchedEvent state:SyncConnected type:NodeDataChanged path:/collections/nodes_used_collection/state.json] for collection [nodes_used_collection] has occurred - updating... (live nodes size: [4])
   [junit4]   2> 1520590 INFO  (zkCallback-991-thread-1-processing-n:127.0.0.1:52023_solr) [n:127.0.0.1:52023_solr    ] o.a.s.c.c.ZkStateReader A cluster state change: [WatchedEvent state:SyncConnected type:NodeDataChanged path:/collections/nodes_used_collection/state.json] for collection [nodes_used_collection] has occurred - updating... (live nodes size: [4])
   [junit4]   2> 1520590 INFO  (zkCallback-986-thread-1-processing-n:127.0.0.1:46880_solr) [n:127.0.0.1:46880_solr    ] o.a.s.c.c.ZkStateReader A cluster state change: [WatchedEvent state:SyncConnected type:NodeDataChanged path:/collections/nodes_used_collection/state.json] for collection [nodes_used_collection] has occurred - updating... (live nodes size: [4])
   [junit4]   2> 1520590 INFO  (zkCallback-988-thread-1-processing-n:127.0.0.1:59222_solr) [n:127.0.0.1:59222_solr    ] o.a.s.c.c.ZkStateReader A cluster state change: [WatchedEvent state:SyncConnected type:NodeDataChanged path:/collections/nodes_used_collection/state.json] for collection [nodes_used_collection] has occurred - updating... (live nodes size: [4])
   [junit4]   2> 1521453 INFO  (qtp192093847-53869) [n:127.0.0.1:48149_solr c:nodes_used_collection s:shard1  x:nodes_used_collection_shard1_replica1] o.a.s.c.SolrConfig Using Lucene MatchVersion: 6.4.0
   [junit4]   2> 1521459 INFO  (qtp192093847-53869) [n:127.0.0.1:48149_solr c:nodes_used_collection s:shard1  x:nodes_used_collection_shard1_replica1] o.a.s.s.IndexSchema [nodes_used_collection_shard1_replica1] Schema name=minimal
   [junit4]   2> 1521462 INFO  (qtp192093847-53869) [n:127.0.0.1:48149_solr c:nodes_used_collection s:shard1  x:nodes_used_collection_shard1_replica1] o.a.s.s.IndexSchema Loaded schema minimal/1.1 with uniqueid field id
   [junit4]   2> 1521465 INFO  (qtp192093847-53869) [n:127.0.0.1:48149_solr c:nodes_used_collection s:shard1  x:nodes_used_collection_shard1_replica1] o.a.s.c.CoreContainer Creating SolrCore 'nodes_used_collection_shard1_replica1' using configuration from collection nodes_used_collection
   [junit4]   2> 1521481 INFO  (qtp192093847-53869) [n:127.0.0.1:48149_solr c:nodes_used_collection s:shard1  x:nodes_used_collection_shard1_replica1] o.a.s.c.HdfsDirectoryFactory solr.hdfs.home=hdfs://localhost:41663/data
   [junit4]   2> 1521481 INFO  (qtp192093847-53869) [n:127.0.0.1:48149_solr c:nodes_used_collection s:shard1  x:nodes_used_collection_shard1_replica1] o.a.s.c.HdfsDirectoryFactory Solr Kerberos Authentication disabled
   [junit4]   2> 1521482 INFO  (qtp192093847-53869) [n:127.0.0.1:48149_solr c:nodes_used_collection s:shard1  x:nodes_used_collection_shard1_replica1] o.a.s.c.SolrCore [[nodes_used_collection_shard1_replica1] ] Opening new SolrCore at [/x1/jenkins/jenkins-slave/workspace/Lucene-Solr-NightlyTests-6.x/checkout/solr/build/solr-core/test/J0/temp/solr.cloud.hdfs.HdfsCollectionsAPIDistributedZkTest_5D25608316BF2D04-001/tempDir-001/node2/nodes_used_collection_shard1_replica1], dataDir=[hdfs://localhost:41663/data/nodes_used_collection/core_node1/data/]
   [junit4]   2> 1521484 INFO  (qtp528479911-53905) [n:127.0.0.1:52023_solr c:nodes_used_collection s:shard2  x:nodes_used_collection_shard2_replica1] o.a.s.c.SolrConfig Using Lucene MatchVersion: 6.4.0
   [junit4]   2> 1521487 INFO  (qtp1982501886-53882) [n:127.0.0.1:46880_solr c:nodes_used_collection s:shard1  x:nodes_used_collection_shard1_replica2] o.a.s.c.SolrConfig Using Lucene MatchVersion: 6.4.0
   [junit4]   2> 1521505 INFO  (qtp192093847-53869) [n:127.0.0.1:48149_solr c:nodes_used_collection s:shard1  x:nodes_used_collection_shard1_replica1] o.a.s.c.HdfsDirectoryFactory creating directory factory for path hdfs://localhost:41663/data/nodes_used_collection/core_node1/data/snapshot_metadata
   [junit4]   2> 1521515 INFO  (qtp1950465760-53893) [n:127.0.0.1:59222_solr c:nodes_used_collection s:shard2  x:nodes_used_collection_shard2_replica2] o.a.s.c.SolrConfig Using Lucene MatchVersion: 6.4.0
   [junit4]   2> 1521524 INFO  (qtp1982501886-53882) [n:127.0.0.1:46880_solr c:nodes_used_collection s:shard1  x:nodes_used_collection_shard1_replica2] o.a.s.s.IndexSchema [nodes_used_collection_shard1_replica2] Schema name=minimal
   [junit4]   2> 1521526 INFO  (qtp1982501886-53882) [n:127.0.0.1:46880_solr c:nodes_used_collection s:shard1  x:nodes_used_collection_shard1_replica2] o.a.s.s.IndexSchema Loaded schema minimal/1.1 with uniqueid field id
   [junit4]   2> 1521527 INFO  (qtp1950465760-53893) [n:127.0.0.1:59222_solr c:nodes_used_collection s:shard2  x:nodes_used_collection_shard2_replica2] o.a.s.s.IndexSchema [nodes_used_collection_shard2_replica2] Schema name=minimal
   [junit4]   2> 1521529 INFO  (qtp528479911-53905) [n:127.0.0.1:52023_solr c:nodes_used_collection s:shard2  x:nodes_used_collection_shard2_replica1] o.a.s.s.IndexSchema [nodes_used_collection_shard2_replica1] Schema name=minimal
   [junit4]   2> 1521533 INFO  (qtp192093847-53869) [n:127.0.0.1:48149_solr c:nodes_used_collection s:shard1  x:nodes_used_collection_shard1_replica1] o.a.s.c.HdfsDirectoryFactory Number of slabs of block cache [1] with direct memory allocation set to [true]
   [junit4]   2> 1521533 INFO  (qtp192093847-53869) [n:127.0.0.1:48149_solr c:nodes_used_collection s:shard1  x:nodes_used_collection_shard1_replica1] o.a.s.c.HdfsDirectoryFactory Block cache target memory usage, slab size of [16777216] will allocate [1] slabs and use ~[16777216] bytes
   [junit4]   2> 1521533 INFO  (qtp192093847-53869) [n:127.0.0.1:48149_solr c:nodes_used_collection s:shard1  x:nodes_used_collection_shard1_replica1] o.a.s.c.HdfsDirectoryFactory Creating new global HDFS BlockCache
   [junit4]   2> 1521530 INFO  (qtp1982501886-53882) [n:127.0.0.1:46880_solr c:nodes_used_collection s:shard1  x:nodes_used_collection_shard1_replica2] o.a.s.c.CoreContainer Creating SolrCore 'nodes_used_collection_shard1_replica2' using configuration from collection nodes_used_collection
   [junit4]   2> 1521530 INFO  (qtp1950465760-53893) [n:127.0.0.1:59222_solr c:nodes_used_collection s:shard2  x:nodes_used_collection_shard2_replica2] o.a.s.s.IndexSchema Loaded schema minimal/1.1 with uniqueid field id
   [junit4]   2> 1521534 INFO  (qtp1950465760-53893) [n:127.0.0.1:59222_solr c:nodes_used_collection s:shard2  x:nodes_used_collection_shard2_replica2] o.a.s.c.CoreContainer Creating SolrCore 'nodes_used_collection_shard2_replica2' using configuration from collection nodes_used_collection
   [junit4]   2> 1521538 INFO  (qtp528479911-53905) [n:127.0.0.1:52023_solr c:nodes_used_collection s:shard2  x:nodes_used_collection_shard2_replica1] o.a.s.s.IndexSchema Loaded schema minimal/1.1 with uniqueid field id
   [junit4]   2> 1521542 INFO  (qtp1982501886-53882) [n:127.0.0.1:46880_solr c:nodes_used_collection s:shard1  x:nodes_used_collection_shard1_replica2] o.a.s.c.HdfsDirectoryFactory solr.hdfs.home=hdfs://localhost:41663/data
   [junit4]   2> 1521542 INFO  (qtp1982501886-53882) [n:127.0.0.1:46880_solr c:nodes_used_collection s:shard1  x:nodes_used_collection_shard1_replica2] o.a.s.c.HdfsDirectoryFactory Solr Kerberos Authentication disabled
   [junit4]   2> 1521542 INFO  (qtp528479911-53905) [n:127.0.0.1:52023_solr c:nodes_used_collection s:shard2  x:nodes_used_collection_shard2_replica1] o.a.s.c.CoreContainer Creating SolrCore 'nodes_used_collection_shard2_replica1' using configuration from collection nodes_used_collection
   [junit4]   2> 1521542 INFO  (qtp1982501886-53882) [n:127.0.0.1:46880_solr c:nodes_used_collection s:shard1  x:nodes_used_collection_shard1_replica2] o.a.s.c.SolrCore [[nodes_used_collection_shard1_replica2] ] Opening new SolrCore at [/x1/jenkins/jenkins-slave/workspace/Lucene-Solr-NightlyTests-6.x/checkout/solr/build/solr-core/test/J0/temp/solr.cloud.hdfs.HdfsCollectionsAPIDistributedZkTest_5D25608316BF2D04-001/tempDir-001/node4/nodes_used_collection_shard1_replica2], dataDir=[hdfs://localhost:41663/data/nodes_used_collection/core_node3/data/]
   [junit4]   2> 1521543 INFO  (qtp1982501886-53882) [n:127.0.0.1:46880_solr c:nodes_used_collection s:shard1  x:nodes_used_collection_shard1_replica2] o.a.s.c.HdfsDirectoryFactory creating directory factory for path hdfs://localhost:41663/data/nodes_used_collection/core_node3/data/snapshot_metadata
   [junit4]   2> 1521543 INFO  (qtp528479911-53905) [n:127.0.0.1:52023_solr c:nodes_used_collection s:shard2  x:nodes_used_collection_shard2_replica1] o.a.s.c.HdfsDirectoryFactory solr.hdfs.home=hdfs://localhost:41663/data
   [junit4]   2> 1521543 INFO  (qtp528479911-53905) [n:127.0.0.1:52023_solr c:nodes_used_collection s:shard2  x:nodes_used_collection_shard2_replica1] o.a.s.c.HdfsDirectoryFactory Solr Kerberos Authentication disabled
   [junit4]   2> 1521543 INFO  (qtp528479911-53905) [n:127.0.0.1:52023_solr c:nodes_used_collection s:shard2  x:nodes_used_collection_shard2_replica1] o.a.s.c.SolrCore [[nodes_used_collection_shard2_replica1] ] Opening new SolrCore at [/x1/jenkins/jenkins-slave/workspace/Lucene-Solr-NightlyTests-6.x/checkout/solr/build/solr-core/test/J0/temp/solr.cloud.hdfs.HdfsCollectionsAPIDistributedZkTest_5D25608316BF2D04-001/tempDir-001/node1/nodes_used_collection_shard2_replica1], dataDir=[hdfs://localhost:41663/data/nodes_used_collection/core_node2/data/]
   [junit4]   2> 1521543 INFO  (qtp528479911-53905) [n:127.0.0.1:52023_solr c:nodes_used_collection s:shard2  x:nodes_used_collection_shard2_replica1] o.a.s.c.HdfsDirectoryFactory creating directory factory for path hdfs://localhost:41663/data/nodes_used_collection/core_node2/data/snapshot_metadata
   [junit4]   2> 1521549 INFO  (qtp1950465760-53893) [n:127.0.0.1:59222_solr c:nodes_used_collection s:shard2  x:nodes_used_collection_shard2_replica2] o.a.s.c.HdfsDirectoryFactory solr.hdfs.home=hdfs://localhost:41663/data
   [junit4]   2> 1521549 INFO  (qtp1950465760-53893) [n:127.0.0.1:59222_solr c:nodes_used_collection s:shard2  x:nodes_used_collection_shard2_replica2] o.a.s.c.HdfsDirectoryFactory Solr Kerberos Authentication disabled
   [junit4]   2> 1521549 INFO  (qtp1950465760-53893) [n:127.0.0.1:59222_solr c:nodes_used_collection s:shard2  x:nodes_used_collection_shard2_replica2] o.a.s.c.SolrCore [[nodes_used_collection_shard2_replica2] ] Opening new SolrCore at [/x1/jenkins/jenkins-slave/workspace/Lucene-Solr-NightlyTests-6.x/checkout/solr/build/solr-core/test/J0/temp/solr.cloud.hdfs.HdfsCollectionsAPIDistributedZkTest_5D25608316BF2D04-001/tempDir-001/node3/nodes_used_collection_shard2_replica2], dataDir=[hdfs://localhost:41663/data/nodes_used_collection/core_node4/data/]
   [junit4]   2> 1521549 INFO  (qtp1950465760-53893) [n:127.0.0.1:59222_solr c:nodes_used_collection s:shard2  x:nodes_used_collection_shard2_replica2] o.a.s.c.HdfsDirectoryFactory creating directory factory for path hdfs://localhost:41663/data/nodes_used_collection/core_node4/data/snapshot_metadata
   [junit4]   2> 1521551 INFO  (qtp1982501886-53882) [n:127.0.0.1:46880_solr c:nodes_used_collection s:shard1  x:nodes_used_collection_shard1_replica2] o.a.s.c.HdfsDirectoryFactory Number of slabs of block cache [1] with direct memory allocation set to [true]
   [junit4]   2> 1521551 INFO  (qtp1982501886-53882) [n:127.0.0.1:46880_solr c:nodes_used_collection s:shard1  x:nodes_used_collection_shard1_replica2] o.a.s.c.HdfsDirectoryFactory Block cache target memory usage, slab size of [16777216] will allocate [1] slabs and use ~[16777216] bytes
   [junit4]   2> 1521562 INFO  (qtp528479911-53905) [n:127.0.0.1:52023_solr c:nodes_used_collection s:shard2  x:nodes_used_collection_shard2_replica1] o.a.s.c.HdfsDirectoryFactory Number of slabs of block cache [1] with direct memory allocation set to [true]
   [junit4]   2> 1521562 INFO  (qtp528479911-53905) [n:127.0.0.1:52023_solr c:nodes_used_collection s:shard2  x:nodes_used_collection_shard2_replica1] o.a.s.c.HdfsDirectoryFactory Block cache target memory usage, slab size of [16777216] will allocate [1] slabs and use ~[16777216] bytes
   [junit4]   2> 1521573 INFO  (qtp1950465760-53893) [n:127.0.0.1:59222_solr c:nodes_used_collection s:shard2  x:nodes_used_collection_shard2_replica2] o.a.s.c.HdfsDirectoryFactory Number of slabs of block cache [1] with direct memory allocation set to [true]
   [junit4]   2> 1521573 INFO  (qtp1950465760-53893) [n:127.0.0.1:59222_solr c:nodes_used_collection s:shard2  x:nodes_used_collection_shard2_replica2] o.a.s.c.HdfsDirectoryFactory Block cache target memory usage, slab size of [16777216] will allocate [1] slabs and use ~[16777216] bytes
   [junit4]   2> 1521842 INFO  (qtp1950465760-53893) [n:127.0.0.1:59222_solr c:nodes_used_collection s:shard2  x:nodes_used_collection_shard2_replica2] o.a.s.s.b.BlockDirectory Block cache on write is disabled
   [junit4]   2> 1521843 INFO  (qtp192093847-53869) [n:127.0.0.1:48149_solr c:nodes_used_collection s:shard1  x:nodes_used_collection_shard1_replica1] o.a.s.s.b.BlockDirectory Block cache on write is disabled
   [junit4]   2> 1521844 INFO  (qtp1982501886-53882) [n:127.0.0.1:46880_solr c:nodes_used_collection s:shard1  x:nodes_used_collection_shard1_replica2] o.a.s.s.b.BlockDirectory Block cache on write is disabled
   [junit4]   2> 1521848 INFO  (qtp1950465760-53893) [n:127.0.0.1:59222_solr c:nodes_used_collection s:shard2  x:nodes_used_collection_shard2_replica2] o.a.s.c.HdfsDirectoryFactory creating directory factory for path hdfs://localhost:41663/data/nodes_used_collection/core_node4/data
   [junit4]   2> 1521844 INFO  (qtp528479911-53905) [n:127.0.0.1:52023_solr c:nodes_used_collection s:shard2  x:nodes_used_collection_shard2_replica1] o.a.s.s.b.BlockDirectory Block cache on write is disabled
   [junit4]   2> 1521850 INFO  (qtp1982501886-53882) [n:127.0.0.1:46880_solr c:nodes_used_collection s:shard1  x:nodes_used_collection_shard1_replica2] o.a.s.c.HdfsDirectoryFactory creating directory factory for path hdfs://localhost:41663/data/nodes_used_collection/core_node3/data
   [junit4]   2> 1521851 INFO  (qtp528479911-53905) [n:127.0.0.1:52023_solr c:nodes_used_collection s:shard2  x:nodes_used_collection_shard2_replica1] o.a.s.c.HdfsDirectoryFactory creating directory factory for path hdfs://localhost:41663/data/nodes_used_collection/core_node2/data
   [junit4]   2> 1521865 INFO  (qtp192093847-53869) [n:127.0.0.1:48149_solr c:nodes_used_collection s:shard1  x:nodes_used_collection_shard1_replica1] o.a.s.c.HdfsDirectoryFactory creating directory factory for path hdfs://localhost:41663/data/nodes_used_collection/core_node1/data
   [junit4]   2> 1521904 INFO  (qtp528479911-53905) [n:127.0.0.1:52023_solr c:nodes_used_collection s:shard2  x:nodes_used_collection_shard2_replica1] o.a.s.c.HdfsDirectoryFactory creating directory factory for path hdfs://localhost:41663/data/nodes_used_collection/core_node2/data/index
   [junit4]   2> 1521908 INFO  (qtp192093847-53869) [n:127.0.0.1:48149_solr c:nodes_used_collection s:shard1  x:nodes_used_collection_shard1_replica1] o.a.s.c.HdfsDirectoryFactory creating directory factory for path hdfs://localhost:41663/data/nodes_used_collection/core_node1/data/index
   [junit4]   2> 1521911 INFO  (qtp528479911-53905) [n:127.0.0.1:52023_solr c:nodes_used_collection s:shard2  x:nodes_used_collection_shard2_replica1] o.a.s.c.HdfsDirectoryFactory Number of slabs of block cache [1] with direct memory allocation set to [true]
   [junit4]   2> 1521911 INFO  (qtp528479911-53905) [n:127.0.0.1:52023_solr c:nodes_used_collection s:shard2  x:nodes_used_collection_shard2_replica1] o.a.s.c.HdfsDirectoryFactory Block cache target memory usage, slab size of [16777216] will allocate [1] slabs and use ~[16777216] bytes
   [junit4]   2> 1521916 INFO  (qtp1982501886-53882) [n:127.0.0.1:46880_solr c:nodes_used_collection s:shard1  x:nodes_used_collection_shard1_replica2] o.a.s.c.HdfsDirectoryFactory creating directory factory for path hdfs://localhost:41663/data/nodes_used_collection/core_node3/data/index
   [junit4]   2> 1521916 INFO  (qtp528479911-53905) [n:127.0.0.1:52023_solr c:nodes_used_collection s:shard2  x:nodes_used_collection_shard2_replica1] o.a.s.s.b.BlockDirectory Block cache on write is disabled
   [junit4]   2> 1521926 INFO  (qtp192093847-53869) [n:127.0.0.1:48149_solr c:nodes_used_collection s:shard1  x:nodes_used_collection_shard1_replica1] o.a.s.c.HdfsDirectoryFactory Number of slabs of block cache [1] with direct memory allocation set to [true]
   [junit4]   2> 1521926 INFO  (qtp192093847-53869) [n:127.0.0.1:48149_solr c:nodes_used_collection s:shard1  x:nodes_used_collection_shard1_replica1] o.a.s.c.HdfsDirectoryFactory Block cache target memory usage, slab size of [16777216] will allocate [1] slabs and use ~[16777216] bytes
   [junit4]   2> 1521931 INFO  (qtp1982501886-53882) [n:127.0.0.1:46880_solr c:nodes_used_collection s:shard1  x:nodes_used_collection_shard1_replica2] o.a.s.c.HdfsDirectoryFactory Number of slabs of block cache [1] with direct memory allocation set to [true]
   [junit4]   2> 1521931 INFO  (qtp1982501886-53882) [n:127.0.0.1:46880_solr c:nodes_used_collection s:shard1  x:nodes_used_collection_shard1_replica2] o.a.s.c.HdfsDirectoryFactory Block cache target memory usage, slab size of 

[...truncated too long message...]

Policy@1ae84a
   [junit4]   2> 4294174 INFO  (coreLoadExecutor-9637-thread-1) [    x:collection1] o.a.s.s.SolrIndexSearcher Opening [Searcher@690d7c97[collection1] main]
   [junit4]   2> 4294175 INFO  (coreLoadExecutor-9637-thread-1) [    x:collection1] o.a.s.h.c.SpellCheckComponent Initializing spell checkers
   [junit4]   2> 4294187 INFO  (coreLoadExecutor-9637-thread-1) [    x:collection1] o.a.s.s.DirectSolrSpellChecker init: {name=direct,classname=DirectSolrSpellChecker,field=lowerfilt,minQueryLength=3}
   [junit4]   2> 4294213 INFO  (coreLoadExecutor-9637-thread-1) [    x:collection1] o.a.s.h.ReplicationHandler Commits will be reserved for  10000
   [junit4]   2> 4294215 INFO  (searcherExecutor-9638-thread-1-processing-x:collection1) [    x:collection1] o.a.s.h.c.SpellCheckComponent Loading spell index for spellchecker: default
   [junit4]   2> 4294215 INFO  (coreLoadExecutor-9637-thread-1) [    x:collection1] o.a.s.u.UpdateLog Could not find max version in index or recent updates, using new clock 1555256009331572736
   [junit4]   2> 4294215 INFO  (searcherExecutor-9638-thread-1-processing-x:collection1) [    x:collection1] o.a.s.h.c.SpellCheckComponent Loading spell index for spellchecker: direct
   [junit4]   2> 4294215 INFO  (searcherExecutor-9638-thread-1-processing-x:collection1) [    x:collection1] o.a.s.h.c.SpellCheckComponent Loading spell index for spellchecker: wordbreak
   [junit4]   2> 4294215 INFO  (searcherExecutor-9638-thread-1-processing-x:collection1) [    x:collection1] o.a.s.h.c.SpellCheckComponent Loading spell index for spellchecker: multipleFields
   [junit4]   2> 4294216 INFO  (searcherExecutor-9638-thread-1-processing-x:collection1) [    x:collection1] o.a.s.h.c.SpellCheckComponent Loading spell index for spellchecker: jarowinkler
   [junit4]   2> 4294216 INFO  (searcherExecutor-9638-thread-1-processing-x:collection1) [    x:collection1] o.a.s.h.c.SpellCheckComponent Loading spell index for spellchecker: external
   [junit4]   2> 4294217 INFO  (searcherExecutor-9638-thread-1-processing-x:collection1) [    x:collection1] o.a.s.h.c.SpellCheckComponent Loading spell index for spellchecker: freq
   [junit4]   2> 4294217 INFO  (searcherExecutor-9638-thread-1-processing-x:collection1) [    x:collection1] o.a.s.h.c.SpellCheckComponent Loading spell index for spellchecker: fqcn
   [junit4]   2> 4294217 INFO  (searcherExecutor-9638-thread-1-processing-x:collection1) [    x:collection1] o.a.s.h.c.SpellCheckComponent Loading spell index for spellchecker: perDict
   [junit4]   2> 4294226 INFO  (searcherExecutor-9638-thread-1-processing-x:collection1) [    x:collection1] o.a.s.c.SolrCore [collection1] Registered new searcher Searcher@690d7c97[collection1] main{ExitableDirectoryReader(UninvertingDirectoryReader())}
   [junit4]   2> 4299226 INFO  (TEST-SolrGangliaReporterTest.testReporter-seed#[5D25608316BF2D04]) [    ] o.a.s.SolrTestCaseJ4 ###Ending testReporter
   [junit4]   2> NOTE: download the large Jenkins line-docs file by running 'ant get-jenkins-line-docs' in the lucene directory.
   [junit4]   2> NOTE: reproduce with: ant test  -Dtestcase=SolrGangliaReporterTest -Dtests.method=testReporter -Dtests.seed=5D25608316BF2D04 -Dtests.multiplier=2 -Dtests.nightly=true -Dtests.slow=true -Dtests.linedocsfile=/home/jenkins/jenkins-slave/workspace/Lucene-Solr-NightlyTests-6.x/test-data/enwiki.random.lines.txt -Dtests.locale=mk -Dtests.timezone=Etc/Zulu -Dtests.asserts=true -Dtests.file.encoding=UTF-8
   [junit4] ERROR   5.28s J1 | SolrGangliaReporterTest.testReporter <<<
   [junit4]    > Throwable #1: java.util.ConcurrentModificationException
   [junit4]    > 	at __randomizedtesting.SeedInfo.seed([5D25608316BF2D04:2C14DB47DB3BE41]:0)
   [junit4]    > 	at java.util.ArrayList$Itr.checkForComodification(ArrayList.java:901)
   [junit4]    > 	at java.util.ArrayList$Itr.next(ArrayList.java:851)
   [junit4]    > 	at org.apache.solr.metrics.reporters.SolrGangliaReporterTest.testReporter(SolrGangliaReporterTest.java:76)
   [junit4]    > 	at java.lang.Thread.run(Thread.java:745)
   [junit4]   2> 4299230 INFO  (SUITE-SolrGangliaReporterTest-seed#[5D25608316BF2D04]-worker) [    ] o.a.s.SolrTestCaseJ4 ###deleteCore
   [junit4]   2> 4299230 INFO  (SUITE-SolrGangliaReporterTest-seed#[5D25608316BF2D04]-worker) [    ] o.a.s.c.CoreContainer Shutting down CoreContainer instance=5379859
   [junit4]   2> 4299231 INFO  (coreCloseExecutor-9643-thread-1) [    x:collection1] o.a.s.c.SolrCore [collection1]  CLOSING SolrCore org.apache.solr.core.SolrCore@3b554223
   [junit4]   2> 4299238 INFO  (coreCloseExecutor-9643-thread-1) [    x:collection1] o.a.s.m.SolrMetricManager Closing metric reporters for: solr.core.collection1
   [junit4]   2> 4299239 INFO  (SUITE-SolrGangliaReporterTest-seed#[5D25608316BF2D04]-worker) [    ] o.a.s.m.SolrMetricManager Closing metric reporters for: solr.node
   [junit4]   2> NOTE: leaving temporary files on disk at: /x1/jenkins/jenkins-slave/workspace/Lucene-Solr-NightlyTests-6.x/checkout/solr/build/solr-core/test/J1/temp/solr.metrics.reporters.SolrGangliaReporterTest_5D25608316BF2D04-001
   [junit4]   2> NOTE: test params are: codec=Asserting(Lucene62): {}, docValues:{}, maxPointsInLeafNode=1771, maxMBSortInHeap=6.943458277904494, sim=RandomSimilarity(queryNorm=true,coord=no): {}, locale=mk, timezone=Etc/Zulu
   [junit4]   2> NOTE: Linux 3.13.0-85-generic amd64/Oracle Corporation 1.8.0_102 (64-bit)/cpus=4,threads=1,free=129804040,total=532676608
   [junit4]   2> NOTE: All tests run in this JVM: [TestNonDefinedSimilarityFactory, CdcrUpdateLogTest, TestCustomStream, CloneFieldUpdateProcessorFactoryTest, SearchHandlerTest, TestDeleteCollectionOnDownNodes, TestSurroundQueryParser, TestUpdate, TestRandomRequestDistribution, TestQuerySenderListener, CachingDirectoryFactoryTest, SpatialFilterTest, ConvertedLegacyTest, DistanceFunctionTest, MoreLikeThisHandlerTest, TestSearchPerf, DistributedTermsComponentTest, VMParamsZkACLAndCredentialsProvidersTest, TestDelegationWithHadoopAuth, DeleteNodeTest, TestBM25SimilarityFactory, TestUseDocValuesAsStored2, CollectionsAPIDistributedZkTest, HdfsRestartWhileUpdatingTest, UpdateRequestProcessorFactoryTest, BasicFunctionalityTest, SpellingQueryConverterTest, BJQParserTest, TestMacroExpander, TestFreeTextSuggestions, TestDefaultSearchFieldResource, TestSuggestSpellingConverter, SuggesterFSTTest, TestQueryTypes, SolrGraphiteReporterTest, IndexSchemaRuntimeFieldTest, MultiThreadedOCPTest, TestPartialUpdateDeduplication, DateMathParserTest, CollectionsAPIAsyncDistributedZkTest, DistribJoinFromCollectionTest, ClassificationUpdateProcessorFactoryTest, DistributedIntervalFacetingTest, DistributedFacetPivotWhiteBoxTest, TestWordDelimiterFilterFactory, BigEndianAscendingWordDeserializerTest, DeleteStatusTest, TestCloudPivotFacet, ShufflingReplicaListTransformerTest, TestSegmentSorting, TestFieldCacheReopen, HdfsChaosMonkeyNothingIsSafeTest, DistributedFacetPivotLongTailTest, TestMiniSolrCloudClusterSSL, ShardRoutingCustomTest, TestUninvertingReader, TestBackupRepositoryFactory, TestRawTransformer, ChaosMonkeySafeLeaderTest, DocValuesNotIndexedTest, LeaderElectionContextKeyTest, DistanceUnitsTest, CoreAdminCreateDiscoverTest, TestSolr4Spatial2, OpenCloseCoreStressTest, CursorMarkTest, TestReqParamsAPI, TestSearcherReuse, DocValuesTest, ZkControllerTest, TestReRankQParserPlugin, SmileWriterTest, BasicAuthIntegrationTest, JsonLoaderTest, TestXmlQParserPlugin, WordBreakSolrSpellCheckerTest, TestLRUCache, TestSQLHandlerNonCloud, TestCloudManagedSchema, TestCSVResponseWriter, SortByFunctionTest, LoggingHandlerTest, TestQueryUtils, TestAnalyzeInfixSuggestions, HttpSolrCallGetCoreTest, TestAuthenticationFramework, TestSimpleTrackingShardHandler, TestTrie, OverseerStatusTest, TestTolerantUpdateProcessorRandomCloud, OverseerCollectionConfigSetProcessorTest, ClusterStateUpdateTest, IndexSchemaTest, FileUtilsTest, TestCoreContainer, MultiTermTest, TestDocBasedVersionConstraints, CopyFieldTest, TestRequestForwarding, SimpleMLTQParserTest, TestFieldCollectionResource, TestJavabinTupleStreamParser, CollectionReloadTest, ExplicitHLLTest, SolrInfoMBeanTest, HdfsTlogReplayBufferedWhileIndexingTest, BlockDirectoryTest, SimplePostToolTest, TestElisionMultitermQuery, ParsingFieldUpdateProcessorsTest, FullSolrCloudDistribCmdsTest, TestHashPartitioner, DistributedSpellCheckComponentTest, TestJoin, TestSolr4Spatial, StatsComponentTest, PeerSyncTest, TestFiltering, HighlighterTest, SoftAutoCommitTest, SpellCheckCollatorTest, SolrRequestParserTest, SuggesterTest, TestStressLucene, NoCacheHeaderTest, SolrCoreCheckLockOnStartupTest, QueryEqualityTest, XsltUpdateRequestHandlerTest, LukeRequestHandlerTest, StandardRequestHandlerTest, DirectSolrSpellCheckerTest, TestReversedWildcardFilterFactory, TermsComponentTest, DocumentBuilderTest, PathHierarchyTokenizerFactoryTest, TestIndexingPerformance, RequiredFieldsTest, RegexBoostProcessorTest, TestJmxIntegration, MBeansHandlerTest, PingRequestHandlerTest, DirectSolrConnectionTest, NotRequiredUniqueKeyTest, SpellPossibilityIteratorTest, TestCharFilters, EchoParamsTest, TestPerFieldSimilarity, TestLMDirichletSimilarityFactory, TestFastOutputStream, URLClassifyProcessorTest, TestSystemIdResolver, DOMUtilTest, TestDocumentBuilder, SystemInfoHandlerTest, CircularListTest, DistributedMLTComponentTest, TestHighlightDedupGrouping, TestJettySolrRunner, AliasIntegrationTest, AsyncCallRequestStatusResponseTest, CdcrReplicationDistributedZkTest, TestTolerantUpdateProcessorCloud, HdfsBasicDistributedZkTest, HdfsThreadLeakTest, HdfsWriteToMultipleCollectionsTest, StressHdfsTest, TestSolrCoreSnapshots, TestRestoreCore, TestSolrConfigHandlerCloud, DistributedSuggestComponentTest, HighlighterMaxOffsetTest, TestUnifiedSolrHighlighter, TestSlowCompositeReaderWrapper, WrapperMergePolicyFactoryTest, JvmMetricsTest, SolrMetricReporterTest, SolrGangliaReporterTest]
   [junit4] Completed [585/675 (4!)] on J1 in 5.30s, 1 test, 1 error <<< FAILURES!

[...truncated 62740 lines...]



Mime
View raw message