lucene-dev mailing list archives

Site index · List index
Message view « Date » · « Thread »
Top « Date » · « Thread »
From Apache Jenkins Server <jenk...@builds.apache.org>
Subject [JENKINS] Lucene-Solr-Tests-6.x - Build # 532 - Still unstable
Date Fri, 11 Nov 2016 00:52:56 GMT
Build: https://builds.apache.org/job/Lucene-Solr-Tests-6.x/532/

1 tests failed.
FAILED:  org.apache.solr.uninverting.TestFieldCacheSort.testFieldScoreReverse

Error Message:
expected:<0> but was:<1>

Stack Trace:
java.lang.AssertionError: expected:<0> but was:<1>
	at __randomizedtesting.SeedInfo.seed([8CC9B7271D1CA412:F70E4C10ECD12E91]:0)
	at org.junit.Assert.fail(Assert.java:93)
	at org.junit.Assert.failNotEquals(Assert.java:647)
	at org.junit.Assert.assertEquals(Assert.java:128)
	at org.junit.Assert.assertEquals(Assert.java:472)
	at org.junit.Assert.assertEquals(Assert.java:456)
	at org.apache.solr.uninverting.TestFieldCacheSort.testFieldScoreReverse(TestFieldCacheSort.java:445)
	at sun.reflect.NativeMethodAccessorImpl.invoke0(Native Method)
	at sun.reflect.NativeMethodAccessorImpl.invoke(NativeMethodAccessorImpl.java:62)
	at sun.reflect.DelegatingMethodAccessorImpl.invoke(DelegatingMethodAccessorImpl.java:43)
	at java.lang.reflect.Method.invoke(Method.java:498)
	at com.carrotsearch.randomizedtesting.RandomizedRunner.invoke(RandomizedRunner.java:1713)
	at com.carrotsearch.randomizedtesting.RandomizedRunner$8.evaluate(RandomizedRunner.java:907)
	at com.carrotsearch.randomizedtesting.RandomizedRunner$9.evaluate(RandomizedRunner.java:943)
	at com.carrotsearch.randomizedtesting.RandomizedRunner$10.evaluate(RandomizedRunner.java:957)
	at org.apache.lucene.util.TestRuleSetupTeardownChained$1.evaluate(TestRuleSetupTeardownChained.java:49)
	at org.apache.lucene.util.AbstractBeforeAfterRule$1.evaluate(AbstractBeforeAfterRule.java:45)
	at org.apache.lucene.util.TestRuleThreadAndTestName$1.evaluate(TestRuleThreadAndTestName.java:48)
	at org.apache.lucene.util.TestRuleIgnoreAfterMaxFailures$1.evaluate(TestRuleIgnoreAfterMaxFailures.java:64)
	at org.apache.lucene.util.TestRuleMarkFailure$1.evaluate(TestRuleMarkFailure.java:47)
	at com.carrotsearch.randomizedtesting.rules.StatementAdapter.evaluate(StatementAdapter.java:36)
	at com.carrotsearch.randomizedtesting.ThreadLeakControl$StatementRunner.run(ThreadLeakControl.java:367)
	at com.carrotsearch.randomizedtesting.ThreadLeakControl.forkTimeoutingTask(ThreadLeakControl.java:811)
	at com.carrotsearch.randomizedtesting.ThreadLeakControl$3.evaluate(ThreadLeakControl.java:462)
	at com.carrotsearch.randomizedtesting.RandomizedRunner.runSingleTest(RandomizedRunner.java:916)
	at com.carrotsearch.randomizedtesting.RandomizedRunner$5.evaluate(RandomizedRunner.java:802)
	at com.carrotsearch.randomizedtesting.RandomizedRunner$6.evaluate(RandomizedRunner.java:852)
	at com.carrotsearch.randomizedtesting.RandomizedRunner$7.evaluate(RandomizedRunner.java:863)
	at org.apache.lucene.util.AbstractBeforeAfterRule$1.evaluate(AbstractBeforeAfterRule.java:45)
	at com.carrotsearch.randomizedtesting.rules.StatementAdapter.evaluate(StatementAdapter.java:36)
	at org.apache.lucene.util.TestRuleStoreClassName$1.evaluate(TestRuleStoreClassName.java:41)
	at com.carrotsearch.randomizedtesting.rules.NoShadowingOrOverridesOnMethodsRule$1.evaluate(NoShadowingOrOverridesOnMethodsRule.java:40)
	at com.carrotsearch.randomizedtesting.rules.NoShadowingOrOverridesOnMethodsRule$1.evaluate(NoShadowingOrOverridesOnMethodsRule.java:40)
	at com.carrotsearch.randomizedtesting.rules.StatementAdapter.evaluate(StatementAdapter.java:36)
	at com.carrotsearch.randomizedtesting.rules.StatementAdapter.evaluate(StatementAdapter.java:36)
	at com.carrotsearch.randomizedtesting.rules.StatementAdapter.evaluate(StatementAdapter.java:36)
	at org.apache.lucene.util.TestRuleAssertionsRequired$1.evaluate(TestRuleAssertionsRequired.java:53)
	at org.apache.lucene.util.TestRuleMarkFailure$1.evaluate(TestRuleMarkFailure.java:47)
	at org.apache.lucene.util.TestRuleIgnoreAfterMaxFailures$1.evaluate(TestRuleIgnoreAfterMaxFailures.java:64)
	at org.apache.lucene.util.TestRuleIgnoreTestSuites$1.evaluate(TestRuleIgnoreTestSuites.java:54)
	at com.carrotsearch.randomizedtesting.rules.StatementAdapter.evaluate(StatementAdapter.java:36)
	at com.carrotsearch.randomizedtesting.ThreadLeakControl$StatementRunner.run(ThreadLeakControl.java:367)
	at java.lang.Thread.run(Thread.java:745)




Build Log:
[...truncated 12667 lines...]
   [junit4] Suite: org.apache.solr.uninverting.TestFieldCacheSort
   [junit4]   2> NOTE: reproduce with: ant test  -Dtestcase=TestFieldCacheSort -Dtests.method=testFieldScoreReverse
-Dtests.seed=8CC9B7271D1CA412 -Dtests.multiplier=2 -Dtests.slow=true -Dtests.locale=es-UY
-Dtests.timezone=Europe/Zurich -Dtests.asserts=true -Dtests.file.encoding=US-ASCII
   [junit4] FAILURE 0.02s J2 | TestFieldCacheSort.testFieldScoreReverse <<<
   [junit4]    > Throwable #1: java.lang.AssertionError: expected:<0> but was:<1>
   [junit4]    > 	at __randomizedtesting.SeedInfo.seed([8CC9B7271D1CA412:F70E4C10ECD12E91]:0)
   [junit4]    > 	at org.apache.solr.uninverting.TestFieldCacheSort.testFieldScoreReverse(TestFieldCacheSort.java:445)
   [junit4]    > 	at java.lang.Thread.run(Thread.java:745)
   [junit4]   2> NOTE: leaving temporary files on disk at: /x1/jenkins/jenkins-slave/workspace/Lucene-Solr-Tests-6.x/solr/build/solr-core/test/J2/temp/solr.uninverting.TestFieldCacheSort_8CC9B7271D1CA412-001
   [junit4]   2> NOTE: test params are: codec=Asserting(Lucene62), sim=RandomSimilarity(queryNorm=true,coord=yes):
{contents=DFR I(ne)BZ(0.3), body=DFR I(ne)2, value=org.apache.lucene.search.similarities.BooleanSimilarity@4a408884},
locale=es-UY, timezone=Europe/Zurich
   [junit4]   2> NOTE: Linux 3.13.0-85-generic amd64/Oracle Corporation 1.8.0_102 (64-bit)/cpus=4,threads=1,free=143842616,total=530055168
   [junit4]   2> NOTE: All tests run in this JVM: [TestHdfsBackupRestoreCore, TestManagedSchemaThreadSafety,
TestFieldCacheSanityChecker, CollectionStateFormat2Test, HardAutoCommitTest, TestConfigSetsAPI,
ResponseLogComponentTest, TestIndexSearcher, RequestHandlersTest, TestPostingsSolrHighlighter,
TestExportWriter, TestSubQueryTransformerCrossCore, SecurityConfHandlerTest, BigEndianAscendingWordDeserializerTest,
TestUseDocValuesAsStored2, DeleteInactiveReplicaTest, DOMUtilTest, SolrXmlInZkTest, OverseerTest,
TestSolr4Spatial2, TestConfigOverlay, TestManagedResourceStorage, BadComponentTest, ShowFileRequestHandlerTest,
CursorMarkTest, BinaryUpdateRequestHandlerTest, TestDownShardTolerantSearch, TestGroupingSearch,
TlogReplayBufferedWhileIndexingTest, DebugComponentTest, TestLFUCache, PrimUtilsTest, CollectionsAPISolrJTest,
TestMissingGroups, TimeZoneUtilsTest, UpdateParamsTest, TestDynamicFieldCollectionResource,
SimpleCollectionCreateDeleteTest, DistributedQueryComponentOptimizationTest, NoCacheHeaderTest,
CdcrBootstrapTest, TestStressLiveNodes, TestShardHandlerFactory, CoreAdminRequestStatusTest,
TestManagedSynonymFilterFactory, XmlUpdateRequestHandlerTest, DistanceUnitsTest, TestLMJelinekMercerSimilarityFactory,
CdcrRequestHandlerTest, TestXIncludeConfig, HttpPartitionTest, TestMinMaxOnMultiValuedField,
SOLR749Test, DocValuesMultiTest, StatsComponentTest, ConnectionManagerTest, TestScoreJoinQPScore,
SolrPluginUtilsTest, TestDFRSimilarityFactory, TestDynamicLoading, TestSolrDeletionPolicy1,
BasicAuthIntegrationTest, TestMacroExpander, SuggestComponentContextFilterQueryTest, TestLeaderElectionWithEmptyReplica,
PeerSyncReplicationTest, OverriddenZkACLAndCredentialsProvidersTest, PreAnalyzedFieldTest,
TestLocalFSCloudBackupRestore, DistributedFacetPivotLargeTest, TestSort, DistribCursorPagingTest,
CoreSorterTest, TestFieldResource, TestReplicaProperties, DeleteReplicaTest, TestBlendedInfixSuggestions,
ResponseHeaderTest, UnloadDistributedZkTest, SimpleFacetsTest, TestDocTermOrds, PluginInfoTest,
FullSolrCloudDistribCmdsTest, BadIndexSchemaTest, TestSchemaNameResource, SolrTestCaseJ4Test,
TestPhraseSuggestions, TestRestoreCore, TestSolrJ, JavabinLoaderTest, HLLUtilTest, LeaderElectionTest,
SpellPossibilityIteratorTest, DistributedQueueTest, TestInitParams, TestCoreDiscovery, TestRecovery,
TestReRankQParserPlugin, SmileWriterTest, TestMergePolicyConfig, TestConfigSets, SmileWriterTest,
TestRealTimeGet, TestStressVersions, SolrCmdDistributorTest, ConvertedLegacyTest, TestBadConfig,
SimplePostToolTest, SignatureUpdateProcessorFactoryTest, CoreAdminHandlerTest, SuggesterTSTTest,
SuggesterTest, TestStressLucene, WordBreakSolrSpellCheckerTest, SolrCoreCheckLockOnStartupTest,
TestUpdate, TestAtomicUpdateErrorCases, DirectUpdateHandlerOptimizeTest, StatelessScriptUpdateProcessorFactoryTest,
IndexBasedSpellCheckerTest, TestQueryUtils, StandardRequestHandlerTest, TestWriterPerf, TestQueryTypes,
TestOmitPositions, PathHierarchyTokenizerFactoryTest, FieldAnalysisRequestHandlerTest, IndexSchemaRuntimeFieldTest,
JSONWriterTest, TestAnalyzedSuggestions, SearchHandlerTest, ExternalFileFieldSortTest, NotRequiredUniqueKeyTest,
TestSweetSpotSimilarityFactory, TestJmxMonitoredMap, TestFastLRUCache, ChaosMonkeyNothingIsSafeTest,
DistribDocExpirationUpdateProcessorTest, LeaderInitiatedRecoveryOnShardRestartTest, MigrateRouteKeyTest,
OverseerTaskQueueTest, ReplaceNodeTest, SharedFSAutoReplicaFailoverTest, TestCloudInspectUtil,
TestCloudPivotFacet, TestClusterProperties, TestConfigSetsAPIExclusivity, TestConfigSetsAPIZkFailure,
TestCryptoKeys, TestExclusionRuleCollectionAccess, TestLeaderInitiatedRecoveryThread, TestLockTree,
TestMiniSolrCloudCluster, TestRandomRequestDistribution, TestRequestForwarding, TestSSLRandomization,
TestShortCircuitedRequests, TestSolrCloudWithKerberosAlt, TriLevelCompositeIdRoutingTest,
HdfsTlogReplayBufferedWhileIndexingTest, HdfsUnloadDistributedZkTest, HdfsWriteToMultipleCollectionsTest,
StressHdfsTest, TestSolrXml, TestSolrCloudSnapshots, TestSolrConfigHandlerConcurrent, CoreAdminCreateDiscoverTest,
CoreMergeIndexesAdminHandlerTest, DistributedDebugComponentTest, DistributedExpandComponentTest,
DistributedFacetPivotSmallTest, TestExpandComponent, TestTrackingShardHandlerFactory, TestGeoJSONResponseWriter,
TestPushWriter, TestRawResponseWriter, TestRawTransformer, TestSolrQueryResponse, TestManagedResource,
TestBulkSchemaAPI, BadCopyFieldTest, ChangedSchemaMergeTest, DateRangeFieldTest, EnumFieldTest,
TestCollationFieldDocValues, TestManagedSchema, TestManagedSchemaAPI, TestSchemaManager, AnalyticsMergeStrategyTest,
RankQueryTest, SortSpecParsingTest, TestAddFieldRealTimeGet, TestComplexPhraseQParserPlugin,
TestFieldSortValues, TestHashQParserPlugin, TestQueryWrapperFilter, TestRecoveryHdfs, TestPKIAuthenticationPlugin,
TestRuleBasedAuthorizationPlugin, ConjunctionSolrSpellCheckerTest, TestHighFrequencyDictionaryFactory,
BlockCacheTest, BufferStoreTest, TestFieldCache, TestFieldCacheReopen, TestFieldCacheSort]
   [junit4] Completed [623/651 (1!)] on J2 in 1.73s, 60 tests, 1 failure <<< FAILURES!

[...truncated 60735 lines...]



Mime
View raw message