lucene-dev mailing list archives

Site index · List index
Message view « Date » · « Thread »
Top « Date » · « Thread »
From Policeman Jenkins Server <jenk...@thetaphi.de>
Subject [JENKINS] Lucene-Solr-master-MacOSX (64bit/jdk1.8.0) - Build # 3670 - Still Unstable!
Date Sat, 26 Nov 2016 02:05:58 GMT
Build: https://jenkins.thetaphi.de/job/Lucene-Solr-master-MacOSX/3670/
Java: 64bit/jdk1.8.0 -XX:+UseCompressedOops -XX:+UseSerialGC

4 tests failed.
FAILED:  org.apache.solr.uima.processor.UIMAUpdateRequestProcessorTest.testTwoUpdates

Error Message:
unknown UpdateRequestProcessorChain: <add><doc><field name="id">1</field><field
name="text">The Apache Software Foundation is happy to announce BarCampApache Sydney, Australia,
the first ASF-backed event in the Southern Hemisphere!</field></doc></add>

Stack Trace:
org.apache.solr.common.SolrException: unknown UpdateRequestProcessorChain: <add><doc><field
name="id">1</field><field name="text">The Apache Software Foundation is happy
to announce BarCampApache Sydney, Australia, the first ASF-backed event in the Southern Hemisphere!</field></doc></add>
	at __randomizedtesting.SeedInfo.seed([E2A9EE1C039AAE77:EFE3B9431BB5CCD9]:0)
	at org.apache.solr.core.SolrCore.getUpdateProcessingChain(SolrCore.java:1214)
	at org.apache.solr.core.SolrCore.getUpdateProcessorChain(SolrCore.java:1222)
	at org.apache.solr.handler.ContentStreamHandlerBase.handleRequestBody(ContentStreamHandlerBase.java:52)
	at org.apache.solr.SolrTestCaseJ4.addDoc(SolrTestCaseJ4.java:1031)
	at org.apache.solr.uima.processor.UIMAUpdateRequestProcessorTest.testTwoUpdates(UIMAUpdateRequestProcessorTest.java:101)
	at sun.reflect.NativeMethodAccessorImpl.invoke0(Native Method)
	at sun.reflect.NativeMethodAccessorImpl.invoke(NativeMethodAccessorImpl.java:62)
	at sun.reflect.DelegatingMethodAccessorImpl.invoke(DelegatingMethodAccessorImpl.java:43)
	at java.lang.reflect.Method.invoke(Method.java:498)
	at com.carrotsearch.randomizedtesting.RandomizedRunner.invoke(RandomizedRunner.java:1713)
	at com.carrotsearch.randomizedtesting.RandomizedRunner$8.evaluate(RandomizedRunner.java:907)
	at com.carrotsearch.randomizedtesting.RandomizedRunner$9.evaluate(RandomizedRunner.java:943)
	at com.carrotsearch.randomizedtesting.RandomizedRunner$10.evaluate(RandomizedRunner.java:957)
	at com.carrotsearch.randomizedtesting.rules.SystemPropertiesRestoreRule$1.evaluate(SystemPropertiesRestoreRule.java:57)
	at org.apache.lucene.util.TestRuleSetupTeardownChained$1.evaluate(TestRuleSetupTeardownChained.java:49)
	at org.apache.lucene.util.AbstractBeforeAfterRule$1.evaluate(AbstractBeforeAfterRule.java:45)
	at org.apache.lucene.util.TestRuleThreadAndTestName$1.evaluate(TestRuleThreadAndTestName.java:48)
	at org.apache.lucene.util.TestRuleIgnoreAfterMaxFailures$1.evaluate(TestRuleIgnoreAfterMaxFailures.java:64)
	at org.apache.lucene.util.TestRuleMarkFailure$1.evaluate(TestRuleMarkFailure.java:47)
	at com.carrotsearch.randomizedtesting.rules.StatementAdapter.evaluate(StatementAdapter.java:36)
	at com.carrotsearch.randomizedtesting.ThreadLeakControl$StatementRunner.run(ThreadLeakControl.java:367)
	at com.carrotsearch.randomizedtesting.ThreadLeakControl.forkTimeoutingTask(ThreadLeakControl.java:811)
	at com.carrotsearch.randomizedtesting.ThreadLeakControl$3.evaluate(ThreadLeakControl.java:462)
	at com.carrotsearch.randomizedtesting.RandomizedRunner.runSingleTest(RandomizedRunner.java:916)
	at com.carrotsearch.randomizedtesting.RandomizedRunner$5.evaluate(RandomizedRunner.java:802)
	at com.carrotsearch.randomizedtesting.RandomizedRunner$6.evaluate(RandomizedRunner.java:852)
	at com.carrotsearch.randomizedtesting.RandomizedRunner$7.evaluate(RandomizedRunner.java:863)
	at com.carrotsearch.randomizedtesting.rules.StatementAdapter.evaluate(StatementAdapter.java:36)
	at com.carrotsearch.randomizedtesting.rules.SystemPropertiesRestoreRule$1.evaluate(SystemPropertiesRestoreRule.java:57)
	at org.apache.lucene.util.AbstractBeforeAfterRule$1.evaluate(AbstractBeforeAfterRule.java:45)
	at com.carrotsearch.randomizedtesting.rules.StatementAdapter.evaluate(StatementAdapter.java:36)
	at org.apache.lucene.util.TestRuleStoreClassName$1.evaluate(TestRuleStoreClassName.java:41)
	at com.carrotsearch.randomizedtesting.rules.NoShadowingOrOverridesOnMethodsRule$1.evaluate(NoShadowingOrOverridesOnMethodsRule.java:40)
	at com.carrotsearch.randomizedtesting.rules.NoShadowingOrOverridesOnMethodsRule$1.evaluate(NoShadowingOrOverridesOnMethodsRule.java:40)
	at com.carrotsearch.randomizedtesting.rules.StatementAdapter.evaluate(StatementAdapter.java:36)
	at com.carrotsearch.randomizedtesting.rules.StatementAdapter.evaluate(StatementAdapter.java:36)
	at com.carrotsearch.randomizedtesting.rules.StatementAdapter.evaluate(StatementAdapter.java:36)
	at org.apache.lucene.util.TestRuleAssertionsRequired$1.evaluate(TestRuleAssertionsRequired.java:53)
	at org.apache.lucene.util.TestRuleMarkFailure$1.evaluate(TestRuleMarkFailure.java:47)
	at org.apache.lucene.util.TestRuleIgnoreAfterMaxFailures$1.evaluate(TestRuleIgnoreAfterMaxFailures.java:64)
	at org.apache.lucene.util.TestRuleIgnoreTestSuites$1.evaluate(TestRuleIgnoreTestSuites.java:54)
	at com.carrotsearch.randomizedtesting.rules.StatementAdapter.evaluate(StatementAdapter.java:36)
	at com.carrotsearch.randomizedtesting.ThreadLeakControl$StatementRunner.run(ThreadLeakControl.java:367)
	at java.lang.Thread.run(Thread.java:745)


FAILED:  org.apache.solr.uima.processor.UIMAUpdateRequestProcessorTest.testMultiplierProcessing

Error Message:
unknown UpdateRequestProcessorChain: <add><doc><field name="id">2312312321312</field><field
name="text">SpellCheckComponent got improvement related to recent Lucene changes.    Add
support for specifying Spelling SuggestWord Comparator to Lucene spell checkers for SpellCheckComponent.
Issue SOLR-2053 is already fixed, patch is attached if you need it, but it is also committed
to trunk and 3_x branch. Last Lucene European Conference has been held in Prague.</field></doc></add>

Stack Trace:
org.apache.solr.common.SolrException: unknown UpdateRequestProcessorChain: <add><doc><field
name="id">2312312321312</field><field name="text">SpellCheckComponent got improvement
related to recent Lucene changes. 
  Add support for specifying Spelling SuggestWord Comparator to Lucene spell checkers for
SpellCheckComponent. Issue SOLR-2053 is already fixed, patch is attached if you need it, but
it is also committed to trunk and 3_x branch. Last Lucene European Conference has been held
in Prague.</field></doc></add>
	at __randomizedtesting.SeedInfo.seed([E2A9EE1C039AAE77:D9A824B104CE8283]:0)
	at org.apache.solr.core.SolrCore.getUpdateProcessingChain(SolrCore.java:1214)
	at org.apache.solr.core.SolrCore.getUpdateProcessorChain(SolrCore.java:1222)
	at org.apache.solr.handler.ContentStreamHandlerBase.handleRequestBody(ContentStreamHandlerBase.java:52)
	at org.apache.solr.SolrTestCaseJ4.addDoc(SolrTestCaseJ4.java:1031)
	at org.apache.solr.uima.processor.UIMAUpdateRequestProcessorTest.testProcessing(UIMAUpdateRequestProcessorTest.java:83)
	at org.apache.solr.uima.processor.UIMAUpdateRequestProcessorTest.testMultiplierProcessing(UIMAUpdateRequestProcessorTest.java:177)
	at sun.reflect.NativeMethodAccessorImpl.invoke0(Native Method)
	at sun.reflect.NativeMethodAccessorImpl.invoke(NativeMethodAccessorImpl.java:62)
	at sun.reflect.DelegatingMethodAccessorImpl.invoke(DelegatingMethodAccessorImpl.java:43)
	at java.lang.reflect.Method.invoke(Method.java:498)
	at com.carrotsearch.randomizedtesting.RandomizedRunner.invoke(RandomizedRunner.java:1713)
	at com.carrotsearch.randomizedtesting.RandomizedRunner$8.evaluate(RandomizedRunner.java:907)
	at com.carrotsearch.randomizedtesting.RandomizedRunner$9.evaluate(RandomizedRunner.java:943)
	at com.carrotsearch.randomizedtesting.RandomizedRunner$10.evaluate(RandomizedRunner.java:957)
	at com.carrotsearch.randomizedtesting.rules.SystemPropertiesRestoreRule$1.evaluate(SystemPropertiesRestoreRule.java:57)
	at org.apache.lucene.util.TestRuleSetupTeardownChained$1.evaluate(TestRuleSetupTeardownChained.java:49)
	at org.apache.lucene.util.AbstractBeforeAfterRule$1.evaluate(AbstractBeforeAfterRule.java:45)
	at org.apache.lucene.util.TestRuleThreadAndTestName$1.evaluate(TestRuleThreadAndTestName.java:48)
	at org.apache.lucene.util.TestRuleIgnoreAfterMaxFailures$1.evaluate(TestRuleIgnoreAfterMaxFailures.java:64)
	at org.apache.lucene.util.TestRuleMarkFailure$1.evaluate(TestRuleMarkFailure.java:47)
	at com.carrotsearch.randomizedtesting.rules.StatementAdapter.evaluate(StatementAdapter.java:36)
	at com.carrotsearch.randomizedtesting.ThreadLeakControl$StatementRunner.run(ThreadLeakControl.java:367)
	at com.carrotsearch.randomizedtesting.ThreadLeakControl.forkTimeoutingTask(ThreadLeakControl.java:811)
	at com.carrotsearch.randomizedtesting.ThreadLeakControl$3.evaluate(ThreadLeakControl.java:462)
	at com.carrotsearch.randomizedtesting.RandomizedRunner.runSingleTest(RandomizedRunner.java:916)
	at com.carrotsearch.randomizedtesting.RandomizedRunner$5.evaluate(RandomizedRunner.java:802)
	at com.carrotsearch.randomizedtesting.RandomizedRunner$6.evaluate(RandomizedRunner.java:852)
	at com.carrotsearch.randomizedtesting.RandomizedRunner$7.evaluate(RandomizedRunner.java:863)
	at com.carrotsearch.randomizedtesting.rules.StatementAdapter.evaluate(StatementAdapter.java:36)
	at com.carrotsearch.randomizedtesting.rules.SystemPropertiesRestoreRule$1.evaluate(SystemPropertiesRestoreRule.java:57)
	at org.apache.lucene.util.AbstractBeforeAfterRule$1.evaluate(AbstractBeforeAfterRule.java:45)
	at com.carrotsearch.randomizedtesting.rules.StatementAdapter.evaluate(StatementAdapter.java:36)
	at org.apache.lucene.util.TestRuleStoreClassName$1.evaluate(TestRuleStoreClassName.java:41)
	at com.carrotsearch.randomizedtesting.rules.NoShadowingOrOverridesOnMethodsRule$1.evaluate(NoShadowingOrOverridesOnMethodsRule.java:40)
	at com.carrotsearch.randomizedtesting.rules.NoShadowingOrOverridesOnMethodsRule$1.evaluate(NoShadowingOrOverridesOnMethodsRule.java:40)
	at com.carrotsearch.randomizedtesting.rules.StatementAdapter.evaluate(StatementAdapter.java:36)
	at com.carrotsearch.randomizedtesting.rules.StatementAdapter.evaluate(StatementAdapter.java:36)
	at com.carrotsearch.randomizedtesting.rules.StatementAdapter.evaluate(StatementAdapter.java:36)
	at org.apache.lucene.util.TestRuleAssertionsRequired$1.evaluate(TestRuleAssertionsRequired.java:53)
	at org.apache.lucene.util.TestRuleMarkFailure$1.evaluate(TestRuleMarkFailure.java:47)
	at org.apache.lucene.util.TestRuleIgnoreAfterMaxFailures$1.evaluate(TestRuleIgnoreAfterMaxFailures.java:64)
	at org.apache.lucene.util.TestRuleIgnoreTestSuites$1.evaluate(TestRuleIgnoreTestSuites.java:54)
	at com.carrotsearch.randomizedtesting.rules.StatementAdapter.evaluate(StatementAdapter.java:36)
	at com.carrotsearch.randomizedtesting.ThreadLeakControl$StatementRunner.run(ThreadLeakControl.java:367)
	at java.lang.Thread.run(Thread.java:745)


FAILED:  org.apache.solr.uima.processor.UIMAUpdateRequestProcessorTest.testProcessing

Error Message:
unknown UpdateRequestProcessorChain: <add><doc><field name="id">2312312321312</field><field
name="text">SpellCheckComponent got improvement related to recent Lucene changes.    Add
support for specifying Spelling SuggestWord Comparator to Lucene spell checkers for SpellCheckComponent.
Issue SOLR-2053 is already fixed, patch is attached if you need it, but it is also committed
to trunk and 3_x branch. Last Lucene European Conference has been held in Prague.</field></doc></add>

Stack Trace:
org.apache.solr.common.SolrException: unknown UpdateRequestProcessorChain: <add><doc><field
name="id">2312312321312</field><field name="text">SpellCheckComponent got improvement
related to recent Lucene changes. 
  Add support for specifying Spelling SuggestWord Comparator to Lucene spell checkers for
SpellCheckComponent. Issue SOLR-2053 is already fixed, patch is attached if you need it, but
it is also committed to trunk and 3_x branch. Last Lucene European Conference has been held
in Prague.</field></doc></add>
	at __randomizedtesting.SeedInfo.seed([E2A9EE1C039AAE77:F127EA6E44692FDD]:0)
	at org.apache.solr.core.SolrCore.getUpdateProcessingChain(SolrCore.java:1214)
	at org.apache.solr.core.SolrCore.getUpdateProcessorChain(SolrCore.java:1222)
	at org.apache.solr.handler.ContentStreamHandlerBase.handleRequestBody(ContentStreamHandlerBase.java:52)
	at org.apache.solr.SolrTestCaseJ4.addDoc(SolrTestCaseJ4.java:1031)
	at org.apache.solr.uima.processor.UIMAUpdateRequestProcessorTest.testProcessing(UIMAUpdateRequestProcessorTest.java:83)
	at sun.reflect.NativeMethodAccessorImpl.invoke0(Native Method)
	at sun.reflect.NativeMethodAccessorImpl.invoke(NativeMethodAccessorImpl.java:62)
	at sun.reflect.DelegatingMethodAccessorImpl.invoke(DelegatingMethodAccessorImpl.java:43)
	at java.lang.reflect.Method.invoke(Method.java:498)
	at com.carrotsearch.randomizedtesting.RandomizedRunner.invoke(RandomizedRunner.java:1713)
	at com.carrotsearch.randomizedtesting.RandomizedRunner$8.evaluate(RandomizedRunner.java:907)
	at com.carrotsearch.randomizedtesting.RandomizedRunner$9.evaluate(RandomizedRunner.java:943)
	at com.carrotsearch.randomizedtesting.RandomizedRunner$10.evaluate(RandomizedRunner.java:957)
	at com.carrotsearch.randomizedtesting.rules.SystemPropertiesRestoreRule$1.evaluate(SystemPropertiesRestoreRule.java:57)
	at org.apache.lucene.util.TestRuleSetupTeardownChained$1.evaluate(TestRuleSetupTeardownChained.java:49)
	at org.apache.lucene.util.AbstractBeforeAfterRule$1.evaluate(AbstractBeforeAfterRule.java:45)
	at org.apache.lucene.util.TestRuleThreadAndTestName$1.evaluate(TestRuleThreadAndTestName.java:48)
	at org.apache.lucene.util.TestRuleIgnoreAfterMaxFailures$1.evaluate(TestRuleIgnoreAfterMaxFailures.java:64)
	at org.apache.lucene.util.TestRuleMarkFailure$1.evaluate(TestRuleMarkFailure.java:47)
	at com.carrotsearch.randomizedtesting.rules.StatementAdapter.evaluate(StatementAdapter.java:36)
	at com.carrotsearch.randomizedtesting.ThreadLeakControl$StatementRunner.run(ThreadLeakControl.java:367)
	at com.carrotsearch.randomizedtesting.ThreadLeakControl.forkTimeoutingTask(ThreadLeakControl.java:811)
	at com.carrotsearch.randomizedtesting.ThreadLeakControl$3.evaluate(ThreadLeakControl.java:462)
	at com.carrotsearch.randomizedtesting.RandomizedRunner.runSingleTest(RandomizedRunner.java:916)
	at com.carrotsearch.randomizedtesting.RandomizedRunner$5.evaluate(RandomizedRunner.java:802)
	at com.carrotsearch.randomizedtesting.RandomizedRunner$6.evaluate(RandomizedRunner.java:852)
	at com.carrotsearch.randomizedtesting.RandomizedRunner$7.evaluate(RandomizedRunner.java:863)
	at com.carrotsearch.randomizedtesting.rules.StatementAdapter.evaluate(StatementAdapter.java:36)
	at com.carrotsearch.randomizedtesting.rules.SystemPropertiesRestoreRule$1.evaluate(SystemPropertiesRestoreRule.java:57)
	at org.apache.lucene.util.AbstractBeforeAfterRule$1.evaluate(AbstractBeforeAfterRule.java:45)
	at com.carrotsearch.randomizedtesting.rules.StatementAdapter.evaluate(StatementAdapter.java:36)
	at org.apache.lucene.util.TestRuleStoreClassName$1.evaluate(TestRuleStoreClassName.java:41)
	at com.carrotsearch.randomizedtesting.rules.NoShadowingOrOverridesOnMethodsRule$1.evaluate(NoShadowingOrOverridesOnMethodsRule.java:40)
	at com.carrotsearch.randomizedtesting.rules.NoShadowingOrOverridesOnMethodsRule$1.evaluate(NoShadowingOrOverridesOnMethodsRule.java:40)
	at com.carrotsearch.randomizedtesting.rules.StatementAdapter.evaluate(StatementAdapter.java:36)
	at com.carrotsearch.randomizedtesting.rules.StatementAdapter.evaluate(StatementAdapter.java:36)
	at com.carrotsearch.randomizedtesting.rules.StatementAdapter.evaluate(StatementAdapter.java:36)
	at org.apache.lucene.util.TestRuleAssertionsRequired$1.evaluate(TestRuleAssertionsRequired.java:53)
	at org.apache.lucene.util.TestRuleMarkFailure$1.evaluate(TestRuleMarkFailure.java:47)
	at org.apache.lucene.util.TestRuleIgnoreAfterMaxFailures$1.evaluate(TestRuleIgnoreAfterMaxFailures.java:64)
	at org.apache.lucene.util.TestRuleIgnoreTestSuites$1.evaluate(TestRuleIgnoreTestSuites.java:54)
	at com.carrotsearch.randomizedtesting.rules.StatementAdapter.evaluate(StatementAdapter.java:36)
	at com.carrotsearch.randomizedtesting.ThreadLeakControl$StatementRunner.run(ThreadLeakControl.java:367)
	at java.lang.Thread.run(Thread.java:745)


FAILED:  org.apache.solr.uima.processor.UIMAUpdateRequestProcessorTest.testErrorHandling

Error Message:
unknown UpdateRequestProcessorChain: <add><doc><field name="id">2312312321312</field><field
name="text">SpellCheckComponent got improvement related to recent Lucene changes.    Add
support for specifying Spelling SuggestWord Comparator to Lucene spell checkers for SpellCheckComponent.
Issue SOLR-2053 is already fixed, patch is attached if you need it, but it is also committed
to trunk and 3_x branch. Last Lucene European Conference has been held in Prague.</field></doc></add>

Stack Trace:
org.apache.solr.common.SolrException: unknown UpdateRequestProcessorChain: <add><doc><field
name="id">2312312321312</field><field name="text">SpellCheckComponent got improvement
related to recent Lucene changes. 
  Add support for specifying Spelling SuggestWord Comparator to Lucene spell checkers for
SpellCheckComponent. Issue SOLR-2053 is already fixed, patch is attached if you need it, but
it is also committed to trunk and 3_x branch. Last Lucene European Conference has been held
in Prague.</field></doc></add>
	at __randomizedtesting.SeedInfo.seed([E2A9EE1C039AAE77:D75D9022554C2FA3]:0)
	at org.apache.solr.core.SolrCore.getUpdateProcessingChain(SolrCore.java:1214)
	at org.apache.solr.core.SolrCore.getUpdateProcessorChain(SolrCore.java:1222)
	at org.apache.solr.handler.ContentStreamHandlerBase.handleRequestBody(ContentStreamHandlerBase.java:52)
	at org.apache.solr.SolrTestCaseJ4.addDoc(SolrTestCaseJ4.java:1031)
	at org.apache.solr.uima.processor.UIMAUpdateRequestProcessorTest.testErrorHandling(UIMAUpdateRequestProcessorTest.java:137)
	at sun.reflect.NativeMethodAccessorImpl.invoke0(Native Method)
	at sun.reflect.NativeMethodAccessorImpl.invoke(NativeMethodAccessorImpl.java:62)
	at sun.reflect.DelegatingMethodAccessorImpl.invoke(DelegatingMethodAccessorImpl.java:43)
	at java.lang.reflect.Method.invoke(Method.java:498)
	at com.carrotsearch.randomizedtesting.RandomizedRunner.invoke(RandomizedRunner.java:1713)
	at com.carrotsearch.randomizedtesting.RandomizedRunner$8.evaluate(RandomizedRunner.java:907)
	at com.carrotsearch.randomizedtesting.RandomizedRunner$9.evaluate(RandomizedRunner.java:943)
	at com.carrotsearch.randomizedtesting.RandomizedRunner$10.evaluate(RandomizedRunner.java:957)
	at com.carrotsearch.randomizedtesting.rules.SystemPropertiesRestoreRule$1.evaluate(SystemPropertiesRestoreRule.java:57)
	at org.apache.lucene.util.TestRuleSetupTeardownChained$1.evaluate(TestRuleSetupTeardownChained.java:49)
	at org.apache.lucene.util.AbstractBeforeAfterRule$1.evaluate(AbstractBeforeAfterRule.java:45)
	at org.apache.lucene.util.TestRuleThreadAndTestName$1.evaluate(TestRuleThreadAndTestName.java:48)
	at org.apache.lucene.util.TestRuleIgnoreAfterMaxFailures$1.evaluate(TestRuleIgnoreAfterMaxFailures.java:64)
	at org.apache.lucene.util.TestRuleMarkFailure$1.evaluate(TestRuleMarkFailure.java:47)
	at com.carrotsearch.randomizedtesting.rules.StatementAdapter.evaluate(StatementAdapter.java:36)
	at com.carrotsearch.randomizedtesting.ThreadLeakControl$StatementRunner.run(ThreadLeakControl.java:367)
	at com.carrotsearch.randomizedtesting.ThreadLeakControl.forkTimeoutingTask(ThreadLeakControl.java:811)
	at com.carrotsearch.randomizedtesting.ThreadLeakControl$3.evaluate(ThreadLeakControl.java:462)
	at com.carrotsearch.randomizedtesting.RandomizedRunner.runSingleTest(RandomizedRunner.java:916)
	at com.carrotsearch.randomizedtesting.RandomizedRunner$5.evaluate(RandomizedRunner.java:802)
	at com.carrotsearch.randomizedtesting.RandomizedRunner$6.evaluate(RandomizedRunner.java:852)
	at com.carrotsearch.randomizedtesting.RandomizedRunner$7.evaluate(RandomizedRunner.java:863)
	at com.carrotsearch.randomizedtesting.rules.StatementAdapter.evaluate(StatementAdapter.java:36)
	at com.carrotsearch.randomizedtesting.rules.SystemPropertiesRestoreRule$1.evaluate(SystemPropertiesRestoreRule.java:57)
	at org.apache.lucene.util.AbstractBeforeAfterRule$1.evaluate(AbstractBeforeAfterRule.java:45)
	at com.carrotsearch.randomizedtesting.rules.StatementAdapter.evaluate(StatementAdapter.java:36)
	at org.apache.lucene.util.TestRuleStoreClassName$1.evaluate(TestRuleStoreClassName.java:41)
	at com.carrotsearch.randomizedtesting.rules.NoShadowingOrOverridesOnMethodsRule$1.evaluate(NoShadowingOrOverridesOnMethodsRule.java:40)
	at com.carrotsearch.randomizedtesting.rules.NoShadowingOrOverridesOnMethodsRule$1.evaluate(NoShadowingOrOverridesOnMethodsRule.java:40)
	at com.carrotsearch.randomizedtesting.rules.StatementAdapter.evaluate(StatementAdapter.java:36)
	at com.carrotsearch.randomizedtesting.rules.StatementAdapter.evaluate(StatementAdapter.java:36)
	at com.carrotsearch.randomizedtesting.rules.StatementAdapter.evaluate(StatementAdapter.java:36)
	at org.apache.lucene.util.TestRuleAssertionsRequired$1.evaluate(TestRuleAssertionsRequired.java:53)
	at org.apache.lucene.util.TestRuleMarkFailure$1.evaluate(TestRuleMarkFailure.java:47)
	at org.apache.lucene.util.TestRuleIgnoreAfterMaxFailures$1.evaluate(TestRuleIgnoreAfterMaxFailures.java:64)
	at org.apache.lucene.util.TestRuleIgnoreTestSuites$1.evaluate(TestRuleIgnoreTestSuites.java:54)
	at com.carrotsearch.randomizedtesting.rules.StatementAdapter.evaluate(StatementAdapter.java:36)
	at com.carrotsearch.randomizedtesting.ThreadLeakControl$StatementRunner.run(ThreadLeakControl.java:367)
	at java.lang.Thread.run(Thread.java:745)




Build Log:
[...truncated 23899 lines...]
   [junit4] Suite: org.apache.solr.uima.processor.UIMAUpdateRequestProcessorTest
   [junit4]   2> Creating dataDir: /Users/jenkins/workspace/Lucene-Solr-master-MacOSX/solr/build/contrib/solr-uima/test/J0/temp/solr.uima.processor.UIMAUpdateRequestProcessorTest_E2A9EE1C039AAE77-001/init-core-data-001
   [junit4]   2> log4j:WARN No appenders could be found for logger (org.eclipse.jetty.util.log).
   [junit4]   2> log4j:WARN Please initialize the log4j system properly.
   [junit4]   2> log4j:WARN See http://logging.apache.org/log4j/1.2/faq.html#noconfig for
more info.
   [junit4]   2> nov 25, 2016 6:52:21 PM WhitespaceTokenizer initialize
   [junit4]   2> INFORMACI?N: "Whitespace tokenizer successfully initialized"
   [junit4]   2> NOTE: reproduce with: ant test  -Dtestcase=UIMAUpdateRequestProcessorTest
-Dtests.method=testTwoUpdates -Dtests.seed=E2A9EE1C039AAE77 -Dtests.slow=true -Dtests.locale=es
-Dtests.timezone=America/Edmonton -Dtests.asserts=true -Dtests.file.encoding=US-ASCII
   [junit4] ERROR   9.78s J0 | UIMAUpdateRequestProcessorTest.testTwoUpdates <<<
   [junit4]    > Throwable #1: org.apache.solr.common.SolrException: unknown UpdateRequestProcessorChain:
<add><doc><field name="id">1</field><field name="text">The Apache
Software Foundation is happy to announce BarCampApache Sydney, Australia, the first ASF-backed
event in the Southern Hemisphere!</field></doc></add>
   [junit4]    > 	at __randomizedtesting.SeedInfo.seed([E2A9EE1C039AAE77:EFE3B9431BB5CCD9]:0)
   [junit4]    > 	at org.apache.solr.core.SolrCore.getUpdateProcessingChain(SolrCore.java:1214)
   [junit4]    > 	at org.apache.solr.core.SolrCore.getUpdateProcessorChain(SolrCore.java:1222)
   [junit4]    > 	at org.apache.solr.handler.ContentStreamHandlerBase.handleRequestBody(ContentStreamHandlerBase.java:52)
   [junit4]    > 	at org.apache.solr.SolrTestCaseJ4.addDoc(SolrTestCaseJ4.java:1031)
   [junit4]    > 	at org.apache.solr.uima.processor.UIMAUpdateRequestProcessorTest.testTwoUpdates(UIMAUpdateRequestProcessorTest.java:101)
   [junit4]    > 	at java.lang.Thread.run(Thread.java:745)
   [junit4]   2> nov 25, 2016 6:52:28 PM WhitespaceTokenizer initialize
   [junit4]   2> INFORMACI?N: "Whitespace tokenizer successfully initialized"
   [junit4]   2> NOTE: reproduce with: ant test  -Dtestcase=UIMAUpdateRequestProcessorTest
-Dtests.method=testMultiplierProcessing -Dtests.seed=E2A9EE1C039AAE77 -Dtests.slow=true -Dtests.locale=es
-Dtests.timezone=America/Edmonton -Dtests.asserts=true -Dtests.file.encoding=US-ASCII
   [junit4] ERROR   0.02s J0 | UIMAUpdateRequestProcessorTest.testMultiplierProcessing <<<
   [junit4]    > Throwable #1: org.apache.solr.common.SolrException: unknown UpdateRequestProcessorChain:
<add><doc><field name="id">2312312321312</field><field name="text">SpellCheckComponent
got improvement related to recent Lucene changes. 
   [junit4]    >   Add support for specifying Spelling SuggestWord Comparator to Lucene
spell checkers for SpellCheckComponent. Issue SOLR-2053 is already fixed, patch is attached
if you need it, but it is also committed to trunk and 3_x branch. Last Lucene European Conference
has been held in Prague.</field></doc></add>
   [junit4]    > 	at __randomizedtesting.SeedInfo.seed([E2A9EE1C039AAE77:D9A824B104CE8283]:0)
   [junit4]    > 	at org.apache.solr.core.SolrCore.getUpdateProcessingChain(SolrCore.java:1214)
   [junit4]    > 	at org.apache.solr.core.SolrCore.getUpdateProcessorChain(SolrCore.java:1222)
   [junit4]    > 	at org.apache.solr.handler.ContentStreamHandlerBase.handleRequestBody(ContentStreamHandlerBase.java:52)
   [junit4]    > 	at org.apache.solr.SolrTestCaseJ4.addDoc(SolrTestCaseJ4.java:1031)
   [junit4]    > 	at org.apache.solr.uima.processor.UIMAUpdateRequestProcessorTest.testProcessing(UIMAUpdateRequestProcessorTest.java:83)
   [junit4]    > 	at org.apache.solr.uima.processor.UIMAUpdateRequestProcessorTest.testMultiplierProcessing(UIMAUpdateRequestProcessorTest.java:177)
   [junit4]    > 	at java.lang.Thread.run(Thread.java:745)
   [junit4]   2> NOTE: reproduce with: ant test  -Dtestcase=UIMAUpdateRequestProcessorTest
-Dtests.method=testProcessing -Dtests.seed=E2A9EE1C039AAE77 -Dtests.slow=true -Dtests.locale=es
-Dtests.timezone=America/Edmonton -Dtests.asserts=true -Dtests.file.encoding=US-ASCII
   [junit4] ERROR   0.01s J0 | UIMAUpdateRequestProcessorTest.testProcessing <<<
   [junit4]    > Throwable #1: org.apache.solr.common.SolrException: unknown UpdateRequestProcessorChain:
<add><doc><field name="id">2312312321312</field><field name="text">SpellCheckComponent
got improvement related to recent Lucene changes. 
   [junit4]    >   Add support for specifying Spelling SuggestWord Comparator to Lucene
spell checkers for SpellCheckComponent. Issue SOLR-2053 is already fixed, patch is attached
if you need it, but it is also committed to trunk and 3_x branch. Last Lucene European Conference
has been held in Prague.</field></doc></add>
   [junit4]    > 	at __randomizedtesting.SeedInfo.seed([E2A9EE1C039AAE77:F127EA6E44692FDD]:0)
   [junit4]    > 	at org.apache.solr.core.SolrCore.getUpdateProcessingChain(SolrCore.java:1214)
   [junit4]    > 	at org.apache.solr.core.SolrCore.getUpdateProcessorChain(SolrCore.java:1222)
   [junit4]    > 	at org.apache.solr.handler.ContentStreamHandlerBase.handleRequestBody(ContentStreamHandlerBase.java:52)
   [junit4]    > 	at org.apache.solr.SolrTestCaseJ4.addDoc(SolrTestCaseJ4.java:1031)
   [junit4]    > 	at org.apache.solr.uima.processor.UIMAUpdateRequestProcessorTest.testProcessing(UIMAUpdateRequestProcessorTest.java:83)
   [junit4]    > 	at java.lang.Thread.run(Thread.java:745)
   [junit4]   2> NOTE: reproduce with: ant test  -Dtestcase=UIMAUpdateRequestProcessorTest
-Dtests.method=testErrorHandling -Dtests.seed=E2A9EE1C039AAE77 -Dtests.slow=true -Dtests.locale=es
-Dtests.timezone=America/Edmonton -Dtests.asserts=true -Dtests.file.encoding=US-ASCII
   [junit4] ERROR   0.02s J0 | UIMAUpdateRequestProcessorTest.testErrorHandling <<<
   [junit4]    > Throwable #1: org.apache.solr.common.SolrException: unknown UpdateRequestProcessorChain:
<add><doc><field name="id">2312312321312</field><field name="text">SpellCheckComponent
got improvement related to recent Lucene changes. 
   [junit4]    >   Add support for specifying Spelling SuggestWord Comparator to Lucene
spell checkers for SpellCheckComponent. Issue SOLR-2053 is already fixed, patch is attached
if you need it, but it is also committed to trunk and 3_x branch. Last Lucene European Conference
has been held in Prague.</field></doc></add>
   [junit4]    > 	at __randomizedtesting.SeedInfo.seed([E2A9EE1C039AAE77:D75D9022554C2FA3]:0)
   [junit4]    > 	at org.apache.solr.core.SolrCore.getUpdateProcessingChain(SolrCore.java:1214)
   [junit4]    > 	at org.apache.solr.core.SolrCore.getUpdateProcessorChain(SolrCore.java:1222)
   [junit4]    > 	at org.apache.solr.handler.ContentStreamHandlerBase.handleRequestBody(ContentStreamHandlerBase.java:52)
   [junit4]    > 	at org.apache.solr.SolrTestCaseJ4.addDoc(SolrTestCaseJ4.java:1031)
   [junit4]    > 	at org.apache.solr.uima.processor.UIMAUpdateRequestProcessorTest.testErrorHandling(UIMAUpdateRequestProcessorTest.java:137)
   [junit4]    > 	at java.lang.Thread.run(Thread.java:745)
   [junit4]   2> NOTE: leaving temporary files on disk at: /Users/jenkins/workspace/Lucene-Solr-master-MacOSX/solr/build/contrib/solr-uima/test/J0/temp/solr.uima.processor.UIMAUpdateRequestProcessorTest_E2A9EE1C039AAE77-001
   [junit4]   2> NOTE: test params are: codec=Asserting(Lucene70): {}, docValues:{}, maxPointsInLeafNode=690,
maxMBSortInHeap=7.33750002837186, sim=RandomSimilarity(queryNorm=false): {}, locale=es, timezone=America/Edmonton
   [junit4]   2> NOTE: Mac OS X 10.11.6 x86_64/Oracle Corporation 1.8.0_102 (64-bit)/cpus=3,threads=1,free=141395448,total=354775040
   [junit4]   2> NOTE: All tests run in this JVM: [UIMAUpdateRequestProcessorTest]
   [junit4] Completed [2/2 (1!)] on J0 in 27.60s, 6 tests, 4 errors <<< FAILURES!

[...truncated 51249 lines...]


Mime
View raw message