lucene-dev mailing list archives

Site index · List index
Message view « Date » · « Thread »
Top « Date » · « Thread »
From Policeman Jenkins Server <jenk...@thetaphi.de>
Subject [JENKINS] Lucene-Solr-master-Windows (64bit/jdk1.8.0_102) - Build # 6227 - Still Unstable!
Date Thu, 17 Nov 2016 21:51:40 GMT
Build: https://jenkins.thetaphi.de/job/Lucene-Solr-master-Windows/6227/
Java: 64bit/jdk1.8.0_102 -XX:-UseCompressedOops -XX:+UseConcMarkSweepGC

1 tests failed.
FAILED:  org.apache.solr.handler.admin.CoreAdminHandlerTest.testDeleteInstanceDirAfterCreateFailure

Error Message:
The data directory was not cleaned up on unload after a failed core reload

Stack Trace:
java.lang.AssertionError: The data directory was not cleaned up on unload after a failed core reload
	at __randomizedtesting.SeedInfo.seed([6F883A3AE5716BD7:14419876C653B9D6]:0)
	at org.junit.Assert.fail(Assert.java:93)
	at org.junit.Assert.assertTrue(Assert.java:43)
	at org.apache.solr.handler.admin.CoreAdminHandlerTest.testDeleteInstanceDirAfterCreateFailure(CoreAdminHandlerTest.java:334)
	at sun.reflect.NativeMethodAccessorImpl.invoke0(Native Method)
	at sun.reflect.NativeMethodAccessorImpl.invoke(NativeMethodAccessorImpl.java:62)
	at sun.reflect.DelegatingMethodAccessorImpl.invoke(DelegatingMethodAccessorImpl.java:43)
	at java.lang.reflect.Method.invoke(Method.java:498)
	at com.carrotsearch.randomizedtesting.RandomizedRunner.invoke(RandomizedRunner.java:1713)
	at com.carrotsearch.randomizedtesting.RandomizedRunner$8.evaluate(RandomizedRunner.java:907)
	at com.carrotsearch.randomizedtesting.RandomizedRunner$9.evaluate(RandomizedRunner.java:943)
	at com.carrotsearch.randomizedtesting.RandomizedRunner$10.evaluate(RandomizedRunner.java:957)
	at com.carrotsearch.randomizedtesting.rules.SystemPropertiesRestoreRule$1.evaluate(SystemPropertiesRestoreRule.java:57)
	at org.apache.lucene.util.TestRuleSetupTeardownChained$1.evaluate(TestRuleSetupTeardownChained.java:49)
	at org.apache.lucene.util.AbstractBeforeAfterRule$1.evaluate(AbstractBeforeAfterRule.java:45)
	at org.apache.lucene.util.TestRuleThreadAndTestName$1.evaluate(TestRuleThreadAndTestName.java:48)
	at org.apache.lucene.util.TestRuleIgnoreAfterMaxFailures$1.evaluate(TestRuleIgnoreAfterMaxFailures.java:64)
	at org.apache.lucene.util.TestRuleMarkFailure$1.evaluate(TestRuleMarkFailure.java:47)
	at com.carrotsearch.randomizedtesting.rules.StatementAdapter.evaluate(StatementAdapter.java:36)
	at com.carrotsearch.randomizedtesting.ThreadLeakControl$StatementRunner.run(ThreadLeakControl.java:367)
	at com.carrotsearch.randomizedtesting.ThreadLeakControl.forkTimeoutingTask(ThreadLeakControl.java:811)
	at com.carrotsearch.randomizedtesting.ThreadLeakControl$3.evaluate(ThreadLeakControl.java:462)
	at com.carrotsearch.randomizedtesting.RandomizedRunner.runSingleTest(RandomizedRunner.java:916)
	at com.carrotsearch.randomizedtesting.RandomizedRunner$5.evaluate(RandomizedRunner.java:802)
	at com.carrotsearch.randomizedtesting.RandomizedRunner$6.evaluate(RandomizedRunner.java:852)
	at com.carrotsearch.randomizedtesting.RandomizedRunner$7.evaluate(RandomizedRunner.java:863)
	at com.carrotsearch.randomizedtesting.rules.StatementAdapter.evaluate(StatementAdapter.java:36)
	at com.carrotsearch.randomizedtesting.rules.SystemPropertiesRestoreRule$1.evaluate(SystemPropertiesRestoreRule.java:57)
	at org.apache.lucene.util.AbstractBeforeAfterRule$1.evaluate(AbstractBeforeAfterRule.java:45)
	at com.carrotsearch.randomizedtesting.rules.StatementAdapter.evaluate(StatementAdapter.java:36)
	at org.apache.lucene.util.TestRuleStoreClassName$1.evaluate(TestRuleStoreClassName.java:41)
	at com.carrotsearch.randomizedtesting.rules.NoShadowingOrOverridesOnMethodsRule$1.evaluate(NoShadowingOrOverridesOnMethodsRule.java:40)
	at com.carrotsearch.randomizedtesting.rules.NoShadowingOrOverridesOnMethodsRule$1.evaluate(NoShadowingOrOverridesOnMethodsRule.java:40)
	at com.carrotsearch.randomizedtesting.rules.StatementAdapter.evaluate(StatementAdapter.java:36)
	at com.carrotsearch.randomizedtesting.rules.StatementAdapter.evaluate(StatementAdapter.java:36)
	at com.carrotsearch.randomizedtesting.rules.StatementAdapter.evaluate(StatementAdapter.java:36)
	at org.apache.lucene.util.TestRuleAssertionsRequired$1.evaluate(TestRuleAssertionsRequired.java:53)
	at org.apache.lucene.util.TestRuleMarkFailure$1.evaluate(TestRuleMarkFailure.java:47)
	at org.apache.lucene.util.TestRuleIgnoreAfterMaxFailures$1.evaluate(TestRuleIgnoreAfterMaxFailures.java:64)
	at org.apache.lucene.util.TestRuleIgnoreTestSuites$1.evaluate(TestRuleIgnoreTestSuites.java:54)
	at com.carrotsearch.randomizedtesting.rules.StatementAdapter.evaluate(StatementAdapter.java:36)
	at com.carrotsearch.randomizedtesting.ThreadLeakControl$StatementRunner.run(ThreadLeakControl.java:367)
	at java.lang.Thread.run(Thread.java:745)




Build Log:
[...truncated 11215 lines...]
   [junit4] Suite: org.apache.solr.handler.admin.CoreAdminHandlerTest
   [junit4]   2> Creating dataDir: C:\Users\jenkins\workspace\Lucene-Solr-master-Windows\solr\build\solr-core\test\J1\temp\solr.handler.admin.CoreAdminHandlerTest_6F883A3AE5716BD7-001\init-core-data-001
   [junit4]   2> 1327702 INFO  (SUITE-CoreAdminHandlerTest-seed#[6F883A3AE5716BD7]-worker) [    ] o.a.s.SolrTestCaseJ4 Randomized ssl (false) and clientAuth (false) via: @org.apache.solr.util.RandomizeSSL(reason=, value=NaN, ssl=NaN, clientAuth=NaN)
   [junit4]   2> 1327703 INFO  (SUITE-CoreAdminHandlerTest-seed#[6F883A3AE5716BD7]-worker) [    ] o.a.s.SolrTestCaseJ4 ####initCore
   [junit4]   2> 1327704 INFO  (SUITE-CoreAdminHandlerTest-seed#[6F883A3AE5716BD7]-worker) [    ] o.a.s.c.SolrResourceLoader [null] Added 2 libs to classloader, from paths: [/C:/Users/jenkins/workspace/Lucene-Solr-master-Windows/solr/core/src/test-files/solr/collection1/lib, /C:/Users/jenkins/workspace/Lucene-Solr-master-Windows/solr/core/src/test-files/solr/collection1/lib/classes]
   [junit4]   2> 1327768 INFO  (SUITE-CoreAdminHandlerTest-seed#[6F883A3AE5716BD7]-worker) [    ] o.a.s.c.SolrConfig Using Lucene MatchVersion: 7.0.0
   [junit4]   2> 1327787 INFO  (SUITE-CoreAdminHandlerTest-seed#[6F883A3AE5716BD7]-worker) [    ] o.a.s.s.IndexSchema [null] Schema name=test
   [junit4]   2> 1327868 WARN  (SUITE-CoreAdminHandlerTest-seed#[6F883A3AE5716BD7]-worker) [    ] o.a.s.s.IndexSchema [null] default search field in schema is text. WARNING: Deprecated, please use 'df' on request instead.
   [junit4]   2> 1327870 INFO  (SUITE-CoreAdminHandlerTest-seed#[6F883A3AE5716BD7]-worker) [    ] o.a.s.s.IndexSchema Loaded schema test/1.0 with uniqueid field id
   [junit4]   2> 1327887 INFO  (coreLoadExecutor-4667-thread-1) [    ] o.a.s.c.SolrResourceLoader [null] Added 2 libs to classloader, from paths: [/C:/Users/jenkins/workspace/Lucene-Solr-master-Windows/solr/core/src/test-files/solr/collection1/lib, /C:/Users/jenkins/workspace/Lucene-Solr-master-Windows/solr/core/src/test-files/solr/collection1/lib/classes]
   [junit4]   2> 1327917 INFO  (coreLoadExecutor-4667-thread-1) [    ] o.a.s.c.SolrConfig Using Lucene MatchVersion: 7.0.0
   [junit4]   2> 1327942 INFO  (coreLoadExecutor-4667-thread-1) [    ] o.a.s.s.IndexSchema [collection1] Schema name=test
   [junit4]   2> 1328026 WARN  (coreLoadExecutor-4667-thread-1) [    ] o.a.s.s.IndexSchema [collection1] default search field in schema is text. WARNING: Deprecated, please use 'df' on request instead.
   [junit4]   2> 1328028 INFO  (coreLoadExecutor-4667-thread-1) [    ] o.a.s.s.IndexSchema Loaded schema test/1.0 with uniqueid field id
   [junit4]   2> 1328044 INFO  (coreLoadExecutor-4667-thread-1) [    ] o.a.s.c.CoreContainer Creating SolrCore 'collection1' using configuration from instancedir C:\Users\jenkins\workspace\Lucene-Solr-master-Windows\solr\core\src\test-files\solr\collection1
   [junit4]   2> 1328044 INFO  (coreLoadExecutor-4667-thread-1) [    x:collection1] o.a.s.c.SolrCore [[collection1] ] Opening new SolrCore at [C:\Users\jenkins\workspace\Lucene-Solr-master-Windows\solr\core\src\test-files\solr\collection1], dataDir=[C:\Users\jenkins\workspace\Lucene-Solr-master-Windows\solr\build\solr-core\test\J1\temp\solr.handler.admin.CoreAdminHandlerTest_6F883A3AE5716BD7-001\init-core-data-001\]
   [junit4]   2> 1328044 INFO  (coreLoadExecutor-4667-thread-1) [    x:collection1] o.a.s.c.JmxMonitoredMap JMX monitoring is enabled. Adding Solr mbeans to JMX Server: com.sun.jmx.mbeanserver.JmxMBeanServer@151687c8
   [junit4]   2> 1328045 INFO  (coreLoadExecutor-4667-thread-1) [    x:collection1] o.a.s.u.RandomMergePolicy RandomMergePolicy wrapping class org.apache.lucene.index.LogByteSizeMergePolicy: [LogByteSizeMergePolicy: minMergeSize=1677721, mergeFactor=25, maxMergeSize=2147483648, maxMergeSizeForForcedMerge=9223372036854775807, calibrateSizeByDeletes=false, maxMergeDocs=2147483647, maxCFSSegmentSizeMB=8.796093022207999E12, noCFSRatio=0.0]
   [junit4]   2> 1328061 INFO  (coreLoadExecutor-4667-thread-1) [    x:collection1] o.a.s.u.UpdateHandler Using UpdateLog implementation: org.apache.solr.update.UpdateLog
   [junit4]   2> 1328061 INFO  (coreLoadExecutor-4667-thread-1) [    x:collection1] o.a.s.u.UpdateLog Initializing UpdateLog: dataDir= defaultSyncLevel=FLUSH numRecordsToKeep=100 maxNumLogsToKeep=10 numVersionBuckets=65536
   [junit4]   2> 1328062 INFO  (coreLoadExecutor-4667-thread-1) [    x:collection1] o.a.s.u.CommitTracker Hard AutoCommit: disabled
   [junit4]   2> 1328062 INFO  (coreLoadExecutor-4667-thread-1) [    x:collection1] o.a.s.u.CommitTracker Soft AutoCommit: disabled
   [junit4]   2> 1328063 INFO  (coreLoadExecutor-4667-thread-1) [    x:collection1] o.a.s.u.RandomMergePolicy RandomMergePolicy wrapping class org.apache.lucene.index.TieredMergePolicy: [TieredMergePolicy: maxMergeAtOnce=47, maxMergeAtOnceExplicit=37, maxMergedSegmentMB=3.931640625, floorSegmentMB=0.59375, forceMergeDeletesPctAllowed=7.409407998606444, segmentsPerTier=45.0, maxCFSSegmentSizeMB=8.796093022207999E12, noCFSRatio=1.0
   [junit4]   2> 1328063 INFO  (coreLoadExecutor-4667-thread-1) [    x:collection1] o.a.s.s.SolrIndexSearcher Opening [Searcher@688ba5e8[collection1] main]
   [junit4]   2> 1328063 INFO  (coreLoadExecutor-4667-thread-1) [    x:collection1] o.a.s.h.c.SpellCheckComponent Initializing spell checkers
   [junit4]   2> 1328075 INFO  (coreLoadExecutor-4667-thread-1) [    x:collection1] o.a.s.s.DirectSolrSpellChecker init: {name=direct,classname=DirectSolrSpellChecker,field=lowerfilt,minQueryLength=3}
   [junit4]   2> 1328114 INFO  (coreLoadExecutor-4667-thread-1) [    x:collection1] o.a.s.h.ReplicationHandler Commits will be reserved for  10000
   [junit4]   2> 1328114 INFO  (searcherExecutor-4668-thread-1-processing-x:collection1) [    x:collection1] o.a.s.h.c.SpellCheckComponent Loading spell index for spellchecker: default
   [junit4]   2> 1328114 INFO  (coreLoadExecutor-4667-thread-1) [    x:collection1] o.a.s.u.UpdateLog Could not find max version in index or recent updates, using new clock 1551280054558785536
   [junit4]   2> 1328114 INFO  (searcherExecutor-4668-thread-1-processing-x:collection1) [    x:collection1] o.a.s.h.c.SpellCheckComponent Loading spell index for spellchecker: direct
   [junit4]   2> 1328114 INFO  (searcherExecutor-4668-thread-1-processing-x:collection1) [    x:collection1] o.a.s.h.c.SpellCheckComponent Loading spell index for spellchecker: wordbreak
   [junit4]   2> 1328114 INFO  (searcherExecutor-4668-thread-1-processing-x:collection1) [    x:collection1] o.a.s.h.c.SpellCheckComponent Loading spell index for spellchecker: multipleFields
   [junit4]   2> 1328115 INFO  (searcherExecutor-4668-thread-1-processing-x:collection1) [    x:collection1] o.a.s.h.c.SpellCheckComponent Loading spell index for spellchecker: jarowinkler
   [junit4]   2> 1328116 INFO  (searcherExecutor-4668-thread-1-processing-x:collection1) [    x:collection1] o.a.s.h.c.SpellCheckComponent Loading spell index for spellchecker: external
   [junit4]   2> 1328117 INFO  (searcherExecutor-4668-thread-1-processing-x:collection1) [    x:collection1] o.a.s.h.c.SpellCheckComponent Loading spell index for spellchecker: freq
   [junit4]   2> 1328117 INFO  (searcherExecutor-4668-thread-1-processing-x:collection1) [    x:collection1] o.a.s.h.c.SpellCheckComponent Loading spell index for spellchecker: fqcn
   [junit4]   2> 1328118 INFO  (searcherExecutor-4668-thread-1-processing-x:collection1) [    x:collection1] o.a.s.h.c.SpellCheckComponent Loading spell index for spellchecker: perDict
   [junit4]   2> 1328118 INFO  (SUITE-CoreAdminHandlerTest-seed#[6F883A3AE5716BD7]-worker) [    ] o.a.s.SolrTestCaseJ4 ####initCore end
   [junit4]   2> 1328118 INFO  (searcherExecutor-4668-thread-1-processing-x:collection1) [    x:collection1] o.a.s.c.SolrCore [collection1] Registered new searcher Searcher@688ba5e8[collection1] main{ExitableDirectoryReader(UninvertingDirectoryReader())}
   [junit4]   2> 1328121 INFO  (TEST-CoreAdminHandlerTest.testCreateWithSysVars-seed#[6F883A3AE5716BD7]) [    ] o.a.s.SolrTestCaseJ4 ###Starting testCreateWithSysVars
   [junit4]   2> 1328130 INFO  (TEST-CoreAdminHandlerTest.testCreateWithSysVars-seed#[6F883A3AE5716BD7]) [    ] o.a.s.h.a.CoreAdminOperation core create command schema=${SCHEMA_TEST}&dataDir=${DATA_TEST}&name=org.apache.solr.handler.admin.CoreAdminHandlerTest_sys_vars&action=CREATE&instanceDir=${INSTDIR_TEST}&config=${CONFIG_TEST}&wt=xml
   [junit4]   2> 1328141 INFO  (TEST-CoreAdminHandlerTest.testCreateWithSysVars-seed#[6F883A3AE5716BD7]) [    ] o.a.s.c.SolrConfig Using Lucene MatchVersion: 7.0.0
   [junit4]   2> 1328150 INFO  (TEST-CoreAdminHandlerTest.testCreateWithSysVars-seed#[6F883A3AE5716BD7]) [    ] o.a.s.s.IndexSchema [org.apache.solr.handler.admin.CoreAdminHandlerTest_sys_vars] Schema name=tiny
   [junit4]   2> 1328160 INFO  (TEST-CoreAdminHandlerTest.testCreateWithSysVars-seed#[6F883A3AE5716BD7]) [    ] o.a.s.s.IndexSchema Loaded schema tiny/1.1 with uniqueid field id
   [junit4]   2> 1328163 INFO  (TEST-CoreAdminHandlerTest.testCreateWithSysVars-seed#[6F883A3AE5716BD7]) [    ] o.a.s.c.CoreContainer Creating SolrCore 'org.apache.solr.handler.admin.CoreAdminHandlerTest_sys_vars' using configuration from instancedir C:\Users\jenkins\workspace\Lucene-Solr-master-Windows\solr\build\solr-core\test\J1\temp\solr.handler.admin.CoreAdminHandlerTest_6F883A3AE5716BD7-001\org.apache.solr.handler.admin.CoreAdminHandlerTest_sys_vars-001\with_sys_vars
   [junit4]   2> 1328163 INFO  (TEST-CoreAdminHandlerTest.testCreateWithSysVars-seed#[6F883A3AE5716BD7]) [    x:org.apache.solr.handler.admin.CoreAdminHandlerTest_sys_vars] o.a.s.c.SolrCore [[org.apache.solr.handler.admin.CoreAdminHandlerTest_sys_vars] ] Opening new SolrCore at [C:\Users\jenkins\workspace\Lucene-Solr-master-Windows\solr\build\solr-core\test\J1\temp\solr.handler.admin.CoreAdminHandlerTest_6F883A3AE5716BD7-001\org.apache.solr.handler.admin.CoreAdminHandlerTest_sys_vars-001\with_sys_vars], dataDir=[C:\Users\jenkins\workspace\Lucene-Solr-master-Windows\solr\build\solr-core\test\J1\temp\solr.handler.admin.CoreAdminHandlerTest_6F883A3AE5716BD7-001\org.apache.solr.handler.admin.CoreAdminHandlerTest_sys_vars-001\data_diff\]
   [junit4]   2> 1328169 INFO  (TEST-CoreAdminHandlerTest.testCreateWithSysVars-seed#[6F883A3AE5716BD7]) [    x:org.apache.solr.handler.admin.CoreAdminHandlerTest_sys_vars] o.a.s.u.RandomMergePolicy RandomMergePolicy wrapping class org.apache.lucene.index.MockRandomMergePolicy: org.apache.lucene.index.MockRandomMergePolicy@7ee6dee3
   [junit4]   2> 1328181 INFO  (TEST-CoreAdminHandlerTest.testCreateWithSysVars-seed#[6F883A3AE5716BD7]) [    x:org.apache.solr.handler.admin.CoreAdminHandlerTest_sys_vars] o.a.s.u.CommitTracker Hard AutoCommit: disabled
   [junit4]   2> 1328181 INFO  (TEST-CoreAdminHandlerTest.testCreateWithSysVars-seed#[6F883A3AE5716BD7]) [    x:org.apache.solr.handler.admin.CoreAdminHandlerTest_sys_vars] o.a.s.u.CommitTracker Soft AutoCommit: disabled
   [junit4]   2> 1328182 INFO  (TEST-CoreAdminHandlerTest.testCreateWithSysVars-seed#[6F883A3AE5716BD7]) [    x:org.apache.solr.handler.admin.CoreAdminHandlerTest_sys_vars] o.a.s.u.RandomMergePolicy RandomMergePolicy wrapping class org.apache.lucene.index.TieredMergePolicy: [TieredMergePolicy: maxMergeAtOnce=37, maxMergeAtOnceExplicit=10, maxMergedSegmentMB=81.623046875, floorSegmentMB=0.701171875, forceMergeDeletesPctAllowed=19.12945475930958, segmentsPerTier=11.0, maxCFSSegmentSizeMB=8.796093022207999E12, noCFSRatio=1.0
   [junit4]   2> 1328182 INFO  (TEST-CoreAdminHandlerTest.testCreateWithSysVars-seed#[6F883A3AE5716BD7]) [    x:org.apache.solr.handler.admin.CoreAdminHandlerTest_sys_vars] o.a.s.s.SolrIndexSearcher Opening [Searcher@42fffd2e[org.apache.solr.handler.admin.CoreAdminHandlerTest_sys_vars] main]
   [junit4]   2> 1328183 INFO  (TEST-CoreAdminHandlerTest.testCreateWithSysVars-seed#[6F883A3AE5716BD7]) [    x:org.apache.solr.handler.admin.CoreAdminHandlerTest_sys_vars] o.a.s.r.ManagedResourceStorage File-based storage initialized to use dir: C:\Users\jenkins\workspace\Lucene-Solr-master-Windows\solr\build\solr-core\test\J1\temp\solr.handler.admin.CoreAdminHandlerTest_6F883A3AE5716BD7-001\org.apache.solr.handler.admin.CoreAdminHandlerTest_sys_vars-001\with_sys_vars\conf
   [junit4]   2> 1328184 INFO  (TEST-CoreAdminHandlerTest.testCreateWithSysVars-seed#[6F883A3AE5716BD7]) [    x:org.apache.solr.handler.admin.CoreAdminHandlerTest_sys_vars] o.a.s.h.ReplicationHandler Commits will be reserved for  10000
   [junit4]   2> 1328184 INFO  (searcherExecutor-4674-thread-1-processing-x:org.apache.solr.handler.admin.CoreAdminHandlerTest_sys_vars) [    x:org.apache.solr.handler.admin.CoreAdminHandlerTest_sys_vars] o.a.s.c.SolrCore [org.apache.solr.handler.admin.CoreAdminHandlerTest_sys_vars] Registered new searcher Searcher@42fffd2e[org.apache.solr.handler.admin.CoreAdminHandlerTest_sys_vars] main{ExitableDirectoryReader(UninvertingDirectoryReader())}
   [junit4]   2> 1328186 INFO  (TEST-CoreAdminHandlerTest.testCreateWithSysVars-seed#[6F883A3AE5716BD7]) [    x:org.apache.solr.handler.admin.CoreAdminHandlerTest_sys_vars] o.a.s.SolrTestCaseJ4 ###Ending testCreateWithSysVars
   [junit4]   2> 1328189 INFO  (TEST-CoreAdminHandlerTest.testNonexistentCoreReload-seed#[6F883A3AE5716BD7]) [    x:org.apache.solr.handler.admin.CoreAdminHandlerTest_sys_vars] o.a.s.SolrTestCaseJ4 ###Starting testNonexistentCoreReload
   [junit4]   2> 1328190 INFO  (TEST-CoreAdminHandlerTest.testNonexistentCoreReload-seed#[6F883A3AE5716BD7]) [    x:org.apache.solr.handler.admin.CoreAdminHandlerTest_sys_vars] o.a.s.SolrTestCaseJ4 ###Ending testNonexistentCoreReload
   [junit4]   2> 1328192 INFO  (TEST-CoreAdminHandlerTest.testDeleteInstanceDir-seed#[6F883A3AE5716BD7]) [    x:org.apache.solr.handler.admin.CoreAdminHandlerTest_sys_vars] o.a.s.SolrTestCaseJ4 ###Starting testDeleteInstanceDir
   [junit4]   2> 1328214 INFO  (TEST-CoreAdminHandlerTest.testDeleteInstanceDir-seed#[6F883A3AE5716BD7]) [    ] o.e.j.s.Server jetty-9.3.8.v20160314
   [junit4]   2> 1328215 INFO  (TEST-CoreAdminHandlerTest.testDeleteInstanceDir-seed#[6F883A3AE5716BD7]) [    ] o.e.j.s.h.ContextHandler Started o.e.j.s.ServletContextHandler@212b757a{/solr,null,AVAILABLE}
   [junit4]   2> 1328216 INFO  (TEST-CoreAdminHandlerTest.testDeleteInstanceDir-seed#[6F883A3AE5716BD7]) [    ] o.e.j.s.ServerConnector Started ServerConnector@63fbbd23{HTTP/1.1,[http/1.1]}{127.0.0.1:61132}
   [junit4]   2> 1328217 INFO  (TEST-CoreAdminHandlerTest.testDeleteInstanceDir-seed#[6F883A3AE5716BD7]) [    ] o.e.j.s.Server Started @1332934ms
   [junit4]   2> 1328217 INFO  (TEST-CoreAdminHandlerTest.testDeleteInstanceDir-seed#[6F883A3AE5716BD7]) [    ] o.a.s.c.s.e.JettySolrRunner Jetty properties: {hostContext=/solr, hostPort=61132}
   [junit4]   2> 1328217 ERROR (TEST-CoreAdminHandlerTest.testDeleteInstanceDir-seed#[6F883A3AE5716BD7]) [    ] o.a.s.s.StartupLoggingUtils Missing Java Option solr.log.dir. Logging may be missing or incomplete.
   [junit4]   2> 1328217 INFO  (TEST-CoreAdminHandlerTest.testDeleteInstanceDir-seed#[6F883A3AE5716BD7]) [    ] o.a.s.s.SolrDispatchFilter  ___      _       Welcome to Apache Solr? version 7.0.0
   [junit4]   2> 1328217 INFO  (TEST-CoreAdminHandlerTest.testDeleteInstanceDir-seed#[6F883A3AE5716BD7]) [    ] o.a.s.s.SolrDispatchFilter / __| ___| |_ _   Starting in standalone mode on port null
   [junit4]   2> 1328217 INFO  (TEST-CoreAdminHandlerTest.testDeleteInstanceDir-seed#[6F883A3AE5716BD7]) [    ] o.a.s.s.SolrDispatchFilter \__ \/ _ \ | '_|  Install dir: null
   [junit4]   2> 1328217 INFO  (TEST-CoreAdminHandlerTest.testDeleteInstanceDir-seed#[6F883A3AE5716BD7]) [    ] o.a.s.s.SolrDispatchFilter |___/\___/_|_|    Start time: 2016-11-17T20:52:25.689Z
   [junit4]   2> 1328218 INFO  (TEST-CoreAdminHandlerTest.testDeleteInstanceDir-seed#[6F883A3AE5716BD7]) [    ] o.a.s.c.SolrXmlConfig Loading container configuration from C:\Users\jenkins\workspace\Lucene-Solr-master-Windows\solr\build\solr-core\test\J1\temp\solr.handler.admin.CoreAdminHandlerTest_6F883A3AE5716BD7-001\init-core-data-001\org.apache.solr.handler.admin.CoreAdminHandlerTest-corex-125464200068772\solr.xml
   [junit4]   2> 1328238 INFO  (TEST-CoreAdminHandlerTest.testDeleteInstanceDir-seed#[6F883A3AE5716BD7]) [    ] o.a.s.c.CorePropertiesLocator Found 1 core definitions underneath C:\Users\jenkins\workspace\Lucene-Solr-master-Windows\solr\build\solr-core\test\J1\temp\solr.handler.admin.CoreAdminHandlerTest_6F883A3AE5716BD7-001\init-core-data-001\org.apache.solr.handler.admin.CoreAdminHandlerTest-corex-125464200068772\.
   [junit4]   2> 1328238 INFO  (TEST-CoreAdminHandlerTest.testDeleteInstanceDir-seed#[6F883A3AE5716BD7]) [    ] o.a.s.c.CorePropertiesLocator Cores are: [corex]
   [junit4]   2> 1328272 INFO  (coreLoadExecutor-4684-thread-1) [    ] o.a.s.c.SolrConfig Using Lucene MatchVersion: 7.0.0
   [junit4]   2> 1328299 INFO  (coreLoadExecutor-4684-thread-1) [    ] o.a.s.s.IndexSchema [corex] Schema name=test
   [junit4]   2> 1328396 WARN  (coreLoadExecutor-4684-thread-1) [    ] o.a.s.s.IndexSchema [corex] default search field in schema is text. WARNING: Deprecated, please use 'df' on request instead.
   [junit4]   2> 1328398 INFO  (coreLoadExecutor-4684-thread-1) [    ] o.a.s.s.IndexSchema Loaded schema test/1.0 with uniqueid field id
   [junit4]   2> 1328413 INFO  (coreLoadExecutor-4684-thread-1) [    ] o.a.s.c.CoreContainer Creating SolrCore 'corex' using configuration from instancedir C:\Users\jenkins\workspace\Lucene-Solr-master-Windows\solr\build\solr-core\test\J1\temp\solr.handler.admin.CoreAdminHandlerTest_6F883A3AE5716BD7-001\init-core-data-001\org.apache.solr.handler.admin.CoreAdminHandlerTest-corex-125464200068772\.\corex
   [junit4]   2> 1328413 INFO  (coreLoadExecutor-4684-thread-1) [    x:corex] o.a.s.c.SolrCore [[corex] ] Opening new SolrCore at [C:\Users\jenkins\workspace\Lucene-Solr-master-Windows\solr\build\solr-core\test\J1\temp\solr.handler.admin.CoreAdminHandlerTest_6F883A3AE5716BD7-001\init-core-data-001\org.apache.solr.handler.admin.CoreAdminHandlerTest-corex-125464200068772\corex], dataDir=[C:\Users\jenkins\workspace\Lucene-Solr-master-Windows\solr\build\solr-core\test\J1\temp\solr.handler.admin.CoreAdminHandlerTest_6F883A3AE5716BD7-001\init-core-data-001\org.apache.solr.handler.admin.CoreAdminHandlerTest-corex-125464200068772\.\corex\data\]
   [junit4]   2> 1328413 INFO  (coreLoadExecutor-4684-thread-1) [    x:corex] o.a.s.c.JmxMonitoredMap JMX monitoring is enabled. Adding Solr mbeans to JMX Server: com.sun.jmx.mbeanserver.JmxMBeanServer@151687c8
   [junit4]   2> 1328414 INFO  (coreLoadExecutor-4684-thread-1) [    x:corex] o.a.s.u.RandomMergePolicy RandomMergePolicy wrapping class org.apache.lucene.index.LogByteSizeMergePolicy: [LogByteSizeMergePolicy: minMergeSize=1677721, mergeFactor=25, maxMergeSize=2147483648, maxMergeSizeForForcedMerge=9223372036854775807, calibrateSizeByDeletes=false, maxMergeDocs=2147483647, maxCFSSegmentSizeMB=8.796093022207999E12, noCFSRatio=0.0]
   [junit4]   2> 1328430 INFO  (coreLoadExecutor-4684-thread-1) [    x:corex] o.a.s.u.UpdateHandler Using UpdateLog implementation: org.apache.solr.update.UpdateLog
   [junit4]   2> 1328431 INFO  (coreLoadExecutor-4684-thread-1) [    x:corex] o.a.s.u.UpdateLog Initializing UpdateLog: dataDir= defaultSyncLevel=FLUSH numRecordsToKeep=100 maxNumLogsToKeep=10 numVersionBuckets=65536
   [junit4]   2> 1328432 INFO  (coreLoadExecutor-4684-thread-1) [    x:corex] o.a.s.u.CommitTracker Hard AutoCommit: disabled
   [junit4]   2> 1328432 INFO  (coreLoadExecutor-4684-thread-1) [    x:corex] o.a.s.u.CommitTracker Soft AutoCommit: disabled
   [junit4]   2> 1328432 INFO  (coreLoadExecutor-4684-thread-1) [    x:corex] o.a.s.u.RandomMergePolicy RandomMergePolicy wrapping class org.apache.lucene.index.TieredMergePolicy: [TieredMergePolicy: maxMergeAtOnce=47, maxMergeAtOnceExplicit=37, maxMergedSegmentMB=3.931640625, floorSegmentMB=0.59375, forceMergeDeletesPctAllowed=7.409407998606444, segmentsPerTier=45.0, maxCFSSegmentSizeMB=8.796093022207999E12, noCFSRatio=1.0
   [junit4]   2> 1328433 INFO  (coreLoadExecutor-4684-thread-1) [    x:corex] o.a.s.s.SolrIndexSearcher Opening [Searcher@4b65d9b3[corex] main]
   [junit4]   2> 1328433 INFO  (coreLoadExecutor-4684-thread-1) [    x:corex] o.a.s.h.c.SpellCheckComponent Initializing spell checkers
   [junit4]   2> 1328441 INFO  (coreLoadExecutor-4684-thread-1) [    x:corex] o.a.s.s.DirectSolrSpellChecker init: {name=direct,classname=DirectSolrSpellChecker,field=lowerfilt,minQueryLength=3}
   [junit4]   2> 1328478 INFO  (coreLoadExecutor-4684-thread-1) [    x:corex] o.a.s.h.ReplicationHandler Commits will be reserved for  10000
   [junit4]   2> 1328479 INFO  (searcherExecutor-4685-thread-1-processing-x:corex) [    x:corex] o.a.s.h.c.SpellCheckComponent Loading spell index for spellchecker: default
   [junit4]   2> 1328479 INFO  (coreLoadExecutor-4684-thread-1) [    x:corex] o.a.s.u.UpdateLog Could not find max version in index or recent updates, using new clock 1551280054941515776
   [junit4]   2> 1328479 INFO  (searcherExecutor-4685-thread-1-processing-x:corex) [    x:corex] o.a.s.h.c.SpellCheckComponent Loading spell index for spellchecker: direct
   [junit4]   2> 1328479 INFO  (searcherExecutor-4685-thread-1-processing-x:corex) [    x:corex] o.a.s.h.c.SpellCheckComponent Loading spell index for spellchecker: wordbreak
   [junit4]   2> 1328479 INFO  (searcherExecutor-4685-thread-1-processing-x:corex) [    x:corex] o.a.s.h.c.SpellCheckComponent Loading spell index for spellchecker: multipleFields
   [junit4]   2> 1328480 INFO  (searcherExecutor-4685-thread-1-processing-x:corex) [    x:corex] o.a.s.h.c.SpellCheckComponent Loading spell index for spellchecker: jarowinkler
   [junit4]   2> 1328480 INFO  (searcherExecutor-4685-thread-1-processing-x:corex) [    x:corex] o.a.s.h.c.SpellCheckComponent Loading spell index for spellchecker: external
   [junit4]   2> 1328480 INFO  (searcherExecutor-4685-thread-1-processing-x:corex) [    x:corex] o.a.s.h.c.SpellCheckComponent Loading spell index for spellchecker: freq
   [junit4]   2> 1328481 INFO  (searcherExecutor-4685-thread-1-processing-x:corex) [    x:corex] o.a.s.h.c.SpellCheckComponent Loading spell index for spellchecker: fqcn
   [junit4]   2> 1328481 INFO  (searcherExecutor-4685-thread-1-processing-x:corex) [    x:corex] o.a.s.h.c.SpellCheckComponent Loading spell index for spellchecker: perDict
   [junit4]   2> 1328482 INFO  (searcherExecutor-4685-thread-1-processing-x:corex) [    x:corex] o.a.s.c.SolrCore [corex] Registered new searcher Searcher@4b65d9b3[corex] main{ExitableDirectoryReader(UninvertingDirectoryReader())}
   [junit4]   2> 1328748 INFO  (qtp1512784828-9671) [    x:corex] o.a.s.u.p.LogUpdateProcessorFactory [corex]  webapp=/solr path=/update params={wt=javabin&version=2}{add=[123 (1551280055220436992)]} 0 2
   [junit4]   2> 1328749 INFO  (qtp1512784828-9671) [    x:corex] o.a.s.u.DirectUpdateHandler2 start commit{,optimize=false,openSearcher=true,waitSearcher=true,expungeDeletes=false,softCommit=false,prepareCommit=false}
   [junit4]   2> 1328749 INFO  (qtp1512784828-9671) [    x:corex] o.a.s.u.SolrIndexWriter Calling setCommitData with IW:org.apache.solr.update.SolrIndexWriter@5d439917
   [junit4]   2> 1328751 INFO  (qtp1512784828-9671) [    x:corex] o.a.s.s.SolrIndexSearcher Opening [Searcher@7f5373fe[corex] main]
   [junit4]   2> 1328751 INFO  (qtp1512784828-9671) [    x:corex] o.a.s.u.DirectUpdateHandler2 end_commit_flush
   [junit4]   2> 1328753 INFO  (searcherExecutor-4685-thread-1-processing-x:corex) [    x:corex] o.a.s.c.SolrCore [corex] Registered new searcher Searcher@7f5373fe[corex] main{ExitableDirectoryReader(UninvertingDirectoryReader(Uninverting(_0(7.0.0):C1)))}
   [junit4]   2> 1328753 INFO  (qtp1512784828-9671) [    x:corex] o.a.s.u.p.LogUpdateProcessorFactory [corex]  webapp=/solr path=/update params={waitSearcher=true&commit=true&softCommit=false&wt=javabin&version=2}{commit=} 0 4
   [junit4]   2> 1328758 INFO  (qtp1512784828-9675) [    ] o.a.s.c.SolrCore [corex]  CLOSING SolrCore org.apache.solr.core.SolrCore@7141c001
   [junit4]   2> 1328817 INFO  (qtp1512784828-9675) [    ] o.a.s.s.HttpSolrCall [admin] webapp=null path=/admin/cores params={deleteInstanceDir=true&core=corex&deleteDataDir=false&action=UNLOAD&indexInfo=true&wt=javabin&version=2&deleteIndex=false} status=0 QTime=60
   [junit4]   2> 1328819 INFO  (TEST-CoreAdminHandlerTest.testDeleteInstanceDir-seed#[6F883A3AE5716BD7]) [    ] o.e.j.s.ServerConnector Stopped ServerConnector@63fbbd23{HTTP/1.1,[http/1.1]}{127.0.0.1:0}
   [junit4]   2> 1328819 INFO  (TEST-CoreAdminHandlerTest.testDeleteInstanceDir-seed#[6F883A3AE5716BD7]) [    ] o.a.s.c.CoreContainer Shutting down CoreContainer instance=625933245
   [junit4]   2> 1328820 INFO  (TEST-CoreAdminHandlerTest.testDeleteInstanceDir-seed#[6F883A3AE5716BD7]) [    ] o.e.j.s.h.ContextHandler Stopped o.e.j.s.ServletContextHandler@212b757a{/solr,null,UNAVAILABLE}
   [junit4]   2> 1328823 INFO  (TEST-CoreAdminHandlerTest.testDeleteInstanceDir-seed#[6F883A3AE5716BD7]) [    x:org.apache.solr.handler.admin.CoreAdminHandlerTest_sys_vars] o.a.s.SolrTestCaseJ4 ###Ending testDeleteInstanceDir
   [junit4]   2> 1328825 INFO  (TEST-CoreAdminHandlerTest.testCoreAdminHandler-seed#[6F883A3AE5716BD7]) [    x:org.apache.solr.handler.admin.CoreAdminHandlerTest_sys_vars] o.a.s.SolrTestCaseJ4 ###Starting testCoreAdminHandler
   [junit4]   2> 1329192 INFO  (TEST-CoreAdminHandlerTest.testCoreAdminHandler-seed#[6F883A3AE5716BD7]) [    x:org.apache.solr.handler.admin.CoreAdminHandlerTest_sys_vars] o.a.s.h.a.CoreAdminOperation core create command name=ugly$core%3Dname&action=CREATE&instanceDir=C:\Users\jenkins\workspace\Lucene-Solr-master-Windows\solr\build\solr-core\test\J1\temp\solr.handler.admin.CoreAdminHandlerTest_6F883A3AE5716BD7-001\tempDir-001\instProp&wt=xml
   [junit4]   2> 1329193 ERROR (TEST-CoreAdminHandlerTest.testCoreAdminHandler-seed#[6F883A3AE5716BD7]) [    x:org.apache.solr.handler.admin.CoreAdminHandlerTest_sys_vars] o.a.s.c.CoreContainer Error creating core [ugly$core=name]: Invalid core: [ugly$core=name]. core names must consist entirely of periods, underscores, hyphens, and alphanumerics as well not start with a hyphen
   [junit4]   2> org.apache.solr.common.SolrException: Invalid core: [ugly$core=name]. core names must consist entirely of periods, underscores, hyphens, and alphanumerics as well not start with a hyphen
   [junit4]   2> 	at org.apache.solr.client.solrj.util.SolrIdentifierValidator.validateName(SolrIdentifierValidator.java:39)
   [junit4]   2> 	at org.apache.solr.client.solrj.util.SolrIdentifierValidator.validateCoreName(SolrIdentifierValidator.java:56)
   [junit4]   2> 	at org.apache.solr.core.CoreContainer.create(CoreContainer.java:861)
   [junit4]   2> 	at org.apache.solr.core.CoreContainer.create(CoreContainer.java:805)
   [junit4]   2> 	at org.apache.solr.handler.admin.CoreAdminOperation.lambda$static$0(CoreAdminOperation.java:88)
   [junit4]   2> 	at org.apache.solr.handler.admin.CoreAdminOperation.execute(CoreAdminOperation.java:377)
   [junit4]   2> 	at org.apache.solr.handler.admin.CoreAdminHandler$CallInfo.call(CoreAdminHandler.java:365)
   [junit4]   2> 	at org.apache.solr.handler.admin.CoreAdminHandler.handleRequestBody(CoreAdminHandler.java:156)
   [junit4]   2> 	at org.apache.solr.handler.admin.CoreAdminHandlerTest.testCoreAdminHandler(CoreAdminHandlerTest.java:137)
   [junit4]   2> 	at sun.reflect.NativeMethodAccessorImpl.invoke0(Native Method)
   [junit4]   2> 	at sun.reflect.NativeMethodAccessorImpl.invoke(NativeMethodAccessorImpl.java:62)
   [junit4]   2> 	at sun.reflect.DelegatingMethodAccessorImpl.invoke(DelegatingMethodAccessorImpl.java:43)
   [junit4]   2> 	at java.lang.reflect.Method.invoke(Method.java:498)
   [junit4]   2> 	at com.carrotsearch.randomizedtesting.RandomizedRunner.invoke(RandomizedRunner.java:1713)
   [junit4]   2> 	at com.carrotsearch.randomizedtesting.RandomizedRunner$8.evaluate(RandomizedRunner.java:907)
   [junit4]   2> 	at com.carrotsearch.randomizedtesting.RandomizedRunner$9.evaluate(RandomizedRunner.java:943)
   [junit4]   2> 	at com.carrotsearch.randomizedtesting.RandomizedRunner$10.evaluate(RandomizedRunner.java:957)
   [junit4]   2> 	at com.carrotsearch.randomizedtesting.rules.SystemPropertiesRestoreRule$1.evaluate(SystemPropertiesRestoreRule.java:57)
   [junit4]   2> 	at org.apache.lucene.util.TestRuleSetupTeardownChained$1.evaluate(TestRuleSetupTeardownChained.java:49)
   [junit4]   2> 	at org.apache.lucene.util.AbstractBeforeAfterRule$1.evaluate(AbstractBeforeAfterRule.java:45)
   [junit4]   2> 	at org.apache.lucene.util.TestRuleThreadAndTestName$1.evaluate(TestRuleThreadAndTestName.java:48)
   [junit4]   2> 	at org.apache.lucene.util.TestRuleIgnoreAfterMaxFailures$1.evaluate(TestRuleIgnoreAfterMaxFailures.java:64)
   [junit4]   2> 	at org.apache.lucene.util.TestRuleMarkFailure$1.evaluate(TestRuleMarkFailure.java:47)
   [junit4]   2> 	at com.carrotsearch.randomizedtesting.rules.StatementAdapter.evaluate(StatementAdapter.java:36)
   [junit4]   2> 	at com.carrotsearch.randomizedtesting.ThreadLeakControl$StatementRunner.run(ThreadLeakControl.java:367)
   [junit4]   2> 	at com.carrotsearch.randomizedtesting.ThreadLeakControl.forkTimeoutingTask(ThreadLeakControl.java:811)
   [junit4]   2> 	at com.carrotsearch.randomizedtesting.ThreadLeakControl$3.evaluate(ThreadLeakControl.java:462)
   [junit4]   2> 	at com.carrotsearch.randomizedtesting.RandomizedRunner.runSingleTest(RandomizedRunner.java:916)
   [junit4]   2> 	at com.carrotsearch.randomizedtesting.RandomizedRunner$5.evaluate(RandomizedRunner.java:802)
   [junit4]   2> 	at com.carrotsearch.randomizedtesting.RandomizedRunner$6.evaluate(RandomizedRunner.java:852)
   [junit4]   2> 	at com.carrotsearch.randomizedtesting.RandomizedRunner$7.evaluate(RandomizedRunner.java:863)
   [junit4]   2> 	at com.carrotsearch.randomizedtesting.rules.StatementAdapter.evaluate(StatementAdapter.java:36)
   [junit4]   2> 	at com.carrotsearch.randomizedtesting.rules.SystemPropertiesRestoreRule$1.evaluate(SystemPropertiesRestoreRule.java:57)
   [junit4]   2> 	at org.apache.lucene.util.AbstractBeforeAfterRule$1.evaluate(AbstractBeforeAfterRule.java:45)
   [junit4]   2> 	at com.carrotsearch.randomizedtesting.rules.StatementAdapter.evaluate(StatementAdapter.java:36)
   [junit4]   2> 	at org.apache.lucene.util.TestRuleStoreClassName$1.evaluate(TestRuleStoreClassName.java:41)
   [junit4]   2> 	at com.carrotsearch.randomizedtesting.rules.NoShadowingOrOverridesOnMethodsRule$1.evaluate(NoShadowingOrOverridesOnMethodsRule.java:40)
   [junit4]   2> 	at com.carrotsearch.randomizedtesting.rules.NoShadowingOrOverridesOnMethodsRule$1.evaluate(NoShadowingOrOverridesOnMethodsRule.java:40)
   [junit4]   2> 	at com.carrotsearch.randomizedtesting.rules.StatementAdapter.evaluate(StatementAdapter.java:36)
   [junit4]   2> 	at com.carrotsearch.randomizedtesting.rules.StatementAdapter.evaluate(StatementAdapter.java:36)
   [junit4]   2> 	at com.carrotsearch.randomizedtesting.rules.StatementAdapter.evaluate(StatementAdapter.java:36)
   [junit4]   2> 	at org.apache.lucene.util.TestRuleAssertionsRequired$1.evaluate(TestRuleAssertionsRequired.java:53)
   [junit4]   2> 	at org.apache.lucene.util.TestRuleMarkFailure$1.evaluate(TestRuleMarkFailure.java:47)
   [junit4]   2> 	at org.apache.lucene.util.TestRuleIgnoreAfterMaxFailures$1.evaluate(TestRuleIgnoreAfterMaxFailures.java:64)
   [junit4]   2> 	at org.apache.lucene.util.TestRuleIgnoreTestSuites$1.evaluate(TestRuleIgnoreTestSuites.java:54)
   [junit4]   2> 	at com.carrotsearch.randomizedtesting.rules.StatementAdapter.evaluate(StatementAdapter.java:36)
   [junit4]   2> 	at com.carrotsearch.randomizedtesting.ThreadLeakControl$StatementRunner.run(ThreadLeakControl.java:367)
   [junit4]   2> 	at java.lang.Thread.run(Thread.java:745)
   [junit4]   2> 1329194 INFO  (TEST-CoreAdminHandlerTest.testCoreAdminHandler-seed#[6F883A3AE5716BD7]) [    ] o.a.s.h.a.CoreAdminOperation core create command property.hoss=man&name=props&action=CREATE&property.foo=baz&instanceDir=C:\Users\jenkins\workspace\Lucene-Solr-master-Windows\solr\build\solr-core\test\J1\temp\solr.handler.admin.CoreAdminHandlerTest_6F883A3AE5716BD7-001\tempDir-001\instProp&wt=xml
   [junit4]   2> 1329195 INFO  (TEST-CoreAdminHandlerTest.testCoreAdminHandler-seed#[6F883A3AE5716BD7]) [    ] o.a.s.c.SolrResourceLoader [null] Added 2 libs to classloader, from paths: [/C:/Users/jenkins/workspace/Lucene-Solr-master-Windows/solr/build/solr-core/test/J1/temp/solr.handler.admin.CoreAdminHandlerTest_6F883A3AE5716BD7-001/tempDir-001/instProp/lib, /C:/Users/jenkins/workspace/Lucene-Solr-master-Windows/solr/build/solr-core/test/J1/temp/solr.handler.admin.CoreAdminHandlerTest_6F883A3AE5716BD7-001/tempDir-001/instProp/lib/classes]
   [junit4]   2> 1329266 INFO  (TEST-CoreAdminHandlerTest.testCoreAdminHandler-seed#[6F883A3AE5716BD7]) [    ] o.a.s.c.SolrConfig Using Lucene MatchVersion: 7.0.0
   [junit4]   2> 1329285 INFO  (TEST-CoreAdminHandlerTest.testCoreAdminHandler-seed#[6F883A3AE5716BD7]) [    ] o.a.s.s.IndexSchema [props] Schema name=test
   [junit4]   2> 1329575 WARN  (TEST-CoreAdminHandlerTest.testCoreAdminHandler-seed#[6F883A3AE5716BD7]) [    ] o.a.s.s.IndexSchema [props] default search field in schema is text. WARNING: Deprecated, please use 'df' on request instead.
   [junit4]   2> 1329577 INFO  (TEST-CoreAdminHandlerTest.testCoreAdminHandler-seed#[6F883A3AE5716BD7]) [    ] o.a.s.s.IndexSchema Loaded schema test/1.0 with uniqueid field id
   [junit4]   2> 1329594 INFO  (TEST-CoreAdminHandlerTest.testCoreAdminHandler-seed#[6F883A3AE5716BD7]) [    ] o.a.s.c.CoreContainer Creating SolrCore 'props' using configuration from instancedir C:\Users\jenkins\workspace\Lucene-Solr-master-Windows\solr\build\solr-core\test\J1\temp\solr.handler.admin.CoreAdminHandlerTest_6F883A3AE5716BD7-001\tempDir-001\instProp
   [junit4]   2> 1329594 INFO  (TEST-CoreAdminHandlerTest.testCoreAdminHandler-seed#[6F883A3AE5716BD7]) [    x:props] o.a.s.c.SolrCore [[props] ] Opening new SolrCore at [C:\Users\jenkins\workspace\Lucene-Solr-master-Windows\solr\build\solr-core\test\J1\temp\solr.handler.admin.CoreAdminHandlerTest_6F883A3AE5716BD7-001\tempDir-001\instProp], dataDir=[C:\Users\jenkins\workspace\Lucene-Solr-master-Windows\solr\build\solr-core\test\J1\temp\solr.handler.admin.CoreAdminHandlerTest_6F883A3AE5716BD7-001\tempDir-001\instProp\data\]
   [junit4]   2> 1329595 INFO  (TEST-CoreAdminHandlerTest.testCoreAdminHandler-seed#[6F883A3AE5716BD7]) [    x:props] o.a.s.c.JmxMonitoredMap JMX monitoring is enabled. Adding Solr mbeans to JMX Server: com.sun.jmx.mbeanserver.JmxMBeanServer@151687c8
   [junit4]   2> 1329596 INFO  (TEST-CoreAdminHandlerTest.testCoreAdminHandler-seed#[6F883A3AE5716BD7]) [    x:props] o.a.s.u.RandomMergePolicy RandomMergePolicy wrapping class org.apache.lucene.index.TieredMergePolicy: [TieredMergePolicy: maxMergeAtOnce=33, maxMergeAtOnceExplicit=44, maxMergedSegmentMB=14.470703125, floorSegmentMB=1.1748046875, forceMergeDeletesPctAllowed=12.484141436257174, segmentsPerTier=36.0, maxCFSSegmentSizeMB=8.796093022207999E12, noCFSRatio=1.0
   [junit4]   2> 1329615 INFO  (TEST-CoreAdminHandlerTest.testCoreAdminHandler-seed#[6F883A3AE5716BD7]) [    x:props] o.a.s.u.UpdateHandler Using UpdateLog implementation: org.apache.solr.update.UpdateLog
   [junit4]   2> 1329615 INFO  (TEST-CoreAdminHandlerTest.testCoreAdminHandler-seed#[6F883A3AE5716BD7]) [    x:props] o.a.s.u.UpdateLog Initializing UpdateLog: dataDir= defaultSyncLevel=FLUSH numRecordsToKeep=100 maxNumLogsToKeep=10 numVersionBuckets=65536
   [junit4]   2> 1329616 INFO  (TEST-CoreAdminHandlerTest.testCoreAdminHandler-seed#[6F883A3AE5716BD7]) [    x:props] o.a.s.u.CommitTracker Hard AutoCommit: disabled
   [junit4]   2> 1329616 INFO  (TEST-CoreAdminHandlerTest.testCoreAdminHandler-seed#[6F883A3AE5716BD7]) [    x:props] o.a.s.u.CommitTracker Soft AutoCommit: disabled
   [junit4]   2> 1329617 INFO  (TEST-CoreAdminHandlerTest.testCoreAdminHandler-seed#[6F883A3AE5716BD7]) [    x:props] o.a.s.u.RandomMergePolicy RandomMergePolicy wrapping class org.apache.lucene.index.LogDocMergePolicy: [LogDocMergePolicy: minMergeSize=1000, mergeFactor=45, maxMergeSize=9223372036854775807, maxMergeSizeForForcedMerge=9223372036854775807, calibrateSizeByDeletes=true, maxMergeDocs=2147483647, maxCFSSegmentSizeMB=8.796093022207999E12, noCFSRatio=0.33659386174914663]
   [junit4]   2> 1329617 INFO  (TEST-CoreAdminHandlerTest.testCoreAdminHandler-seed#[6F883A3AE5716BD7]) [    x:props] o.a.s.s.SolrIndexSearcher Opening [Searcher@43c6571f[props] main]
   [junit4]   2> 1329617 INFO  (TEST-CoreAdminHandlerTest.testCoreAdminHandler-seed#[6F883A3AE5716BD7]) [    x:props] o.a.s.h.c.SpellCheckComponent Initializing spell checkers
   [junit4]   2> 1329627 INFO  (TEST-CoreAdminHandlerTest.testCoreAdminHandler-seed#[6F883A3AE5716BD7]) [    x:props] o.a.s.s.DirectSolrSpellChecker init: {name=direct,classname=DirectSolrSpellChecker,field=lowerfilt,minQueryLength=3}
   [junit4]   2> 1329663 INFO  (TEST-CoreAdminHandlerTest.testCoreAdminHandler-seed#[6F883A3AE5716BD7]) [    x:props] o.a.s.h.ReplicationHandler Commits will be reserved for  10000
   [junit4]   2> 1329663 INFO  (searcherExecutor-4692-thread-1-processing-x:props) [    x:props] o.a.s.h.c.SpellCheckComponent Loading spell index for spellchecker: default
   [junit4]   2> 1329663 INFO  (searcherExecutor-4692-thread-1-processing-x:props) [    x:props] o.a.s.h.c.SpellCheckComponent Loading spell index for spellchecker: direct
   [junit4]   2> 1329663 INFO  (searcherExecutor-4692-thread-1-processing-x:props) [    x:props] o.a.s.h.c.SpellCheckComponent Loading spell index for spellchecker: wordbreak
   [junit4]   2> 1329663 INFO  (searcherExecutor-4692-thread-1-processing-x:props) [    x:props] o.a.s.h.c.SpellCheckComponent Loading spell index for spellchecker: multipleFields
   [junit4]   2> 1329663 INFO  (TEST-CoreAdminHandlerTest.testCoreAdminHandler-seed#[6F883A3AE5716BD7]) [    x:props] o.a.s.u.UpdateLog Could not find max version in index or recent updates, using new clock 1551280056183029760
   [junit4]   2> 1329665 INFO  (searcherExecutor-4692-thread-1-processing-x:props) [    x:props] o.a.s.h.c.SpellCheckComponent Loading spell index for spellchecker: jarowinkler
   [junit4]   2> 1329665 INFO  (searcherExecutor-4692-thread-1-processing-x:props) [    x:props] o.a.s.h.c.SpellCheckComponent Loading spell index for spellchecker: external
   [junit4]   2> 1329666 INFO  (searcherExecutor-4692-thread-1-processing-x:props) [    x:props] o.a.s.h.c.SpellCheckComponent Loading spell index for spellchecker: freq
   [junit4]   2> 1329666 INFO  (searcherExecutor-4692-thread-1-processing-x:props) [    x:props] o.a.s.h.c.SpellCheckComponent Loading spell index for spellchecker: fqcn
   [junit4]   2> 1329666 INFO  (searcherExecutor-4692-thread-1-processing-x:props) [    x:props] o.a.s.h.c.SpellCheckComponent Loading spell index for spellchecker: perDict
   [junit4]   2> 1329666 INFO  (TEST-CoreAdminHandlerTest.testCoreAdminHandler-seed#[6F883A3AE5716BD7]) [    ] o.a.s.h.a.CoreAdminOperation core create command name=bogus_dir_core&action=CREATE&instanceDir=dir_does_not_exist_127896&wt=xml
   [junit4]   2> 1329667 INFO  (searcherExecutor-4692-thread-1-processing-x:props) [    x:props] o.a.s.c.SolrCore [props] Registered new searcher Searcher@43c6571f[props] main{ExitableDirectoryReader(UninvertingDirectoryReader())}
   [junit4]   2> 1329675 ERROR (TEST-CoreAdminHandlerTest.testCoreAdminHandler-seed#[6F883A3AE5716BD7]) [    ] o.a.s.c.CoreContainer Error creating core [bogus_dir_core]: Could not load conf for core bogus_dir_core: Error loading solr config from C:\Users\jenkins\workspace\Lucene-Solr-master-Windows\solr\core\src\test-files\solr\dir_does_not_exist_127896\conf\solrconfig.xml
   [junit4]   2> org.apache.solr.common.SolrException: Could not load conf for core bogus_dir_core: Error loading solr config from C:\Users\jenkins\workspace\Lucene-Solr-master-Windows\solr\core\src\test-files\solr\dir_does_not_exist_127896\conf\solrconfig.xml
   [junit4]   2> 	at org.apache.solr.core.ConfigSetService.getConfig(ConfigSetService.java:85)
   [junit4]   2> 	at org.apache.solr.core.CoreContainer.create(CoreContainer.java:866)
   [junit4]   2> 	at org.apache.solr.core.CoreContainer.create(CoreContainer.java:805)
   [junit4]   2> 	at org.apache.solr.handler.admin.CoreAdminOperation.lambda$static$0(CoreAdminOperation.java:88)
   [junit4]   2> 	at org.apache.solr.handler.admin.CoreAdminOperation.execute(CoreAdminOperation.java:377)
   [junit4]   2> 	at org.apache.solr.handler.admin.CoreAdminHandler$CallInfo.call(CoreAdminHandler.java:365)
   [junit4]   2> 	at org.apache.solr.handler.admin.CoreAdminHandler.handleRequestBody(CoreAdminHandler.java:156)
   [junit4]   2> 	at org.apache.solr.handler.admin.CoreAdminHandlerTest.testCoreAdminHandler(CoreAdminHandlerTest.java:171)
   [junit4]   2> 	at sun.reflect.NativeMethodAccessorImpl.invoke0(Native Method)
   [junit4]   2> 	at sun.reflect.NativeMethodAccessorImpl.invoke(NativeMethodAccessorImpl.java:62)
   [junit4]   2> 	at sun.reflect.DelegatingMethodAccessorImpl.invoke(DelegatingMethodAccessorImpl.java:43)
   [junit4]   2> 	at java.lang.reflect.Method.invoke(Method.java:498)
   [junit4]   2> 	at com.carrotsearch.randomizedtesting.RandomizedRunner.invoke(RandomizedRunner.java:1713)
   [junit4]   2> 	at com.carrotsearch.randomizedtesting.RandomizedRunner$8.evaluate(RandomizedRunner.java:907)
   [junit4]   2> 	at com.carrotsearch.randomizedtesting.RandomizedRunner$9.evaluate(RandomizedRunner.java:943)
   [junit4]   2> 	at com.carrotsearch.randomizedtesting.RandomizedRunner$10.evaluate(RandomizedRunner.java:957)
   [junit4]   2> 	at com.carrotsearch.randomizedtesting.rules.SystemPropertiesRestoreRule$1.evaluate(SystemPropertiesRestoreRule.java:57)
   [junit4]   2> 	at org.apache.lucene.util.TestRuleSetupTeardownChained$1.evaluate(TestRuleSetupTeardownChained.java:49)
   [junit4]   2> 	at org.apache.lucene.util.AbstractBeforeAfterRule$1.evaluate(AbstractBeforeAfterRule.java:45)
   [junit4]   2> 	at org.apache.lucene.util.TestRuleThreadAndTestName$1.evaluate(TestRuleThreadAndTestName.java:48)
   [junit4]   2> 	at org.apache.lucene.util.TestRuleIgnoreAfterMaxFailures$1.evaluate(TestRuleIgnoreAfterMaxFailures.java:64)
   [junit4]   2> 	at org.apache.lucene.util.TestRuleMarkFailure$1.evaluate(TestRuleMarkFailure.java:47)
   [junit4]   2> 	at com.carrotsearch.randomizedtesting.rules.StatementAdapter.evaluate(StatementAdapter.java:36)
   [junit4]   2> 	at com.carrotsearch.randomizedtesting.ThreadLeakControl$StatementRunner.run(ThreadLeakControl.java:367)
   [junit4]   2> 	at com.carrotsearch.randomizedtesting.ThreadLeakControl.forkTimeoutingTask(ThreadLeakControl.java:811)
   [junit4]   2> 	at com.carrotsearch.randomizedtesting.ThreadLeakControl$3.evaluate(ThreadLeakControl.java:462)
   [junit4]   2> 	at com.carrotsearch.randomizedtesting.RandomizedRunner.runSingleTest(RandomizedRunner.java:916)
   [junit4]   2> 	at com.carrotsearch.randomizedtesting.RandomizedRunner$5.evaluate(RandomizedRunner.java:802)
   [junit4]   2> 	at com.carrotsearch.randomizedtesting.RandomizedRunner$6.evaluate(RandomizedRunner.java:852)
   [junit4]   2> 	at com.carrotsearch.randomizedtesting.RandomizedRunner$7.evaluate(RandomizedRunner.java:863)
   [junit4]   2> 	at com.carrotsearch.randomizedtesting.rules.StatementAdapter.evaluate(StatementAdapter.java:36)
   [junit4]   2> 	at com.carrotsearch.randomizedtesting.rules.SystemPropertiesRestoreRule$1.evaluate(SystemPropertiesRestoreRule.java:57)
   [junit4]   2> 	at org.apache.lucene.util.AbstractBeforeAfterRule$1.evaluate(AbstractBeforeAfterRule.java:45)
   [junit4]   2> 	at com.carrotsearch.randomizedtesting.rules.StatementAdapter.evaluate(StatementAdapter.java:36)
   [junit4]   2> 	at org.apache.lucene.util.TestRuleStoreClassName$1.evaluate(TestRuleStoreClassName.java:41)
   [junit4]   2> 	at com.carrotsearch.randomizedtesting.rules.NoShadowingOrOverridesOnMethodsRule$1.evaluate(NoShadowingOrOverridesOnMethodsRule.java:40)
   [junit4]   2> 	at com.carrotsearch.randomizedtesting.rules.NoShadowingOrOverridesOnMethodsRule$1.evaluate(NoShadowingOrOverridesOnMethodsRule.java:40)
   [junit4]   2> 	at com.carrotsearch.randomizedtesting.rules.StatementAdapter.evaluate(StatementAdapter.java:36)
   [junit4]   2> 	at com.carrotsearch.randomizedtesting.rules.StatementAdapter.evaluate(StatementAdapter.java:36)
   [junit4]   2> 	at com.carrotsearch.randomizedtesting.rules.StatementAdapter.evaluate(StatementAdapter.java:36)
   [junit4]   2> 	at org.apache.lucene.util.TestRuleAssertionsRequired$1.evaluate(TestRuleAssertionsRequired.java:53)
   [junit4]   2> 	at org.apache.lucene.util.TestRuleMarkFailure$1.evaluate(TestRuleMarkFailure.java:47)
   [junit4]   2> 	at org.apache.lucene.util.TestRuleIgnoreAfterMaxFailures$1.evaluate(TestRuleIgnoreAfterMaxFailures.java:64)
   [junit4]   2> 	at org.apache.lucene.util.TestRuleIgnoreTestSuites$1.evaluate(TestRuleIgnoreTestSuites.java:54)
   [junit4]   2> 	at com.carrotsearch.randomizedtesting.rules.StatementAdapter.evaluate(StatementAdapter.java:36)
   [junit4]   2> 	at com.carrotsearch.randomizedtesting.ThreadLeakControl$StatementRunner.run(ThreadLeakControl.java:367)
   [junit4]   2> 	at java.lang.Thread.run(Thread.java:745)
   [junit4]   2> Caused by: org.apache.solr.common.SolrException: Error loading solr config from C:\Users\jenkins\workspace\Lucene-Solr-master-Windows\solr\core\src\test-files\solr\dir_does_not_exist_127896\conf\solrconfig.xml
   [junit4]   2> 	at org.apache.solr.core.SolrConfig.readFromResourceLoader(SolrConfig.java:187)
   [junit4]   2> 	at org.apache.solr.core.ConfigSetService.createSolrConfig(ConfigSetService.java:97)
   [junit4]   2> 	at org.apache.solr.core.ConfigSetService.getConfig(ConfigSetService.java:77)
   [junit4]   2> 	... 46 more
   [junit4]   2> Caused by: org.apache.solr.core.SolrResourceNotFoundException: Can't find resource 'solrconfig.xml' in classpath or 'C:\Users\jenkins\workspace\Lucene-Solr-master-Windows\solr\core\src\test-files\solr\dir_does_not_exist_127896'
   [junit4]   2> 	at org.apache.solr.core.SolrResourceLoader.openResource(SolrResourceLoader.java:406)
   [junit4]   2> 	at org.apache.solr.core.SolrResourceLoader.openConfig(SolrResourceLoader.java:361)
   [junit4]   2> 	at org.apache.solr.core.Config.<init>(Config.java:120)
   [junit4]   2> 	at org.apache.solr.core.Config.<init>(Config.java:90)
   [junit4]   2> 	at org.apache.solr.core.SolrConfig.<init>(SolrConfig.java:202)
   [junit4]   2> 	at org.apache.solr.core.SolrConfig.readFromResourceLoader(SolrConfig.java:179)
   [junit4]   2> 	... 48 more
   [junit4]   2> 1329677 INFO  (TEST-CoreAdminHandlerTest.testCoreAdminHandler-seed#[6F883A3AE5716BD7]) [    ] o.a.s.SolrTestCaseJ4 ###Ending testCoreAdminHandler
   [junit4]   2> 1329681 INFO  (TEST-CoreAdminHandlerTest.testDeleteInstanceDirAfterCreateFailure-seed#[6F883A3AE5716BD7]) [    ] o.a.s.SolrTestCaseJ4 ###Starting testDeleteInstanceDirAfterCreateFailure
   [junit4]   2> 1329703 INFO  (TEST-CoreAdminHandlerTest.testDeleteInstanceDirAfterCreateFailure-seed#[6F883A3AE5716BD7]) [    ] o.e.j.s.Server jetty-9.3.8.v20160314
   [junit4]   2> 1329705 INFO  (TEST-CoreAdminHandlerTest.testDeleteInstanceDirAfterCreateFailure-seed#[6F883A3AE5716BD7]) [    ] o.e.j.s.h.ContextHandler Started o.e.j.s.ServletContextHandler@5f364a75{/solr,null,AVAILABLE}
   [junit4]   2> 1329705 INFO  (TEST-CoreAdminHandlerTest.testDeleteInstanceDirAfterCreateFailure-seed#[6F883A3AE5716BD7]) [    ] o.e.j.s.ServerConnector Started ServerConnector@511a9809{HTTP/1.1,[http/1.1]}{127.0.0.1:61137}
   [junit4]   2> 1329706 INFO  (TEST-CoreAdminHandlerTest.testDeleteInstanceDirAfterCreateFailure-seed#[6F883A3AE5716BD7]) [    ] o.e.j.s.Server Started @1334423ms
   [junit4]   2> 1329706 INFO  (TEST-CoreAdminHandlerTest.testDeleteInstanceDirAfterCreateFailure-seed#[6F883A3AE5716BD7]) [    ] o.a.s.c.s.e.JettySolrRunner Jetty properties: {hostContext=/solr, hostPort=61137}
   [junit4]   2> 1329706 ERROR (TEST-CoreAdminHandlerTest.testDeleteInstanceDirAfterCreateFailure-seed#[6F883A3AE5716BD7]) [    ] o.a.s.s.StartupLoggingUtils Missing Java Option solr.log.dir. Logging may be missing or incomplete.
   [junit4]   2> 1329707 INFO  (TEST-CoreAdminHandlerTest.testDeleteInstanceDirAfterCreateFailure-seed#[6F883A3AE5716BD7]) [    ] o.a.s.s.SolrDispatchFilter  ___      _       Welcome to Apache Solr? version 7.0.0
   [junit4]   2> 1329707 INFO  (TEST-CoreAdminHandlerTest.testDeleteInstanceDirAfterCreateFailure-seed#[6F883A3AE5716BD7]) [    ] o.a.s.s.SolrDispatchFilter / __| ___| |_ _   Starting in standalone mode on port null
   [junit4]   2> 1329707 INFO  (TEST-CoreAdminHandlerTest.testDeleteInstanceDirAfterCreateFailure-seed#[6F883A3AE5716BD7]) [    ] o.a.s.s.SolrDispatchFilter \__ \/ _ \ | '_|  Install dir: null
   [junit4]   2> 1329707 INFO  (TEST-CoreAdminHandlerTest.testDeleteInstanceDirAfterCreateFailure-seed#[6F883A3AE5716BD7]) [    ] o.a.s.s.SolrDispatchFilter |___/\___/_|_|    Start time: 2016-11-17T20:52:27.179Z
   [junit4]   2> 1329709 INFO  (TEST-CoreAdminHandlerTest.testDeleteInstanceDirAfterCreateFailure-seed#[6F883A3AE5716BD7]) [    ] o.a.s.c.SolrXmlConfig Loading container configuration from C:\Users\jenkins\workspace\Lucene-Solr-master-Windows\solr\build\solr-core\test\J1\temp\solr.handler.admin.CoreAdminHandlerTest_6F883A3AE5716BD7-001\init-core-data-001\org.apache.solr.handler.admin.CoreAdminHandlerTest-corex-125465688241789\solr.xml
   [junit4]   2> 1329728 INFO  (TEST-CoreAdminHandlerTest.testDeleteInstanceDirAfterCreateFailure-seed#[6F883A3AE5716BD7]) [    ] o.a.s.c.CorePropertiesLocator Found 1 core definitions underneath C:\Users\jenkins\workspace\Lucene-Solr-master-Windows\solr\build\solr-core\test\J1\temp\solr.handler.admin.CoreAdminHandlerTest_6F883A3AE5716BD7-001\init-core-data-001\org.apache.solr.handler.admin.CoreAdminHandlerTest-corex-125465688241789\.
   [junit4]   2> 1329728 INFO  (TEST-CoreAdminHandlerTest.testDeleteInstanceDirAfterCreateFailure-seed#[6F883A3AE5716BD7]) [    ] o.a.s.c.CorePropertiesLocator Cores are: [corex]
   [junit4]   2> 1329760 INFO  (coreLoadExecutor-4702-thread-1) [    ] o.a.s.c.SolrConfig Using Lucene MatchVersion: 7.0.0
   [junit4]   2> 1329778 INFO  (coreLoadExecutor-4702-thread-1) [    ] o.a.s.s.IndexSchema [corex] Schema name=test
   [junit4]   2> 1329867 WARN  (coreLoadExecutor-4702-thread-1) [    ] o.a.s.s.IndexSchema [corex] default search field in schema is text. WARNING: Deprecated, please use 'df' on request instead.
   [junit4]   2> 1329869 INFO  (coreLoadExecutor-4702-thread-1) [    ] o.a.s.s.IndexSchema Loaded schema test/1.0 with uniqueid field id
   [junit4]   2> 1329884 INFO  (coreLoadExecutor-4702-thread-1) [    ] o.a.s.c.CoreContainer Creating SolrCore 'corex' using configuration from instancedir C:\Users\jenkins\workspace\Lucene-Solr-master-Windows\solr\build\solr-core\test\J1\temp\solr.handler.admin.CoreAdminHandlerTest_6F883A3AE5716BD7-001\init-core-data-001\org.apache.solr.handler.admin.CoreAdminHandlerTest-corex-125465688241789\.\corex
   [junit4]   2> 1329885 INFO  (coreLoadExecutor-4702-thread-1) [    x:corex] o.a.s.c.SolrCore [[corex] ] Opening new SolrCore at [C:\Users\jenkins\workspace\Lucene-Solr-master-Windows\solr\build\solr-core\test\J1\temp\solr.handler.admin.CoreAdminHandlerTest_6F883A3AE5716BD7-001\init-core-data-001\org.apache.solr.handler.admin.CoreAdminHandlerTest-corex-125465688241789\corex], dataDir=[C:\Users\jenkins\workspace\Lucene-Solr-master-Windows\solr\build\solr-core\test\J1\temp\solr.handler.admin.CoreAdminHandlerTest_6F883A3AE5716BD7-001\init-core-data-001\org.apache.solr.handler.admin.CoreAdminHandlerTest-corex-125465688241789\.\corex\data\]
   [junit4]   2> 1329885 INFO  (coreLoadExecutor-4702-thread-1) [    x:corex] o.a.s.c.JmxMonitoredMap JMX monitoring is enabled. Adding Solr mbeans to JMX Server: com.sun.jmx.mbeanserver.JmxMBeanServer@151687c8
   [junit4]   2> 1329885 INFO  (coreLoadExecutor-4702-thread-1) [    x:corex] o.a.s.u.RandomMergePolicy RandomMergePolicy wrapping class org.apache.lucene.index.LogByteSizeMergePolicy: [LogByteSizeMergePolicy: minMergeSize=1677721, mergeFactor=25, maxMergeSize=2147483648, maxMergeSizeForForcedMerge=9223372036854775807, calibrateSizeByDeletes=false, maxMergeDocs=2147483647, maxCFSSegmentSizeMB=8.796093022207999E12, noCFSRatio=0.0]
   [junit4]   2> 1329902 INFO  (coreLoadExecutor-4702-thread-1) [    x:corex] o.a.s.u.UpdateHandler Using UpdateLog implementation: org.apache.solr.update.UpdateLog
   [junit4]   2> 1329902 INFO  (coreLoadExecutor-4702-thread-1) [    x:corex] o.a.s.u.UpdateLog Initializing UpdateLog: dataDir= defaultSyncLevel=FLUSH numRecordsToKeep=100 maxNumLogsToKeep=10 numVersionBuckets=65536
   [junit4]   2> 1329903 INFO  (coreLoadExecutor-4702-thread-1) [    x:corex] o.a.s.u.CommitTracker Hard AutoCommit: disabled
   [junit4]   2> 1329903 INFO  (coreLoadExecutor-4702-thread-1) [    x:corex] o.a.s.u.CommitTracker Soft AutoCommit: disabled
   [junit4]   2> 1329905 INFO  (coreLoadExecutor-4702-thread-1) [    x:corex] o.a.s.u.RandomMergePolicy RandomMergePolicy wrapping class org.apache.lucene.index.TieredMergePolicy: [TieredMergePolicy: maxMergeAtOnce=47, maxMergeAtOnceExplicit=37, maxMergedSegmentMB=3.931640625, floorSegmentMB=0.59375, forceMergeDeletesPctAllowed=7.409407998606444, segmentsPerTier=45.0, maxCFSSegmentSizeMB=8.796093022207999E12, noCFSRatio=1.0
   [junit4]   2> 1329905 INFO  (coreLoadExecutor-4702-thread-1) [    x:corex] o.a.s.s.SolrIndexSearcher Opening [Searcher@2b3106be[corex] main]
   [junit4]   2> 1329905 INFO  (coreLoadExecutor-4702-thread-1) [    x:corex] o.a.s.h.c.SpellCheckComponent Initializing spell checkers
   [junit4]   2> 1329913 INFO  (coreLoadExecutor-4702-thread-1) [    x:corex] o.a.s.s.DirectSolrSpellChecker init: {name=direct,classname=DirectSolrSpellChecker,field=lowerfilt,minQueryLength=3}
   [junit4]   2> 1329951 INFO  (coreLoadExecutor-4702-thread-1) [    x:corex] o.a.s.h.ReplicationHandler Commits will be reserved for  10000
   [junit4]   2> 1329951 INFO  (searcherExecutor-4703-thread-1-processing-x:corex) [    x:corex] o.a.s.h.c.SpellCheckComponent Loading spell index for spellchecker: default
   [junit4]   2> 1329952 INFO  (coreLoadExecutor-4702-thread-1) [    x:corex] o.a.s.u.UpdateLog Could not find max version in index or recent updates, using new clock 1551280056486068224
   [junit4]   2> 1329952 INFO  (searcherExecutor-4703-thread-1-processing-x:corex) [    x:corex] o.a.s.h.c.SpellCheckComponent Loading spell index for spellchecker: direct
   [junit4]   2> 1329952 INFO  (searcherExecutor-4703-thread-1-processing-x:corex) [    x:corex] o.a.s.h.c.SpellCheckComponent Loading spell index for spellchecker: wordbreak
   [junit4]   2> 1329952 INFO  (searcherExecutor-4703-thread-1-processing-x:corex) [    x:corex] o.a.s.h.c.SpellCheckComponent Loading spell index for spellchecker: multipleFields
   [junit4]   2> 1329952 INFO  (searcherExecutor-4703-thread-1-processing-x:corex) [    x:corex] o.a.s.h.c.SpellCheckComponent Loading spell index for spellchecker: jarowinkler
   [junit4]   2> 1329953 INFO  (searcherExecutor-4703-thread-1-processing-x:corex) [    x:corex] o.a.s.h.c.SpellCheckComponent Loading spell index for spellchecker: external
   [junit4]   2> 1329953 INFO  (searcherExecutor-4703-thread-1-processing-x:corex) [    x:corex] o.a.s.h.c.SpellCheckComponent Loading spell index for spellchecker: freq
   [junit4]   2> 1329954 INFO  (searcherExecutor-4703-thread-1-processing-x:corex) [    x:corex] o.a.s.h.c.SpellCheckComponent Loading spell index for spellchecker: fqcn
   [junit4]   2> 1329954 INFO  (searcherExecutor-4703-thread-1-processing-x:corex) [    x:corex] o.a.s.h.c.SpellCheckComponent Loading spell index for spellchecker: perDict
   [junit4]   2> 1329954 INFO  (searcherExecutor-4703-thread-1-processing-x:corex) [    x:corex] o.a.s.c.SolrCore [corex] Registered new searcher Searcher@2b3106be[corex] main{ExitableDirectoryReader(UninvertingDirectoryReader())}
   [junit4]   2> 1330234 INFO  (qtp1154552803-9692) [    x:corex] o.a.s.u.p.LogUpdateProcessorFactory [corex]  webapp=/solr path=/update params={wt=javabin&version=2}{add=[123 (1551280056779669504)]} 0 2
   [junit4]   2> 1330235 INFO  (qtp1154552803-9693) [    x:corex] o.a.s.u.DirectUpdateHandler2 start commit{,optimize=false,openSearcher=true,waitSearcher=true,expungeDeletes=false,softCommit=false,prepareCommit=false}
   [junit4]   2> 1330235 INFO  (qtp1154552803-9693) [    x:corex] o.a.s.u.SolrIndexWriter Calling setCommitData with IW:org.apache.solr.update.SolrIndexWriter@162dbfa6
   [junit4]   2> 1330240 INFO  (qtp1154552803-9693) [    x:corex] o.a.s.s.SolrIndexSearcher Opening [Searcher@1d14934b[corex] main]
   [junit4]   2> 1330241 INFO  (qtp1154552803-9693) [    x:corex] o.a.s.u.DirectUpdateHandler2 end_commit_flush
   [junit4]   2> 1330242 INFO  (searcherExecutor-4703-thread-1-processing-x:corex) [    x:corex] o.a.s.c.SolrCore [corex] Registered new searcher Searcher@1d14934b[corex] main{ExitableDirectoryReader(UninvertingDirectoryReader(Uninverting(_0(7.0.0):C1)))}
   [junit4]   2> 1330242 INFO  (qtp1154552803-9693) [    x:corex] o.a.s.u.p.LogUpdateProcessorFactory [corex]  webapp=/solr path=/update params={waitSearcher=true&commit=true&softCommit=false&wt=javabin&version=2}{commit=} 0 7
   [junit4]   2> 1330246 INFO  (qtp1154552803-9697) [    ] o.a.s.s.HttpSolrCall [admin] webapp=null path=/admin/cores params={action=STATUS&indexInfo=true&wt=javabin&version=2} status=0 QTime=0
   [junit4]   2> 1330273 INFO  (qtp1154552803-9692) [    ] o.a.s.c.SolrConfig Using Lucene MatchVersion: 7.0.0
   [junit4]   2> 1330289 INFO  (qtp1154552803-9692) [    ] o.a.s.s.IndexSchema [corex] Schema name=test
   [junit4]   2> 1330380 WARN  (qtp1154552803-9692) [    ] o.a.s.s.IndexSchema [corex] default search field in schema is text. WARNING: Deprecated, please use 'df' on request instead.
   [junit4]   2> 1330382 INFO  (qtp1154552803-9692) [    ] o.a.s.s.IndexSchema Loaded schema test/1.0 with uniqueid field id
   [junit4]   2> 1330391 INFO  (qtp1154552803-9692) [    ] o.a.s.c.CoreContainer Reloading SolrCore 'corex' using configuration from instancedir C:\Users\jenkins\workspace\Lucene-Solr-master-Windows\solr\build\solr-core\test\J1\temp\solr.handler.admin.CoreAdminHandlerTest_6F883A3AE5716BD7-001\init-core-data-001\org.apache.solr.handler.admin.CoreAdminHandlerTest-corex-125465688241789\.\corex
   [junit4]   2> 1330392 INFO  (qtp1154552803-9692) [    x:corex] o.a.s.c.SolrCore [[corex] ] Opening new SolrCore at [C:\Users\jenkins\workspace\Lucene-Solr-master-Windows\solr\build\solr-core\test\J1\temp\solr.handler.admin.CoreAdminHandlerTest_6F883A3AE5716BD7-001\init-core-data-001\org.apache.solr.handler.admin.CoreAdminHandlerTest-corex-125465688241789\corex], dataDir=[C:\Users\jenkins\workspace\Lucene-Solr-master-Windows\solr\build\solr-core\test\J1\temp\solr.handler.admin.CoreAdminHandlerTest_6F883A3AE5716BD7-001\init-core-data-001\org.apache.solr.handler.admin.CoreAdminHandlerTest-corex-125465688241789\.\corex\data\]
   [junit4]   2> 1330414 INFO  (qtp1154552803-9692) [    x:corex] o.a.s.c.SolrCore [corex]  CLOSING SolrCore org.apache.solr.core.SolrCore@19dd0949
   [junit4]   2> 1330415 ERROR (qtp1154552803-9692) [    x:corex] o.a.s.h.RequestHandlerBase org.apache.solr.common.SolrException: Error handling 'reload' action
   [junit4]   2> 	at org.apache.solr.handler.admin.CoreAdminOperation.lambda$static$2(CoreAdminOperation.java:114)
   [junit4]   2> 	at org.apache.solr.handler.admin.CoreAdminOperation.execute(CoreAdminOperation.java:377)
   [junit4]   2> 	at org.apache.solr.handler.admin.CoreAdminHandler$CallInfo.call(CoreAdminHandler.java:365)
   [junit4]   2> 	at org.apache.solr.handler.admin.CoreAdminHandler.handleRequestBody(CoreAdminHandler.java:156)
   [junit4]   2> 	at org.apache.solr.handler.RequestHandlerBase.handleRequest(RequestHandlerBase.java:153)
   [junit4]   2> 	at org.apache.solr.servlet.HttpSolrCall.handleAdminRequest(HttpSolrCall.java:664)
   [junit4]   2> 	at org.apache.solr.servlet.HttpSolrCall.call(HttpSolrCall.java:445)
   [junit4]   2> 	at org.apache.solr.servlet.SolrDispatchFilter.doFilter(SolrDispatchFilter.java:303)
   [junit4]   2> 	at org.apache.solr.servlet.SolrDispatchFilter.doFilter(SolrDispatchFilter.java:254)
   [junit4]   2> 	at org.eclipse.jetty.servlet.ServletHandler$CachedChain.doFilter(ServletHandler.java:1676)
   [junit4]   2> 	at org.apache.solr.client.solrj.embedded.JettySolrRunner$DebugFilter.doFilter(JettySolrRunner.java:113)
   [junit4]   2> 	at org.eclipse.jetty.servlet.ServletHandler$CachedChain.doFilter(ServletHandler.java:1676)
   [junit4]   2> 	at org.eclipse.jetty.servlet.ServletHandler.doHandle(ServletHandler.java:581)
   [junit4]   2> 	at org.eclipse.jetty.server.session.SessionHandler.doHandle(SessionHandler.java:224)
   [junit4]   2> 	at org.eclipse.jetty.server.handler.ContextHandler.doHandle(ContextHandler.java:1160)
   [junit4]   2> 	at org.eclipse.jetty.servlet.ServletHandler.doScope(ServletHandler.java:511)
   [junit4]   2> 	at org.eclipse.jetty.server.session.SessionHandler.doScope(SessionHandler.java:185)
   [junit4]   2> 	at org.eclipse.jetty.server.handler.ContextHandler.doScope(ContextHandler.java:1092)
   [junit4]   2> 	at org.eclipse.jetty.server.handler.ScopedHandler.handle(ScopedHandler.java:141)
   [junit4]   2> 	at org.eclipse.jetty.server.handler.gzip.GzipHandler.handle(GzipHandler.java:462)
   [junit4]   2> 	at org.eclipse.jetty.server.handler.HandlerWrapper.handle(HandlerWrapper.java:134)
   [junit4]   2> 	at org.eclipse.jetty.server.Server.handle(Server.java:518)
   [junit4]   2> 	at org.eclipse.jetty.server.HttpChannel.handle(HttpChannel.java:308)
   [junit4]   2> 	at org.eclipse.jetty.server.HttpConnection.onFillable(HttpConnection.java:244)
   [junit4]   2> 	at org.eclipse.jetty.io.AbstractConnection$ReadCallback.succeeded(AbstractConnection.java:273)
   [junit4]   2> 	at org.eclipse.jetty.io.FillInterest.fillable(FillInterest.java:95)
   [junit4]   2> 	at org.eclipse.jetty.io.SelectChannelEndPoint$2.run(SelectChannelEndPoint.java:93)
   [junit4]   2> 	at org.eclipse.jetty.util.thread.strategy.ExecuteProduceConsume.produceAndRun(ExecuteProduceConsume.java:246)
   [junit4]   2> 	at org.eclipse.jetty.util.thread.strategy.ExecuteProduceConsume.run(ExecuteProduceConsume.java:156)
   [junit4]   2> 	at org.eclipse.jetty.util.thread.QueuedThreadPool.runJob(QueuedThreadPool.java:654)
   [junit4]   2> 	at org.eclipse.jetty.util.thread.QueuedThreadPool$3.run(QueuedThreadPool.java:572)
   [junit4]   2> 	at java.lang.Thread.run(Thread.java:745)
   [junit4]   2> Caused by: org.apache.solr.common.SolrException: Unable to reload core [corex]
   [junit4]   2> 	at org.apache.solr.core.CoreContainer.reload(CoreContainer.java:976)
   [junit4]   2> 	at org.apache.solr.handler.admin.CoreAdminOperation.lambda$static$2(CoreAdminOperation.java:112)
   [junit4]   2> 	... 31 more
   [junit4]   2> Caused by: org.apache.solr.common.SolrException: Doing my job, throwing a java.lang.Error
   [junit4]   2> 	at org.apache.solr.core.SolrCore.<init>(SolrCore.java:918)
   [junit4]   2> 	at org.apache.solr.core.SolrCore.reload(SolrCore.java:590)
   [junit4]   2> 	at org.apache.solr.core.CoreContainer.reload(CoreContainer.java:970)
   [junit4]   2> 	... 32 more
   [junit4]   2> Caused by: java.lang.Error: Doing my job, throwing a java.lang.Error
   [junit4]   2> 	at org.apache.solr.handler.ThrowErrorOnInitRequestHandler.init(ThrowErrorOnInitRequestHandler.java:45)
   [junit4]   2> 	at org.apache.solr.core.PluginBag.initInstance(PluginBag.java:97)
   [junit4]   2> 	at org.apache.solr.core.PluginBag.createPlugin(PluginBag.java:127)
   [junit4]   2> 	at org.apache.solr.core.PluginBag.init(PluginBag.java:226)
   [junit4]   2> 	at org.apache.solr.core.RequestHandlers.initHandlersFromConfig(RequestHandlers.java:130)
   [junit4]   2> 	at org.apache.solr.core.SolrCore.<init>(SolrCore.java:877)
   [junit4]   2> 	... 34 more
   [junit4]   2> 
   [junit4]   2> 1330415 INFO  (qtp1154552803-9692) [    x:corex] o.a.s.s.HttpSolrCall [admin] webapp=null path=/admin/cores params={core=corex&action=RELOAD&indexInfo=true&wt=javabin&version=2} status=500 QTime=160
   [junit4]   2> 1330416 ERROR (qtp1154552803-9692) [    x:corex] o.a.s.s.HttpSolrCall null:org.apache.solr.common.SolrException: Error handling 'reload' action
   [junit4]   2> 	at org.apache.solr.handler.admin.CoreAdminOperation.lambda$static$2(CoreAdminOperation.java:114)
   [junit4]   2> 	at org.apache.solr.handler.admin.CoreAdminOperation.execute(CoreAdminOperation.java:377)
   [junit4]   2> 	at org.apache.solr.handler.admin.CoreAdminHandler$CallInfo.call(CoreAdminHandler.java:365)
   [junit4]   2> 	at org.apache.solr.handler.admin.CoreAdminHandler.handleRequestBody(CoreAdminHandler.java:156)
   [junit4]   2> 	at org.apache.solr.handler.RequestHandlerBase.handleRequest(RequestHandlerBase.java:153)
   [junit4]   2> 	at org.apache.solr.servlet.HttpSolrCall.handleAdminRequest(HttpSolrCall.java:664)
   [junit4]   2> 	at org.apache.solr.servlet.HttpSolrCall.call(HttpSolrCall.java:445)
   [junit4]   2> 	at org.apache.solr.servlet.SolrDispatchFilter.doFilter(SolrDispatchFilter.java:303)
   [junit4]   2> 	at org.apache.solr.servlet.SolrDispatchFilter.doFilter(SolrDispatchFilter.java:254)
   [junit4]   2> 	at org.eclipse.jetty.servlet.ServletHandler$CachedChain.doFilter(ServletHandler.java:1676)
   [junit4]   2> 	at org.apache.solr.client.solrj.embedded.JettySolrRunner$DebugFilter.doFilter(JettySolrRunner.java:113)
   [junit4]   2> 	at org.eclipse.jetty.servlet.ServletHandler$CachedChain.doFilter(ServletHandler.java:1676)
   [junit4]   2> 	at org.eclipse.jetty.servlet.ServletHandler.doHandle(ServletHandler.java:581)
   [junit4]   2> 	at org.eclipse.jetty.server.session.SessionHandler.doHandle(SessionHandler.java:224)
   [junit4]   2> 	at org.eclipse.jetty.server.handler.ContextHandler.doHandle(ContextHandler.java:1160)
   [junit4]   2> 	at org.eclipse.jetty.servlet.ServletHandler.doScope(ServletHandler.java:511)
   [junit4]   2> 	at org.eclipse.jetty.server.session.SessionHandler.doScope(SessionHandler.java:185)
   [junit4]   2> 	at org.eclipse.jetty.server.handler.ContextHandler.doScope(ContextHandler.java:1092)
   [junit4]   2> 	at org.eclipse.jetty.server.handler.ScopedHandler.handle(ScopedHandler.java:141)
   [junit4]   2> 	at org.eclipse.jetty.server.handler.gzip.GzipHandler.handle(GzipHandler.java:462)
   [junit4]   2> 	at org.eclipse.jetty.server.handler.HandlerWrapper.handle(HandlerWrapper.java:134)
   [junit4]   2> 	at org.eclipse.jetty.server.Server.handle(Server.java:518)
   [junit4]   2> 	at org.eclipse.jetty.server.HttpChannel.handle(HttpChannel.java:308)
   [junit4]   2> 	at org.eclipse.jetty.server.HttpConnection.onFillable(HttpConnection.java:244)
   [junit4]   2> 	at org.eclipse.jetty.io.AbstractConnection$ReadCallback.succeeded(AbstractConnection.java:273)
   [junit4]   2> 	at org.eclipse.jetty.io.FillInterest.fillable(FillInterest.java:95)
   [junit4]   2> 	at org.eclipse.jetty.io.SelectChannelEndPoint$2.run(SelectChannelEndPoint.java:93)
   [junit4]   2> 	at org.eclipse.jetty.util.thread.strategy.ExecuteProduceConsume.produceAndRun(ExecuteProduceConsume.java:246)
   [junit4]   2> 	at org.eclipse.jetty.util.thread.strategy.ExecuteProduceConsume.run(ExecuteProduceConsume.java:156)
   [junit4]   2> 	at org.eclipse.jetty.util.thread.QueuedThreadPool.runJob(QueuedThreadPool.java:654)
   [junit4]   2> 	at org.eclipse.jetty.util.thread.QueuedThreadPool$3.run(QueuedThreadPool.java:572)
   [junit4]   2> 	at java.lang.Thread.run(Thread.java:745)
   [junit4]   2> Caused by: org.apache.solr.common.SolrException: Unable to reload core [corex]
   [junit4]   2> 	at org.apache.solr.core.CoreContainer.reload(CoreContainer.java:976)
   [junit4]   2> 	at org.apache.solr.handler.admin.CoreAdminOperation.lambda$static$2(CoreAdminOperation.java:112)
   [junit4]   2> 	... 31 more
   [junit4]   2> Caused by: org.apache.solr.common.SolrException: Doing my job, throwing a java.lang.Error
   [junit4]   2> 	at org.apache.solr.core.SolrCore.<init>(SolrCore.java:918)
   [junit4]   2> 	at org.apache.solr.core.SolrCore.reload(SolrCore.java:590)
   [junit4]   2> 	at org.apache.solr.core.CoreContainer.reload(CoreContainer.java:970)
   [junit4]   2> 	... 32 more
   [junit4]   2> Caused by: java.lang.Error: Doing my job, throwing a java.lang.Error
   [junit4]   2> 	at org.apache.solr.handler.ThrowErrorOnInitRequestHandler.init(ThrowErrorOnInitRequestHandler.java:45)
   [junit4]   2> 	at org.apache.solr.core.PluginBag.initInstance(PluginBag.java:97)
   [junit4]   2> 	at org.apache.solr.core.PluginBag.createPlugin(PluginBag.java:127)
   [junit4]   2> 	at org.apache.solr.core.PluginBag.init(PluginBag.java:226)
   [junit4]   2> 	at org.apache.solr.core.RequestHandlers.initHandlersFromConfig(RequestHandlers.java:130)
   [junit4]   2> 	at org.apache.solr.core.SolrCore.<init>(SolrCore.java:877)
   [junit4]   2> 	... 34 more
   [junit4]   2> 
   [junit4]   2> 1330449 ERROR (qtp1154552803-9693) [    ] o.a.s.c.SolrCore Failed to delete data dir for unloaded core:corex dir:C:\Users\jenkins\workspace\Lucene-Solr-master-Windows\solr\build\solr-core\test\J1\temp\solr.handler.admin.CoreAdminHandlerTest_6F883A3AE5716BD7-001\init-core-data-001\org.apache.solr.handler.admin.CoreAdminHandlerTest-corex-125465688241789\.\corex\data
   [junit4]   2> 1330449 INFO  (qtp1154552803-9693) [    ] o.a.s.s.HttpSolrCall [admin] webapp=null path=/admin/cores params={deleteInstanceDir=false&core=corex&deleteDataDir=true&action=UNLOAD&indexInfo=true&wt=javabin&version=2&deleteIndex=false} status=0 QTime=32
   [junit4]   2> 1330450 INFO  (TEST-CoreAdminHandlerTest.testDeleteInstanceDirAfterCreateFailure-seed#[6F883A3AE5716BD7]) [    ] o.e.j.s.ServerConnector Stopped ServerConnector@511a9809{HTTP/1.1,[http/1.1]}{127.0.0.1:0}
   [junit4]   2> 1330450 INFO  (TEST-CoreAdminHandlerTest.testDeleteInstanceDirAfterCreateFailure-seed#[6F883A3AE5716BD7]) [    ] o.a.s.c.CoreContainer Shutting down CoreContainer instance=450746587
   [junit4]   2> 1330451 INFO  (coreCloseExecutor-4710-thread-1) [    x:corex] o.a.s.c.SolrCore [corex]  CLOSING SolrCore org.apache.solr.core.SolrCore@3cb10f6d
   [junit4]   2> 1330461 INFO  (TEST-CoreAdminHandlerTest.testDeleteInstanceDirAfterCreateFailure-seed#[6F883A3AE5716BD7]) [    ] o.e.j.s.h.ContextHandler Stopped o.e.j.s.ServletContextHandler@5f364a75{/solr,null,UNAVAILABLE}
   [junit4]   2> 1330464 INFO  (TEST-CoreAdminHandlerTest.testDeleteInstanceDirAfterCreateFailure-seed#[6F883A3AE5716BD7]) [    ] o.a.s.SolrTestCaseJ4 ###Ending testDeleteInstanceDirAfterCreateFailure
   [junit4]   2> NOTE: reproduce with: ant test  -Dtestcase=CoreAdminHandlerTest -Dtests.method=testDeleteInstanceDirAfterCreateFailure -Dtests.seed=6F883A3AE5716BD7 -Dtests.slow=true -Dtests.locale=sq -Dtests.timezone=Indian/Christmas -Dtests.asserts=true -Dtests.file.encoding=ISO-8859-1
   [junit4] FAILURE 0.79s J1 | CoreAdminHandlerTest.testDeleteInstanceDirAfterCreateFailure <<<
   [junit4]    > Throwable #1: java.lang.AssertionError: The data directory was not cleaned up on unload after a failed core reload
   [junit4]    > 	at __randomizedtesting.SeedInfo.seed([6F883A3AE5716BD7:14419876C653B9D6]:0)
   [junit4]    > 	at org.apache.solr.handler.admin.CoreAdminHandlerTest.testDeleteInstanceDirAfterCreateFailure(CoreAdminHandlerTest.java:334)
   [junit4]    > 	at java.lang.Thread.run(Thread.java:745)
   [junit4]   2> 1330467 INFO  (SUITE-CoreAdminHandlerTest-seed#[6F883A3AE5716BD7]-worker) [    ] o.a.s.SolrTestCaseJ4 ###deleteCore
   [junit4]   2> 1330467 INFO  (SUITE-CoreAdminHandlerTest-seed#[6F883A3AE5716BD7]-worker) [    ] o.a.s.c.CoreContainer Shutting down CoreContainer instance=431840208
   [junit4]   2> 1330468 INFO  (coreCloseExecutor-4712-thread-1) [    x:collection1] o.a.s.c.SolrCore [collection1]  CLOSING SolrCore org.apache.solr.core.SolrCore@41b564e3
   [junit4]   2> 1330470 INFO  (coreCloseExecutor-4712-thread-3) [    x:rename_me] o.a.s.c.SolrCore [rename_me]  CLOSING SolrCore org.apache.solr.core.SolrCore@2b0df325
   [junit4]   2> 1330470 INFO  (coreCloseExecutor-4712-thread-2) [    x:org.apache.solr.handler.admin.CoreAdminHandlerTest_sys_vars] o.a.s.c.SolrCore [org.apache.solr.handler.admin.CoreAdminHandlerTest_sys_vars]  CLOSING SolrCore org.apache.solr.core.SolrCore@5db185be
   [junit4]   2> NOTE: leaving temporary files on disk at: C:\Users\jenkins\workspace\Lucene-Solr-master-Windows\solr\build\solr-core\test\J1\temp\solr.handler.admin.CoreAdminHandlerTest_6F883A3AE5716BD7-001
   [junit4]   2> NOTE: test params are: codec=DummyCompressingStoredFields(storedFieldsFormat=CompressingStoredFieldsFormat(compressionMode=DUMMY, chunkSize=8, maxDocsPerChunk=896, blockSize=707), termVectorsFormat=CompressingTermVectorsFormat(compressionMode=DUMMY, chunkSize=8, blockSize=707)), sim=RandomSimilarity(queryNorm=true): {}, locale=sq, timezone=Indian/Christmas
   [junit4]   2> NOTE: Windows 10 10.0 amd64/Oracle Corporation 1.8.0_102 (64-bit)/cpus=3,threads=1,free=188863976,total=412262400
   [junit4]   2> NOTE: All tests run in this JVM: [OverseerCollectionConfigSetProcessorTest, BJQParserTest, TestXmlQParserPlugin, SliceStateTest, TestSolrCloudWithSecureImpersonation, HdfsCollectionsAPIDistributedZkTest, TestClassicSimilarityFactory, HighlighterConfigTest, UpdateParamsTest, SortByFunctionTest, TestHighFrequencyDictionaryFactory, TestFuzzyAnalyzedSuggestions, CleanupOldIndexTest, TestIntervalFaceting, TestOmitPositions, DistributedSuggestComponentTest, CurrencyFieldOpenExchangeTest, TestDynamicFieldResource, RulesTest, TestCloudSchemaless, CacheHeaderTest, TestZkChroot, ReplicaListTransformerTest, OverseerTaskQueueTest, EchoParamsTest, HdfsBasicDistributedZk2Test, TestCoreDiscovery, TestSchemaResource, FieldAnalysisRequestHandlerTest, BlockJoinFacetRandomTest, CircularListTest, RequestLoggingTest, TestDistributedGrouping, TestRecovery, UUIDFieldTest, ScriptEngineTest, TestSchemaVersionResource, ReturnFieldsTest, HttpPartitionTest, TestAnalyzedSuggestions, DistributedQueryComponentCustomSortTest, SpatialRPTFieldTypeTest, TestOrdValues, BlockDirectoryTest, UtilsToolTest, SharedFSAutoReplicaFailoverUtilsTest, CdcrUpdateLogTest, CollectionTooManyReplicasTest, TestShortCircuitedRequests, CSVRequestHandlerTest, TestNRTOpen, TestSimpleQParserPlugin, MigrateRouteKeyTest, NoCacheHeaderTest, TestConfig, TestLuceneMatchVersion, TestTrie, TestRequestStatusCollectionAPI, SegmentsInfoRequestHandlerTest, TestTolerantUpdateProcessorRandomCloud, TestReversedWildcardFilterFactory, TestLegacyFieldCache, ConnectionReuseTest, CoreSorterTest, TestScoreJoinQPScore, HdfsChaosMonkeyNothingIsSafeTest, FieldMutatingUpdateProcessorTest, DistanceFunctionTest, VersionInfoTest, TestSolrConfigHandlerConcurrent, TermVectorComponentTest, TestEmbeddedSolrServerConstructors, BadComponentTest, ShardSplitTest, StressHdfsTest, DistributedFacetPivotLongTailTest, TestFastWriter, CloneFieldUpdateProcessorFactoryTest, TestIndexingPerformance, TestSolrDynamicMBean, TestConfigSetProperties, TestLMJelinekMercerSimilarityFactory, CollectionsAPISolrJTest, TestNamedUpdateProcessors, TestHashQParserPlugin, CollectionReloadTest, HdfsUnloadDistributedZkTest, TestManagedSynonymFilterFactory, CreateCollectionCleanupTest, TestSolrQueryParser, ZkSolrClientTest, DefaultValueUpdateProcessorTest, TestCrossCoreJoin, CoreAdminRequestStatusTest, DirectUpdateHandlerOptimizeTest, DebugComponentTest, ExternalFileFieldSortTest, GraphQueryTest, ShardRoutingCustomTest, CdcrVersionReplicationTest, TestAtomicUpdateErrorCases, TestChildDocTransformer, ChaosMonkeySafeLeaderTest, ConfigSetsAPITest, UUIDUpdateProcessorFallbackTest, URLClassifyProcessorTest, TestLockTree, PKIAuthenticationIntegrationTest, FullSolrCloudDistribCmdsTest, TestSearchPerf, MinimalSchemaTest, DistributedFacetExistsSmallTest, TestQueryUtils, HighlighterMaxOffsetTest, TestSQLHandlerNonCloud, TestCloudDeleteByQuery, TestPKIAuthenticationPlugin, TestUseDocValuesAsStored, BasicZkTest, TestRestManager, DeleteInactiveReplicaTest, TestRandomRequestDistribution, ClusterStateTest, HdfsRestartWhileUpdatingTest, CoreAdminHandlerTest]
   [junit4] Completed [163/652 (1!)] on J1 in 2.81s, 5 tests, 1 failure <<< FAILURES!

[...truncated 63886 lines...]


Mime
View raw message