lucene-dev mailing list archives

Site index · List index
Message view « Date » · « Thread »
Top « Date » · « Thread »
From Mikhail Khludnev <m...@apache.org>
Subject Re: [JENKINS] Lucene-Solr-master-Linux (64bit/jdk1.8.0_102) - Build # 18009 - Still Unstable!
Date Sun, 09 Oct 2016 16:53:33 GMT
It might be caused by SOLR-9608 commit.  Looking into.

On Sun, Oct 9, 2016 at 7:43 PM, Policeman Jenkins Server <
jenkins@thetaphi.de> wrote:

> Build: https://jenkins.thetaphi.de/job/Lucene-Solr-master-Linux/18009/
> Java: 64bit/jdk1.8.0_102 -XX:+UseCompressedOops -XX:+UseConcMarkSweepGC
>
> 1 tests failed.
> FAILED:  org.apache.solr.cloud.TestSolrCloudWithKerberosAlt.testBasics
>
> Error Message:
> Could not find collection:testkerberoscollection
>
> Stack Trace:
> java.lang.AssertionError: Could not find collection:testkerberoscollection
>         at __randomizedtesting.SeedInfo.seed([4376F219244CF700:
> 7EAE5C351CA2A970]:0)
>         at org.junit.Assert.fail(Assert.java:93)
>         at org.junit.Assert.assertTrue(Assert.java:43)
>         at org.junit.Assert.assertNotNull(Assert.java:526)
>         at org.apache.solr.cloud.AbstractDistribZkTestBase.
> waitForRecoveriesToFinish(AbstractDistribZkTestBase.java:153)
>         at org.apache.solr.cloud.TestSolrCloudWithKerberosAlt.
> testCollectionCreateSearchDelete(TestSolrCloudWithKerberosAlt.java:206)
>         at org.apache.solr.cloud.TestSolrCloudWithKerberosAlt.testBasics(
> TestSolrCloudWithKerberosAlt.java:152)
>         at sun.reflect.NativeMethodAccessorImpl.invoke0(Native Method)
>         at sun.reflect.NativeMethodAccessorImpl.invoke(
> NativeMethodAccessorImpl.java:62)
>         at sun.reflect.DelegatingMethodAccessorImpl.invoke(
> DelegatingMethodAccessorImpl.java:43)
>         at java.lang.reflect.Method.invoke(Method.java:498)
>         at com.carrotsearch.randomizedtesting.RandomizedRunner.invoke(
> RandomizedRunner.java:1764)
>         at com.carrotsearch.randomizedtesting.RandomizedRunner$8.evaluate(
> RandomizedRunner.java:871)
>         at com.carrotsearch.randomizedtesting.RandomizedRunner$9.evaluate(
> RandomizedRunner.java:907)
>         at com.carrotsearch.randomizedtesting.
> RandomizedRunner$10.evaluate(RandomizedRunner.java:921)
>         at com.carrotsearch.randomizedtesting.rules.
> SystemPropertiesRestoreRule$1.evaluate(SystemPropertiesRestoreRule.
> java:57)
>         at org.apache.lucene.util.TestRuleSetupTeardownChained$1.evaluate(
> TestRuleSetupTeardownChained.java:49)
>         at org.apache.lucene.util.AbstractBeforeAfterRule$1.evaluate(
> AbstractBeforeAfterRule.java:45)
>         at org.apache.lucene.util.TestRuleThreadAndTestName$1.evaluate(
> TestRuleThreadAndTestName.java:48)
>         at org.apache.lucene.util.TestRuleIgnoreAfterMaxFailures
> $1.evaluate(TestRuleIgnoreAfterMaxFailures.java:64)
>         at org.apache.lucene.util.TestRuleMarkFailure$1.
> evaluate(TestRuleMarkFailure.java:47)
>         at com.carrotsearch.randomizedtesting.rules.
> StatementAdapter.evaluate(StatementAdapter.java:36)
>         at com.carrotsearch.randomizedtesting.ThreadLeakControl$
> StatementRunner.run(ThreadLeakControl.java:367)
>         at com.carrotsearch.randomizedtesting.ThreadLeakControl.
> forkTimeoutingTask(ThreadLeakControl.java:809)
>         at com.carrotsearch.randomizedtesting.
> ThreadLeakControl$3.evaluate(ThreadLeakControl.java:460)
>         at com.carrotsearch.randomizedtesting.RandomizedRunner.
> runSingleTest(RandomizedRunner.java:880)
>         at com.carrotsearch.randomizedtesting.RandomizedRunner$5.evaluate(
> RandomizedRunner.java:781)
>         at com.carrotsearch.randomizedtesting.RandomizedRunner$6.evaluate(
> RandomizedRunner.java:816)
>         at com.carrotsearch.randomizedtesting.RandomizedRunner$7.evaluate(
> RandomizedRunner.java:827)
>         at com.carrotsearch.randomizedtesting.rules.
> StatementAdapter.evaluate(StatementAdapter.java:36)
>         at com.carrotsearch.randomizedtesting.rules.
> SystemPropertiesRestoreRule$1.evaluate(SystemPropertiesRestoreRule.
> java:57)
>         at org.apache.lucene.util.AbstractBeforeAfterRule$1.evaluate(
> AbstractBeforeAfterRule.java:45)
>         at com.carrotsearch.randomizedtesting.rules.
> StatementAdapter.evaluate(StatementAdapter.java:36)
>         at org.apache.lucene.util.TestRuleStoreClassName$1.evaluate(
> TestRuleStoreClassName.java:41)
>         at com.carrotsearch.randomizedtesting.rules.
> NoShadowingOrOverridesOnMethodsRule$1.evaluate(
> NoShadowingOrOverridesOnMethodsRule.java:40)
>         at com.carrotsearch.randomizedtesting.rules.
> NoShadowingOrOverridesOnMethodsRule$1.evaluate(
> NoShadowingOrOverridesOnMethodsRule.java:40)
>         at com.carrotsearch.randomizedtesting.rules.
> StatementAdapter.evaluate(StatementAdapter.java:36)
>         at com.carrotsearch.randomizedtesting.rules.
> StatementAdapter.evaluate(StatementAdapter.java:36)
>         at com.carrotsearch.randomizedtesting.rules.
> StatementAdapter.evaluate(StatementAdapter.java:36)
>         at org.apache.lucene.util.TestRuleAssertionsRequired$1.evaluate(
> TestRuleAssertionsRequired.java:53)
>         at org.apache.lucene.util.TestRuleMarkFailure$1.
> evaluate(TestRuleMarkFailure.java:47)
>         at org.apache.lucene.util.TestRuleIgnoreAfterMaxFailures
> $1.evaluate(TestRuleIgnoreAfterMaxFailures.java:64)
>         at org.apache.lucene.util.TestRuleIgnoreTestSuites$1.evaluate(
> TestRuleIgnoreTestSuites.java:54)
>         at com.carrotsearch.randomizedtesting.rules.
> StatementAdapter.evaluate(StatementAdapter.java:36)
>         at com.carrotsearch.randomizedtesting.ThreadLeakControl$
> StatementRunner.run(ThreadLeakControl.java:367)
>         at java.lang.Thread.run(Thread.java:745)
>
>
>
>
> Build Log:
> [...truncated 11647 lines...]
>    [junit4] Suite: org.apache.solr.cloud.TestSolrCloudWithKerberosAlt
>    [junit4]   2> 1050394 WARN  (TEST-TestSolrCloudWithKerberosAlt.
> testBasics-seed#[4376F219244CF700]) [    ] o.a.d.s.c.DefaultDirectoryService
> You didn't change the admin password of directory service instance
> 'DefaultKrbServer'.  Please update the admin password as soon as possible
> to prevent a possible security breach.
>    [junit4]   2> 1052585 INFO  (TEST-TestSolrCloudWithKerberosAlt.
> testBasics-seed#[4376F219244CF700]) [    ] o.a.s.c.TestSolrCloudWithKerberosAlt
> Enable delegation token: true
>    [junit4]   2> 1052585 INFO  (TEST-TestSolrCloudWithKerberosAlt.
> testBasics-seed#[4376F219244CF700]) [    ] o.a.s.c.MiniSolrCloudCluster
> Starting cluster of 1 servers in /home/jenkins/workspace/
> Lucene-Solr-master-Linux/solr/build/solr-core/test/J0/temp/solr.cloud.
> TestSolrCloudWithKerberosAlt_4376F219244CF700-001/tempDir-002
>    [junit4]   2> 1052586 INFO  (TEST-TestSolrCloudWithKerberosAlt.
> testBasics-seed#[4376F219244CF700]) [    ] o.a.s.c.ZkTestServer STARTING
> ZK TEST SERVER
>    [junit4]   2> 1052586 INFO  (Thread-1018) [    ] o.a.s.c.ZkTestServer
> client port:0.0.0.0/0.0.0.0:0
>    [junit4]   2> 1052586 INFO  (Thread-1018) [    ] o.a.s.c.ZkTestServer
> Starting server
>    [junit4]   2> 1052686 INFO  (TEST-TestSolrCloudWithKerberosAlt.
> testBasics-seed#[4376F219244CF700]) [    ] o.a.s.c.ZkTestServer start zk
> server on port:36829
>    [junit4]   2> 1052687 WARN  (TEST-TestSolrCloudWithKerberosAlt.
> testBasics-seed#[4376F219244CF700]-SendThread(127.0.0.1:36829)) [    ]
> o.a.z.ClientCnxn SASL configuration failed: javax.security.auth.login.LoginException:
> No JAAS configuration section named 'Client' was found in specified JAAS
> configuration file: '/home/jenkins/workspace/
> Lucene-Solr-master-Linux/solr/build/solr-core/test/J0/temp/solr.cloud.
> TestSolrCloudWithKerberosAlt_4376F219244CF700-001/tempDir-001/minikdc/jaas-client.conf'.
> Will continue connection to Zookeeper server without SASL authentication,
> if Zookeeper server allows it.
>    [junit4]   2> 1052688 WARN  (zkCallback-25157-thread-1) [    ]
> o.a.s.c.c.ConnectionManager Watcher org.apache.solr.common.cloud.
> ConnectionManager@4c8ff5ff name: ZooKeeperConnection Watcher:
> 127.0.0.1:36829 got event WatchedEvent state:AuthFailed type:None
> path:null path: null type: None
>    [junit4]   2> 1052688 WARN  (zkCallback-25157-thread-1) [    ]
> o.a.s.c.c.ConnectionManager zkClient received AuthFailed
>    [junit4]   2> 1052720 INFO  (jetty-launcher-25156-thread-1) [    ]
> o.e.j.s.Server jetty-9.3.8.v20160314
>    [junit4]   2> 1052721 INFO  (jetty-launcher-25156-thread-1) [    ]
> o.e.j.s.h.ContextHandler Started o.e.j.s.ServletContextHandler@
> 70f41fe9{/solr,null,AVAILABLE}
>    [junit4]   2> 1052721 INFO  (jetty-launcher-25156-thread-1) [    ]
> o.e.j.s.ServerConnector Started ServerConnector@c77f8c5{HTTP/
> 1.1,[http/1.1]}{127.0.0.1:43889}
>    [junit4]   2> 1052721 INFO  (jetty-launcher-25156-thread-1) [    ]
> o.e.j.s.Server Started @1054641ms
>    [junit4]   2> 1052721 INFO  (jetty-launcher-25156-thread-1) [    ]
> o.a.s.c.s.e.JettySolrRunner Jetty properties: {hostContext=/solr,
> hostPort=43889}
>    [junit4]   2> 1052721 INFO  (jetty-launcher-25156-thread-1) [    ]
> o.a.s.s.SolrDispatchFilter  ___      _       Welcome to Apache Solr™
> version 7.0.0
>    [junit4]   2> 1052721 INFO  (jetty-launcher-25156-thread-1) [    ]
> o.a.s.s.SolrDispatchFilter / __| ___| |_ _   Starting in cloud mode on port
> null
>    [junit4]   2> 1052721 INFO  (jetty-launcher-25156-thread-1) [    ]
> o.a.s.s.SolrDispatchFilter \__ \/ _ \ | '_|  Install dir: null
>    [junit4]   2> 1052721 INFO  (jetty-launcher-25156-thread-1) [    ]
> o.a.s.s.SolrDispatchFilter |___/\___/_|_|    Start time:
> 2016-10-09T16:11:50.279Z
>    [junit4]   2> 1052723 WARN  (jetty-launcher-25156-thread-1-SendThread(
> 127.0.0.1:36829)) [    ] o.a.z.ClientCnxn SASL configuration failed:
> javax.security.auth.login.LoginException: No JAAS configuration section
> named 'Client' was found in specified JAAS configuration file:
> '/home/jenkins/workspace/Lucene-Solr-master-Linux/solr/
> build/solr-core/test/J0/temp/solr.cloud.TestSolrCloudWithKerberosAlt_
> 4376F219244CF700-001/tempDir-001/minikdc/jaas-client.conf'. Will continue
> connection to Zookeeper server without SASL authentication, if Zookeeper
> server allows it.
>    [junit4]   2> 1052723 WARN  (zkCallback-25158-thread-1) [    ]
> o.a.s.c.c.ConnectionManager Watcher org.apache.solr.common.cloud.
> ConnectionManager@6bf28e0a name: ZooKeeperConnection Watcher:
> 127.0.0.1:36829/solr got event WatchedEvent state:AuthFailed type:None
> path:null path: null type: None
>    [junit4]   2> 1052723 WARN  (zkCallback-25158-thread-1) [    ]
> o.a.s.c.c.ConnectionManager zkClient received AuthFailed
>    [junit4]   2> 1052725 INFO  (jetty-launcher-25156-thread-1) [    ]
> o.a.s.s.SolrDispatchFilter solr.xml found in ZooKeeper. Loading...
>    [junit4]   2> 1052731 INFO  (jetty-launcher-25156-thread-1) [    ]
> o.a.s.c.ZkContainer Zookeeper client=127.0.0.1:36829/solr
>    [junit4]   2> 1052732 WARN  (jetty-launcher-25156-thread-1-SendThread(
> 127.0.0.1:36829)) [    ] o.a.z.ClientCnxn SASL configuration failed:
> javax.security.auth.login.LoginException: No JAAS configuration section
> named 'Client' was found in specified JAAS configuration file:
> '/home/jenkins/workspace/Lucene-Solr-master-Linux/solr/
> build/solr-core/test/J0/temp/solr.cloud.TestSolrCloudWithKerberosAlt_
> 4376F219244CF700-001/tempDir-001/minikdc/jaas-client.conf'. Will continue
> connection to Zookeeper server without SASL authentication, if Zookeeper
> server allows it.
>    [junit4]   2> 1052732 WARN  (zkCallback-25161-thread-1) [    ]
> o.a.s.c.c.ConnectionManager Watcher org.apache.solr.common.cloud.
> ConnectionManager@12bf132b name: ZooKeeperConnection Watcher:
> 127.0.0.1:36829 got event WatchedEvent state:AuthFailed type:None
> path:null path: null type: None
>    [junit4]   2> 1052732 WARN  (zkCallback-25161-thread-1) [    ]
> o.a.s.c.c.ConnectionManager zkClient received AuthFailed
>    [junit4]   2> 1052737 WARN  (jetty-launcher-25156-thread-1-SendThread(
> 127.0.0.1:36829)) [n:127.0.0.1:43889_solr    ] o.a.z.ClientCnxn SASL
> configuration failed: javax.security.auth.login.LoginException: No JAAS
> configuration section named 'Client' was found in specified JAAS
> configuration file: '/home/jenkins/workspace/
> Lucene-Solr-master-Linux/solr/build/solr-core/test/J0/temp/solr.cloud.
> TestSolrCloudWithKerberosAlt_4376F219244CF700-001/tempDir-001/minikdc/jaas-client.conf'.
> Will continue connection to Zookeeper server without SASL authentication,
> if Zookeeper server allows it.
>    [junit4]   2> 1052737 WARN  (zkCallback-25162-thread-1-
> processing-n:127.0.0.1:43889_solr) [n:127.0.0.1:43889_solr    ]
> o.a.s.c.c.ConnectionManager Watcher org.apache.solr.common.cloud.
> ConnectionManager@5822be2e name: ZooKeeperConnection Watcher:
> 127.0.0.1:36829/solr got event WatchedEvent state:AuthFailed type:None
> path:null path: null type: None
>    [junit4]   2> 1052737 WARN  (zkCallback-25162-thread-1-
> processing-n:127.0.0.1:43889_solr) [n:127.0.0.1:43889_solr    ]
> o.a.s.c.c.ConnectionManager zkClient received AuthFailed
>    [junit4]   2> 1052797 INFO  (jetty-launcher-25156-thread-1)
> [n:127.0.0.1:43889_solr    ] o.a.s.c.OverseerElectionContext I am going
> to be the leader 127.0.0.1:43889_solr
>    [junit4]   2> 1052799 INFO  (jetty-launcher-25156-thread-1)
> [n:127.0.0.1:43889_solr    ] o.a.s.c.Overseer Overseer
> (id=96733069976862723-127.0.0.1:43889_solr-n_0000000000) starting
>    [junit4]   2> 1052835 INFO  (jetty-launcher-25156-thread-1)
> [n:127.0.0.1:43889_solr    ] o.a.s.c.ZkController Register node as live
> in ZooKeeper:/live_nodes/127.0.0.1:43889_solr
>    [junit4]   2> 1052851 INFO  (zkCallback-25162-thread-1-
> processing-n:127.0.0.1:43889_solr) [n:127.0.0.1:43889_solr    ]
> o.a.s.c.c.ZkStateReader Updated live nodes from ZooKeeper... (0) -> (1)
>    [junit4]   2> 1052864 INFO  (jetty-launcher-25156-thread-1)
> [n:127.0.0.1:43889_solr    ] o.a.s.c.CoreContainer Authentication plugin
> class obtained from system property 'authenticationPlugin':
> org.apache.solr.security.KerberosPlugin
>    [junit4]   2> 1052867 INFO  (jetty-launcher-25156-thread-1)
> [n:127.0.0.1:43889_solr    ] o.a.s.c.s.i.Krb5HttpClientBuilder Setting up
> SPNego auth with config: /home/jenkins/workspace/
> Lucene-Solr-master-Linux/solr/build/solr-core/test/J0/temp/solr.cloud.
> TestSolrCloudWithKerberosAlt_4376F219244CF700-001/tempDir-
> 001/minikdc/jaas-client.conf
>    [junit4]   2> 1052892 INFO  (jetty-launcher-25156-thread-1)
> [n:127.0.0.1:43889_solr    ] o.a.s.s.KerberosPlugin Params:
> {token.valid=30, kerberos.principal=HTTP/127.0.0.1,
> kerberos.keytab=/home/jenkins/workspace/Lucene-Solr-master-
> Linux/solr/build/solr-core/test/J0/temp/solr.cloud.
> TestSolrCloudWithKerberosAlt_4376F219244CF700-001/tempDir-001/minikdc/keytabs,
> cookie.domain=127.0.0.1, token.validity=36000, type=kerberos,
> delegation-token.token-kind=solr-dt, cookie.path=/, zk-dt-secret-manager.
> znodeWorkingPath=solr/security/zkdtsm, signer.secret.provider.zookeeper.path=/token,
> zk-dt-secret-manager.enable=true, kerberos.name.rules=RULE:[1:$1@$0](.*
> EXAMPLE.COM)s/@.*//
>    [junit4]   2> RULE:[2:$2@$0](.*EXAMPLE.COM)s/@.*//
>    [junit4]   2> DEFAULT, signer.secret.provider=zookeeper}
>    [junit4]   2> 1053014 INFO  (jetty-launcher-25156-thread-1)
> [n:127.0.0.1:43889_solr    ] o.a.c.f.i.CuratorFrameworkImpl Starting
>    [junit4]   2> 1053019 WARN  (jetty-launcher-25156-thread-1-SendThread(
> 127.0.0.1:36829)) [n:127.0.0.1:43889_solr    ] o.a.z.ClientCnxn SASL
> configuration failed: javax.security.auth.login.LoginException: No JAAS
> configuration section named 'Client' was found in specified JAAS
> configuration file: '/home/jenkins/workspace/
> Lucene-Solr-master-Linux/solr/build/solr-core/test/J0/temp/solr.cloud.
> TestSolrCloudWithKerberosAlt_4376F219244CF700-001/tempDir-001/minikdc/jaas-client.conf'.
> Will continue connection to Zookeeper server without SASL authentication,
> if Zookeeper server allows it.
>    [junit4]   2> 1053025 ERROR (jetty-launcher-25156-thread-1-EventThread)
> [n:127.0.0.1:43889_solr    ] o.a.c.ConnectionState Authentication failed
>    [junit4]   2> 1053038 INFO  (jetty-launcher-25156-thread-1-EventThread)
> [n:127.0.0.1:43889_solr    ] o.a.c.f.s.ConnectionStateManager State
> change: CONNECTED
>    [junit4]   2> 1054214 INFO  (jetty-launcher-25156-thread-1)
> [n:127.0.0.1:43889_solr    ] o.a.s.c.s.i.Krb5HttpClientBuilder Setting up
> SPNego auth with config: /home/jenkins/workspace/
> Lucene-Solr-master-Linux/solr/build/solr-core/test/J0/temp/solr.cloud.
> TestSolrCloudWithKerberosAlt_4376F219244CF700-001/tempDir-
> 001/minikdc/jaas-client.conf
>    [junit4]   2> 1054215 INFO  (jetty-launcher-25156-thread-1)
> [n:127.0.0.1:43889_solr    ] o.a.s.c.CorePropertiesLocator Found 0 core
> definitions underneath /home/jenkins/workspace/
> Lucene-Solr-master-Linux/solr/build/solr-core/test/J0/temp/solr.cloud.
> TestSolrCloudWithKerberosAlt_4376F219244CF700-001/tempDir-002/node1/.
>    [junit4]   2> 1054315 WARN  (TEST-TestSolrCloudWithKerberosAlt.
> testBasics-seed#[4376F219244CF700]-SendThread(127.0.0.1:36829)) [    ]
> o.a.z.ClientCnxn SASL configuration failed: javax.security.auth.login.LoginException:
> No JAAS configuration section named 'Client' was found in specified JAAS
> configuration file: '/home/jenkins/workspace/
> Lucene-Solr-master-Linux/solr/build/solr-core/test/J0/temp/solr.cloud.
> TestSolrCloudWithKerberosAlt_4376F219244CF700-001/tempDir-001/minikdc/jaas-client.conf'.
> Will continue connection to Zookeeper server without SASL authentication,
> if Zookeeper server allows it.
>    [junit4]   2> 1054315 WARN  (zkCallback-25164-thread-1) [    ]
> o.a.s.c.c.ConnectionManager Watcher org.apache.solr.common.cloud.
> ConnectionManager@6a1d3b45 name: ZooKeeperConnection Watcher:
> 127.0.0.1:36829 got event WatchedEvent state:AuthFailed type:None
> path:null path: null type: None
>    [junit4]   2> 1054315 WARN  (zkCallback-25164-thread-1) [    ]
> o.a.s.c.c.ConnectionManager zkClient received AuthFailed
>    [junit4]   2> 1054403 WARN  (TEST-TestSolrCloudWithKerberosAlt.
> testBasics-seed#[4376F219244CF700]-SendThread(127.0.0.1:36829)) [    ]
> o.a.z.ClientCnxn SASL configuration failed: javax.security.auth.login.LoginException:
> No JAAS configuration section named 'Client' was found in specified JAAS
> configuration file: '/home/jenkins/workspace/
> Lucene-Solr-master-Linux/solr/build/solr-core/test/J0/temp/solr.cloud.
> TestSolrCloudWithKerberosAlt_4376F219244CF700-001/tempDir-001/minikdc/jaas-client.conf'.
> Will continue connection to Zookeeper server without SASL authentication,
> if Zookeeper server allows it.
>    [junit4]   2> 1054403 WARN  (zkCallback-25166-thread-1) [    ]
> o.a.s.c.c.ConnectionManager Watcher org.apache.solr.common.cloud.
> ConnectionManager@50240dcf name: ZooKeeperConnection Watcher:
> 127.0.0.1:36829/solr got event WatchedEvent state:AuthFailed type:None
> path:null path: null type: None
>    [junit4]   2> 1054403 WARN  (zkCallback-25166-thread-1) [    ]
> o.a.s.c.c.ConnectionManager zkClient received AuthFailed
>    [junit4]   2> 1057697 WARN  (TEST-TestSolrCloudWithKerberosAlt.
> testBasics-seed#[4376F219244CF700]-SendThread(127.0.0.1:36829)) [    ]
> o.a.z.ClientCnxn SASL configuration failed: javax.security.auth.login.LoginException:
> No JAAS configuration section named 'Client' was found in specified JAAS
> configuration file: '/home/jenkins/workspace/
> Lucene-Solr-master-Linux/solr/build/solr-core/test/J0/temp/solr.cloud.
> TestSolrCloudWithKerberosAlt_4376F219244CF700-001/tempDir-001/minikdc/jaas-client.conf'.
> Will continue connection to Zookeeper server without SASL authentication,
> if Zookeeper server allows it.
>    [junit4]   2> 1057697 WARN  (zkCallback-25168-thread-1) [    ]
> o.a.s.c.c.ConnectionManager Watcher org.apache.solr.common.cloud.
> ConnectionManager@4c78af3f name: ZooKeeperConnection Watcher:
> 127.0.0.1:36829/solr got event WatchedEvent state:AuthFailed type:None
> path:null path: null type: None
>    [junit4]   2> 1057697 WARN  (zkCallback-25168-thread-1) [    ]
> o.a.s.c.c.ConnectionManager zkClient received AuthFailed
>    [junit4]   2> 1057720 INFO  (TEST-TestSolrCloudWithKerberosAlt.
> testBasics-seed#[4376F219244CF700]) [    ] o.a.s.c.c.ZkStateReader
> Updated live nodes from ZooKeeper... (0) -> (1)
>    [junit4]   2> 1057726 WARN  (qtp416740792-93041) [    ] o.a.h.s.a.s.KerberosAuthenticationHandler
> 'Authorization' does not start with 'Negotiate' :  Basic
> aGFycnk6SGFycnlJc1ViZXJDb29s
>    [junit4]   1> Debug is  true storeKey true useTicketCache false
> useKeyTab true doNotPrompt false ticketCache is null isInitiator true
> KeyTab is /home/jenkins/workspace/Lucene-Solr-master-Linux/solr/
> build/solr-core/test/J0/temp/solr.cloud.TestSolrCloudWithKerberosAlt_
> 4376F219244CF700-001/tempDir-001/minikdc/keytabs refreshKrb5Config is
> true principal is solr tryFirstPass is false useFirstPass is false
> storePass is false clearPass is false
>    [junit4]   1> Refreshing Kerberos configuration
>    [junit4]   1> principal is solr@EXAMPLE.COM
>    [junit4]   1> Will use keytab
>    [junit4]   1> Commit Succeeded
>    [junit4]   1>
>    [junit4]   2> 1058275 INFO  (qtp416740792-93042) [n:127.0.0.1:43889_solr
>   ] o.a.s.h.a.CollectionsHandler Invoked Collection Action :create with
> params replicationFactor=1&property.solr.tests.ramBufferSizeMB=
> 100&property.solr.tests.useMergePolicyFactory=false&property.solr.tests.
> useMergePolicy=true&version=2&property.solr.tests.
> mergeScheduler=org.apache.lucene.index.ConcurrentMergeScheduler&
> property.config=solrconfig-tlog.xml&property.solr.tests.
> maxBufferedDocs=100000&name=testkerberoscollection&action=
> CREATE&numShards=1&property.solr.tests.mergePolicy=org.
> apache.lucene.index.TieredMergePolicy&property.solr.directoryFactory=solr.RAMDirectoryFactory&wt=javabin
> and sendToOCPQueue=true
>    [junit4]   2> 1058283 INFO  (OverseerThreadFactory-6508-
> thread-1-processing-n:127.0.0.1:43889_solr) [n:127.0.0.1:43889_solr    ]
> o.a.s.c.CreateCollectionCmd Create collection testkerberoscollection
>    [junit4]   2> 1058283 INFO  (OverseerThreadFactory-6508-
> thread-1-processing-n:127.0.0.1:43889_solr) [n:127.0.0.1:43889_solr    ]
> o.a.s.c.CreateCollectionCmd Only one config set found in zk - using
> it:solrCloudCollectionConfig
>    [junit4]   2> 1058404 WARN  (qtp416740792-93036) [    ] o.a.h.s.a.s.KerberosAuthenticationHandler
> 'Authorization' does not start with 'Negotiate' :  Basic
> aGFycnk6SGFycnlJc1ViZXJDb29s
>    [junit4]   2> 1058406 ERROR (OverseerThreadFactory-6508-
> thread-1-processing-n:127.0.0.1:43889_solr) [n:127.0.0.1:43889_solr    ]
> o.a.s.c.OverseerCollectionMessageHandler Error from shard:
> http://127.0.0.1:43889/solr
>    [junit4]   2> org.apache.solr.client.solrj.impl.HttpSolrClient$RemoteSolrException:
> Error from server at http://127.0.0.1:43889/solr: Expected mime type
> application/octet-stream but got text/html. <html>
>    [junit4]   2> <head>
>    [junit4]   2> <meta http-equiv="Content-Type"
> content="text/html;charset=ISO-8859-1"/>
>    [junit4]   2> <title>Error 401 </title>
>    [junit4]   2> </head>
>    [junit4]   2> <body>
>    [junit4]   2> <h2>HTTP ERROR: 401</h2>
>    [junit4]   2> <p>Problem accessing /solr/admin/cores. Reason:
>    [junit4]   2> <pre>    Authentication required</pre></p>
>    [junit4]   2> <hr /><a href="http://eclipse.org/jetty">Powered by
> Jetty:// 9.3.8.v20160314</a><hr/>
>    [junit4]   2> </body>
>    [junit4]   2> </html>
>    [junit4]   2>
>    [junit4]   2>        at org.apache.solr.client.solrj.
> impl.HttpSolrClient.executeMethod(HttpSolrClient.java:578)
>    [junit4]   2>        at org.apache.solr.client.solrj.
> impl.HttpSolrClient.request(HttpSolrClient.java:262)
>    [junit4]   2>        at org.apache.solr.client.solrj.
> impl.HttpSolrClient.request(HttpSolrClient.java:251)
>    [junit4]   2>        at org.apache.solr.client.solrj.
> SolrClient.request(SolrClient.java:1219)
>    [junit4]   2>        at org.apache.solr.handler.
> component.HttpShardHandler.lambda$submit$0(HttpShardHandler.java:195)
>    [junit4]   2>        at java.util.concurrent.FutureTask.run(FutureTask.
> java:266)
>    [junit4]   2>        at java.util.concurrent.Executors$RunnableAdapter.
> call(Executors.java:511)
>    [junit4]   2>        at java.util.concurrent.FutureTask.run(FutureTask.
> java:266)
>    [junit4]   2>        at org.apache.solr.common.util.ExecutorUtil$
> MDCAwareThreadPoolExecutor.lambda$execute$0(ExecutorUtil.java:229)
>    [junit4]   2>        at java.util.concurrent.
> ThreadPoolExecutor.runWorker(ThreadPoolExecutor.java:1142)
>    [junit4]   2>        at java.util.concurrent.
> ThreadPoolExecutor$Worker.run(ThreadPoolExecutor.java:617)
>    [junit4]   2>        at java.lang.Thread.run(Thread.java:745)
>    [junit4]   2> 1058407 ERROR (OverseerThreadFactory-6508-
> thread-1-processing-n:127.0.0.1:43889_solr) [n:127.0.0.1:43889_solr    ]
> o.a.s.c.OverseerCollectionMessageHandler Cleaning up collection
> [testkerberoscollection].
>    [junit4]   2> 1058407 INFO  (OverseerThreadFactory-6508-
> thread-1-processing-n:127.0.0.1:43889_solr) [n:127.0.0.1:43889_solr    ]
> o.a.s.c.OverseerCollectionMessageHandler Executing Collection Cmd :
> action=UNLOAD&deleteInstanceDir=true&deleteDataDir=true
>    [junit4]   2> 1059114 INFO  (OverseerThreadFactory-6508-
> thread-1-processing-n:127.0.0.1:43889_solr) [n:127.0.0.1:43889_solr    ]
> o.a.s.c.CreateCollectionCmd Cleaned up artifacts for failed create
> collection for [testkerberoscollection]
>    [junit4]   2> 1059161 INFO  (qtp416740792-93042) [n:127.0.0.1:43889_solr
>   ] o.a.s.h.a.CollectionsHandler Wait for new collection to be active for
> at most 30 seconds. Check all shard replicas
>    [junit4]   2> 1060285 INFO  (OverseerCollectionConfigSetPro
> cessor-96733069976862723-127.0.0.1:43889_solr-n_0000000000)
> [n:127.0.0.1:43889_solr    ] o.a.s.c.OverseerTaskQueue Response ZK path:
> /overseer/collection-queue-work/qnr-0000000000 doesn't exist.  Requestor
> may have disconnected from ZooKeeper
>    [junit4]   2> 1089164 ERROR (qtp416740792-93042) [n:127.0.0.1:43889_solr
>   ] o.a.s.h.a.CollectionsHandler Timed out waiting for new collection's
> replicas to become ACTIVE with timeout=30
>    [junit4]   2> 1089164 INFO  (qtp416740792-93042) [n:127.0.0.1:43889_solr
>   ] o.a.s.s.HttpSolrCall [admin] webapp=null path=/admin/collections
> params={replicationFactor=1&property.solr.tests.
> ramBufferSizeMB=100&property.solr.tests.useMergePolicyFactory=false&
> property.solr.tests.useMergePolicy=true&version=2&property.solr.tests.
> mergeScheduler=org.apache.lucene.index.ConcurrentMergeScheduler&
> property.config=solrconfig-tlog.xml&property.solr.tests.
> maxBufferedDocs=100000&name=testkerberoscollection&action=
> CREATE&numShards=1&property.solr.tests.mergePolicy=org.
> apache.lucene.index.TieredMergePolicy&property.solr.directoryFactory=solr.
> RAMDirectoryFactory&wt=javabin} status=0 QTime=30889
>    [junit4]   2> 1089169 WARN  (TEST-TestSolrCloudWithKerberosAlt.
> testBasics-seed#[4376F219244CF700]) [    ] o.a.h.c.p.ResponseProcessCookies
> Invalid cookie header: "Set-Cookie: hadoop.auth="u=solr&p=solr@EXAMPLE.COM
> &t=kerberos-dt&e=1476065515751&s=EF3tC0T50CJm/6myVB9gzcZaIFc="; Path=/;
> Domain=127.0.0.1; Expires=ma, 10-okt-2016 02:11:55 GMT; HttpOnly". Invalid
> 'expires' attribute: ma, 10-okt-2016 02:11:55 GMT
>    [junit4]   2> 1089171 WARN  (TEST-TestSolrCloudWithKerberosAlt.
> testBasics-seed#[4376F219244CF700]-SendThread(127.0.0.1:36829)) [    ]
> o.a.z.ClientCnxn SASL configuration failed: javax.security.auth.login.LoginException:
> No JAAS configuration section named 'Client' was found in specified JAAS
> configuration file: '/home/jenkins/workspace/
> Lucene-Solr-master-Linux/solr/build/solr-core/test/J0/temp/solr.cloud.
> TestSolrCloudWithKerberosAlt_4376F219244CF700-001/tempDir-001/minikdc/jaas-client.conf'.
> Will continue connection to Zookeeper server without SASL authentication,
> if Zookeeper server allows it.
>    [junit4]   2> 1089171 WARN  (zkCallback-25169-thread-1) [    ]
> o.a.s.c.c.ConnectionManager Watcher org.apache.solr.common.cloud.
> ConnectionManager@18e5f40c name: ZooKeeperConnection Watcher:
> 127.0.0.1:36829/solr got event WatchedEvent state:AuthFailed type:None
> path:null path: null type: None
>    [junit4]   2> 1089171 WARN  (zkCallback-25169-thread-1) [    ]
> o.a.s.c.c.ConnectionManager zkClient received AuthFailed
>    [junit4]   2> 1089177 INFO  (TEST-TestSolrCloudWithKerberosAlt.
> testBasics-seed#[4376F219244CF700]) [    ] o.a.s.c.c.ZkStateReader
> Updated live nodes from ZooKeeper... (0) -> (1)
>    [junit4]   2> 1089178 INFO  (TEST-TestSolrCloudWithKerberosAlt.
> testBasics-seed#[4376F219244CF700]) [    ] o.a.s.c.AbstractDistribZkTestBase
> Wait for recoveries to finish - collection: testkerberoscollection
> failOnTimeout:true timeout (sec):330
>    [junit4]   1> -
>    [junit4]   2> 1089183 INFO  (jetty-launcher-25156-thread-1) [    ]
> o.e.j.s.ServerConnector Stopped ServerConnector@c77f8c5{HTTP/
> 1.1,[http/1.1]}{127.0.0.1:0}
>    [junit4]   2> 1089183 INFO  (jetty-launcher-25156-thread-1) [    ]
> o.a.s.c.CoreContainer Shutting down CoreContainer instance=137691300
>    [junit4]   2> 1089187 INFO  (jetty-launcher-25156-thread-1) [    ]
> o.a.s.c.Overseer Overseer (id=96733069976862723-127.0.0.1:43889_solr-n_0000000000)
> closing
>    [junit4]   2> 1089187 INFO  (OverseerStateUpdate-
> 96733069976862723-127.0.0.1:43889_solr-n_0000000000) [n:127.0.0.1:43889_solr
>   ] o.a.s.c.Overseer Overseer Loop exiting : 127.0.0.1:43889_solr
>    [junit4]   2> 1089190 WARN  (zkCallback-25162-thread-3-
> processing-n:127.0.0.1:43889_solr) [n:127.0.0.1:43889_solr    ]
> o.a.s.c.c.ZkStateReader ZooKeeper watch triggered, but Solr cannot talk to
> ZK: [KeeperErrorCode = Session expired for /live_nodes]
>    [junit4]   2> 1089190 WARN  (NIOServerCxn.Factory:0.0.0.0/0.0.0.0:0)
> [    ] o.a.z.s.NIOServerCnxn caught end of stream exception
>    [junit4]   2> EndOfStreamException: Unable to read additional data from
> client sessionid 0x157aa36f2010003, likely client has closed socket
>    [junit4]   2>        at org.apache.zookeeper.server.NIOServerCnxn.doIO(
> NIOServerCnxn.java:228)
>    [junit4]   2>        at org.apache.zookeeper.server.
> NIOServerCnxnFactory.run(NIOServerCnxnFactory.java:208)
>    [junit4]   2>        at java.lang.Thread.run(Thread.java:745)
>    [junit4]   2> 1089190 ERROR (Thread[Thread-1028,5,TGRP-TestSolrCloudWithKerberosAlt])
> [n:127.0.0.1:43889_solr    ] o.a.h.s.t.d.AbstractDelegationTokenSecretManager
> ExpiredTokenRemover received java.lang.InterruptedException: sleep
> interrupted
>    [junit4]   2> 1089199 INFO  (jetty-launcher-25156-thread-1) [    ]
> o.e.j.s.h.ContextHandler Stopped o.e.j.s.ServletContextHandler@
> 70f41fe9{/solr,null,UNAVAILABLE}
>    [junit4]   2> 1089201 INFO  (TEST-TestSolrCloudWithKerberosAlt.
> testBasics-seed#[4376F219244CF700]) [    ] o.a.s.c.ZkTestServer
> connecting to 127.0.0.1:36829 36829
>    [junit4]   2> 1089211 INFO  (Thread-1018) [    ] o.a.s.c.ZkTestServer
> connecting to 127.0.0.1:36829 36829
>    [junit4]   2> 1089212 WARN  (Thread-1018) [    ] o.a.s.c.ZkTestServer
> Watch limit violations:
>    [junit4]   2> Maximum concurrent create/delete watches above limit:
>    [junit4]   2>
>    [junit4]   2>        3       /solr/aliases.json
>    [junit4]   2>        3       /solr/clusterprops.json
>    [junit4]   2>
>    [junit4]   2> Maximum concurrent data watches above limit:
>    [junit4]   2>
>    [junit4]   2>        3       /solr/clusterstate.json
>    [junit4]   2>
>    [junit4]   2> Maximum concurrent children watches above limit:
>    [junit4]   2>
>    [junit4]   2>        35      /solr/overseer/collection-queue-work
>    [junit4]   2>        3       /solr/live_nodes
>    [junit4]   2>        3       /solr/collections
>    [junit4]   2>        2       /solr/overseer/queue
>    [junit4]   2>        2       /solr/overseer/queue-work
>    [junit4]   2>
>    [junit4]   2> NOTE: reproduce with: ant test  -Dtestcase=TestSolrCloudWithKerberosAlt
> -Dtests.method=testBasics -Dtests.seed=4376F219244CF700
> -Dtests.multiplier=3 -Dtests.slow=true -Dtests.locale=no-NO
> -Dtests.timezone=America/Boa_Vista -Dtests.asserts=true
> -Dtests.file.encoding=UTF-8
>    [junit4] FAILURE 47.1s J0 | TestSolrCloudWithKerberosAlt.testBasics <<<
>    [junit4]    > Throwable #1: java.lang.AssertionError: Could not find
> collection:testkerberoscollection
>    [junit4]    >        at __randomizedtesting.SeedInfo.
> seed([4376F219244CF700:7EAE5C351CA2A970]:0)
>    [junit4]    >        at org.apache.solr.cloud.
> AbstractDistribZkTestBase.waitForRecoveriesToFinish(
> AbstractDistribZkTestBase.java:153)
>    [junit4]    >        at org.apache.solr.cloud.
> TestSolrCloudWithKerberosAlt.testCollectionCreateSearchDelete(
> TestSolrCloudWithKerberosAlt.java:206)
>    [junit4]    >        at org.apache.solr.cloud.
> TestSolrCloudWithKerberosAlt.testBasics(TestSolrCloudWithKerberosAlt.
> java:152)
>    [junit4]    >        at java.lang.Thread.run(Thread.java:745)
>    [junit4]   2> NOTE: leaving temporary files on disk at:
> /home/jenkins/workspace/Lucene-Solr-master-Linux/solr/
> build/solr-core/test/J0/temp/solr.cloud.TestSolrCloudWithKerberosAlt_
> 4376F219244CF700-001
>    [junit4]   2> NOTE: test params are: codec=Asserting(Lucene70): {},
> docValues:{}, maxPointsInLeafNode=349, maxMBSortInHeap=7.225730435729361,
> sim=RandomSimilarity(queryNorm=false): {}, locale=no-NO,
> timezone=America/Boa_Vista
>    [junit4]   2> NOTE: Linux 4.4.0-36-generic amd64/Oracle Corporation
> 1.8.0_102 (64-bit)/cpus=12,threads=1,free=185292008,total=508887040
>    [junit4]   2> NOTE: All tests run in this JVM: [
> TestLMJelinekMercerSimilarityFactory, BasicZkTest, TestJmxMonitoredMap,
> TestSolrConfigHandlerConcurrent, TestManagedStopFilterFactory,
> TestRecoveryHdfs, TestGraphTermsQParserPlugin, TestManagedResource,
> TestStressLiveNodes, LeaderInitiatedRecoveryOnShardRestartTest,
> DeleteLastCustomShardedReplicaTest, TestDocTermOrds, TestMacros,
> TestBadConfig, CloudExitableDirectoryReaderTest,
> TestSuggestSpellingConverter, FileBasedSpellCheckerTest,
> DataDrivenBlockJoinTest, StandardRequestHandlerTest,
> TestExactSharedStatsCache, TestBulkSchemaAPI, TestTrieFacet,
> BlobRepositoryCloudTest, TestSchemaSimilarityResource,
> DistribDocExpirationUpdateProcessorTest, TestCloudPseudoReturnFields,
> SearchHandlerTest, ClusterStateTest, TestRealTimeGet,
> XsltUpdateRequestHandlerTest, TestRangeQuery, TestFaceting,
> BooleanFieldTest, TestLegacyNumericRangeQueryBuilder,
> TestSortByMinMaxFunction, CurrencyFieldOpenExchangeTest,
> PingRequestHandlerTest, HdfsRecoverLeaseTest, TestSolrDeletionPolicy2,
> AnalysisAfterCoreReloadTest, PluginInfoTest, CursorPagingTest,
> TestAtomicUpdateErrorCases, ResponseLogComponentTest,
> TestSolrQueryResponse, SystemInfoHandlerTest, DocumentAnalysisRequestHandlerTest,
> TestNumericTerms32, UUIDFieldTest, WrapperMergePolicyFactoryTest,
> BlockJoinFacetRandomTest, ConcurrentDeleteAndCreateCollectionTest,
> TestFastWriter, TestQuerySenderListener, TestHdfsUpdateLog, CoreSorterTest,
> BigEndianAscendingWordDeserializerTest, TestSolrCoreProperties,
> TestExpandComponent, AnalyticsQueryTest, HdfsDirectoryFactoryTest,
> CacheHeaderTest, OutOfBoxZkACLAndCredentialsProvidersTest,
> HdfsBasicDistributedZk2Test, TestUseDocValuesAsStored, HLLUtilTest,
> TestMiniSolrCloudClusterSSL, HdfsUnloadDistributedZkTest,
> DocValuesMissingTest, TestRandomRequestDistribution,
> TestBulkSchemaConcurrent, PreAnalyzedUpdateProcessorTest,
> TestFieldCollectionResource, DisMaxRequestHandlerTest,
> BasicAuthIntegrationTest, NotRequiredUniqueKeyTest,
> UUIDUpdateProcessorFallbackTest, BufferStoreTest, ReturnFieldsTest,
> DocExpirationUpdateProcessorFactoryTest, TestLockTree,
> OverseerModifyCollectionTest, SignatureUpdateProcessorFactoryTest,
> TestLeaderInitiatedRecoveryThread, TestRTimerTree,
> TestSolrCloudWithKerberosAlt]
>    [junit4] Completed [321/635 (1!)] on J0 in 47.09s, 1 test, 1 failure
> <<< FAILURES!
>
> [...truncated 61319 lines...]
>



-- 
Sincerely yours
Mikhail Khludnev

Mime
View raw message