lucene-dev mailing list archives

Site index · List index
Message view « Date » · « Thread »
Top « Date » · « Thread »
From Policeman Jenkins Server <jenk...@thetaphi.de>
Subject [JENKINS] Lucene-Solr-6.x-Solaris (64bit/jdk1.8.0) - Build # 470 - Still Unstable!
Date Tue, 25 Oct 2016 20:43:14 GMT
Build: https://jenkins.thetaphi.de/job/Lucene-Solr-6.x-Solaris/470/
Java: 64bit/jdk1.8.0 -XX:+UseCompressedOops -XX:+UseParallelGC

6 tests failed.
FAILED:  org.apache.solr.search.facet.TestJsonFacets.testStatsDistrib {p0=DV}

Error Message:
mismatch: 'A'!='B' @ facets/cat0/buckets/[0]/val

Stack Trace:
java.lang.RuntimeException: mismatch: 'A'!='B' @ facets/cat0/buckets/[0]/val
	at __randomizedtesting.SeedInfo.seed([A49D63747AED620C:785DCA02176CC6C6]:0)
	at org.apache.solr.SolrTestCaseHS.matchJSON(SolrTestCaseHS.java:161)
	at org.apache.solr.SolrTestCaseHS.assertJQ(SolrTestCaseHS.java:143)
	at org.apache.solr.SolrTestCaseHS$Client$Tester.assertJQ(SolrTestCaseHS.java:255)
	at org.apache.solr.SolrTestCaseHS$Client.testJQ(SolrTestCaseHS.java:296)
	at org.apache.solr.search.facet.TestJsonFacets.doStatsTemplated(TestJsonFacets.java:1152)
	at org.apache.solr.search.facet.TestJsonFacets.doStats(TestJsonFacets.java:361)
	at org.apache.solr.search.facet.TestJsonFacets.testStatsDistrib(TestJsonFacets.java:322)
	at sun.reflect.NativeMethodAccessorImpl.invoke0(Native Method)
	at sun.reflect.NativeMethodAccessorImpl.invoke(NativeMethodAccessorImpl.java:62)
	at sun.reflect.DelegatingMethodAccessorImpl.invoke(DelegatingMethodAccessorImpl.java:43)
	at java.lang.reflect.Method.invoke(Method.java:498)
	at com.carrotsearch.randomizedtesting.RandomizedRunner.invoke(RandomizedRunner.java:1713)
	at com.carrotsearch.randomizedtesting.RandomizedRunner$8.evaluate(RandomizedRunner.java:907)
	at com.carrotsearch.randomizedtesting.RandomizedRunner$9.evaluate(RandomizedRunner.java:943)
	at com.carrotsearch.randomizedtesting.RandomizedRunner$10.evaluate(RandomizedRunner.java:957)
	at com.carrotsearch.randomizedtesting.rules.SystemPropertiesRestoreRule$1.evaluate(SystemPropertiesRestoreRule.java:57)
	at org.apache.lucene.util.TestRuleSetupTeardownChained$1.evaluate(TestRuleSetupTeardownChained.java:49)
	at org.apache.lucene.util.AbstractBeforeAfterRule$1.evaluate(AbstractBeforeAfterRule.java:45)
	at org.apache.lucene.util.TestRuleThreadAndTestName$1.evaluate(TestRuleThreadAndTestName.java:48)
	at org.apache.lucene.util.TestRuleIgnoreAfterMaxFailures$1.evaluate(TestRuleIgnoreAfterMaxFailures.java:64)
	at org.apache.lucene.util.TestRuleMarkFailure$1.evaluate(TestRuleMarkFailure.java:47)
	at com.carrotsearch.randomizedtesting.rules.StatementAdapter.evaluate(StatementAdapter.java:36)
	at com.carrotsearch.randomizedtesting.ThreadLeakControl$StatementRunner.run(ThreadLeakControl.java:367)
	at com.carrotsearch.randomizedtesting.ThreadLeakControl.forkTimeoutingTask(ThreadLeakControl.java:811)
	at com.carrotsearch.randomizedtesting.ThreadLeakControl$3.evaluate(ThreadLeakControl.java:462)
	at com.carrotsearch.randomizedtesting.RandomizedRunner.runSingleTest(RandomizedRunner.java:916)
	at com.carrotsearch.randomizedtesting.RandomizedRunner$5.evaluate(RandomizedRunner.java:802)
	at com.carrotsearch.randomizedtesting.RandomizedRunner$6.evaluate(RandomizedRunner.java:852)
	at com.carrotsearch.randomizedtesting.RandomizedRunner$7.evaluate(RandomizedRunner.java:863)
	at com.carrotsearch.randomizedtesting.rules.StatementAdapter.evaluate(StatementAdapter.java:36)
	at com.carrotsearch.randomizedtesting.rules.SystemPropertiesRestoreRule$1.evaluate(SystemPropertiesRestoreRule.java:57)
	at org.apache.lucene.util.AbstractBeforeAfterRule$1.evaluate(AbstractBeforeAfterRule.java:45)
	at com.carrotsearch.randomizedtesting.rules.StatementAdapter.evaluate(StatementAdapter.java:36)
	at org.apache.lucene.util.TestRuleStoreClassName$1.evaluate(TestRuleStoreClassName.java:41)
	at com.carrotsearch.randomizedtesting.rules.NoShadowingOrOverridesOnMethodsRule$1.evaluate(NoShadowingOrOverridesOnMethodsRule.java:40)
	at com.carrotsearch.randomizedtesting.rules.NoShadowingOrOverridesOnMethodsRule$1.evaluate(NoShadowingOrOverridesOnMethodsRule.java:40)
	at com.carrotsearch.randomizedtesting.rules.StatementAdapter.evaluate(StatementAdapter.java:36)
	at com.carrotsearch.randomizedtesting.rules.StatementAdapter.evaluate(StatementAdapter.java:36)
	at com.carrotsearch.randomizedtesting.rules.StatementAdapter.evaluate(StatementAdapter.java:36)
	at org.apache.lucene.util.TestRuleAssertionsRequired$1.evaluate(TestRuleAssertionsRequired.java:53)
	at org.apache.lucene.util.TestRuleMarkFailure$1.evaluate(TestRuleMarkFailure.java:47)
	at org.apache.lucene.util.TestRuleIgnoreAfterMaxFailures$1.evaluate(TestRuleIgnoreAfterMaxFailures.java:64)
	at org.apache.lucene.util.TestRuleIgnoreTestSuites$1.evaluate(TestRuleIgnoreTestSuites.java:54)
	at com.carrotsearch.randomizedtesting.rules.StatementAdapter.evaluate(StatementAdapter.java:36)
	at com.carrotsearch.randomizedtesting.ThreadLeakControl$StatementRunner.run(ThreadLeakControl.java:367)
	at java.lang.Thread.run(Thread.java:745)


FAILED:  org.apache.solr.search.facet.TestJsonFacets.testStatsDistrib {p0=UIF}

Error Message:
mismatch: 'A'!='B' @ facets/cat0/buckets/[0]/val

Stack Trace:
java.lang.RuntimeException: mismatch: 'A'!='B' @ facets/cat0/buckets/[0]/val
	at __randomizedtesting.SeedInfo.seed([A49D63747AED620C:785DCA02176CC6C6]:0)
	at org.apache.solr.SolrTestCaseHS.matchJSON(SolrTestCaseHS.java:161)
	at org.apache.solr.SolrTestCaseHS.assertJQ(SolrTestCaseHS.java:143)
	at org.apache.solr.SolrTestCaseHS$Client$Tester.assertJQ(SolrTestCaseHS.java:255)
	at org.apache.solr.SolrTestCaseHS$Client.testJQ(SolrTestCaseHS.java:296)
	at org.apache.solr.search.facet.TestJsonFacets.doStatsTemplated(TestJsonFacets.java:1152)
	at org.apache.solr.search.facet.TestJsonFacets.doStats(TestJsonFacets.java:361)
	at org.apache.solr.search.facet.TestJsonFacets.testStatsDistrib(TestJsonFacets.java:322)
	at sun.reflect.NativeMethodAccessorImpl.invoke0(Native Method)
	at sun.reflect.NativeMethodAccessorImpl.invoke(NativeMethodAccessorImpl.java:62)
	at sun.reflect.DelegatingMethodAccessorImpl.invoke(DelegatingMethodAccessorImpl.java:43)
	at java.lang.reflect.Method.invoke(Method.java:498)
	at com.carrotsearch.randomizedtesting.RandomizedRunner.invoke(RandomizedRunner.java:1713)
	at com.carrotsearch.randomizedtesting.RandomizedRunner$8.evaluate(RandomizedRunner.java:907)
	at com.carrotsearch.randomizedtesting.RandomizedRunner$9.evaluate(RandomizedRunner.java:943)
	at com.carrotsearch.randomizedtesting.RandomizedRunner$10.evaluate(RandomizedRunner.java:957)
	at com.carrotsearch.randomizedtesting.rules.SystemPropertiesRestoreRule$1.evaluate(SystemPropertiesRestoreRule.java:57)
	at org.apache.lucene.util.TestRuleSetupTeardownChained$1.evaluate(TestRuleSetupTeardownChained.java:49)
	at org.apache.lucene.util.AbstractBeforeAfterRule$1.evaluate(AbstractBeforeAfterRule.java:45)
	at org.apache.lucene.util.TestRuleThreadAndTestName$1.evaluate(TestRuleThreadAndTestName.java:48)
	at org.apache.lucene.util.TestRuleIgnoreAfterMaxFailures$1.evaluate(TestRuleIgnoreAfterMaxFailures.java:64)
	at org.apache.lucene.util.TestRuleMarkFailure$1.evaluate(TestRuleMarkFailure.java:47)
	at com.carrotsearch.randomizedtesting.rules.StatementAdapter.evaluate(StatementAdapter.java:36)
	at com.carrotsearch.randomizedtesting.ThreadLeakControl$StatementRunner.run(ThreadLeakControl.java:367)
	at com.carrotsearch.randomizedtesting.ThreadLeakControl.forkTimeoutingTask(ThreadLeakControl.java:811)
	at com.carrotsearch.randomizedtesting.ThreadLeakControl$3.evaluate(ThreadLeakControl.java:462)
	at com.carrotsearch.randomizedtesting.RandomizedRunner.runSingleTest(RandomizedRunner.java:916)
	at com.carrotsearch.randomizedtesting.RandomizedRunner$5.evaluate(RandomizedRunner.java:802)
	at com.carrotsearch.randomizedtesting.RandomizedRunner$6.evaluate(RandomizedRunner.java:852)
	at com.carrotsearch.randomizedtesting.RandomizedRunner$7.evaluate(RandomizedRunner.java:863)
	at com.carrotsearch.randomizedtesting.rules.StatementAdapter.evaluate(StatementAdapter.java:36)
	at com.carrotsearch.randomizedtesting.rules.SystemPropertiesRestoreRule$1.evaluate(SystemPropertiesRestoreRule.java:57)
	at org.apache.lucene.util.AbstractBeforeAfterRule$1.evaluate(AbstractBeforeAfterRule.java:45)
	at com.carrotsearch.randomizedtesting.rules.StatementAdapter.evaluate(StatementAdapter.java:36)
	at org.apache.lucene.util.TestRuleStoreClassName$1.evaluate(TestRuleStoreClassName.java:41)
	at com.carrotsearch.randomizedtesting.rules.NoShadowingOrOverridesOnMethodsRule$1.evaluate(NoShadowingOrOverridesOnMethodsRule.java:40)
	at com.carrotsearch.randomizedtesting.rules.NoShadowingOrOverridesOnMethodsRule$1.evaluate(NoShadowingOrOverridesOnMethodsRule.java:40)
	at com.carrotsearch.randomizedtesting.rules.StatementAdapter.evaluate(StatementAdapter.java:36)
	at com.carrotsearch.randomizedtesting.rules.StatementAdapter.evaluate(StatementAdapter.java:36)
	at com.carrotsearch.randomizedtesting.rules.StatementAdapter.evaluate(StatementAdapter.java:36)
	at org.apache.lucene.util.TestRuleAssertionsRequired$1.evaluate(TestRuleAssertionsRequired.java:53)
	at org.apache.lucene.util.TestRuleMarkFailure$1.evaluate(TestRuleMarkFailure.java:47)
	at org.apache.lucene.util.TestRuleIgnoreAfterMaxFailures$1.evaluate(TestRuleIgnoreAfterMaxFailures.java:64)
	at org.apache.lucene.util.TestRuleIgnoreTestSuites$1.evaluate(TestRuleIgnoreTestSuites.java:54)
	at com.carrotsearch.randomizedtesting.rules.StatementAdapter.evaluate(StatementAdapter.java:36)
	at com.carrotsearch.randomizedtesting.ThreadLeakControl$StatementRunner.run(ThreadLeakControl.java:367)
	at java.lang.Thread.run(Thread.java:745)


FAILED:  org.apache.solr.search.facet.TestJsonFacets.testStatsDistrib {p0=SMART}

Error Message:
mismatch: 'A'!='B' @ facets/cat0/buckets/[0]/val

Stack Trace:
java.lang.RuntimeException: mismatch: 'A'!='B' @ facets/cat0/buckets/[0]/val
	at __randomizedtesting.SeedInfo.seed([A49D63747AED620C:785DCA02176CC6C6]:0)
	at org.apache.solr.SolrTestCaseHS.matchJSON(SolrTestCaseHS.java:161)
	at org.apache.solr.SolrTestCaseHS.assertJQ(SolrTestCaseHS.java:143)
	at org.apache.solr.SolrTestCaseHS$Client$Tester.assertJQ(SolrTestCaseHS.java:255)
	at org.apache.solr.SolrTestCaseHS$Client.testJQ(SolrTestCaseHS.java:296)
	at org.apache.solr.search.facet.TestJsonFacets.doStatsTemplated(TestJsonFacets.java:1152)
	at org.apache.solr.search.facet.TestJsonFacets.doStats(TestJsonFacets.java:361)
	at org.apache.solr.search.facet.TestJsonFacets.testStatsDistrib(TestJsonFacets.java:322)
	at sun.reflect.NativeMethodAccessorImpl.invoke0(Native Method)
	at sun.reflect.NativeMethodAccessorImpl.invoke(NativeMethodAccessorImpl.java:62)
	at sun.reflect.DelegatingMethodAccessorImpl.invoke(DelegatingMethodAccessorImpl.java:43)
	at java.lang.reflect.Method.invoke(Method.java:498)
	at com.carrotsearch.randomizedtesting.RandomizedRunner.invoke(RandomizedRunner.java:1713)
	at com.carrotsearch.randomizedtesting.RandomizedRunner$8.evaluate(RandomizedRunner.java:907)
	at com.carrotsearch.randomizedtesting.RandomizedRunner$9.evaluate(RandomizedRunner.java:943)
	at com.carrotsearch.randomizedtesting.RandomizedRunner$10.evaluate(RandomizedRunner.java:957)
	at com.carrotsearch.randomizedtesting.rules.SystemPropertiesRestoreRule$1.evaluate(SystemPropertiesRestoreRule.java:57)
	at org.apache.lucene.util.TestRuleSetupTeardownChained$1.evaluate(TestRuleSetupTeardownChained.java:49)
	at org.apache.lucene.util.AbstractBeforeAfterRule$1.evaluate(AbstractBeforeAfterRule.java:45)
	at org.apache.lucene.util.TestRuleThreadAndTestName$1.evaluate(TestRuleThreadAndTestName.java:48)
	at org.apache.lucene.util.TestRuleIgnoreAfterMaxFailures$1.evaluate(TestRuleIgnoreAfterMaxFailures.java:64)
	at org.apache.lucene.util.TestRuleMarkFailure$1.evaluate(TestRuleMarkFailure.java:47)
	at com.carrotsearch.randomizedtesting.rules.StatementAdapter.evaluate(StatementAdapter.java:36)
	at com.carrotsearch.randomizedtesting.ThreadLeakControl$StatementRunner.run(ThreadLeakControl.java:367)
	at com.carrotsearch.randomizedtesting.ThreadLeakControl.forkTimeoutingTask(ThreadLeakControl.java:811)
	at com.carrotsearch.randomizedtesting.ThreadLeakControl$3.evaluate(ThreadLeakControl.java:462)
	at com.carrotsearch.randomizedtesting.RandomizedRunner.runSingleTest(RandomizedRunner.java:916)
	at com.carrotsearch.randomizedtesting.RandomizedRunner$5.evaluate(RandomizedRunner.java:802)
	at com.carrotsearch.randomizedtesting.RandomizedRunner$6.evaluate(RandomizedRunner.java:852)
	at com.carrotsearch.randomizedtesting.RandomizedRunner$7.evaluate(RandomizedRunner.java:863)
	at com.carrotsearch.randomizedtesting.rules.StatementAdapter.evaluate(StatementAdapter.java:36)
	at com.carrotsearch.randomizedtesting.rules.SystemPropertiesRestoreRule$1.evaluate(SystemPropertiesRestoreRule.java:57)
	at org.apache.lucene.util.AbstractBeforeAfterRule$1.evaluate(AbstractBeforeAfterRule.java:45)
	at com.carrotsearch.randomizedtesting.rules.StatementAdapter.evaluate(StatementAdapter.java:36)
	at org.apache.lucene.util.TestRuleStoreClassName$1.evaluate(TestRuleStoreClassName.java:41)
	at com.carrotsearch.randomizedtesting.rules.NoShadowingOrOverridesOnMethodsRule$1.evaluate(NoShadowingOrOverridesOnMethodsRule.java:40)
	at com.carrotsearch.randomizedtesting.rules.NoShadowingOrOverridesOnMethodsRule$1.evaluate(NoShadowingOrOverridesOnMethodsRule.java:40)
	at com.carrotsearch.randomizedtesting.rules.StatementAdapter.evaluate(StatementAdapter.java:36)
	at com.carrotsearch.randomizedtesting.rules.StatementAdapter.evaluate(StatementAdapter.java:36)
	at com.carrotsearch.randomizedtesting.rules.StatementAdapter.evaluate(StatementAdapter.java:36)
	at org.apache.lucene.util.TestRuleAssertionsRequired$1.evaluate(TestRuleAssertionsRequired.java:53)
	at org.apache.lucene.util.TestRuleMarkFailure$1.evaluate(TestRuleMarkFailure.java:47)
	at org.apache.lucene.util.TestRuleIgnoreAfterMaxFailures$1.evaluate(TestRuleIgnoreAfterMaxFailures.java:64)
	at org.apache.lucene.util.TestRuleIgnoreTestSuites$1.evaluate(TestRuleIgnoreTestSuites.java:54)
	at com.carrotsearch.randomizedtesting.rules.StatementAdapter.evaluate(StatementAdapter.java:36)
	at com.carrotsearch.randomizedtesting.ThreadLeakControl$StatementRunner.run(ThreadLeakControl.java:367)
	at java.lang.Thread.run(Thread.java:745)


FAILED:  org.apache.solr.search.facet.TestJsonFacets.testStatsDistrib {p0=STREAM}

Error Message:
mismatch: 'A'!='B' @ facets/cat0/buckets/[0]/val

Stack Trace:
java.lang.RuntimeException: mismatch: 'A'!='B' @ facets/cat0/buckets/[0]/val
	at __randomizedtesting.SeedInfo.seed([A49D63747AED620C:785DCA02176CC6C6]:0)
	at org.apache.solr.SolrTestCaseHS.matchJSON(SolrTestCaseHS.java:161)
	at org.apache.solr.SolrTestCaseHS.assertJQ(SolrTestCaseHS.java:143)
	at org.apache.solr.SolrTestCaseHS$Client$Tester.assertJQ(SolrTestCaseHS.java:255)
	at org.apache.solr.SolrTestCaseHS$Client.testJQ(SolrTestCaseHS.java:296)
	at org.apache.solr.search.facet.TestJsonFacets.doStatsTemplated(TestJsonFacets.java:1152)
	at org.apache.solr.search.facet.TestJsonFacets.doStats(TestJsonFacets.java:361)
	at org.apache.solr.search.facet.TestJsonFacets.testStatsDistrib(TestJsonFacets.java:322)
	at sun.reflect.NativeMethodAccessorImpl.invoke0(Native Method)
	at sun.reflect.NativeMethodAccessorImpl.invoke(NativeMethodAccessorImpl.java:62)
	at sun.reflect.DelegatingMethodAccessorImpl.invoke(DelegatingMethodAccessorImpl.java:43)
	at java.lang.reflect.Method.invoke(Method.java:498)
	at com.carrotsearch.randomizedtesting.RandomizedRunner.invoke(RandomizedRunner.java:1713)
	at com.carrotsearch.randomizedtesting.RandomizedRunner$8.evaluate(RandomizedRunner.java:907)
	at com.carrotsearch.randomizedtesting.RandomizedRunner$9.evaluate(RandomizedRunner.java:943)
	at com.carrotsearch.randomizedtesting.RandomizedRunner$10.evaluate(RandomizedRunner.java:957)
	at com.carrotsearch.randomizedtesting.rules.SystemPropertiesRestoreRule$1.evaluate(SystemPropertiesRestoreRule.java:57)
	at org.apache.lucene.util.TestRuleSetupTeardownChained$1.evaluate(TestRuleSetupTeardownChained.java:49)
	at org.apache.lucene.util.AbstractBeforeAfterRule$1.evaluate(AbstractBeforeAfterRule.java:45)
	at org.apache.lucene.util.TestRuleThreadAndTestName$1.evaluate(TestRuleThreadAndTestName.java:48)
	at org.apache.lucene.util.TestRuleIgnoreAfterMaxFailures$1.evaluate(TestRuleIgnoreAfterMaxFailures.java:64)
	at org.apache.lucene.util.TestRuleMarkFailure$1.evaluate(TestRuleMarkFailure.java:47)
	at com.carrotsearch.randomizedtesting.rules.StatementAdapter.evaluate(StatementAdapter.java:36)
	at com.carrotsearch.randomizedtesting.ThreadLeakControl$StatementRunner.run(ThreadLeakControl.java:367)
	at com.carrotsearch.randomizedtesting.ThreadLeakControl.forkTimeoutingTask(ThreadLeakControl.java:811)
	at com.carrotsearch.randomizedtesting.ThreadLeakControl$3.evaluate(ThreadLeakControl.java:462)
	at com.carrotsearch.randomizedtesting.RandomizedRunner.runSingleTest(RandomizedRunner.java:916)
	at com.carrotsearch.randomizedtesting.RandomizedRunner$5.evaluate(RandomizedRunner.java:802)
	at com.carrotsearch.randomizedtesting.RandomizedRunner$6.evaluate(RandomizedRunner.java:852)
	at com.carrotsearch.randomizedtesting.RandomizedRunner$7.evaluate(RandomizedRunner.java:863)
	at com.carrotsearch.randomizedtesting.rules.StatementAdapter.evaluate(StatementAdapter.java:36)
	at com.carrotsearch.randomizedtesting.rules.SystemPropertiesRestoreRule$1.evaluate(SystemPropertiesRestoreRule.java:57)
	at org.apache.lucene.util.AbstractBeforeAfterRule$1.evaluate(AbstractBeforeAfterRule.java:45)
	at com.carrotsearch.randomizedtesting.rules.StatementAdapter.evaluate(StatementAdapter.java:36)
	at org.apache.lucene.util.TestRuleStoreClassName$1.evaluate(TestRuleStoreClassName.java:41)
	at com.carrotsearch.randomizedtesting.rules.NoShadowingOrOverridesOnMethodsRule$1.evaluate(NoShadowingOrOverridesOnMethodsRule.java:40)
	at com.carrotsearch.randomizedtesting.rules.NoShadowingOrOverridesOnMethodsRule$1.evaluate(NoShadowingOrOverridesOnMethodsRule.java:40)
	at com.carrotsearch.randomizedtesting.rules.StatementAdapter.evaluate(StatementAdapter.java:36)
	at com.carrotsearch.randomizedtesting.rules.StatementAdapter.evaluate(StatementAdapter.java:36)
	at com.carrotsearch.randomizedtesting.rules.StatementAdapter.evaluate(StatementAdapter.java:36)
	at org.apache.lucene.util.TestRuleAssertionsRequired$1.evaluate(TestRuleAssertionsRequired.java:53)
	at org.apache.lucene.util.TestRuleMarkFailure$1.evaluate(TestRuleMarkFailure.java:47)
	at org.apache.lucene.util.TestRuleIgnoreAfterMaxFailures$1.evaluate(TestRuleIgnoreAfterMaxFailures.java:64)
	at org.apache.lucene.util.TestRuleIgnoreTestSuites$1.evaluate(TestRuleIgnoreTestSuites.java:54)
	at com.carrotsearch.randomizedtesting.rules.StatementAdapter.evaluate(StatementAdapter.java:36)
	at com.carrotsearch.randomizedtesting.ThreadLeakControl$StatementRunner.run(ThreadLeakControl.java:367)
	at java.lang.Thread.run(Thread.java:745)


FAILED:  org.apache.solr.search.facet.TestJsonFacets.testStatsDistrib {p0=ENUM}

Error Message:
mismatch: 'A'!='B' @ facets/cat0/buckets/[0]/val

Stack Trace:
java.lang.RuntimeException: mismatch: 'A'!='B' @ facets/cat0/buckets/[0]/val
	at __randomizedtesting.SeedInfo.seed([A49D63747AED620C:785DCA02176CC6C6]:0)
	at org.apache.solr.SolrTestCaseHS.matchJSON(SolrTestCaseHS.java:161)
	at org.apache.solr.SolrTestCaseHS.assertJQ(SolrTestCaseHS.java:143)
	at org.apache.solr.SolrTestCaseHS$Client$Tester.assertJQ(SolrTestCaseHS.java:255)
	at org.apache.solr.SolrTestCaseHS$Client.testJQ(SolrTestCaseHS.java:296)
	at org.apache.solr.search.facet.TestJsonFacets.doStatsTemplated(TestJsonFacets.java:1152)
	at org.apache.solr.search.facet.TestJsonFacets.doStats(TestJsonFacets.java:361)
	at org.apache.solr.search.facet.TestJsonFacets.testStatsDistrib(TestJsonFacets.java:322)
	at sun.reflect.NativeMethodAccessorImpl.invoke0(Native Method)
	at sun.reflect.NativeMethodAccessorImpl.invoke(NativeMethodAccessorImpl.java:62)
	at sun.reflect.DelegatingMethodAccessorImpl.invoke(DelegatingMethodAccessorImpl.java:43)
	at java.lang.reflect.Method.invoke(Method.java:498)
	at com.carrotsearch.randomizedtesting.RandomizedRunner.invoke(RandomizedRunner.java:1713)
	at com.carrotsearch.randomizedtesting.RandomizedRunner$8.evaluate(RandomizedRunner.java:907)
	at com.carrotsearch.randomizedtesting.RandomizedRunner$9.evaluate(RandomizedRunner.java:943)
	at com.carrotsearch.randomizedtesting.RandomizedRunner$10.evaluate(RandomizedRunner.java:957)
	at com.carrotsearch.randomizedtesting.rules.SystemPropertiesRestoreRule$1.evaluate(SystemPropertiesRestoreRule.java:57)
	at org.apache.lucene.util.TestRuleSetupTeardownChained$1.evaluate(TestRuleSetupTeardownChained.java:49)
	at org.apache.lucene.util.AbstractBeforeAfterRule$1.evaluate(AbstractBeforeAfterRule.java:45)
	at org.apache.lucene.util.TestRuleThreadAndTestName$1.evaluate(TestRuleThreadAndTestName.java:48)
	at org.apache.lucene.util.TestRuleIgnoreAfterMaxFailures$1.evaluate(TestRuleIgnoreAfterMaxFailures.java:64)
	at org.apache.lucene.util.TestRuleMarkFailure$1.evaluate(TestRuleMarkFailure.java:47)
	at com.carrotsearch.randomizedtesting.rules.StatementAdapter.evaluate(StatementAdapter.java:36)
	at com.carrotsearch.randomizedtesting.ThreadLeakControl$StatementRunner.run(ThreadLeakControl.java:367)
	at com.carrotsearch.randomizedtesting.ThreadLeakControl.forkTimeoutingTask(ThreadLeakControl.java:811)
	at com.carrotsearch.randomizedtesting.ThreadLeakControl$3.evaluate(ThreadLeakControl.java:462)
	at com.carrotsearch.randomizedtesting.RandomizedRunner.runSingleTest(RandomizedRunner.java:916)
	at com.carrotsearch.randomizedtesting.RandomizedRunner$5.evaluate(RandomizedRunner.java:802)
	at com.carrotsearch.randomizedtesting.RandomizedRunner$6.evaluate(RandomizedRunner.java:852)
	at com.carrotsearch.randomizedtesting.RandomizedRunner$7.evaluate(RandomizedRunner.java:863)
	at com.carrotsearch.randomizedtesting.rules.StatementAdapter.evaluate(StatementAdapter.java:36)
	at com.carrotsearch.randomizedtesting.rules.SystemPropertiesRestoreRule$1.evaluate(SystemPropertiesRestoreRule.java:57)
	at org.apache.lucene.util.AbstractBeforeAfterRule$1.evaluate(AbstractBeforeAfterRule.java:45)
	at com.carrotsearch.randomizedtesting.rules.StatementAdapter.evaluate(StatementAdapter.java:36)
	at org.apache.lucene.util.TestRuleStoreClassName$1.evaluate(TestRuleStoreClassName.java:41)
	at com.carrotsearch.randomizedtesting.rules.NoShadowingOrOverridesOnMethodsRule$1.evaluate(NoShadowingOrOverridesOnMethodsRule.java:40)
	at com.carrotsearch.randomizedtesting.rules.NoShadowingOrOverridesOnMethodsRule$1.evaluate(NoShadowingOrOverridesOnMethodsRule.java:40)
	at com.carrotsearch.randomizedtesting.rules.StatementAdapter.evaluate(StatementAdapter.java:36)
	at com.carrotsearch.randomizedtesting.rules.StatementAdapter.evaluate(StatementAdapter.java:36)
	at com.carrotsearch.randomizedtesting.rules.StatementAdapter.evaluate(StatementAdapter.java:36)
	at org.apache.lucene.util.TestRuleAssertionsRequired$1.evaluate(TestRuleAssertionsRequired.java:53)
	at org.apache.lucene.util.TestRuleMarkFailure$1.evaluate(TestRuleMarkFailure.java:47)
	at org.apache.lucene.util.TestRuleIgnoreAfterMaxFailures$1.evaluate(TestRuleIgnoreAfterMaxFailures.java:64)
	at org.apache.lucene.util.TestRuleIgnoreTestSuites$1.evaluate(TestRuleIgnoreTestSuites.java:54)
	at com.carrotsearch.randomizedtesting.rules.StatementAdapter.evaluate(StatementAdapter.java:36)
	at com.carrotsearch.randomizedtesting.ThreadLeakControl$StatementRunner.run(ThreadLeakControl.java:367)
	at java.lang.Thread.run(Thread.java:745)


FAILED:  org.apache.solr.search.facet.TestJsonFacets.testStatsDistrib {p0=DVHASH}

Error Message:
mismatch: 'A'!='B' @ facets/cat0/buckets/[0]/val

Stack Trace:
java.lang.RuntimeException: mismatch: 'A'!='B' @ facets/cat0/buckets/[0]/val
	at __randomizedtesting.SeedInfo.seed([A49D63747AED620C:785DCA02176CC6C6]:0)
	at org.apache.solr.SolrTestCaseHS.matchJSON(SolrTestCaseHS.java:161)
	at org.apache.solr.SolrTestCaseHS.assertJQ(SolrTestCaseHS.java:143)
	at org.apache.solr.SolrTestCaseHS$Client$Tester.assertJQ(SolrTestCaseHS.java:255)
	at org.apache.solr.SolrTestCaseHS$Client.testJQ(SolrTestCaseHS.java:296)
	at org.apache.solr.search.facet.TestJsonFacets.doStatsTemplated(TestJsonFacets.java:1152)
	at org.apache.solr.search.facet.TestJsonFacets.doStats(TestJsonFacets.java:361)
	at org.apache.solr.search.facet.TestJsonFacets.testStatsDistrib(TestJsonFacets.java:322)
	at sun.reflect.NativeMethodAccessorImpl.invoke0(Native Method)
	at sun.reflect.NativeMethodAccessorImpl.invoke(NativeMethodAccessorImpl.java:62)
	at sun.reflect.DelegatingMethodAccessorImpl.invoke(DelegatingMethodAccessorImpl.java:43)
	at java.lang.reflect.Method.invoke(Method.java:498)
	at com.carrotsearch.randomizedtesting.RandomizedRunner.invoke(RandomizedRunner.java:1713)
	at com.carrotsearch.randomizedtesting.RandomizedRunner$8.evaluate(RandomizedRunner.java:907)
	at com.carrotsearch.randomizedtesting.RandomizedRunner$9.evaluate(RandomizedRunner.java:943)
	at com.carrotsearch.randomizedtesting.RandomizedRunner$10.evaluate(RandomizedRunner.java:957)
	at com.carrotsearch.randomizedtesting.rules.SystemPropertiesRestoreRule$1.evaluate(SystemPropertiesRestoreRule.java:57)
	at org.apache.lucene.util.TestRuleSetupTeardownChained$1.evaluate(TestRuleSetupTeardownChained.java:49)
	at org.apache.lucene.util.AbstractBeforeAfterRule$1.evaluate(AbstractBeforeAfterRule.java:45)
	at org.apache.lucene.util.TestRuleThreadAndTestName$1.evaluate(TestRuleThreadAndTestName.java:48)
	at org.apache.lucene.util.TestRuleIgnoreAfterMaxFailures$1.evaluate(TestRuleIgnoreAfterMaxFailures.java:64)
	at org.apache.lucene.util.TestRuleMarkFailure$1.evaluate(TestRuleMarkFailure.java:47)
	at com.carrotsearch.randomizedtesting.rules.StatementAdapter.evaluate(StatementAdapter.java:36)
	at com.carrotsearch.randomizedtesting.ThreadLeakControl$StatementRunner.run(ThreadLeakControl.java:367)
	at com.carrotsearch.randomizedtesting.ThreadLeakControl.forkTimeoutingTask(ThreadLeakControl.java:811)
	at com.carrotsearch.randomizedtesting.ThreadLeakControl$3.evaluate(ThreadLeakControl.java:462)
	at com.carrotsearch.randomizedtesting.RandomizedRunner.runSingleTest(RandomizedRunner.java:916)
	at com.carrotsearch.randomizedtesting.RandomizedRunner$5.evaluate(RandomizedRunner.java:802)
	at com.carrotsearch.randomizedtesting.RandomizedRunner$6.evaluate(RandomizedRunner.java:852)
	at com.carrotsearch.randomizedtesting.RandomizedRunner$7.evaluate(RandomizedRunner.java:863)
	at com.carrotsearch.randomizedtesting.rules.StatementAdapter.evaluate(StatementAdapter.java:36)
	at com.carrotsearch.randomizedtesting.rules.SystemPropertiesRestoreRule$1.evaluate(SystemPropertiesRestoreRule.java:57)
	at org.apache.lucene.util.AbstractBeforeAfterRule$1.evaluate(AbstractBeforeAfterRule.java:45)
	at com.carrotsearch.randomizedtesting.rules.StatementAdapter.evaluate(StatementAdapter.java:36)
	at org.apache.lucene.util.TestRuleStoreClassName$1.evaluate(TestRuleStoreClassName.java:41)
	at com.carrotsearch.randomizedtesting.rules.NoShadowingOrOverridesOnMethodsRule$1.evaluate(NoShadowingOrOverridesOnMethodsRule.java:40)
	at com.carrotsearch.randomizedtesting.rules.NoShadowingOrOverridesOnMethodsRule$1.evaluate(NoShadowingOrOverridesOnMethodsRule.java:40)
	at com.carrotsearch.randomizedtesting.rules.StatementAdapter.evaluate(StatementAdapter.java:36)
	at com.carrotsearch.randomizedtesting.rules.StatementAdapter.evaluate(StatementAdapter.java:36)
	at com.carrotsearch.randomizedtesting.rules.StatementAdapter.evaluate(StatementAdapter.java:36)
	at org.apache.lucene.util.TestRuleAssertionsRequired$1.evaluate(TestRuleAssertionsRequired.java:53)
	at org.apache.lucene.util.TestRuleMarkFailure$1.evaluate(TestRuleMarkFailure.java:47)
	at org.apache.lucene.util.TestRuleIgnoreAfterMaxFailures$1.evaluate(TestRuleIgnoreAfterMaxFailures.java:64)
	at org.apache.lucene.util.TestRuleIgnoreTestSuites$1.evaluate(TestRuleIgnoreTestSuites.java:54)
	at com.carrotsearch.randomizedtesting.rules.StatementAdapter.evaluate(StatementAdapter.java:36)
	at com.carrotsearch.randomizedtesting.ThreadLeakControl$StatementRunner.run(ThreadLeakControl.java:367)
	at java.lang.Thread.run(Thread.java:745)




Build Log:
[...truncated 10648 lines...]
   [junit4] Suite: org.apache.solr.search.facet.TestJsonFacets
   [junit4]   2> Creating dataDir: /export/home/jenkins/workspace/Lucene-Solr-6.x-Solaris/solr/build/solr-core/test/J0/temp/solr.search.facet.TestJsonFacets_A49D63747AED620C-001/init-core-data-001
   [junit4]   2> 121645 INFO  (SUITE-TestJsonFacets-seed#[A49D63747AED620C]-worker) [    ] o.a.s.SolrTestCaseJ4 Randomized ssl (false) and clientAuth (false) via: @org.apache.solr.SolrTestCaseJ4$SuppressSSL(bugUrl=None)
   [junit4]   2> 121664 INFO  (SUITE-TestJsonFacets-seed#[A49D63747AED620C]-worker) [    ] o.a.s.SolrTestCaseJ4 ####initCore
   [junit4]   2> 121664 INFO  (SUITE-TestJsonFacets-seed#[A49D63747AED620C]-worker) [    ] o.a.s.c.SolrResourceLoader [null] Added 2 libs to classloader, from paths: [/export/home/jenkins/workspace/Lucene-Solr-6.x-Solaris/solr/core/src/test-files/solr/collection1/lib, /export/home/jenkins/workspace/Lucene-Solr-6.x-Solaris/solr/core/src/test-files/solr/collection1/lib/classes]
   [junit4]   2> 121695 INFO  (SUITE-TestJsonFacets-seed#[A49D63747AED620C]-worker) [    ] o.a.s.c.SolrConfig Using Lucene MatchVersion: 6.3.0
   [junit4]   2> 121709 INFO  (SUITE-TestJsonFacets-seed#[A49D63747AED620C]-worker) [    ] o.a.s.s.IndexSchema [null] Schema name=example
   [junit4]   2> 121776 INFO  (SUITE-TestJsonFacets-seed#[A49D63747AED620C]-worker) [    ] o.a.s.s.IndexSchema Loaded schema example/1.6 with uniqueid field id
   [junit4]   2> 121796 INFO  (SUITE-TestJsonFacets-seed#[A49D63747AED620C]-worker) [    ] o.a.s.u.UpdateShardHandler Creating UpdateShardHandler HTTP client with params: socketTimeout=30000&connTimeout=30000&retry=true
   [junit4]   2> 121800 INFO  (coreLoadExecutor-160-thread-1) [    ] o.a.s.c.SolrResourceLoader [null] Added 2 libs to classloader, from paths: [/export/home/jenkins/workspace/Lucene-Solr-6.x-Solaris/solr/core/src/test-files/solr/collection1/lib, /export/home/jenkins/workspace/Lucene-Solr-6.x-Solaris/solr/core/src/test-files/solr/collection1/lib/classes]
   [junit4]   2> 121845 INFO  (coreLoadExecutor-160-thread-1) [    ] o.a.s.c.SolrConfig Using Lucene MatchVersion: 6.3.0
   [junit4]   2> 121858 INFO  (coreLoadExecutor-160-thread-1) [    ] o.a.s.s.IndexSchema [collection1] Schema name=example
   [junit4]   2> 121905 INFO  (coreLoadExecutor-160-thread-1) [    ] o.a.s.s.IndexSchema Loaded schema example/1.6 with uniqueid field id
   [junit4]   2> 121916 INFO  (coreLoadExecutor-160-thread-1) [    ] o.a.s.c.CoreContainer Creating SolrCore 'collection1' using configuration from instancedir /export/home/jenkins/workspace/Lucene-Solr-6.x-Solaris/solr/core/src/test-files/solr/collection1
   [junit4]   2> 121916 INFO  (coreLoadExecutor-160-thread-1) [    x:collection1] o.a.s.c.SolrCore [[collection1] ] Opening new SolrCore at [/export/home/jenkins/workspace/Lucene-Solr-6.x-Solaris/solr/core/src/test-files/solr/collection1], dataDir=[/export/home/jenkins/workspace/Lucene-Solr-6.x-Solaris/solr/build/solr-core/test/J0/temp/solr.search.facet.TestJsonFacets_A49D63747AED620C-001/init-core-data-001/]
   [junit4]   2> 121916 INFO  (coreLoadExecutor-160-thread-1) [    x:collection1] o.a.s.c.JmxMonitoredMap JMX monitoring is enabled. Adding Solr mbeans to JMX Server: com.sun.jmx.mbeanserver.JmxMBeanServer@58dc4974
   [junit4]   2> 121917 INFO  (coreLoadExecutor-160-thread-1) [    x:collection1] o.a.s.u.RandomMergePolicy RandomMergePolicy wrapping class org.apache.lucene.index.TieredMergePolicy: [TieredMergePolicy: maxMergeAtOnce=32, maxMergeAtOnceExplicit=41, maxMergedSegmentMB=31.40625, floorSegmentMB=1.66796875, forceMergeDeletesPctAllowed=21.339764953835093, segmentsPerTier=21.0, maxCFSSegmentSizeMB=8.796093022207999E12, noCFSRatio=1.0
   [junit4]   2> 121923 WARN  (coreLoadExecutor-160-thread-1) [    x:collection1] o.a.s.c.RequestHandlers INVALID paramSet a in requestHandler {type = requestHandler,name = /dump,class = DumpRequestHandler,args = {defaults={a=A,b=B}}}
   [junit4]   2> 121930 INFO  (coreLoadExecutor-160-thread-1) [    x:collection1] o.a.s.u.UpdateHandler Using UpdateLog implementation: org.apache.solr.update.UpdateLog
   [junit4]   2> 121930 INFO  (coreLoadExecutor-160-thread-1) [    x:collection1] o.a.s.u.UpdateLog Initializing UpdateLog: dataDir= defaultSyncLevel=FLUSH numRecordsToKeep=100 maxNumLogsToKeep=10 numVersionBuckets=65536
   [junit4]   2> 121930 INFO  (coreLoadExecutor-160-thread-1) [    x:collection1] o.a.s.u.CommitTracker Hard AutoCommit: disabled
   [junit4]   2> 121930 INFO  (coreLoadExecutor-160-thread-1) [    x:collection1] o.a.s.u.CommitTracker Soft AutoCommit: disabled
   [junit4]   2> 121930 INFO  (coreLoadExecutor-160-thread-1) [    x:collection1] o.a.s.u.RandomMergePolicy RandomMergePolicy wrapping class org.apache.lucene.index.LogDocMergePolicy: [LogDocMergePolicy: minMergeSize=1000, mergeFactor=11, maxMergeSize=9223372036854775807, maxMergeSizeForForcedMerge=9223372036854775807, calibrateSizeByDeletes=false, maxMergeDocs=2147483647, maxCFSSegmentSizeMB=8.796093022207999E12, noCFSRatio=1.0]
   [junit4]   2> 121935 INFO  (coreLoadExecutor-160-thread-1) [    x:collection1] o.a.s.s.SolrIndexSearcher Opening [Searcher@29a84a17[collection1] main]
   [junit4]   2> 121935 WARN  (coreLoadExecutor-160-thread-1) [    x:collection1] o.a.s.r.ManagedResourceStorage Cannot write to config directory /export/home/jenkins/workspace/Lucene-Solr-6.x-Solaris/solr/core/src/test-files/solr/collection1/conf; switching to use InMemory storage instead.
   [junit4]   2> 121935 INFO  (coreLoadExecutor-160-thread-1) [    x:collection1] o.a.s.h.ReplicationHandler Commits will be reserved for  10000
   [junit4]   2> 121936 INFO  (searcherExecutor-161-thread-1-processing-x:collection1) [    x:collection1] o.a.s.c.SolrCore [collection1] Registered new searcher Searcher@29a84a17[collection1] main{ExitableDirectoryReader(UninvertingDirectoryReader())}
   [junit4]   2> 121937 INFO  (coreLoadExecutor-160-thread-1) [    x:collection1] o.a.s.u.UpdateLog Could not find max version in index or recent updates, using new clock 1549191699416219648
   [junit4]   2> 121941 INFO  (SUITE-TestJsonFacets-seed#[A49D63747AED620C]-worker) [    ] o.a.s.SolrTestCaseJ4 ####initCore end
   [junit4]   2> 121944 INFO  (TEST-TestJsonFacets.testTolerant-seed#[A49D63747AED620C]) [    ] o.a.s.SolrTestCaseJ4 ###Starting testTolerant {p0=DV}
   [junit4]   2> 121959 INFO  (TEST-TestJsonFacets.testTolerant-seed#[A49D63747AED620C]) [    ] o.e.j.s.Server jetty-9.3.8.v20160314
   [junit4]   2> 121961 INFO  (TEST-TestJsonFacets.testTolerant-seed#[A49D63747AED620C]) [    ] o.e.j.s.h.ContextHandler Started o.e.j.s.ServletContextHandler@79ba8092{/solr,null,AVAILABLE}
   [junit4]   2> 121962 INFO  (TEST-TestJsonFacets.testTolerant-seed#[A49D63747AED620C]) [    ] o.e.j.s.ServerConnector Started ServerConnector@54f5ab0{HTTP/1.1,[http/1.1]}{127.0.0.1:47908}
   [junit4]   2> 121962 INFO  (TEST-TestJsonFacets.testTolerant-seed#[A49D63747AED620C]) [    ] o.e.j.s.Server Started @124960ms
   [junit4]   2> 121962 INFO  (TEST-TestJsonFacets.testTolerant-seed#[A49D63747AED620C]) [    ] o.a.s.c.s.e.JettySolrRunner Jetty properties: {schema=schema_latest.xml, solrconfig=solrconfig-tlog.xml, hostContext=/solr, hostPort=47908}
   [junit4]   2> 121963 ERROR (TEST-TestJsonFacets.testTolerant-seed#[A49D63747AED620C]) [    ] o.a.s.s.StartupLoggingUtils Missing Java Option solr.log.dir. Logging may be missing or incomplete.
   [junit4]   2> 121964 INFO  (TEST-TestJsonFacets.testTolerant-seed#[A49D63747AED620C]) [    ] o.a.s.s.SolrDispatchFilter  ___      _       Welcome to Apache Solr™ version 6.3.0
   [junit4]   2> 121964 INFO  (TEST-TestJsonFacets.testTolerant-seed#[A49D63747AED620C]) [    ] o.a.s.s.SolrDispatchFilter / __| ___| |_ _   Starting in standalone mode on port null
   [junit4]   2> 121964 INFO  (TEST-TestJsonFacets.testTolerant-seed#[A49D63747AED620C]) [    ] o.a.s.s.SolrDispatchFilter \__ \/ _ \ | '_|  Install dir: null
   [junit4]   2> 121964 INFO  (TEST-TestJsonFacets.testTolerant-seed#[A49D63747AED620C]) [    ] o.a.s.s.SolrDispatchFilter |___/\___/_|_|    Start time: 2016-10-25T19:38:54.950Z
   [junit4]   2> 121964 INFO  (TEST-TestJsonFacets.testTolerant-seed#[A49D63747AED620C]) [    ] o.a.s.c.SolrXmlConfig Loading container configuration from /export/home/jenkins/workspace/Lucene-Solr-6.x-Solaris/solr/build/solr-core/test/J0/temp/solr.search.facet.TestJsonFacets_A49D63747AED620C-001/s0-001/solr.xml
   [junit4]   2> 121970 INFO  (TEST-TestJsonFacets.testTolerant-seed#[A49D63747AED620C]) [    ] o.a.s.u.UpdateShardHandler Creating UpdateShardHandler HTTP client with params: socketTimeout=340000&connTimeout=45000&retry=true
   [junit4]   2> 121973 INFO  (TEST-TestJsonFacets.testTolerant-seed#[A49D63747AED620C]) [    ] o.a.s.c.CorePropertiesLocator Found 1 core definitions underneath /export/home/jenkins/workspace/Lucene-Solr-6.x-Solaris/solr/build/solr-core/test/J0/temp/solr.search.facet.TestJsonFacets_A49D63747AED620C-001/s0-001/.
   [junit4]   2> 121973 INFO  (TEST-TestJsonFacets.testTolerant-seed#[A49D63747AED620C]) [    ] o.a.s.c.CorePropertiesLocator Cores are: [collection1]
   [junit4]   2> 121985 INFO  (coreLoadExecutor-171-thread-1) [    ] o.a.s.c.SolrConfig Using Lucene MatchVersion: 6.3.0
   [junit4]   2> 121998 INFO  (coreLoadExecutor-171-thread-1) [    ] o.a.s.s.IndexSchema [collection1] Schema name=example
   [junit4]   2> 122049 INFO  (coreLoadExecutor-171-thread-1) [    ] o.a.s.s.IndexSchema Loaded schema example/1.6 with uniqueid field id
   [junit4]   2> 122060 INFO  (coreLoadExecutor-171-thread-1) [    ] o.a.s.c.CoreContainer Creating SolrCore 'collection1' using configuration from instancedir /export/home/jenkins/workspace/Lucene-Solr-6.x-Solaris/solr/build/solr-core/test/J0/temp/solr.search.facet.TestJsonFacets_A49D63747AED620C-001/s0-001/./collection1
   [junit4]   2> 122060 INFO  (coreLoadExecutor-171-thread-1) [    x:collection1] o.a.s.c.SolrCore [[collection1] ] Opening new SolrCore at [/export/home/jenkins/workspace/Lucene-Solr-6.x-Solaris/solr/build/solr-core/test/J0/temp/solr.search.facet.TestJsonFacets_A49D63747AED620C-001/s0-001/collection1], dataDir=[/export/home/jenkins/workspace/Lucene-Solr-6.x-Solaris/solr/build/solr-core/test/J0/temp/solr.search.facet.TestJsonFacets_A49D63747AED620C-001/s0-001/./collection1/data/]
   [junit4]   2> 122060 INFO  (coreLoadExecutor-171-thread-1) [    x:collection1] o.a.s.c.JmxMonitoredMap JMX monitoring is enabled. Adding Solr mbeans to JMX Server: com.sun.jmx.mbeanserver.JmxMBeanServer@58dc4974
   [junit4]   2> 122061 INFO  (coreLoadExecutor-171-thread-1) [    x:collection1] o.a.s.u.RandomMergePolicy RandomMergePolicy wrapping class org.apache.lucene.index.TieredMergePolicy: [TieredMergePolicy: maxMergeAtOnce=32, maxMergeAtOnceExplicit=41, maxMergedSegmentMB=31.40625, floorSegmentMB=1.66796875, forceMergeDeletesPctAllowed=21.339764953835093, segmentsPerTier=21.0, maxCFSSegmentSizeMB=8.796093022207999E12, noCFSRatio=1.0
   [junit4]   2> 122066 WARN  (coreLoadExecutor-171-thread-1) [    x:collection1] o.a.s.c.RequestHandlers INVALID paramSet a in requestHandler {type = requestHandler,name = /dump,class = DumpRequestHandler,args = {defaults={a=A,b=B}}}
   [junit4]   2> 122077 INFO  (coreLoadExecutor-171-thread-1) [    x:collection1] o.a.s.u.UpdateHandler Using UpdateLog implementation: org.apache.solr.update.UpdateLog
   [junit4]   2> 122077 INFO  (coreLoadExecutor-171-thread-1) [    x:collection1] o.a.s.u.UpdateLog Initializing UpdateLog: dataDir= defaultSyncLevel=FLUSH numRecordsToKeep=100 maxNumLogsToKeep=10 numVersionBuckets=65536
   [junit4]   2> 122077 INFO  (coreLoadExecutor-171-thread-1) [    x:collection1] o.a.s.u.CommitTracker Hard AutoCommit: disabled
   [junit4]   2> 122077 INFO  (coreLoadExecutor-171-thread-1) [    x:collection1] o.a.s.u.CommitTracker Soft AutoCommit: disabled
   [junit4]   2> 122078 INFO  (coreLoadExecutor-171-thread-1) [    x:collection1] o.a.s.u.RandomMergePolicy RandomMergePolicy wrapping class org.apache.lucene.index.LogDocMergePolicy: [LogDocMergePolicy: minMergeSize=1000, mergeFactor=11, maxMergeSize=9223372036854775807, maxMergeSizeForForcedMerge=9223372036854775807, calibrateSizeByDeletes=false, maxMergeDocs=2147483647, maxCFSSegmentSizeMB=8.796093022207999E12, noCFSRatio=1.0]
   [junit4]   2> 122079 INFO  (coreLoadExecutor-171-thread-1) [    x:collection1] o.a.s.s.SolrIndexSearcher Opening [Searcher@78436792[collection1] main]
   [junit4]   2> 122079 INFO  (coreLoadExecutor-171-thread-1) [    x:collection1] o.a.s.r.ManagedResourceStorage File-based storage initialized to use dir: /export/home/jenkins/workspace/Lucene-Solr-6.x-Solaris/solr/build/solr-core/test/J0/temp/solr.search.facet.TestJsonFacets_A49D63747AED620C-001/s0-001/collection1/conf
   [junit4]   2> 122079 INFO  (coreLoadExecutor-171-thread-1) [    x:collection1] o.a.s.h.ReplicationHandler Commits will be reserved for  10000
   [junit4]   2> 122080 INFO  (searcherExecutor-172-thread-1-processing-x:collection1) [    x:collection1] o.a.s.c.SolrCore [collection1] Registered new searcher Searcher@78436792[collection1] main{ExitableDirectoryReader(UninvertingDirectoryReader())}
   [junit4]   2> 122080 INFO  (coreLoadExecutor-171-thread-1) [    x:collection1] o.a.s.u.UpdateLog Could not find max version in index or recent updates, using new clock 1549191699566166016
   [junit4]   2> 122480 INFO  (TEST-TestJsonFacets.testTolerant-seed#[A49D63747AED620C]) [    ] o.a.s.SolrTestCaseHS ===> Started solr server port=47908 home=/export/home/jenkins/workspace/Lucene-Solr-6.x-Solaris/solr/build/solr-core/test/J0/temp/solr.search.facet.TestJsonFacets_A49D63747AED620C-001/s0-001
   [junit4]   2> 122491 INFO  (TEST-TestJsonFacets.testTolerant-seed#[A49D63747AED620C]) [    ] o.e.j.s.Server jetty-9.3.8.v20160314
   [junit4]   2> 122495 INFO  (TEST-TestJsonFacets.testTolerant-seed#[A49D63747AED620C]) [    ] o.e.j.s.h.ContextHandler Started o.e.j.s.ServletContextHandler@20ad7656{/solr,null,AVAILABLE}
   [junit4]   2> 122496 INFO  (TEST-TestJsonFacets.testTolerant-seed#[A49D63747AED620C]) [    ] o.e.j.s.ServerConnector Started ServerConnector@284c6fd4{HTTP/1.1,[http/1.1]}{127.0.0.1:65040}
   [junit4]   2> 122496 INFO  (TEST-TestJsonFacets.testTolerant-seed#[A49D63747AED620C]) [    ] o.e.j.s.Server Started @125494ms
   [junit4]   2> 122496 INFO  (TEST-TestJsonFacets.testTolerant-seed#[A49D63747AED620C]) [    ] o.a.s.c.s.e.JettySolrRunner Jetty properties: {schema=schema_latest.xml, solrconfig=solrconfig-tlog.xml, hostContext=/solr, hostPort=65040}
   [junit4]   2> 122496 ERROR (TEST-TestJsonFacets.testTolerant-seed#[A49D63747AED620C]) [    ] o.a.s.s.StartupLoggingUtils Missing Java Option solr.log.dir. Logging may be missing or incomplete.
   [junit4]   2> 122497 INFO  (TEST-TestJsonFacets.testTolerant-seed#[A49D63747AED620C]) [    ] o.a.s.s.SolrDispatchFilter  ___      _       Welcome to Apache Solr™ version 6.3.0
   [junit4]   2> 122497 INFO  (TEST-TestJsonFacets.testTolerant-seed#[A49D63747AED620C]) [    ] o.a.s.s.SolrDispatchFilter / __| ___| |_ _   Starting in standalone mode on port null
   [junit4]   2> 122497 INFO  (TEST-TestJsonFacets.testTolerant-seed#[A49D63747AED620C]) [    ] o.a.s.s.SolrDispatchFilter \__ \/ _ \ | '_|  Install dir: null
   [junit4]   2> 122497 INFO  (TEST-TestJsonFacets.testTolerant-seed#[A49D63747AED620C]) [    ] o.a.s.s.SolrDispatchFilter |___/\___/_|_|    Start time: 2016-10-25T19:38:55.483Z
   [junit4]   2> 122497 INFO  (TEST-TestJsonFacets.testTolerant-seed#[A49D63747AED620C]) [    ] o.a.s.c.SolrXmlConfig Loading container configuration from /export/home/jenkins/workspace/Lucene-Solr-6.x-Solaris/solr/build/solr-core/test/J0/temp/solr.search.facet.TestJsonFacets_A49D63747AED620C-001/s1-001/solr.xml
   [junit4]   2> 122508 INFO  (TEST-TestJsonFacets.testTolerant-seed#[A49D63747AED620C]) [    ] o.a.s.u.UpdateShardHandler Creating UpdateShardHandler HTTP client with params: socketTimeout=340000&connTimeout=45000&retry=true
   [junit4]   2> 122516 INFO  (TEST-TestJsonFacets.testTolerant-seed#[A49D63747AED620C]) [    ] o.a.s.c.CorePropertiesLocator Found 1 core definitions underneath /export/home/jenkins/workspace/Lucene-Solr-6.x-Solaris/solr/build/solr-core/test/J0/temp/solr.search.facet.TestJsonFacets_A49D63747AED620C-001/s1-001/.
   [junit4]   2> 122516 INFO  (TEST-TestJsonFacets.testTolerant-seed#[A49D63747AED620C]) [    ] o.a.s.c.CorePropertiesLocator Cores are: [collection1]
   [junit4]   2> 122532 INFO  (coreLoadExecutor-182-thread-1) [    ] o.a.s.c.SolrConfig Using Lucene MatchVersion: 6.3.0
   [junit4]   2> 122546 INFO  (coreLoadExecutor-182-thread-1) [    ] o.a.s.s.IndexSchema [collection1] Schema name=example
   [junit4]   2> 122608 INFO  (coreLoadExecutor-182-thread-1) [    ] o.a.s.s.IndexSchema Loaded schema example/1.6 with uniqueid field id
   [junit4]   2> 122623 INFO  (coreLoadExecutor-182-thread-1) [    ] o.a.s.c.CoreContainer Creating SolrCore 'collection1' using configuration from instancedir /export/home/jenkins/workspace/Lucene-Solr-6.x-Solaris/solr/build/solr-core/test/J0/temp/solr.search.facet.TestJsonFacets_A49D63747AED620C-001/s1-001/./collection1
   [junit4]   2> 122624 INFO  (coreLoadExecutor-182-thread-1) [    x:collection1] o.a.s.c.SolrCore [[collection1] ] Opening new SolrCore at [/export/home/jenkins/workspace/Lucene-Solr-6.x-Solaris/solr/build/solr-core/test/J0/temp/solr.search.facet.TestJsonFacets_A49D63747AED620C-001/s1-001/collection1], dataDir=[/export/home/jenkins/workspace/Lucene-Solr-6.x-Solaris/solr/build/solr-core/test/J0/temp/solr.search.facet.TestJsonFacets_A49D63747AED620C-001/s1-001/./collection1/data/]
   [junit4]   2> 122624 INFO  (coreLoadExecutor-182-thread-1) [    x:collection1] o.a.s.c.JmxMonitoredMap JMX monitoring is enabled. Adding Solr mbeans to JMX Server: com.sun.jmx.mbeanserver.JmxMBeanServer@58dc4974
   [junit4]   2> 122625 INFO  (coreLoadExecutor-182-thread-1) [    x:collection1] o.a.s.u.RandomMergePolicy RandomMergePolicy wrapping class org.apache.lucene.index.TieredMergePolicy: [TieredMergePolicy: maxMergeAtOnce=32, maxMergeAtOnceExplicit=41, maxMergedSegmentMB=31.40625, floorSegmentMB=1.66796875, forceMergeDeletesPctAllowed=21.339764953835093, segmentsPerTier=21.0, maxCFSSegmentSizeMB=8.796093022207999E12, noCFSRatio=1.0
   [junit4]   2> 122642 WARN  (coreLoadExecutor-182-thread-1) [    x:collection1] o.a.s.c.RequestHandlers INVALID paramSet a in requestHandler {type = requestHandler,name = /dump,class = DumpRequestHandler,args = {defaults={a=A,b=B}}}
   [junit4]   2> 122660 INFO  (coreLoadExecutor-182-thread-1) [    x:collection1] o.a.s.u.UpdateHandler Using UpdateLog implementation: org.apache.solr.update.UpdateLog
   [junit4]   2> 122660 INFO  (coreLoadExecutor-182-thread-1) [    x:collection1] o.a.s.u.UpdateLog Initializing UpdateLog: dataDir= defaultSyncLevel=FLUSH numRecordsToKeep=100 maxNumLogsToKeep=10 numVersionBuckets=65536
   [junit4]   2> 122661 INFO  (coreLoadExecutor-182-thread-1) [    x:collection1] o.a.s.u.CommitTracker Hard AutoCommit: disabled
   [junit4]   2> 122661 INFO  (coreLoadExecutor-182-thread-1) [    x:collection1] o.a.s.u.CommitTracker Soft AutoCommit: disabled
   [junit4]   2> 122663 INFO  (coreLoadExecutor-182-thread-1) [    x:collection1] o.a.s.u.RandomMergePolicy RandomMergePolicy wrapping class org.apache.lucene.index.LogDocMergePolicy: [LogDocMergePolicy: minMergeSize=1000, mergeFactor=11, maxMergeSize=9223372036854775807, maxMergeSizeForForcedMerge=9223372036854775807, calibrateSizeByDeletes=false, maxMergeDocs=2147483647, maxCFSSegmentSizeMB=8.796093022207999E12, noCFSRatio=1.0]
   [junit4]   2> 122664 INFO  (coreLoadExecutor-182-thread-1) [    x:collection1] o.a.s.s.SolrIndexSearcher Opening [Searcher@39813169[collection1] main]
   [junit4]   2> 122664 INFO  (coreLoadExecutor-182-thread-1) [    x:collection1] o.a.s.r.ManagedResourceStorage File-based storage initialized to use dir: /export/home/jenkins/workspace/Lucene-Solr-6.x-Solaris/solr/build/solr-core/test/J0/temp/solr.search.facet.TestJsonFacets_A49D63747AED620C-001/s1-001/collection1/conf
   [junit4]   2> 122664 INFO  (coreLoadExecutor-182-thread-1) [    x:collection1] o.a.s.h.ReplicationHandler Commits will be reserved for  10000
   [junit4]   2> 122665 INFO  (coreLoadExecutor-182-thread-1) [    x:collection1] o.a.s.u.UpdateLog Could not find max version in index or recent updates, using new clock 1549191700179582976
   [junit4]   2> 122667 INFO  (searcherExecutor-183-thread-1-processing-x:collection1) [    x:collection1] o.a.s.c.SolrCore [collection1] Registered new searcher Searcher@39813169[collection1] main{ExitableDirectoryReader(UninvertingDirectoryReader())}
   [junit4]   2> 123020 INFO  (TEST-TestJsonFacets.testTolerant-seed#[A49D63747AED620C]) [    ] o.a.s.SolrTestCaseHS ===> Started solr server port=65040 home=/export/home/jenkins/workspace/Lucene-Solr-6.x-Solaris/solr/build/solr-core/test/J0/temp/solr.search.facet.TestJsonFacets_A49D63747AED620C-001/s1-001
   [junit4]   2> 123039 INFO  (TEST-TestJsonFacets.testTolerant-seed#[A49D63747AED620C]) [    ] o.e.j.s.Server jetty-9.3.8.v20160314
   [junit4]   2> 123043 INFO  (TEST-TestJsonFacets.testTolerant-seed#[A49D63747AED620C]) [    ] o.e.j.s.h.ContextHandler Started o.e.j.s.ServletContextHandler@1021cc{/solr,null,AVAILABLE}
   [junit4]   2> 123045 INFO  (TEST-TestJsonFacets.testTolerant-seed#[A49D63747AED620C]) [    ] o.e.j.s.ServerConnector Started ServerConnector@4eb8564d{HTTP/1.1,[http/1.1]}{127.0.0.1:48243}
   [junit4]   2> 123045 INFO  (TEST-TestJsonFacets.testTolerant-seed#[A49D63747AED620C]) [    ] o.e.j.s.Server Started @126043ms
   [junit4]   2> 123045 INFO  (TEST-TestJsonFacets.testTolerant-seed#[A49D63747AED620C]) [    ] o.a.s.c.s.e.JettySolrRunner Jetty properties: {schema=schema_latest.xml, solrconfig=solrconfig-tlog.xml, hostContext=/solr, hostPort=48243}
   [junit4]   2> 123046 ERROR (TEST-TestJsonFacets.testTolerant-seed#[A49D63747AED620C]) [    ] o.a.s.s.StartupLoggingUtils Missing Java Option solr.log.dir. Logging may be missing or incomplete.
   [junit4]   2> 123047 INFO  (TEST-TestJsonFacets.testTolerant-seed#[A49D63747AED620C]) [    ] o.a.s.s.SolrDispatchFilter  ___      _       Welcome to Apache Solr™ version 6.3.0
   [junit4]   2> 123048 INFO  (TEST-TestJsonFacets.testTolerant-seed#[A49D63747AED620C]) [    ] o.a.s.s.SolrDispatchFilter / __| ___| |_ _   Starting in standalone mode on port null
   [junit4]   2> 123048 INFO  (TEST-TestJsonFacets.testTolerant-seed#[A49D63747AED620C]) [    ] o.a.s.s.SolrDispatchFilter \__ \/ _ \ | '_|  Install dir: null
   [junit4]   2> 123048 INFO  (TEST-TestJsonFacets.testTolerant-seed#[A49D63747AED620C]) [    ] o.a.s.s.SolrDispatchFilter |___/\___/_|_|    Start time: 2016-10-25T19:38:56.034Z
   [junit4]   2> 123048 INFO  (TEST-TestJsonFacets.testTolerant-seed#[A49D63747AED620C]) [    ] o.a.s.c.SolrXmlConfig Loading container configuration from /export/home/jenkins/workspace/Lucene-Solr-6.x-Solaris/solr/build/solr-core/test/J0/temp/solr.search.facet.TestJsonFacets_A49D63747AED620C-001/s2-001/solr.xml
   [junit4]   2> 123055 INFO  (TEST-TestJsonFacets.testTolerant-seed#[A49D63747AED620C]) [    ] o.a.s.u.UpdateShardHandler Creating UpdateShardHandler HTTP client with params: socketTimeout=340000&connTimeout=45000&retry=true
   [junit4]   2> 123058 INFO  (TEST-TestJsonFacets.testTolerant-seed#[A49D63747AED620C]) [    ] o.a.s.c.CorePropertiesLocator Found 1 core definitions underneath /export/home/jenkins/workspace/Lucene-Solr-6.x-Solaris/solr/build/solr-core/test/J0/temp/solr.search.facet.TestJsonFacets_A49D63747AED620C-001/s2-001/.
   [junit4]   2> 123058 INFO  (TEST-TestJsonFacets.testTolerant-seed#[A49D63747AED620C]) [    ] o.a.s.c.CorePropertiesLocator Cores are: [collection1]
   [junit4]   2> 123072 INFO  (coreLoadExecutor-193-thread-1) [    ] o.a.s.c.SolrConfig Using Lucene MatchVersion: 6.3.0
   [junit4]   2> 123096 INFO  (coreLoadExecutor-193-thread-1) [    ] o.a.s.s.IndexSchema [collection1] Schema name=example
   [junit4]   2> 123155 INFO  (coreLoadExecutor-193-thread-1) [    ] o.a.s.s.IndexSchema Loaded schema example/1.6 with uniqueid field id
   [junit4]   2> 123166 INFO  (coreLoadExecutor-193-thread-1) [    ] o.a.s.c.CoreContainer Creating SolrCore 'collection1' using configuration from instancedir /export/home/jenkins/workspace/Lucene-Solr-6.x-Solaris/solr/build/solr-core/test/J0/temp/solr.search.facet.TestJsonFacets_A49D63747AED620C-001/s2-001/./collection1
   [junit4]   2> 123166 INFO  (coreLoadExecutor-193-thread-1) [    x:collection1] o.a.s.c.SolrCore [[collection1] ] Opening new SolrCore at [/export/home/jenkins/workspace/Lucene-Solr-6.x-Solaris/solr/build/solr-core/test/J0/temp/solr.search.facet.TestJsonFacets_A49D63747AED620C-001/s2-001/collection1], dataDir=[/export/home/jenkins/workspace/Lucene-Solr-6.x-Solaris/solr/build/solr-core/test/J0/temp/solr.search.facet.TestJsonFacets_A49D63747AED620C-001/s2-001/./collection1/data/]
   [junit4]   2> 123166 INFO  (coreLoadExecutor-193-thread-1) [    x:collection1] o.a.s.c.JmxMonitoredMap JMX monitoring is enabled. Adding Solr mbeans to JMX Server: com.sun.jmx.mbeanserver.JmxMBeanServer@58dc4974
   [junit4]   2> 123167 INFO  (coreLoadExecutor-193-thread-1) [    x:collection1] o.a.s.u.RandomMergePolicy RandomMergePolicy wrapping class org.apache.lucene.index.TieredMergePolicy: [TieredMergePolicy: maxMergeAtOnce=32, maxMergeAtOnceExplicit=41, maxMergedSegmentMB=31.40625, floorSegmentMB=1.66796875, forceMergeDeletesPctAllowed=21.339764953835093, segmentsPerTier=21.0, maxCFSSegmentSizeMB=8.796093022207999E12, noCFSRatio=1.0
   [junit4]   2> 123173 WARN  (coreLoadExecutor-193-thread-1) [    x:collection1] o.a.s.c.RequestHandlers INVALID paramSet a in requestHandler {type = requestHandler,name = /dump,class = DumpRequestHandler,args = {defaults={a=A,b=B}}}
   [junit4]   2> 123183 INFO  (coreLoadExecutor-193-thread-1) [    x:collection1] o.a.s.u.UpdateHandler Using UpdateLog implementation: org.apache.solr.update.UpdateLog
   [junit4]   2> 123183 INFO  (coreLoadExecutor-193-thread-1) [    x:collection1] o.a.s.u.UpdateLog Initializing UpdateLog: dataDir= defaultSyncLevel=FLUSH numRecordsToKeep=100 maxNumLogsToKeep=10 numVersionBuckets=65536
   [junit4]   2> 123184 INFO  (coreLoadExecutor-193-thread-1) [    x:collection1] o.a.s.u.CommitTracker Hard AutoCommit: disabled
   [junit4]   2> 123184 INFO  (coreLoadExecutor-193-thread-1) [    x:collection1] o.a.s.u.CommitTracker Soft AutoCommit: disabled
   [junit4]   2> 123185 INFO  (coreLoadExecutor-193-thread-1) [    x:collection1] o.a.s.u.RandomMergePolicy RandomMergePolicy wrapping class org.apache.lucene.index.LogDocMergePolicy: [LogDocMergePolicy: minMergeSize=1000, mergeFactor=11, maxMergeSize=9223372036854775807, maxMergeSizeForForcedMerge=9223372036854775807, calibrateSizeByDeletes=false, maxMergeDocs=2147483647, maxCFSSegmentSizeMB=8.796093022207999E12, noCFSRatio=1.0]
   [junit4]   2> 123185 INFO  (coreLoadExecutor-193-thread-1) [    x:collection1] o.a.s.s.SolrIndexSearcher Opening [Searcher@7b297bfe[collection1] main]
   [junit4]   2> 123185 INFO  (coreLoadExecutor-193-thread-1) [    x:collection1] o.a.s.r.ManagedResourceStorage File-based storage initialized to use dir: /export/home/jenkins/workspace/Lucene-Solr-6.x-Solaris/solr/build/solr-core/test/J0/temp/solr.search.facet.TestJsonFacets_A49D63747AED620C-001/s2-001/collection1/conf
   [junit4]   2> 123185 INFO  (coreLoadExecutor-193-thread-1) [    x:collection1] o.a.s.h.ReplicationHandler Commits will be reserved for  10000
   [junit4]   2> 123186 INFO  (searcherExecutor-194-thread-1-processing-x:collection1) [    x:collection1] o.a.s.c.SolrCore [collection1] Registered new searcher Searcher@7b297bfe[collection1] main{ExitableDirectoryReader(UninvertingDirectoryReader())}
   [junit4]   2> 123186 INFO  (coreLoadExecutor-193-thread-1) [    x:collection1] o.a.s.u.UpdateLog Could not find max version in index or recent updates, using new clock 1549191700725891072
   [junit4]   2> 123561 INFO  (TEST-TestJsonFacets.testTolerant-seed#[A49D63747AED620C]) [    ] o.a.s.SolrTestCaseHS ===> Started solr server port=48243 home=/export/home/jenkins/workspace/Lucene-Solr-6.x-Solaris/solr/build/solr-core/test/J0/temp/solr.search.facet.TestJsonFacets_A49D63747AED620C-001/s2-001
   [junit4]   2> 123578 INFO  (qtp1876879980-485) [    x:collection1] o.a.s.u.p.LogUpdateProcessorFactory [collection1]  webapp=/solr path=/update params={wt=javabin&version=2}{deleteByQuery=*:* (-1549191701132738560)} 0 4
   [junit4]   2> 123588 INFO  (qtp246914973-499) [    x:collection1] o.a.s.u.p.LogUpdateProcessorFactory [collection1]  webapp=/solr path=/update params={wt=javabin&version=2}{deleteByQuery=*:* (-1549191701142175744)} 0 6
   [junit4]   2> 123600 INFO  (qtp2013567558-518) [    x:collection1] o.a.s.u.p.LogUpdateProcessorFactory [collection1]  webapp=/solr path=/update params={wt=javabin&version=2}{deleteByQuery=*:* (-1549191701154758656)} 0 6
   [junit4]   2> 123609 INFO  (qtp246914973-501) [    x:collection1] o.a.s.u.p.LogUpdateProcessorFactory [collection1]  webapp=/solr path=/update params={wt=javabin&version=2}{add=[1 (1549191701163147264)]} 0 5
   [junit4]   2> 123613 INFO  (qtp1876879980-483) [    x:collection1] o.a.s.u.p.LogUpdateProcessorFactory [collection1]  webapp=/solr path=/update params={wt=javabin&version=2}{add=[2 (1549191701171535872)]} 0 1
   [junit4]   2> 123617 INFO  (qtp2013567558-519) [    x:collection1] o.a.s.u.p.LogUpdateProcessorFactory [collection1]  webapp=/solr path=/update params={wt=javabin&version=2}{add=[3 (1549191701176778752)]} 0 1
   [junit4]   2> 123621 INFO  (qtp1876879980-487) [    x:collection1] o.a.s.u.DirectUpdateHandler2 start commit{,optimize=false,openSearcher=true,waitSearcher=true,expungeDeletes=false,softCommit=false,prepareCommit=false}
   [junit4]   2> 123621 INFO  (qtp1876879980-487) [    x:collection1] o.a.s.u.SolrIndexWriter Calling setCommitData with IW:org.apache.solr.update.SolrIndexWriter@27d9d981
   [junit4]   2> 123645 INFO  (qtp1876879980-487) [    x:collection1] o.a.s.s.SolrIndexSearcher Opening [Searcher@7f545585[collection1] main]
   [junit4]   2> 123646 INFO  (qtp1876879980-487) [    x:collection1] o.a.s.u.DirectUpdateHandler2 end_commit_flush
   [junit4]   2> 123648 INFO  (searcherExecutor-172-thread-1-processing-x:collection1) [    x:collection1] o.a.s.c.SolrCore [collection1] Registered new searcher Searcher@7f545585[collection1] main{ExitableDirectoryReader(UninvertingDirectoryReader(Uninverting(_0(6.3.0):C1)))}
   [junit4]   2> 123648 INFO  (qtp1876879980-487) [    x:collection1] o.a.s.u.p.LogUpdateProcessorFactory [collection1]  webapp=/solr path=/update params={waitSearcher=true&commit=true&softCommit=false&wt=javabin&version=2}{commit=} 0 27
   [junit4]   2> 123653 INFO  (qtp246914973-502) [    x:collection1] o.a.s.u.DirectUpdateHandler2 start commit{,optimize=false,openSearcher=true,waitSearcher=true,expungeDeletes=false,softCommit=false,prepareCommit=false}
   [junit4]   2> 123653 INFO  (qtp246914973-502) [    x:collection1] o.a.s.u.SolrIndexWriter Calling setCommitData with IW:org.apache.solr.update.SolrIndexWriter@7efa368c
   [junit4]   2> 123669 INFO  (qtp246914973-502) [    x:collection1] o.a.s.s.SolrIndexSearcher Opening [Searcher@5bc5862b[collection1] main]
   [junit4]   2> 123670 INFO  (qtp246914973-502) [    x:collection1] o.a.s.u.DirectUpdateHandler2 end_commit_flush
   [junit4]   2> 123671 INFO  (searcherExecutor-183-thread-1-processing-x:collection1) [    x:collection1] o.a.s.c.SolrCore [collection1] Registered new searcher Searcher@5bc5862b[collection1] main{ExitableDirectoryReader(UninvertingDirectoryReader(Uninverting(_0(6.3.0):C1)))}
   [junit4]   2> 123672 INFO  (qtp246914973-502) [    x:collection1] o.a.s.u.p.LogUpdateProcessorFactory [collection1]  webapp=/solr path=/update params={waitSearcher=true&commit=true&softCommit=false&wt=javabin&version=2}{commit=} 0 18
   [junit4]   2> 123675 INFO  (qtp2013567558-520) [    x:collection1] o.a.s.u.DirectUpdateHandler2 start commit{,optimize=false,openSearcher=true,waitSearcher=true,expungeDeletes=false,softCommit=false,prepareCommit=false}
   [junit4]   2> 123675 INFO  (qtp2013567558-520) [    x:collection1] o.a.s.u.SolrIndexWriter Calling setCommitData with IW:org.apache.solr.update.SolrIndexWriter@3ff42f59
   [junit4]   2> 123680 INFO  (qtp2013567558-520) [    x:collection1] o.a.s.s.SolrIndexSearcher Opening [Searcher@7ea645aa[collection1] main]
   [junit4]   2> 123680 INFO  (qtp2013567558-520) [    x:collection1] o.a.s.u.DirectUpdateHandler2 end_commit_flush
   [junit4]   2> 123681 INFO  (searcherExecutor-194-thread-1-processing-x:collection1) [    x:collection1] o.a.s.c.SolrCore [collection1] Registered new searcher Searcher@7ea645aa[collection1] main{ExitableDirectoryReader(UninvertingDirectoryReader(Uninverting(_0(6.3.0):C1)))}
   [junit4]   2> 123682 INFO  (qtp2013567558-520) [    x:collection1] o.a.s.u.p.LogUpdateProcessorFactory [collection1]  webapp=/solr path=/update params={waitSearcher=true&commit=true&softCommit=false&wt=javabin&version=2}{commit=} 0 6
   [junit4]   2> 123687 INFO  (qtp246914973-503) [    x:collection1] o.a.s.u.p.LogUpdateProcessorFactory [collection1]  webapp=/solr path=/update params={wt=javabin&version=2}{add=[4 (1549191701249130496)]} 0 2
   [junit4]   2> 123697 INFO  (qtp1876879980-486) [    x:collection1] o.a.s.u.p.LogUpdateProcessorFactory [collection1]  webapp=/solr path=/update params={wt=javabin&version=2}{add=[5 (1549191701255421952)]} 0 6
   [junit4]   2> 123706 INFO  (qtp1876879980-488) [    x:collection1] o.a.s.u.DirectUpdateHandler2 start commit{,optimize=false,openSearcher=true,waitSearcher=true,expungeDeletes=false,softCommit=false,prepareCommit=false}
   [junit4]   2> 123709 INFO  (qtp1876879980-488) [    x:collection1] o.a.s.u.SolrIndexWriter Calling setCommitData with IW:org.apache.solr.update.SolrIndexWriter@27d9d981
   [junit4]   2> 123715 INFO  (qtp1876879980-488) [    x:collection1] o.a.s.s.SolrIndexSearcher Opening [Searcher@48cfb470[collection1] main]
   [junit4]   2> 123716 INFO  (qtp1876879980-488) [    x:collection1] o.a.s.u.DirectUpdateHandler2 end_commit_flush
   [junit4]   2> 123717 INFO  (searcherExecutor-172-thread-1-processing-x:collection1) [    x:collection1] o.a.s.c.SolrCore [collection1] Registered new searcher Searcher@48cfb470[collection1] main{ExitableDirectoryReader(UninvertingDirectoryReader(Uninverting(_0(6.3.0):C1) Uninverting(_1(6.3.0):C1)))}
   [junit4]   2> 123717 INFO  (qtp1876879980-488) [    x:collection1] o.a.s.u.p.LogUpdateProcessorFactory [collection1]  webapp=/solr path=/update params={waitSearcher=true&commit=true&softCommit=false&wt=javabin&version=2}{commit=} 0 12
   [junit4]   2> 123729 INFO  (qtp246914973-504) [    x:collection1] o.a.s.u.DirectUpdateHandler2 start commit{,optimize=false,openSearcher=true,waitSearcher=true,expungeDeletes=false,softCommit=false,prepareCommit=false}
   [junit4]   2> 123732 INFO  (qtp246914973-504) [    x:collection1] o.a.s.u.SolrIndexWriter Calling setCommitData with IW:org.apache.solr.update.SolrIndexWriter@7efa368c
   [junit4]   2> 123736 INFO  (qtp246914973-504) [    x:collection1] o.a.s.s.SolrIndexSearcher Opening [Searcher@2d280c48[collection1] main]
   [junit4]   2> 123736 INFO  (qtp246914973-504) [    x:collection1] o.a.s.u.DirectUpdateHandler2 end_commit_flush
   [junit4]   2> 123738 INFO  (searcherExecutor-183-thread-1-processing-x:collection1) [    x:collection1] o.a.s.c.SolrCore [collection1] Registered new searcher Searcher@2d280c48[collection1] main{ExitableDirectoryReader(UninvertingDirectoryReader(Uninverting(_0(6.3.0):C1) Uninverting(_1(6.3.0):C1)))}
   [junit4]   2> 123738 INFO  (qtp246914973-504) [    x:collection1] o.a.s.u.p.LogUpdateProcessorFactory [collection1]  webapp=/solr path=/update params={waitSearcher=true&commit=true&softCommit=false&wt=javabin&version=2}{commit=} 0 13
   [junit4]   2> 123743 INFO  (qtp2013567558-521) [    x:collection1] o.a.s.u.DirectUpdateHandler2 start commit{,optimize=false,openSearcher=true,waitSearcher=true,expungeDeletes=false,softCommit=false,prepareCommit=false}
   [junit4]   2> 123744 INFO  (qtp2013567558-521) [    x:collection1] o.a.s.u.DirectUpdateHandler2 No uncommitted changes. Skipping IW.commit.
   [junit4]   2> 123744 INFO  (qtp2013567558-521) [    x:collection1] o.a.s.u.DirectUpdateHandler2 end_commit_flush
   [junit4]   2> 123744 INFO  (qtp2013567558-521) [    x:collection1] o.a.s.u.p.LogUpdateProcessorFactory [collection1]  webapp=/solr path=/update params={waitSearcher=true&commit=true&softCommit=false&wt=javabin&version=2}{commit=} 0 1
   [junit4]   2> 123749 INFO  (qtp2013567558-522) [    x:collection1] o.a.s.u.p.LogUpdateProcessorFactory [collection1]  webapp=/solr path=/update params={wt=javabin&version=2}{add=[6 (1549191701314142208)]} 0 2
   [junit4]   2> 123753 INFO  (qtp1876879980-489) [    x:collection1] o.a.s.u.DirectUpdateHandler2 start commit{,optimize=false,openSearcher=true,waitSearcher=true,expungeDeletes=false,softCommit=false,prepareCommit=false}
   [junit4]   2> 123754 INFO  (qtp1876879980-489) [    x:collection1] o.a.s.u.DirectUpdateHandler2 No uncommitted changes. Skipping IW.commit.
   [junit4]   2> 123754 INFO  (qtp1876879980-489) [    x:collection1] o.a.s.u.DirectUpdateHandler2 end_commit_flush
   [junit4]   2> 123754 INFO  (qtp1876879980-489) [    x:collection1] o.a.s.u.p.LogUpdateProcessorFactory [collection1]  webapp=/solr path=/update params={waitSearcher=true&commit=true&softCommit=false&wt=javabin&version=2}{commit=} 0 0
   [junit4]   2> 123757 INFO  (qtp246914973-505) [    x:collection1] o.a.s.u.DirectUpdateHandler2 start commit{,optimize=false,openSearcher=true,waitSearcher=true,expungeDeletes=false,softCommit=false,prepareCommit=false}
   [junit4]   2> 123757 INFO  (qtp246914973-505) [    x:collection1] o.a.s.u.DirectUpdateHandler2 No uncommitted changes. Skipping IW.commit.
   [junit4]   2> 123757 INFO  (qtp246914973-505) [    x:collection1] o.a.s.u.DirectUpdateHandler2 end_commit_flush
   [junit4]   2> 123757 INFO  (qtp246914973-505) [    x:collection1] o.a.s.u.p.LogUpdateProcessorFactory [collection1]  webapp=/solr path=/update params={waitSearcher=true&commit=true&softCommit=false&wt=javabin&version=2}{commit=} 0 0
   [junit4]   2> 123762 INFO  (qtp2013567558-523) [    x:collection1] o.a.s.u.DirectUpdateHandler2 start commit{,optimize=false,openSearcher=true,waitSearcher=true,expungeDeletes=false,softCommit=false,prepareCommit=false}
   [junit4]   2> 123762 INFO  (qtp2013567558-523) [    x:collection1] o.a.s.u.SolrIndexWriter Calling setCommitData with IW:org.apache.solr.update.SolrIndexWriter@3ff42f59
   [junit4]   2> 123767 INFO  (qtp2013567558-523) [    x:collection1] o.a.s.s.SolrIndexSearcher Opening [Searcher@6fa59f73[collection1] main]
   [junit4]   2> 123768 INFO  (qtp2013567558-523) [    x:collection1] o.a.s.u.DirectUpdateHandler2 end_commit_flush
   [junit4]   2> 123770 INFO  (searcherExecutor-194-thread-1-processing-x:collection1) [    x:collection1] o.a.s.c.SolrCore [collection1] Registered new searcher Searcher@6fa59f73[collection1] main{ExitableDirectoryReader(UninvertingDirectoryReader(Uninverting(_0(6.3.0):C1) Uninverting(_1(6.3.0):C1)))}
   [junit4]   2> 123770 INFO  (qtp2013567558-523) [    x:collection1] o.a.s.u.p.LogUpdateProcessorFactory [collection1]  webapp=/solr path=/update params={waitSearcher=true&commit=true&softCommit=false&wt=javabin&version=2}{commit=} 0 8
   [junit4]   2> 123804 INFO  (qtp2013567558-516) [    x:collection1] o.a.s.h.RequestHandlerBase Ignoring exception matching ignore_exception
   [junit4]   2> 123804 INFO  (qtp2013567558-516) [    x:collection1] o.a.s.c.S.Request [collection1]  webapp=/solr path=/select params={shards=127.0.0.1:47908/solr/collection1,127.0.0.1:65040/solr/collection1,127.0.0.1:48243/solr/collection1,[ff01::114]:33332:/ignore_exception&q=*:*&json.facet={f:{type:terms,+field:cat_s}}&shards.tolerant=false&indent=true&ignore_exception=true&wt=json&version=2.2} status=500 QTime=29
   [junit4]   2> 123807 INFO  (qtp2013567558-516) [    x:collection1] o.a.s.s.HttpSolrCall Ignoring exception matching ignore_exception
   [junit4]   2> 123889 INFO  (qtp2013567558-518) [    x:collection1] o.a.s.c.S.Request [collection1]  webapp=/solr path=/select params={distrib=false&_facet_={}&fl=id&fl=score&shards.purpose=1048580&start=0&fsv=true&shard.url=127.0.0.1:48243/solr/collection1&rows=10&version=2&q=*:*&json.facet={f:{type:terms,+field:cat_s}}&shards.tolerant=false&NOW=1477424336760&isShard=true&ignore_exception=true&wt=javabin} hits=2 status=0 QTime=84
   [junit4]   2> 123890 INFO  (qtp1876879980-487) [    x:collection1] o.a.s.c.S.Request [collection1]  webapp=/solr path=/select params={distrib=false&_facet_={}&fl=id&fl=score&shards.purpose=1048580&start=0&fsv=true&shard.url=127.0.0.1:47908/solr/collection1&rows=10&version=2&q=*:*&json.facet={f:{type:terms,+field:cat_s}}&shards.tolerant=true&NOW=1477424336820&isShard=true&ignore_exception=true&wt=javabin} hits=2 status=0 QTime=34
   [junit4]   2> 123890 INFO  (qtp1876879980-489) [    x:collection1] o.a.s.c.S.Request [collection1]  webapp=/solr path=/select params={distrib=false&_facet_={}&fl=id&fl=score&shards.purpose=1048580&start=0&fsv=true&shard.url=127.0.0.1:47908/solr/collection1&rows=10&version=2&q=*:*&json.facet={f:{type:terms,+field:cat_s}}&shards.tolerant=false&NOW=1477424336760&isShard=true&ignore_exception=true&wt=javabin} hits=2 status=0 QTime=82
   [junit4]   2> 123890 INFO  (qtp2013567558-520) [    x:collection1] o.a.s.c.S.Request [collection1]  webapp=/solr path=/select params={distrib=false&_facet_={}&fl=id&fl=score&shards.purpose=1048580&start=0&fsv=true&shard.url=127.0.0.1:48243/solr/collection1&rows=10&version=2&q=*:*&json.facet={f:{type:terms,+field:cat_s}}&shards.tolerant=true&NOW=1477424336820&isShard=true&ignore_exception=true&wt=javabin} hits=2 status=0 QTime=33
   [junit4]   2> 123890 INFO  (qtp246914973-501) [    x:collection1] o.a.s.c.S.Request [collection1]  webapp=/solr path=/select params={distrib=false&_facet_={}&fl=id&fl=score&shards.purpose=1048580&start=0&fsv=true&shard.url=127.0.0.1:65040/solr/collection1&rows=10&version=2&q=*:*&json.facet={f:{type:terms,+field:cat_s}}&shards.tolerant=true&NOW=1477424336820&isShard=true&ignore_exception=true&wt=javabin} hits=2 status=0 QTime=34
   [junit4]   2> 123891 INFO  (qtp246914973-506) [    x:collection1] o.a.s.c.S.Request [collection1]  webapp=/solr path=/select params={distrib=false&_facet_={}&fl=id&fl=score&shards.purpose=1048580&start=0&fsv=true&shard.url=127.0.0.1:65040/solr/collection1&rows=10&version=2&q=*:*&json.facet={f:{type:terms,+field:cat_s}}&shards.tolerant=false&NOW=1477424336760&isShard=true&ignore_exception=true&wt=javabin} hits=2 status=0 QTime=85
   [junit4]   2> 123910 INFO  (qtp2013567558-521) [    x:collection1] o.a.s.c.S.Request [collection1]  webapp=/solr path=/select params={q=*:*&distrib=false&shards.tolerant=true&shards.purpose=64&NOW=1477424336820&ids=3,6&isShard=true&shard.url=127.0.0.1:48243/solr/collection1&ignore_exception=true&wt=javabin&version=2} status=0 QTime=0
   [junit4]   2> 123911 INFO  (qtp246914973-502) [    x:collection1] o.a.s.c.S.Request [collection1]  webapp=/solr path=/select params={q=*:*&distrib=false&shards.tolerant=true&shards.purpose=64&NOW=1477424336820&ids=1,4&isShard=true&shard.url=127.0.0.1:65040/solr/collection1&ignore_exception=true&wt=javabin&version=2} status=0 QTime=0
   [junit4]   2> 123916 INFO  (qtp1876879980-486) [    x:collection1] o.a.s.c.S.Request [collection1]  webapp=/solr path=/select params={q=*:*&distrib=false&shards.tolerant=true&shards.purpose=64&NOW=1477424336820&ids=2,5&isShard=true&shard.url=127.0.0.1:47908/solr/collection1&ignore_exception=true&wt=javabin&version=2} status=0 QTime=4
   [junit4]   2> 123924 INFO  (qtp1876879980-485) [    x:collection1] o.a.s.c.S.Request [collection1]  webapp=/solr path=/select params={shards=127.0.0.1:47908/solr/collection1,127.0.0.1:65040/solr/collection1,127.0.0.1:48243/solr/collection1,[ff01::114]:33332:/ignore_exception&q=*:*&json.facet={f:{type:terms,+field:cat_s}}&shards.tolerant=true&indent=true&ignore_exception=true&wt=json&version=2.2} hits=6 status=0 QTime=90
   [junit4]   2> 123935 INFO  (TEST-TestJsonFacets.testTolerant-seed#[A49D63747AED620C]) [    ] o.a.s.SolrTestCaseJ4 ###Ending testTolerant {p0=DV}
   [junit4]   2> 123965 INFO  (TEST-TestJsonFacets.testBlockJoin-seed#[A49D63747AED620C]) [    ] o.a.s.SolrTestCaseJ4 ###Starting testBlockJoin {p0=DV}
   [junit4]   2> 123971 INFO  (TEST-TestJsonFacets.testBlockJoin-seed#[A49D63747AED620C]) [    ] o.a.s.u.p.LogUpdateProcessorFactory [collection1]  webapp=null path=null params={}{deleteByQuery=*:* (-1549191701543780352)} 0 6
   [junit4]   2> 123975 INFO  (TEST-TestJsonFacets.testBlockJoin-seed#[A49D63747AED620C]) [    ] o.a.s.u.p.LogUpdateProcessorFactory [collection1]  webapp=null path=null params={versions=true&wt=json&indent=true}{add=[1 (1549191701553217536)]} 0 1
   [junit4]   2> 123978 INFO  (TEST-TestJsonFacets.testBlockJoin-seed#[A49D63747AED620C]) [    ] o.a.s.u.p.LogUpdateProcessorFactory [collection1]  webapp=null path=null params={versions=true&wt=json&indent=true}{add=[2 (1549191701554266112)]} 0 1
   [junit4]   2> 123978 INFO  (TEST-TestJsonFacets.testBlockJoin-seed#[A49D63747AED620C]) [    ] o.a.s.u.p.LogUpdateProcessorFactory [collection1]  webapp=null path=null params={versions=true&wt=json&indent=true}{add=[3 (1549191701556363264)]} 0 0
   [junit4]   2> 123978 INFO  (TEST-TestJsonFacets.testBlockJoin-seed#[A49D63747AED620C]) [    ] o.a.s.u.p.LogUpdateProcessorFactory [collection1]  webapp=null path=null params={versions=true&wt=json&indent=true}{add=[4 (1549191701556363265)]} 0 0
   [junit4]   2> 123978 INFO  (TEST-TestJsonFacets.testBlockJoin-seed#[A49D63747AED620C]) [    ] o.a.s.u.DirectUpdateHandler2 start commit{,optimize=false,openSearcher=true,waitSearcher=true,expungeDeletes=false,softCommit=false,prepareCommit=false}
   [junit4]   2> 123978 INFO  (TEST-TestJsonFacets.testBlockJoin-seed#[A49D63747AED620C]) [    ] o.a.s.u.SolrIndexWriter Calling setCommitData with IW:org.apache.solr.update.SolrIndexWriter@423fff08
   [junit4]   2> 123984 INFO  (TEST-TestJsonFacets.testBlockJoin-seed#[A49D63747AED620C]) [    ] o.a.s.s.SolrIndexSearcher Opening [Searcher@7dd62a53[collection1] main]
   [junit4]   2> 123984 INFO  (TEST-TestJsonFacets.testBlockJoin-seed#[A49D63747AED620C]) [    ] o.a.s.u.DirectUpdateHandler2 end_commit_flush
   [junit4]   2> 123985 INFO  (searcherExecutor-161-thread-1) [    ] o.a.s.c.SolrCore [collection1] Registered new searcher Searcher@7dd62a53[collection1] main{ExitableDirectoryReader(UninvertingDirectoryReader(Uninverting(_0(6.3.0):C10)))}
   [junit4]   2> 123985 INFO  (TEST-TestJsonFacets.testBlockJoin-seed#[A49D63747AED620C]) [    ] o.a.s.u.p.LogUpdateProcessorFactory [collection1]  webapp=null path=null params={}{commit=} 0 7
   [junit4]   2> 124001 INFO  (TEST-TestJsonFacets.testBlockJoin-seed#[A49D63747AED620C]) [    ] o.a.s.s.f.UnInvertedField UnInverted multi-valued field {field=v_t,memSize=4741,tindexSize=41,time=2,phase1=1,nTerms=6,bigTerms=4,termInstances=4,uses=0}
   [junit4]   2> 124013 INFO  (TEST-TestJsonFacets.testBlockJoin-seed#[A49D63747AED620C]) [    ] o.a.s.c.S.Request [collection1]  webapp=null path=null params={rows=0&q=*:*&json.facet={+pages:{+type:query,+domain:{blockChildren:'type_s:book'}+,+facet:{+x:{field:v_t}+}+},pages2:{type:terms,+field:v_t,+domain:{blockChildren:'type_s:book'}+},books:{+type:query,+domain:{blockParent:'type_s:book'}++,+facet:{+x:{field:v_t}+}+},books2:{type:terms,+field:v_t,+domain:{blockParent:'type_s:book'}+},pageof3:{+type:query,+q:'id:3',+facet+:+{+x+:+{+type:terms,+field:page_s,+domain:{blockChildren:'type_s:book'}}}+},bookof22:{+type:query,+q:'id:2.2',+facet+:+{+x+:+{+type:terms,+field:book_s,+domain:{blockParent:'type_s:book'}}}+},missing_blockParent:{+type:query,+domain:{blockParent:'type_s:does_not_exist'}+},missing_blockChildren:{+type:query,+domain:{blockChildren:'type_s:does_not_exist'}+}}&wt=json&indent=true} hits=10 status=0 QTime=27
   [junit4]   2> 124015 INFO  (TEST-TestJsonFacets.testBlockJoin-seed#[A49D63747AED620C]) [    ] o.a.s.c.S.Request [collection1]  webapp=null path=null params={q=no_match_s:NO_MATCHES&json.facet={+processEmpty:true,pages:{+type:query,+domain:{blockChildren:'type_s:book'}+},books:{+type:query,+domain:{blockParent:'type_s:book'}+}}&wt=json&indent=true} hits=0 status=0 QTime=1
   [junit4]   2> 124017 INFO  (TEST-TestJsonFacets.testBlockJoin-seed#[A49D63747AED620C]) [    ] o.a.s.c.S.Request [collection1]  webapp=null path=null params={q=*:*&json.facet={books:{+type:terms,+field:book_s,+facet:{+pages:{type:terms,+field:v_t,+domain:{blockChildren:'type_s:book'}}+}+}}&wt=json&indent=true} hits=10 status=0 QTime=2
   [junit4]   2> 124047 INFO  (TEST-TestJsonFacets.testBlockJoin-seed#[A49D63747AED620C]) [    ] o.a.s.SolrTestCaseJ4 ###Ending testBlockJoin {p0=DV}
   [junit4]   2> 124087 INFO  (TEST-TestJsonFacets.testBigger-seed#[A49D63747AED620C]) [    ] o.a.s.SolrTestCaseJ4 ###Starting testBigger {p0=DV}
   [junit4]   2> 124093 INFO  (qtp1876879980-488) [    x:collection1] o.a.s.s.SolrIndexSearcher Opening [Searcher@29d0167[collection1] realtime]
   [junit4]   2> 124094 INFO  (qtp1876879980-488) [    x:collection1] o.a.s.u.p.LogUpdateProcessorFactory [collection1]  webapp=/solr path=/update params={wt=javabin&version=2}{deleteByQuery=*:* (-1549191701672755200)} 0 4
   [junit4]   2> 124105 INFO  (qtp246914973-503) [    x:collection1] o.a.s.s.SolrIndexSearcher Opening [Searcher@206878be[collection1] realtime]
   [junit4]   2> 124105 INFO  (qtp246914973-503) [    x:collection1] o.a.s.u.p.LogUpdateProcessorFactory [collection1]  webapp=/solr path=/update params={wt=javabin&version=2}{deleteByQuery=*:* (-1549191701686386688)} 0 3
   [junit4]   2> 124111 INFO  (qtp2013567558-522) [    x:collection1] o.a.s.s.SolrIndexSearcher Opening [Searcher@1910255f[collection1] realtime]
   [junit4]   2> 124111 INFO  (qtp2013567558-522) [    x:collection1] o.a.s.u.p.LogUpdateProcessorFactory [collection1]  webapp=/solr path=/update params={wt=javabin&version=2}{deleteByQuery=*:* (-1549191701693726720)} 0 2
   [junit4]   2> 124118 INFO  (qtp2013567558-522) [    x:collection1] o.a.s.u.p.LogUpdateProcessorFactory [collection1]  webapp=/solr path=/update params={wt=javabin&version=2}{add=[0 (1549191701702115328)]} 0 1
   [junit4]   2> 124122 INFO  (qtp246914973-504) [    x:collection1] o.a.s.u.p.LogUpdateProcessorFactory [collection1]  webapp=/solr path=/update params={wt=javabin&version=2}{add=[1 (1549191701706309632)]} 0 0
   [junit4]   2> 124126 INFO  (qtp1876879980-482) [    x:collection1] o.a.s.u.p.LogUpdateProcessorFactory [collection1]  webapp=/solr path=/update params={wt=javabin&version=2}{add=[2 (1549191701711552512)]} 0 0
   [junit4]   2> 124130 INFO  (qtp2013567558-519) [    x:collection1] o.a.s.u.p.LogUpdateProcessorFactory [collection1]  webapp=/solr path=/update params={wt=javabin&version=2}{add=[3 (1549191701714698240)]} 0 0
   [junit4]   2> 124133 INFO  (qtp246914973-504) [    x:collection1] o.a.s.u.p.LogUpdateProcessorFactory [collection1]  webapp=/solr path=/update params={wt=javabin&version=2}{add=[4 (1549191701718892544)]} 0 0
   [junit4]   2> 124137 INFO  (qtp1876879980-482) [    x:collection1] o.a.s.u.p.LogUpdateProcessorFactory [collection1]  webapp=/solr path=/update params={wt=javabin&version=2}{add=[5 (1549191701723086848)]} 0 0
   [junit4]   2> 124141 INFO  (qtp2013567558-516) [    x:collection1] o.a.s.u.p.LogUpdateProcessorFactory [collection1]  webapp=/solr path=/update params={wt=javabin&version=2}{add=[6 (1549191701726232576)]} 0 0
   [junit4]   2> 124144 INFO  (qtp246914973-499) [    x:collection1] o.a.s.u.p.LogUpdateProcessorFactory [collection1]  webapp=/solr path=/update params={wt=javabin&version=2}{add=[7 (1549191701730426880)]} 0 0
   [junit4]   2> 124147 INFO  (qtp1876879980-489) [    x:collection1] o.a.s.u.p.LogUpdateProcessorFactory [collection1]  webapp=/solr path=/update params={wt=javabin&version=2}{add=[8 (1549191701733572608)]} 0 0
   [junit4]   2> 124150 INFO  (qtp1876879980-487) [    x:collection1] o.a.s.u.DirectUpdateHandler2 start commit{,optimize=false,openSearcher=true,waitSearcher=true,expungeDeletes=false,softCommit=false,prepareCommit=false}
   [junit4]   2> 124150 INFO  (qtp1876879980-487) [    x:collection1] o.a.s.u.SolrIndexWriter Calling setCommitData with IW:org.apache.solr.update.SolrIndexWriter@27d9d981
   [junit4]   2> 124153 INFO  (qtp1876879980-487) [    x:collection1] o.a.s.s.SolrIndexSearcher Opening [Searcher@2887dd9f[collection1] main]
   [junit4]   2> 124154 INFO  (qtp1876879980-487) [    x:collection1] o.a.s.u.DirectUpdateHandler2 end_commit_flush
   [junit4]   2> 124155 INFO  (searcherExecutor-172-thread-1-processing-x:collection1) [    x:collection1] o.a.s.c.SolrCore [collection1] Registered new searcher Searcher@2887dd9f[collection1] main{ExitableDirectoryReader(UninvertingDirectoryReader(Uninverting(_2(6.3.0):C3)))}
   [junit4]   2> 124157 INFO  (qtp1876879980-487) [    x:collection1] o.a.s.u.p.LogUpdateProcessorFactory [collection1]  webapp=/solr path=/update params={waitSearcher=true&commit=true&softCommit=false&wt=javabin&version=2}{commit=} 0 7
   [junit4]   2> 124162 INFO  (qtp246914973-501) [    x:collection1] o.a.s.u.DirectUpdateHandler2 start commit{,optimize=false,openSearcher=true,waitSearcher=true,expungeDeletes=false,softCommit=false,prepareCommit=false}
   [junit4]   2> 124162 INFO  (qtp246914973-501) [    x:collection1] o.a.s.u.SolrIndexWriter Calling setCommitData with IW:org.apache.solr.update.SolrIndexWriter@7efa368c
   [junit4]   2> 124165 INFO  (qtp246914973-501) [    x:collection1] o.a.s.s.SolrIndexSearcher Opening [Searcher@74f264d1[collection1] main]
   [junit4]   2> 124165 INFO  (qtp246914973-501) [    x:collection1] o.a.s.u.DirectUpdateHandler2 end_commit_flush
   [junit4]   2> 124166 INFO  (searcherExecutor-183-thread-1-processing-x:collection1) [    x:collection1] o.a.s.c.SolrCore [collection1] Registered new searcher Searcher@74f264d1[collection1] main{ExitableDirectoryReader(UninvertingDirectoryReader(Uninverting(_2(6.3.0):C3)))}
   [junit4]   2> 124170 INFO  (qtp246914973-501) [    x:collection1] o.a.s.u.p.LogUpdateProcessorFactory [collection1]  webapp=/solr path=/update params={waitSearcher=true&commit=true&softCommit=false&wt=javabin&version=2}{commit=} 0 8
   [junit4]   2> 124177 INFO  (qtp2013567558-518) [    x:collection1] o.a.s.u.DirectUpdateHandler2 start commit{,optimize=false,openSearcher=true,waitSearcher=true,expungeDeletes=false,softCommit=false,prepareCommit=false}
   [junit4]   2> 124177 INFO  (qtp2013567558-518) [    x:collection1] o.a.s.u.SolrIndexWriter Calling setCommitData with IW:org.apache.solr.update.SolrIndexWriter@3ff42f59
   [junit4]   2> 124182 INFO  (qtp2013567558-518) [    x:collection1] o.a.s.s.SolrIndexSearcher Opening [Searcher@404700df[collection1] main]
   [junit4]   2> 124183 INFO  (qtp2013567558-518) [    x:collection1] o.a.s.u.DirectUpdateHandler2 end_commit_flush
   [junit4]   2> 124186 INFO  (searcherExecutor-194-thread-1-processing-x:collection1) [    x:collection1] o.a.s.c.SolrCore [collection1] Registered new searcher Searcher@404700df[collection1] main{ExitableDirectoryReader(UninvertingDirectoryReader(Uninverting(_2(6.3.0):C3)))}
   [junit4]   2> 124191 INFO  (qtp2013567558-518) [    x:collection1] o.a.s.u.p.LogUpdateProcessorFactory [collection1]  webapp=/solr path=/update params={waitSearcher=true&commit=true&softCommit=false&wt=javabin&version=2}{commit=} 0 14
   [junit4]   2> 124197 INFO  (qtp2013567558-520) [    x:collection1] o.a.s.u.p.LogUpdateProcessorFactory [collection1]  webapp=/solr path=/update params={wt=javabin&version=2}{add=[9 (1549191701783904256)]} 0 3
   [junit4]   2> 124203 INFO  (qtp246914973-506) [    x:collection1] o.a.s.u.p.LogUpdateProcessorFactory [collection1]  webapp=/solr path=/update params={wt=javabin&version=2}{add=[10 (1549191701790195712)]} 0 1
   [junit4]   2> 124209 INFO  (qtp1876879980-486) [    x:collection1] o.a.s.u.p.LogUpdateProcessorFactory [collection1]  webapp=/solr path=/update params={wt=javabin&version=2}{add=[11 (1549191701796487168)]} 0 2
   [junit4]   2> 124213 INFO  (qtp2013567558-520) [    x:collection1] o.a.s.u.p.LogUpdateProcessorFactory [collection1]  webapp=/solr path=/update params={wt=javabin&version=2}{add=[12 (1549191701801730048)]} 0 0
   [junit4]   2> 124216 INFO  (qtp246914973-502) [    x:collection1] o.a.s.u.p.LogUpdateProcessorFactory [collection1]  webapp=/solr path=/update params={wt=javabin&version=2}{add=[13 (1549191701805924352)]} 0 0
   [junit4]   2> 124219 INFO  (qtp1876879980-485) [    x:collection1] o.a.s.u.p.LogUpdateProcessorFactory [collection1]  webapp=/solr path=/update params={wt=javabin&version=2}{add=[14 (1549191701809070080)]} 0 0
   [junit4]   2> 124222 INFO  (qtp2013567558-523) [    x:collection1] o.a.s.u.p.LogUpdateProcessorFactory [collection1]  webapp=/solr path=/update params={wt=javabin&version=2}{add=[15 (1549191701812215808)]} 0 0
   [junit4]   2> 124225 INFO  (qtp246914973-503) [    x:collection1] o.a.s.u.p.LogUpdateProcessorFactory [collection1]  webapp=/solr path=/update params={wt=javabin&version=2}{add=[16 (1549191701814312960)]} 0 0
   [junit4]   2> 124231 INFO  (qtp1876879980-488) [    x:collection1] o.a.s.u.p.LogUpdateProcessorFactory [collection1]  webapp=/solr path=/update params={wt=javabin&version=2}{add=[17 (1549191701821652992)]} 0 0
   [junit4]   2> 124236 INFO  (qtp1876879980-483) [    x:collection1] o.a.s.u.DirectUpdateHandler2 start commit{,optimize=false,openSearcher=true,waitSearcher=true,expungeDeletes=false,softCommit=false,prepareCommit=false}
   [junit4]   2> 124236 INFO  (qtp1876879980-483) [    x:collection1] o.a.s.u.SolrIndexWriter Calling setCommitData with IW:org.apache.solr.update.SolrIndexWriter@27d9d981
   [junit4]   2> 124240 INFO  (qtp1876879980-483) [    x:collection1] o.a.s.s.SolrIndexSearcher Opening [Searcher@1624019f[collection1] main]
   [junit4]   2> 124240 INFO  (qtp1876879980-483) [    x:collection1] o.a.s.u.DirectUpdateHandler2 end_commit_flush
   [junit4]   2> 124242 INFO  (searcherExecutor-172-thread-1-processing-x:collection1) [    x:collection1] o.a.s.c.SolrCore [collection1] Registered new searcher Searcher@1624019f[collection1] main{ExitableDirectoryReader(UninvertingDirectoryReader(Uninverting(_2(6.3.0):C3) Uninverting(_3(6.3.0):C3)))}
   [junit4]   2> 124244 INFO  (qtp1876879980-483) [    x:collection1] o.a.s.u.p.LogUpdateProcessorFactory [collection1]  webapp=/solr path=/update params={waitSearcher=true&commit=true&softCommit=false&wt=javabin&version=2}{commit=} 0 8
   [junit4]   2> 124248 INFO  (qtp246914973-505) [    x:collection1] o.a.s.u.DirectUpdateHandler2 start commit{,optimize=false,openSearcher=true,waitSearcher=true,expungeDeletes=false,softCommit=false,prepareCommit=false}
   [junit4]   2> 124248 INFO  (qtp246914973-505) [    x:collection1] o.a.s.u.SolrIndexWriter Calling setCommitData with IW:org.apache.solr.update.SolrIndexWriter@7efa368c
   [junit4]   2> 124250 INFO  (qtp246914973-505) [    x:collection1] o.a.s.s.SolrIndexSearcher Opening [Searcher@758220fa[collection1] main]
   [junit4]   2> 124250 INFO  (qtp246914973-505) [    x:collection1] o.a.s.u.DirectUpdateHandler2 end_commit_flush
   [junit4]   2> 124252 INFO  (searcherExecutor-183-thread-1-processing-x:collection1) [    x:collection1] o.a.s.c.SolrCore [collection1] Registered new searcher Searcher@758220fa[collection1] main{ExitableDirectoryReader(UninvertingDirectoryReader(Uninverting(_2(6.3.0):C3) Uninverting(_3(6.3.0):C3)))}
   [junit4]   2> 124252 INFO  (qtp246914973-505) [    x:collection1] o.a.s.u.p.LogUpdateProcessorFactory [collection1]  webapp=/solr path=/update params={waitSearcher=true&commit=true&softCommit=false&wt=javabin&version=2}{commit=} 0 4
   [junit4]   2> 124255 INFO  (qtp2013567558-522) [    x:collection1] o.a.s.u.DirectUpdateHandler2 start commit{,optimize=false,openSearcher=true,waitSearcher=true,expungeDeletes=false,softCommit=false,prepareCommit=false}
   [junit4]   2> 124255 INFO  (qtp2013567558-522) [    x:collection1] o.a.s.u.SolrIndexWriter Calling setCommitData with IW:org.apache.solr.update.SolrIndexWriter@3ff42f59
   [junit4]   2> 124259 INFO  (qtp2013567558-522) [    x:collection1] o.a.s.s.SolrIndexSearcher Opening [Searcher@5a928f43[collection1] main]
   [junit4]   2> 124259 INFO  (qtp2013567558-522) [    x:collection1] o.a.s.u.DirectUpdateHandler2 end_commit_flush
   [junit4]   2> 124260 INFO  (searcherExecutor-194-thread-1-processing-x:collection1) [    x:collection1] o.a.s.c.SolrCore [collection1] Registered new searcher Searcher@5a928f43[collection1] main{ExitableDirectoryReader(UninvertingDirectoryReader(Uninverting(_2(6.3.0):C3) Uninverting(_3(6.3.0):C3)))}
   [junit4]   2> 124260 INFO  (qtp2013567558-522) [    x:collection1] o.a.s.u.p.LogUpdateProcessorFactory [collection1]  webapp=/solr path=/update params={waitSearcher=true&commit=true&softCommit=false&wt=javabin&version=2}{commit=} 0 5
   [junit4]   2> 124267 INFO  (qtp2013567558-519) [    x:collection1] o.a.s.u.p.LogUpdateProcessorFactory [collection1]  webapp=/solr path=/update params={wt=javabin&version=2}{add=[18 (1549191701858353152)]} 0 1
   [junit4]   2> 124275 INFO  (qtp246914973-504) [    x:collection1] o.a.s.u.p.LogUpdateProcessorFactory [collection1]  webapp=/solr path=/update params={wt=javabin&version=2}{add=[19 (1549191701866741760)]} 0 1
   [junit4]   2> 124279 INFO  (qtp1876879980-482) [    x:collection1] o.a.s.u.p.LogUpdateProcessorFactory [collection1]  webapp=/solr path=/update params={wt=javabin&version=2}{add=[20 (1549191701870936064)]} 0 1
   [junit4]   2> 124284 INFO  (qtp2013567558-516) [    x:collection1] o.a.s.u.p.LogUpdateProcessorFactory [collection1]  webapp=/solr path=/update params={wt=javabin&version=2}{add=[21 (1549191701877227520)]} 0 0
   [junit

[...truncated too long message...]

searcherExecutor-161-thread-1) [    ] o.a.s.c.SolrCore [collection1] Registered new searcher Searcher@5c5fc4a2[collection1] main{ExitableDirectoryReader(UninvertingDirectoryReader(Uninverting(_4x(6.3.0):C3) Uninverting(_4y(6.3.0):C2) Uninverting(_4z(6.3.0):C1)))}
   [junit4]   2> 162154 INFO  (TEST-TestJsonFacets.testMethodStream-seed#[A49D63747AED620C]) [    ] o.a.s.u.DirectUpdateHandler2 end_commit_flush
   [junit4]   2> 162154 INFO  (TEST-TestJsonFacets.testMethodStream-seed#[A49D63747AED620C]) [    ] o.a.s.u.p.LogUpdateProcessorFactory [collection1]  webapp=null path=null params={}{commit=} 0 4
   [junit4]   2> 162154 INFO  (TEST-TestJsonFacets.testMethodStream-seed#[A49D63747AED620C]) [    ] o.a.s.c.S.Request [collection1]  webapp=null path=null params={q=*:*&json.facet={x:'sum(num_d)'}&json.facet={y:'min(num_d)'}&rows=0&wt=xml} hits=6 status=0 QTime=0
   [junit4]   2> 162156 INFO  (TEST-TestJsonFacets.testMethodStream-seed#[A49D63747AED620C]) [    ] o.a.s.c.S.Request [collection1]  webapp=null path=null params={q=*:*&json.facet={+++cat:{terms:{field:'cat_s',+method:stream+}},+cat2:{terms:{field:'cat_s',+method:stream,+sort:'index+asc'+}},+cat3:{terms:{field:'cat_s',+method:stream,+sort:'index+asc',+mincount:3+}},+cat4:{terms:{field:'cat_s',+method:stream,+sort:'index+asc',+prefix:B+}},+cat5:{terms:{field:'cat_s',+method:stream,+sort:'index+asc',+offset:1+}}+}&rows=0&wt=xml} hits=6 status=0 QTime=1
   [junit4]   2> 162156 INFO  (TEST-TestJsonFacets.testMethodStream-seed#[A49D63747AED620C]) [    ] o.a.s.c.S.Request [collection1]  webapp=null path=null params={q=*:*&json.facet={+++cat:{terms:{field:'cat_s',+sort:'index+asc',+facet:{where:{terms:{field:where_s,method:stream,sort:'index+asc'}}}+++}}}&rows=0&wt=xml} hits=6 status=0 QTime=0
   [junit4]   2> 162167 INFO  (TEST-TestJsonFacets.testMethodStream-seed#[A49D63747AED620C]) [    ] o.a.s.c.S.Request [collection1]  webapp=null path=null params={q=*:*&json.facet={+++cat:{terms:{field:'cat_s',+method:stream,sort:'index+asc',+facet:{where:{terms:{field:where_s,method:stream,sort:'index+asc'}}}+++}}}&rows=0&wt=xml} hits=6 status=0 QTime=0
   [junit4]   2> 162169 INFO  (TEST-TestJsonFacets.testMethodStream-seed#[A49D63747AED620C]) [    ] o.a.s.c.S.Request [collection1]  webapp=null path=null params={q=*:*&json.facet={+++cat:{terms:{field:'cat_s',+method:stream,sort:'index+asc',+facet:{++where:{terms:{field:where_s,method:stream,sort:'index+asc',sort:'index+asc',+facet:{x:'max(num_d)'}+++++}}}+++}}}&rows=0&wt=xml} hits=6 status=0 QTime=0
   [junit4]   2> 162170 INFO  (TEST-TestJsonFacets.testMethodStream-seed#[A49D63747AED620C]) [    ] o.a.s.c.S.Request [collection1]  webapp=null path=null params={q=*:*&json.facet={+++cat:{terms:{field:'cat_s',+method:stream,sort:'index+asc',+facet:{+y:'min(num_d)',++where:{terms:{field:where_s,method:stream,sort:'index+asc',+facet:{x:'max(num_d)'}+++++}}}+++}}}&rows=0&facet=true&wt=xml} hits=6 status=0 QTime=0
   [junit4]   2> 162170 INFO  (TEST-TestJsonFacets.testMethodStream-seed#[A49D63747AED620C]) [    ] o.a.s.c.S.Request [collection1]  webapp=null path=null params={q=*:*&fq=cat_s:A&wt=xml} hits=2 status=0 QTime=0
   [junit4]   2> 162170 INFO  (TEST-TestJsonFacets.testMethodStream-seed#[A49D63747AED620C]) [    ] o.a.s.SolrTestCaseJ4 ###Ending testMethodStream {p0=DVHASH}
   [junit4]   2> 162189 INFO  (SUITE-TestJsonFacets-seed#[A49D63747AED620C]-worker) [    ] o.e.j.s.ServerConnector Stopped ServerConnector@54f5ab0{HTTP/1.1,[http/1.1]}{127.0.0.1:0}
   [junit4]   2> 162193 INFO  (SUITE-TestJsonFacets-seed#[A49D63747AED620C]-worker) [    ] o.a.s.c.CoreContainer Shutting down CoreContainer instance=587479475
   [junit4]   2> 162200 INFO  (coreCloseExecutor-200-thread-1) [    x:collection1] o.a.s.c.SolrCore [collection1]  CLOSING SolrCore org.apache.solr.core.SolrCore@7fefbaff
   [junit4]   2> 162259 INFO  (SUITE-TestJsonFacets-seed#[A49D63747AED620C]-worker) [    ] o.e.j.s.h.ContextHandler Stopped o.e.j.s.ServletContextHandler@79ba8092{/solr,null,UNAVAILABLE}
   [junit4]   2> 162268 INFO  (SUITE-TestJsonFacets-seed#[A49D63747AED620C]-worker) [    ] o.e.j.s.ServerConnector Stopped ServerConnector@284c6fd4{HTTP/1.1,[http/1.1]}{127.0.0.1:0}
   [junit4]   2> 162269 INFO  (SUITE-TestJsonFacets-seed#[A49D63747AED620C]-worker) [    ] o.a.s.c.CoreContainer Shutting down CoreContainer instance=76887797
   [junit4]   2> 162271 INFO  (coreCloseExecutor-202-thread-1) [    x:collection1] o.a.s.c.SolrCore [collection1]  CLOSING SolrCore org.apache.solr.core.SolrCore@6fe73ef9
   [junit4]   2> 162285 INFO  (SUITE-TestJsonFacets-seed#[A49D63747AED620C]-worker) [    ] o.e.j.s.h.ContextHandler Stopped o.e.j.s.ServletContextHandler@20ad7656{/solr,null,UNAVAILABLE}
   [junit4]   2> 162293 INFO  (SUITE-TestJsonFacets-seed#[A49D63747AED620C]-worker) [    ] o.e.j.s.ServerConnector Stopped ServerConnector@4eb8564d{HTTP/1.1,[http/1.1]}{127.0.0.1:0}
   [junit4]   2> 162293 INFO  (SUITE-TestJsonFacets-seed#[A49D63747AED620C]-worker) [    ] o.a.s.c.CoreContainer Shutting down CoreContainer instance=1690904106
   [junit4]   2> 162295 INFO  (coreCloseExecutor-204-thread-1) [    x:collection1] o.a.s.c.SolrCore [collection1]  CLOSING SolrCore org.apache.solr.core.SolrCore@7f0bcdbd
   [junit4]   2> 162327 INFO  (SUITE-TestJsonFacets-seed#[A49D63747AED620C]-worker) [    ] o.e.j.s.h.ContextHandler Stopped o.e.j.s.ServletContextHandler@1021cc{/solr,null,UNAVAILABLE}
   [junit4]   2> 162331 INFO  (SUITE-TestJsonFacets-seed#[A49D63747AED620C]-worker) [    ] o.a.s.SolrTestCaseJ4 ###deleteCore
   [junit4]   2> 162332 INFO  (SUITE-TestJsonFacets-seed#[A49D63747AED620C]-worker) [    ] o.a.s.c.CoreContainer Shutting down CoreContainer instance=263065920
   [junit4]   2> 162334 INFO  (coreCloseExecutor-206-thread-1) [    x:collection1] o.a.s.c.SolrCore [collection1]  CLOSING SolrCore org.apache.solr.core.SolrCore@7834c3d8
   [junit4]   2> NOTE: leaving temporary files on disk at: /export/home/jenkins/workspace/Lucene-Solr-6.x-Solaris/solr/build/solr-core/test/J0/temp/solr.search.facet.TestJsonFacets_A49D63747AED620C-001
   [junit4]   2> NOTE: test params are: codec=Asserting(Lucene62): {num_dd=BlockTreeOrds(blocksize=128), super_s=PostingsFormat(name=LuceneVarGapDocFreqInterval), num_lds=PostingsFormat(name=LuceneVarGapFixedInterval), date_dt=BlockTreeOrds(blocksize=128), cat_sds=BlockTreeOrds(blocksize=128), where_sds=PostingsFormat(name=LuceneVarGapFixedInterval), Z_num_id=BlockTreeOrds(blocksize=128), super_sds=PostingsFormat(name=LuceneVarGapFixedInterval), cat_ss=BlockTreeOrds(blocksize=128), sparse_ss=PostingsFormat(name=LuceneVarGapDocFreqInterval), book_s=BlockTreeOrds(blocksize=128), super_sd=BlockTreeOrds(blocksize=128), where_s=PostingsFormat(name=LuceneVarGapDocFreqInterval), Z_num_i=PostingsFormat(name=LuceneVarGapDocFreqInterval), sparse_sd=PostingsFormat(name=Direct), id=PostingsFormat(name=LuceneVarGapDocFreqInterval), num_is=PostingsFormat(name=LuceneVarGapDocFreqInterval), Z_num_l=PostingsFormat(name=Direct), multi_ss=PostingsFormat(name=Direct), type_s=PostingsFormat(name=LuceneVarGapFixedInterval), date_dtd=PostingsFormat(name=LuceneVarGapDocFreqInterval), sparse_sds=PostingsFormat(name=LuceneVarGapDocFreqInterval), page_s=PostingsFormat(name=LuceneVarGapDocFreqInterval), cat_sd=PostingsFormat(name=LuceneVarGapFixedInterval), super_ss=PostingsFormat(name=Direct), val_b=PostingsFormat(name=LuceneVarGapFixedInterval), _root_=PostingsFormat(name=LuceneVarGapFixedInterval), multi_sds=PostingsFormat(name=Direct), num_f=BlockTreeOrds(blocksize=128), cat_s=PostingsFormat(name=Direct), v_t=PostingsFormat(name=LuceneVarGapDocFreqInterval), where_sd=BlockTreeOrds(blocksize=128), make_s=PostingsFormat(name=LuceneVarGapFixedInterval), num_id=PostingsFormat(name=Direct), num_d=PostingsFormat(name=LuceneVarGapDocFreqInterval), num_ds=PostingsFormat(name=Direct), date_dtds=PostingsFormat(name=Direct), num_i=PostingsFormat(name=LuceneVarGapFixedInterval), cost_f=PostingsFormat(name=Direct), sparse_s=PostingsFormat(name=LuceneVarGapFixedInterval), num_l=PostingsFormat(name=LuceneVarGapDocFreqInterval), num_ls=PostingsFormat(name=Direct), where_ss=PostingsFormat(name=LuceneVarGapFixedInterval), num_dds=PostingsFormat(name=LuceneVarGapFixedInterval), model_s=BlockTreeOrds(blocksize=128), num_fds=PostingsFormat(name=Direct), num_fs=PostingsFormat(name=LuceneVarGapFixedInterval), num_ids=PostingsFormat(name=LuceneVarGapDocFreqInterval)}, docValues:{num_dd=DocValuesFormat(name=Asserting), num_lds=DocValuesFormat(name=Lucene54), date_dtd=DocValuesFormat(name=Direct), sparse_sds=DocValuesFormat(name=Direct), cat_sd=DocValuesFormat(name=Lucene54), cat_sds=DocValuesFormat(name=Asserting), multi_sds=DocValuesFormat(name=Lucene54), where_sds=DocValuesFormat(name=Lucene54), where_sd=DocValuesFormat(name=Asserting), Z_num_id=DocValuesFormat(name=Asserting), num_id=DocValuesFormat(name=Lucene54), super_sds=DocValuesFormat(name=Lucene54), date_dtds=DocValuesFormat(name=Lucene54), _version_=DocValuesFormat(name=Lucene54), cat_ss=DocValuesFormat(name=Asserting), super_sd=DocValuesFormat(name=Asserting), sparse_sd=DocValuesFormat(name=Lucene54), id=DocValuesFormat(name=Direct), where_ss=DocValuesFormat(name=Lucene54), num_dds=DocValuesFormat(name=Lucene54), num_fds=DocValuesFormat(name=Lucene54), num_ids=DocValuesFormat(name=Direct)}, maxPointsInLeafNode=1404, maxMBSortInHeap=5.157942834283433, sim=ClassicSimilarity, locale=ja-JP, timezone=Europe/Kirov
   [junit4]   2> NOTE: SunOS 5.11 amd64/Oracle Corporation 1.8.0_102 (64-bit)/cpus=3,threads=1,free=177890112,total=297795584
   [junit4]   2> NOTE: All tests run in this JVM: [SystemInfoHandlerTest, TestStressVersions, HdfsChaosMonkeySafeLeaderTest, SoftAutoCommitTest, OverseerCollectionConfigSetProcessorTest, TestDefaultSearchFieldResource, LeaderFailoverAfterPartitionTest, CachingDirectoryFactoryTest, TestJsonFacets]
   [junit4] Completed [16/644 (1!)] on J0 in 40.78s, 48 tests, 6 errors <<< FAILURES!

[...truncated 62395 lines...]


Mime
View raw message