lucene-dev mailing list archives

Site index · List index
Message view « Date » · « Thread »
Top « Date » · « Thread »
From Apache Jenkins Server <jenk...@builds.apache.org>
Subject [JENKINS] Lucene-Solr-NightlyTests-master - Build # 1112 - Still Failing
Date Fri, 09 Sep 2016 05:30:50 GMT
Build: https://builds.apache.org/job/Lucene-Solr-NightlyTests-master/1112/

12 tests failed.
FAILED:  org.apache.solr.cloud.hdfs.HdfsUnloadDistributedZkTest.test

Error Message:
Error from server at http://127.0.0.1:46438: Error CREATEing SolrCore 'test_unload_shard_and_collection_1': Unable to create core [test_unload_shard_and_collection_1] Caused by: Direct buffer memory

Stack Trace:
org.apache.solr.client.solrj.impl.HttpSolrClient$RemoteSolrException: Error from server at http://127.0.0.1:46438: Error CREATEing SolrCore 'test_unload_shard_and_collection_1': Unable to create core [test_unload_shard_and_collection_1] Caused by: Direct buffer memory
	at org.apache.solr.client.solrj.impl.HttpSolrClient.executeMethod(HttpSolrClient.java:608)
	at org.apache.solr.client.solrj.impl.HttpSolrClient.request(HttpSolrClient.java:261)
	at org.apache.solr.client.solrj.impl.HttpSolrClient.request(HttpSolrClient.java:250)
	at org.apache.solr.client.solrj.SolrClient.request(SolrClient.java:1219)
	at org.apache.solr.cloud.UnloadDistributedZkTest.testUnloadShardAndCollection(UnloadDistributedZkTest.java:129)
	at org.apache.solr.cloud.UnloadDistributedZkTest.test(UnloadDistributedZkTest.java:70)
	at sun.reflect.NativeMethodAccessorImpl.invoke0(Native Method)
	at sun.reflect.NativeMethodAccessorImpl.invoke(NativeMethodAccessorImpl.java:62)
	at sun.reflect.DelegatingMethodAccessorImpl.invoke(DelegatingMethodAccessorImpl.java:43)
	at java.lang.reflect.Method.invoke(Method.java:498)
	at com.carrotsearch.randomizedtesting.RandomizedRunner.invoke(RandomizedRunner.java:1764)
	at com.carrotsearch.randomizedtesting.RandomizedRunner$8.evaluate(RandomizedRunner.java:871)
	at com.carrotsearch.randomizedtesting.RandomizedRunner$9.evaluate(RandomizedRunner.java:907)
	at com.carrotsearch.randomizedtesting.RandomizedRunner$10.evaluate(RandomizedRunner.java:921)
	at org.apache.solr.BaseDistributedSearchTestCase$ShardsRepeatRule$ShardsFixedStatement.callStatement(BaseDistributedSearchTestCase.java:985)
	at org.apache.solr.BaseDistributedSearchTestCase$ShardsRepeatRule$ShardsStatement.evaluate(BaseDistributedSearchTestCase.java:960)
	at com.carrotsearch.randomizedtesting.rules.SystemPropertiesRestoreRule$1.evaluate(SystemPropertiesRestoreRule.java:57)
	at org.apache.lucene.util.TestRuleSetupTeardownChained$1.evaluate(TestRuleSetupTeardownChained.java:49)
	at org.apache.lucene.util.AbstractBeforeAfterRule$1.evaluate(AbstractBeforeAfterRule.java:45)
	at org.apache.lucene.util.TestRuleThreadAndTestName$1.evaluate(TestRuleThreadAndTestName.java:48)
	at org.apache.lucene.util.TestRuleIgnoreAfterMaxFailures$1.evaluate(TestRuleIgnoreAfterMaxFailures.java:64)
	at org.apache.lucene.util.TestRuleMarkFailure$1.evaluate(TestRuleMarkFailure.java:47)
	at com.carrotsearch.randomizedtesting.rules.StatementAdapter.evaluate(StatementAdapter.java:36)
	at com.carrotsearch.randomizedtesting.ThreadLeakControl$StatementRunner.run(ThreadLeakControl.java:367)
	at com.carrotsearch.randomizedtesting.ThreadLeakControl.forkTimeoutingTask(ThreadLeakControl.java:809)
	at com.carrotsearch.randomizedtesting.ThreadLeakControl$3.evaluate(ThreadLeakControl.java:460)
	at com.carrotsearch.randomizedtesting.RandomizedRunner.runSingleTest(RandomizedRunner.java:880)
	at com.carrotsearch.randomizedtesting.RandomizedRunner$5.evaluate(RandomizedRunner.java:781)
	at com.carrotsearch.randomizedtesting.RandomizedRunner$6.evaluate(RandomizedRunner.java:816)
	at com.carrotsearch.randomizedtesting.RandomizedRunner$7.evaluate(RandomizedRunner.java:827)
	at com.carrotsearch.randomizedtesting.rules.StatementAdapter.evaluate(StatementAdapter.java:36)
	at com.carrotsearch.randomizedtesting.rules.SystemPropertiesRestoreRule$1.evaluate(SystemPropertiesRestoreRule.java:57)
	at org.apache.lucene.util.AbstractBeforeAfterRule$1.evaluate(AbstractBeforeAfterRule.java:45)
	at com.carrotsearch.randomizedtesting.rules.StatementAdapter.evaluate(StatementAdapter.java:36)
	at org.apache.lucene.util.TestRuleStoreClassName$1.evaluate(TestRuleStoreClassName.java:41)
	at com.carrotsearch.randomizedtesting.rules.NoShadowingOrOverridesOnMethodsRule$1.evaluate(NoShadowingOrOverridesOnMethodsRule.java:40)
	at com.carrotsearch.randomizedtesting.rules.NoShadowingOrOverridesOnMethodsRule$1.evaluate(NoShadowingOrOverridesOnMethodsRule.java:40)
	at com.carrotsearch.randomizedtesting.rules.StatementAdapter.evaluate(StatementAdapter.java:36)
	at com.carrotsearch.randomizedtesting.rules.StatementAdapter.evaluate(StatementAdapter.java:36)
	at com.carrotsearch.randomizedtesting.rules.StatementAdapter.evaluate(StatementAdapter.java:36)
	at org.apache.lucene.util.TestRuleAssertionsRequired$1.evaluate(TestRuleAssertionsRequired.java:53)
	at org.apache.lucene.util.TestRuleMarkFailure$1.evaluate(TestRuleMarkFailure.java:47)
	at org.apache.lucene.util.TestRuleIgnoreAfterMaxFailures$1.evaluate(TestRuleIgnoreAfterMaxFailures.java:64)
	at org.apache.lucene.util.TestRuleIgnoreTestSuites$1.evaluate(TestRuleIgnoreTestSuites.java:54)
	at com.carrotsearch.randomizedtesting.rules.StatementAdapter.evaluate(StatementAdapter.java:36)
	at com.carrotsearch.randomizedtesting.ThreadLeakControl$StatementRunner.run(ThreadLeakControl.java:367)
	at java.lang.Thread.run(Thread.java:745)


FAILED:  org.apache.solr.core.OpenCloseCoreStressTest.test10Minutes

Error Message:
Captured an uncaught exception in thread: Thread[id=17412, name=Thread-7291, state=RUNNABLE, group=TGRP-OpenCloseCoreStressTest]

Stack Trace:
com.carrotsearch.randomizedtesting.UncaughtExceptionError: Captured an uncaught exception in thread: Thread[id=17412, name=Thread-7291, state=RUNNABLE, group=TGRP-OpenCloseCoreStressTest]
Caused by: java.lang.OutOfMemoryError: GC overhead limit exceeded


FAILED:  org.apache.solr.handler.TestReplicationHandler.doTestIndexAndConfigAliasReplication

Error Message:
expected:<1> but was:<0>

Stack Trace:
java.lang.AssertionError: expected:<1> but was:<0>
	at __randomizedtesting.SeedInfo.seed([327C025A1D389D1D:C50FEC02DBD032FB]:0)
	at org.junit.Assert.fail(Assert.java:93)
	at org.junit.Assert.failNotEquals(Assert.java:647)
	at org.junit.Assert.assertEquals(Assert.java:128)
	at org.junit.Assert.assertEquals(Assert.java:472)
	at org.junit.Assert.assertEquals(Assert.java:456)
	at org.apache.solr.handler.TestReplicationHandler.doTestIndexAndConfigAliasReplication(TestReplicationHandler.java:1329)
	at sun.reflect.NativeMethodAccessorImpl.invoke0(Native Method)
	at sun.reflect.NativeMethodAccessorImpl.invoke(NativeMethodAccessorImpl.java:62)
	at sun.reflect.DelegatingMethodAccessorImpl.invoke(DelegatingMethodAccessorImpl.java:43)
	at java.lang.reflect.Method.invoke(Method.java:498)
	at com.carrotsearch.randomizedtesting.RandomizedRunner.invoke(RandomizedRunner.java:1764)
	at com.carrotsearch.randomizedtesting.RandomizedRunner$8.evaluate(RandomizedRunner.java:871)
	at com.carrotsearch.randomizedtesting.RandomizedRunner$9.evaluate(RandomizedRunner.java:907)
	at com.carrotsearch.randomizedtesting.RandomizedRunner$10.evaluate(RandomizedRunner.java:921)
	at com.carrotsearch.randomizedtesting.rules.SystemPropertiesRestoreRule$1.evaluate(SystemPropertiesRestoreRule.java:57)
	at org.apache.lucene.util.TestRuleSetupTeardownChained$1.evaluate(TestRuleSetupTeardownChained.java:49)
	at org.apache.lucene.util.AbstractBeforeAfterRule$1.evaluate(AbstractBeforeAfterRule.java:45)
	at org.apache.lucene.util.TestRuleThreadAndTestName$1.evaluate(TestRuleThreadAndTestName.java:48)
	at org.apache.lucene.util.TestRuleIgnoreAfterMaxFailures$1.evaluate(TestRuleIgnoreAfterMaxFailures.java:64)
	at org.apache.lucene.util.TestRuleMarkFailure$1.evaluate(TestRuleMarkFailure.java:47)
	at com.carrotsearch.randomizedtesting.rules.StatementAdapter.evaluate(StatementAdapter.java:36)
	at com.carrotsearch.randomizedtesting.ThreadLeakControl$StatementRunner.run(ThreadLeakControl.java:367)
	at com.carrotsearch.randomizedtesting.ThreadLeakControl.forkTimeoutingTask(ThreadLeakControl.java:809)
	at com.carrotsearch.randomizedtesting.ThreadLeakControl$3.evaluate(ThreadLeakControl.java:460)
	at com.carrotsearch.randomizedtesting.RandomizedRunner.runSingleTest(RandomizedRunner.java:880)
	at com.carrotsearch.randomizedtesting.RandomizedRunner$5.evaluate(RandomizedRunner.java:781)
	at com.carrotsearch.randomizedtesting.RandomizedRunner$6.evaluate(RandomizedRunner.java:816)
	at com.carrotsearch.randomizedtesting.RandomizedRunner$7.evaluate(RandomizedRunner.java:827)
	at com.carrotsearch.randomizedtesting.rules.StatementAdapter.evaluate(StatementAdapter.java:36)
	at com.carrotsearch.randomizedtesting.rules.SystemPropertiesRestoreRule$1.evaluate(SystemPropertiesRestoreRule.java:57)
	at org.apache.lucene.util.AbstractBeforeAfterRule$1.evaluate(AbstractBeforeAfterRule.java:45)
	at com.carrotsearch.randomizedtesting.rules.StatementAdapter.evaluate(StatementAdapter.java:36)
	at org.apache.lucene.util.TestRuleStoreClassName$1.evaluate(TestRuleStoreClassName.java:41)
	at com.carrotsearch.randomizedtesting.rules.NoShadowingOrOverridesOnMethodsRule$1.evaluate(NoShadowingOrOverridesOnMethodsRule.java:40)
	at com.carrotsearch.randomizedtesting.rules.NoShadowingOrOverridesOnMethodsRule$1.evaluate(NoShadowingOrOverridesOnMethodsRule.java:40)
	at com.carrotsearch.randomizedtesting.rules.StatementAdapter.evaluate(StatementAdapter.java:36)
	at com.carrotsearch.randomizedtesting.rules.StatementAdapter.evaluate(StatementAdapter.java:36)
	at com.carrotsearch.randomizedtesting.rules.StatementAdapter.evaluate(StatementAdapter.java:36)
	at org.apache.lucene.util.TestRuleAssertionsRequired$1.evaluate(TestRuleAssertionsRequired.java:53)
	at org.apache.lucene.util.TestRuleMarkFailure$1.evaluate(TestRuleMarkFailure.java:47)
	at org.apache.lucene.util.TestRuleIgnoreAfterMaxFailures$1.evaluate(TestRuleIgnoreAfterMaxFailures.java:64)
	at org.apache.lucene.util.TestRuleIgnoreTestSuites$1.evaluate(TestRuleIgnoreTestSuites.java:54)
	at com.carrotsearch.randomizedtesting.rules.StatementAdapter.evaluate(StatementAdapter.java:36)
	at com.carrotsearch.randomizedtesting.ThreadLeakControl$StatementRunner.run(ThreadLeakControl.java:367)
	at java.lang.Thread.run(Thread.java:745)


FAILED:  org.apache.solr.handler.TestReplicationHandler.doTestStressReplication

Error Message:
[index.20160909000326436, replication.properties, index.properties, index.20160909000333505, snapshot_metadata] expected:<1> but was:<2>

Stack Trace:
java.lang.AssertionError: [index.20160909000326436, replication.properties, index.properties, index.20160909000333505, snapshot_metadata] expected:<1> but was:<2>
	at __randomizedtesting.SeedInfo.seed([327C025A1D389D1D:E9D7029C1810F4AE]:0)
	at org.junit.Assert.fail(Assert.java:93)
	at org.junit.Assert.failNotEquals(Assert.java:647)
	at org.junit.Assert.assertEquals(Assert.java:128)
	at org.junit.Assert.assertEquals(Assert.java:472)
	at org.apache.solr.handler.TestReplicationHandler.checkForSingleIndex(TestReplicationHandler.java:907)
	at org.apache.solr.handler.TestReplicationHandler.doTestStressReplication(TestReplicationHandler.java:874)
	at sun.reflect.NativeMethodAccessorImpl.invoke0(Native Method)
	at sun.reflect.NativeMethodAccessorImpl.invoke(NativeMethodAccessorImpl.java:62)
	at sun.reflect.DelegatingMethodAccessorImpl.invoke(DelegatingMethodAccessorImpl.java:43)
	at java.lang.reflect.Method.invoke(Method.java:498)
	at com.carrotsearch.randomizedtesting.RandomizedRunner.invoke(RandomizedRunner.java:1764)
	at com.carrotsearch.randomizedtesting.RandomizedRunner$8.evaluate(RandomizedRunner.java:871)
	at com.carrotsearch.randomizedtesting.RandomizedRunner$9.evaluate(RandomizedRunner.java:907)
	at com.carrotsearch.randomizedtesting.RandomizedRunner$10.evaluate(RandomizedRunner.java:921)
	at com.carrotsearch.randomizedtesting.rules.SystemPropertiesRestoreRule$1.evaluate(SystemPropertiesRestoreRule.java:57)
	at org.apache.lucene.util.TestRuleSetupTeardownChained$1.evaluate(TestRuleSetupTeardownChained.java:49)
	at org.apache.lucene.util.AbstractBeforeAfterRule$1.evaluate(AbstractBeforeAfterRule.java:45)
	at org.apache.lucene.util.TestRuleThreadAndTestName$1.evaluate(TestRuleThreadAndTestName.java:48)
	at org.apache.lucene.util.TestRuleIgnoreAfterMaxFailures$1.evaluate(TestRuleIgnoreAfterMaxFailures.java:64)
	at org.apache.lucene.util.TestRuleMarkFailure$1.evaluate(TestRuleMarkFailure.java:47)
	at com.carrotsearch.randomizedtesting.rules.StatementAdapter.evaluate(StatementAdapter.java:36)
	at com.carrotsearch.randomizedtesting.ThreadLeakControl$StatementRunner.run(ThreadLeakControl.java:367)
	at com.carrotsearch.randomizedtesting.ThreadLeakControl.forkTimeoutingTask(ThreadLeakControl.java:809)
	at com.carrotsearch.randomizedtesting.ThreadLeakControl$3.evaluate(ThreadLeakControl.java:460)
	at com.carrotsearch.randomizedtesting.RandomizedRunner.runSingleTest(RandomizedRunner.java:880)
	at com.carrotsearch.randomizedtesting.RandomizedRunner$5.evaluate(RandomizedRunner.java:781)
	at com.carrotsearch.randomizedtesting.RandomizedRunner$6.evaluate(RandomizedRunner.java:816)
	at com.carrotsearch.randomizedtesting.RandomizedRunner$7.evaluate(RandomizedRunner.java:827)
	at com.carrotsearch.randomizedtesting.rules.StatementAdapter.evaluate(StatementAdapter.java:36)
	at com.carrotsearch.randomizedtesting.rules.SystemPropertiesRestoreRule$1.evaluate(SystemPropertiesRestoreRule.java:57)
	at org.apache.lucene.util.AbstractBeforeAfterRule$1.evaluate(AbstractBeforeAfterRule.java:45)
	at com.carrotsearch.randomizedtesting.rules.StatementAdapter.evaluate(StatementAdapter.java:36)
	at org.apache.lucene.util.TestRuleStoreClassName$1.evaluate(TestRuleStoreClassName.java:41)
	at com.carrotsearch.randomizedtesting.rules.NoShadowingOrOverridesOnMethodsRule$1.evaluate(NoShadowingOrOverridesOnMethodsRule.java:40)
	at com.carrotsearch.randomizedtesting.rules.NoShadowingOrOverridesOnMethodsRule$1.evaluate(NoShadowingOrOverridesOnMethodsRule.java:40)
	at com.carrotsearch.randomizedtesting.rules.StatementAdapter.evaluate(StatementAdapter.java:36)
	at com.carrotsearch.randomizedtesting.rules.StatementAdapter.evaluate(StatementAdapter.java:36)
	at com.carrotsearch.randomizedtesting.rules.StatementAdapter.evaluate(StatementAdapter.java:36)
	at org.apache.lucene.util.TestRuleAssertionsRequired$1.evaluate(TestRuleAssertionsRequired.java:53)
	at org.apache.lucene.util.TestRuleMarkFailure$1.evaluate(TestRuleMarkFailure.java:47)
	at org.apache.lucene.util.TestRuleIgnoreAfterMaxFailures$1.evaluate(TestRuleIgnoreAfterMaxFailures.java:64)
	at org.apache.lucene.util.TestRuleIgnoreTestSuites$1.evaluate(TestRuleIgnoreTestSuites.java:54)
	at com.carrotsearch.randomizedtesting.rules.StatementAdapter.evaluate(StatementAdapter.java:36)
	at com.carrotsearch.randomizedtesting.ThreadLeakControl$StatementRunner.run(ThreadLeakControl.java:367)
	at java.lang.Thread.run(Thread.java:745)


FAILED:  org.apache.solr.cloud.CdcrReplicationDistributedZkTest.testResilienceWithDeleteByQueryOnTarget

Error Message:
Timeout waiting for CDCR replication to complete @source_collection:shard2

Stack Trace:
java.lang.RuntimeException: Timeout waiting for CDCR replication to complete @source_collection:shard2
	at __randomizedtesting.SeedInfo.seed([327C025A1D389D1D:921E90C0CD615858]:0)
	at org.apache.solr.cloud.BaseCdcrDistributedZkTest.waitForReplicationToComplete(BaseCdcrDistributedZkTest.java:794)
	at org.apache.solr.cloud.CdcrReplicationDistributedZkTest.testResilienceWithDeleteByQueryOnTarget(CdcrReplicationDistributedZkTest.java:589)
	at sun.reflect.NativeMethodAccessorImpl.invoke0(Native Method)
	at sun.reflect.NativeMethodAccessorImpl.invoke(NativeMethodAccessorImpl.java:62)
	at sun.reflect.DelegatingMethodAccessorImpl.invoke(DelegatingMethodAccessorImpl.java:43)
	at java.lang.reflect.Method.invoke(Method.java:498)
	at com.carrotsearch.randomizedtesting.RandomizedRunner.invoke(RandomizedRunner.java:1764)
	at com.carrotsearch.randomizedtesting.RandomizedRunner$8.evaluate(RandomizedRunner.java:871)
	at com.carrotsearch.randomizedtesting.RandomizedRunner$9.evaluate(RandomizedRunner.java:907)
	at com.carrotsearch.randomizedtesting.RandomizedRunner$10.evaluate(RandomizedRunner.java:921)
	at org.apache.solr.BaseDistributedSearchTestCase$ShardsRepeatRule$ShardsFixedStatement.callStatement(BaseDistributedSearchTestCase.java:985)
	at org.apache.solr.BaseDistributedSearchTestCase$ShardsRepeatRule$ShardsStatement.evaluate(BaseDistributedSearchTestCase.java:960)
	at com.carrotsearch.randomizedtesting.rules.SystemPropertiesRestoreRule$1.evaluate(SystemPropertiesRestoreRule.java:57)
	at org.apache.lucene.util.TestRuleSetupTeardownChained$1.evaluate(TestRuleSetupTeardownChained.java:49)
	at org.apache.lucene.util.AbstractBeforeAfterRule$1.evaluate(AbstractBeforeAfterRule.java:45)
	at org.apache.lucene.util.TestRuleThreadAndTestName$1.evaluate(TestRuleThreadAndTestName.java:48)
	at org.apache.lucene.util.TestRuleIgnoreAfterMaxFailures$1.evaluate(TestRuleIgnoreAfterMaxFailures.java:64)
	at org.apache.lucene.util.TestRuleMarkFailure$1.evaluate(TestRuleMarkFailure.java:47)
	at com.carrotsearch.randomizedtesting.rules.StatementAdapter.evaluate(StatementAdapter.java:36)
	at com.carrotsearch.randomizedtesting.ThreadLeakControl$StatementRunner.run(ThreadLeakControl.java:367)
	at com.carrotsearch.randomizedtesting.ThreadLeakControl.forkTimeoutingTask(ThreadLeakControl.java:809)
	at com.carrotsearch.randomizedtesting.ThreadLeakControl$3.evaluate(ThreadLeakControl.java:460)
	at com.carrotsearch.randomizedtesting.RandomizedRunner.runSingleTest(RandomizedRunner.java:880)
	at com.carrotsearch.randomizedtesting.RandomizedRunner$5.evaluate(RandomizedRunner.java:781)
	at com.carrotsearch.randomizedtesting.RandomizedRunner$6.evaluate(RandomizedRunner.java:816)
	at com.carrotsearch.randomizedtesting.RandomizedRunner$7.evaluate(RandomizedRunner.java:827)
	at com.carrotsearch.randomizedtesting.rules.StatementAdapter.evaluate(StatementAdapter.java:36)
	at com.carrotsearch.randomizedtesting.rules.SystemPropertiesRestoreRule$1.evaluate(SystemPropertiesRestoreRule.java:57)
	at org.apache.lucene.util.AbstractBeforeAfterRule$1.evaluate(AbstractBeforeAfterRule.java:45)
	at com.carrotsearch.randomizedtesting.rules.StatementAdapter.evaluate(StatementAdapter.java:36)
	at org.apache.lucene.util.TestRuleStoreClassName$1.evaluate(TestRuleStoreClassName.java:41)
	at com.carrotsearch.randomizedtesting.rules.NoShadowingOrOverridesOnMethodsRule$1.evaluate(NoShadowingOrOverridesOnMethodsRule.java:40)
	at com.carrotsearch.randomizedtesting.rules.NoShadowingOrOverridesOnMethodsRule$1.evaluate(NoShadowingOrOverridesOnMethodsRule.java:40)
	at com.carrotsearch.randomizedtesting.rules.StatementAdapter.evaluate(StatementAdapter.java:36)
	at com.carrotsearch.randomizedtesting.rules.StatementAdapter.evaluate(StatementAdapter.java:36)
	at com.carrotsearch.randomizedtesting.rules.StatementAdapter.evaluate(StatementAdapter.java:36)
	at org.apache.lucene.util.TestRuleAssertionsRequired$1.evaluate(TestRuleAssertionsRequired.java:53)
	at org.apache.lucene.util.TestRuleMarkFailure$1.evaluate(TestRuleMarkFailure.java:47)
	at org.apache.lucene.util.TestRuleIgnoreAfterMaxFailures$1.evaluate(TestRuleIgnoreAfterMaxFailures.java:64)
	at org.apache.lucene.util.TestRuleIgnoreTestSuites$1.evaluate(TestRuleIgnoreTestSuites.java:54)
	at com.carrotsearch.randomizedtesting.rules.StatementAdapter.evaluate(StatementAdapter.java:36)
	at com.carrotsearch.randomizedtesting.ThreadLeakControl$StatementRunner.run(ThreadLeakControl.java:367)
	at java.lang.Thread.run(Thread.java:745)


FAILED:  org.apache.solr.cloud.CdcrReplicationDistributedZkTest.testReplicationAfterLeaderChange

Error Message:
Timeout waiting for CDCR replication to complete @source_collection:shard2

Stack Trace:
java.lang.RuntimeException: Timeout waiting for CDCR replication to complete @source_collection:shard2
	at __randomizedtesting.SeedInfo.seed([327C025A1D389D1D:E08C4EB943973B2F]:0)
	at org.apache.solr.cloud.BaseCdcrDistributedZkTest.waitForReplicationToComplete(BaseCdcrDistributedZkTest.java:794)
	at org.apache.solr.cloud.CdcrReplicationDistributedZkTest.testReplicationAfterLeaderChange(CdcrReplicationDistributedZkTest.java:306)
	at sun.reflect.NativeMethodAccessorImpl.invoke0(Native Method)
	at sun.reflect.NativeMethodAccessorImpl.invoke(NativeMethodAccessorImpl.java:62)
	at sun.reflect.DelegatingMethodAccessorImpl.invoke(DelegatingMethodAccessorImpl.java:43)
	at java.lang.reflect.Method.invoke(Method.java:498)
	at com.carrotsearch.randomizedtesting.RandomizedRunner.invoke(RandomizedRunner.java:1764)
	at com.carrotsearch.randomizedtesting.RandomizedRunner$8.evaluate(RandomizedRunner.java:871)
	at com.carrotsearch.randomizedtesting.RandomizedRunner$9.evaluate(RandomizedRunner.java:907)
	at com.carrotsearch.randomizedtesting.RandomizedRunner$10.evaluate(RandomizedRunner.java:921)
	at org.apache.solr.BaseDistributedSearchTestCase$ShardsRepeatRule$ShardsFixedStatement.callStatement(BaseDistributedSearchTestCase.java:985)
	at org.apache.solr.BaseDistributedSearchTestCase$ShardsRepeatRule$ShardsStatement.evaluate(BaseDistributedSearchTestCase.java:960)
	at com.carrotsearch.randomizedtesting.rules.SystemPropertiesRestoreRule$1.evaluate(SystemPropertiesRestoreRule.java:57)
	at org.apache.lucene.util.TestRuleSetupTeardownChained$1.evaluate(TestRuleSetupTeardownChained.java:49)
	at org.apache.lucene.util.AbstractBeforeAfterRule$1.evaluate(AbstractBeforeAfterRule.java:45)
	at org.apache.lucene.util.TestRuleThreadAndTestName$1.evaluate(TestRuleThreadAndTestName.java:48)
	at org.apache.lucene.util.TestRuleIgnoreAfterMaxFailures$1.evaluate(TestRuleIgnoreAfterMaxFailures.java:64)
	at org.apache.lucene.util.TestRuleMarkFailure$1.evaluate(TestRuleMarkFailure.java:47)
	at com.carrotsearch.randomizedtesting.rules.StatementAdapter.evaluate(StatementAdapter.java:36)
	at com.carrotsearch.randomizedtesting.ThreadLeakControl$StatementRunner.run(ThreadLeakControl.java:367)
	at com.carrotsearch.randomizedtesting.ThreadLeakControl.forkTimeoutingTask(ThreadLeakControl.java:809)
	at com.carrotsearch.randomizedtesting.ThreadLeakControl$3.evaluate(ThreadLeakControl.java:460)
	at com.carrotsearch.randomizedtesting.RandomizedRunner.runSingleTest(RandomizedRunner.java:880)
	at com.carrotsearch.randomizedtesting.RandomizedRunner$5.evaluate(RandomizedRunner.java:781)
	at com.carrotsearch.randomizedtesting.RandomizedRunner$6.evaluate(RandomizedRunner.java:816)
	at com.carrotsearch.randomizedtesting.RandomizedRunner$7.evaluate(RandomizedRunner.java:827)
	at com.carrotsearch.randomizedtesting.rules.StatementAdapter.evaluate(StatementAdapter.java:36)
	at com.carrotsearch.randomizedtesting.rules.SystemPropertiesRestoreRule$1.evaluate(SystemPropertiesRestoreRule.java:57)
	at org.apache.lucene.util.AbstractBeforeAfterRule$1.evaluate(AbstractBeforeAfterRule.java:45)
	at com.carrotsearch.randomizedtesting.rules.StatementAdapter.evaluate(StatementAdapter.java:36)
	at org.apache.lucene.util.TestRuleStoreClassName$1.evaluate(TestRuleStoreClassName.java:41)
	at com.carrotsearch.randomizedtesting.rules.NoShadowingOrOverridesOnMethodsRule$1.evaluate(NoShadowingOrOverridesOnMethodsRule.java:40)
	at com.carrotsearch.randomizedtesting.rules.NoShadowingOrOverridesOnMethodsRule$1.evaluate(NoShadowingOrOverridesOnMethodsRule.java:40)
	at com.carrotsearch.randomizedtesting.rules.StatementAdapter.evaluate(StatementAdapter.java:36)
	at com.carrotsearch.randomizedtesting.rules.StatementAdapter.evaluate(StatementAdapter.java:36)
	at com.carrotsearch.randomizedtesting.rules.StatementAdapter.evaluate(StatementAdapter.java:36)
	at org.apache.lucene.util.TestRuleAssertionsRequired$1.evaluate(TestRuleAssertionsRequired.java:53)
	at org.apache.lucene.util.TestRuleMarkFailure$1.evaluate(TestRuleMarkFailure.java:47)
	at org.apache.lucene.util.TestRuleIgnoreAfterMaxFailures$1.evaluate(TestRuleIgnoreAfterMaxFailures.java:64)
	at org.apache.lucene.util.TestRuleIgnoreTestSuites$1.evaluate(TestRuleIgnoreTestSuites.java:54)
	at com.carrotsearch.randomizedtesting.rules.StatementAdapter.evaluate(StatementAdapter.java:36)
	at com.carrotsearch.randomizedtesting.ThreadLeakControl$StatementRunner.run(ThreadLeakControl.java:367)
	at java.lang.Thread.run(Thread.java:745)


FAILED:  org.apache.solr.cloud.CdcrReplicationDistributedZkTest.testReplicationStartStop

Error Message:
Timeout waiting for CDCR replication to complete @source_collection:shard1

Stack Trace:
java.lang.RuntimeException: Timeout waiting for CDCR replication to complete @source_collection:shard1
	at __randomizedtesting.SeedInfo.seed([327C025A1D389D1D:B1BFDCC909E01694]:0)
	at org.apache.solr.cloud.BaseCdcrDistributedZkTest.waitForReplicationToComplete(BaseCdcrDistributedZkTest.java:794)
	at org.apache.solr.cloud.CdcrReplicationDistributedZkTest.testReplicationStartStop(CdcrReplicationDistributedZkTest.java:196)
	at sun.reflect.NativeMethodAccessorImpl.invoke0(Native Method)
	at sun.reflect.NativeMethodAccessorImpl.invoke(NativeMethodAccessorImpl.java:62)
	at sun.reflect.DelegatingMethodAccessorImpl.invoke(DelegatingMethodAccessorImpl.java:43)
	at java.lang.reflect.Method.invoke(Method.java:498)
	at com.carrotsearch.randomizedtesting.RandomizedRunner.invoke(RandomizedRunner.java:1764)
	at com.carrotsearch.randomizedtesting.RandomizedRunner$8.evaluate(RandomizedRunner.java:871)
	at com.carrotsearch.randomizedtesting.RandomizedRunner$9.evaluate(RandomizedRunner.java:907)
	at com.carrotsearch.randomizedtesting.RandomizedRunner$10.evaluate(RandomizedRunner.java:921)
	at org.apache.solr.BaseDistributedSearchTestCase$ShardsRepeatRule$ShardsFixedStatement.callStatement(BaseDistributedSearchTestCase.java:985)
	at org.apache.solr.BaseDistributedSearchTestCase$ShardsRepeatRule$ShardsStatement.evaluate(BaseDistributedSearchTestCase.java:960)
	at com.carrotsearch.randomizedtesting.rules.SystemPropertiesRestoreRule$1.evaluate(SystemPropertiesRestoreRule.java:57)
	at org.apache.lucene.util.TestRuleSetupTeardownChained$1.evaluate(TestRuleSetupTeardownChained.java:49)
	at org.apache.lucene.util.AbstractBeforeAfterRule$1.evaluate(AbstractBeforeAfterRule.java:45)
	at org.apache.lucene.util.TestRuleThreadAndTestName$1.evaluate(TestRuleThreadAndTestName.java:48)
	at org.apache.lucene.util.TestRuleIgnoreAfterMaxFailures$1.evaluate(TestRuleIgnoreAfterMaxFailures.java:64)
	at org.apache.lucene.util.TestRuleMarkFailure$1.evaluate(TestRuleMarkFailure.java:47)
	at com.carrotsearch.randomizedtesting.rules.StatementAdapter.evaluate(StatementAdapter.java:36)
	at com.carrotsearch.randomizedtesting.ThreadLeakControl$StatementRunner.run(ThreadLeakControl.java:367)
	at com.carrotsearch.randomizedtesting.ThreadLeakControl.forkTimeoutingTask(ThreadLeakControl.java:809)
	at com.carrotsearch.randomizedtesting.ThreadLeakControl$3.evaluate(ThreadLeakControl.java:460)
	at com.carrotsearch.randomizedtesting.RandomizedRunner.runSingleTest(RandomizedRunner.java:880)
	at com.carrotsearch.randomizedtesting.RandomizedRunner$5.evaluate(RandomizedRunner.java:781)
	at com.carrotsearch.randomizedtesting.RandomizedRunner$6.evaluate(RandomizedRunner.java:816)
	at com.carrotsearch.randomizedtesting.RandomizedRunner$7.evaluate(RandomizedRunner.java:827)
	at com.carrotsearch.randomizedtesting.rules.StatementAdapter.evaluate(StatementAdapter.java:36)
	at com.carrotsearch.randomizedtesting.rules.SystemPropertiesRestoreRule$1.evaluate(SystemPropertiesRestoreRule.java:57)
	at org.apache.lucene.util.AbstractBeforeAfterRule$1.evaluate(AbstractBeforeAfterRule.java:45)
	at com.carrotsearch.randomizedtesting.rules.StatementAdapter.evaluate(StatementAdapter.java:36)
	at org.apache.lucene.util.TestRuleStoreClassName$1.evaluate(TestRuleStoreClassName.java:41)
	at com.carrotsearch.randomizedtesting.rules.NoShadowingOrOverridesOnMethodsRule$1.evaluate(NoShadowingOrOverridesOnMethodsRule.java:40)
	at com.carrotsearch.randomizedtesting.rules.NoShadowingOrOverridesOnMethodsRule$1.evaluate(NoShadowingOrOverridesOnMethodsRule.java:40)
	at com.carrotsearch.randomizedtesting.rules.StatementAdapter.evaluate(StatementAdapter.java:36)
	at com.carrotsearch.randomizedtesting.rules.StatementAdapter.evaluate(StatementAdapter.java:36)
	at com.carrotsearch.randomizedtesting.rules.StatementAdapter.evaluate(StatementAdapter.java:36)
	at org.apache.lucene.util.TestRuleAssertionsRequired$1.evaluate(TestRuleAssertionsRequired.java:53)
	at org.apache.lucene.util.TestRuleMarkFailure$1.evaluate(TestRuleMarkFailure.java:47)
	at org.apache.lucene.util.TestRuleIgnoreAfterMaxFailures$1.evaluate(TestRuleIgnoreAfterMaxFailures.java:64)
	at org.apache.lucene.util.TestRuleIgnoreTestSuites$1.evaluate(TestRuleIgnoreTestSuites.java:54)
	at com.carrotsearch.randomizedtesting.rules.StatementAdapter.evaluate(StatementAdapter.java:36)
	at com.carrotsearch.randomizedtesting.ThreadLeakControl$StatementRunner.run(ThreadLeakControl.java:367)
	at java.lang.Thread.run(Thread.java:745)


FAILED:  org.apache.solr.cloud.CdcrReplicationDistributedZkTest.testBatchAddsWithDelete

Error Message:
Timeout waiting for CDCR replication to complete @source_collection:shard2

Stack Trace:
java.lang.RuntimeException: Timeout waiting for CDCR replication to complete @source_collection:shard2
	at __randomizedtesting.SeedInfo.seed([327C025A1D389D1D:45667BFEB5219C31]:0)
	at org.apache.solr.cloud.BaseCdcrDistributedZkTest.waitForReplicationToComplete(BaseCdcrDistributedZkTest.java:794)
	at org.apache.solr.cloud.CdcrReplicationDistributedZkTest.testBatchAddsWithDelete(CdcrReplicationDistributedZkTest.java:526)
	at sun.reflect.NativeMethodAccessorImpl.invoke0(Native Method)
	at sun.reflect.NativeMethodAccessorImpl.invoke(NativeMethodAccessorImpl.java:62)
	at sun.reflect.DelegatingMethodAccessorImpl.invoke(DelegatingMethodAccessorImpl.java:43)
	at java.lang.reflect.Method.invoke(Method.java:498)
	at com.carrotsearch.randomizedtesting.RandomizedRunner.invoke(RandomizedRunner.java:1764)
	at com.carrotsearch.randomizedtesting.RandomizedRunner$8.evaluate(RandomizedRunner.java:871)
	at com.carrotsearch.randomizedtesting.RandomizedRunner$9.evaluate(RandomizedRunner.java:907)
	at com.carrotsearch.randomizedtesting.RandomizedRunner$10.evaluate(RandomizedRunner.java:921)
	at org.apache.solr.BaseDistributedSearchTestCase$ShardsRepeatRule$ShardsFixedStatement.callStatement(BaseDistributedSearchTestCase.java:985)
	at org.apache.solr.BaseDistributedSearchTestCase$ShardsRepeatRule$ShardsStatement.evaluate(BaseDistributedSearchTestCase.java:960)
	at com.carrotsearch.randomizedtesting.rules.SystemPropertiesRestoreRule$1.evaluate(SystemPropertiesRestoreRule.java:57)
	at org.apache.lucene.util.TestRuleSetupTeardownChained$1.evaluate(TestRuleSetupTeardownChained.java:49)
	at org.apache.lucene.util.AbstractBeforeAfterRule$1.evaluate(AbstractBeforeAfterRule.java:45)
	at org.apache.lucene.util.TestRuleThreadAndTestName$1.evaluate(TestRuleThreadAndTestName.java:48)
	at org.apache.lucene.util.TestRuleIgnoreAfterMaxFailures$1.evaluate(TestRuleIgnoreAfterMaxFailures.java:64)
	at org.apache.lucene.util.TestRuleMarkFailure$1.evaluate(TestRuleMarkFailure.java:47)
	at com.carrotsearch.randomizedtesting.rules.StatementAdapter.evaluate(StatementAdapter.java:36)
	at com.carrotsearch.randomizedtesting.ThreadLeakControl$StatementRunner.run(ThreadLeakControl.java:367)
	at com.carrotsearch.randomizedtesting.ThreadLeakControl.forkTimeoutingTask(ThreadLeakControl.java:809)
	at com.carrotsearch.randomizedtesting.ThreadLeakControl$3.evaluate(ThreadLeakControl.java:460)
	at com.carrotsearch.randomizedtesting.RandomizedRunner.runSingleTest(RandomizedRunner.java:880)
	at com.carrotsearch.randomizedtesting.RandomizedRunner$5.evaluate(RandomizedRunner.java:781)
	at com.carrotsearch.randomizedtesting.RandomizedRunner$6.evaluate(RandomizedRunner.java:816)
	at com.carrotsearch.randomizedtesting.RandomizedRunner$7.evaluate(RandomizedRunner.java:827)
	at com.carrotsearch.randomizedtesting.rules.StatementAdapter.evaluate(StatementAdapter.java:36)
	at com.carrotsearch.randomizedtesting.rules.SystemPropertiesRestoreRule$1.evaluate(SystemPropertiesRestoreRule.java:57)
	at org.apache.lucene.util.AbstractBeforeAfterRule$1.evaluate(AbstractBeforeAfterRule.java:45)
	at com.carrotsearch.randomizedtesting.rules.StatementAdapter.evaluate(StatementAdapter.java:36)
	at org.apache.lucene.util.TestRuleStoreClassName$1.evaluate(TestRuleStoreClassName.java:41)
	at com.carrotsearch.randomizedtesting.rules.NoShadowingOrOverridesOnMethodsRule$1.evaluate(NoShadowingOrOverridesOnMethodsRule.java:40)
	at com.carrotsearch.randomizedtesting.rules.NoShadowingOrOverridesOnMethodsRule$1.evaluate(NoShadowingOrOverridesOnMethodsRule.java:40)
	at com.carrotsearch.randomizedtesting.rules.StatementAdapter.evaluate(StatementAdapter.java:36)
	at com.carrotsearch.randomizedtesting.rules.StatementAdapter.evaluate(StatementAdapter.java:36)
	at com.carrotsearch.randomizedtesting.rules.StatementAdapter.evaluate(StatementAdapter.java:36)
	at org.apache.lucene.util.TestRuleAssertionsRequired$1.evaluate(TestRuleAssertionsRequired.java:53)
	at org.apache.lucene.util.TestRuleMarkFailure$1.evaluate(TestRuleMarkFailure.java:47)
	at org.apache.lucene.util.TestRuleIgnoreAfterMaxFailures$1.evaluate(TestRuleIgnoreAfterMaxFailures.java:64)
	at org.apache.lucene.util.TestRuleIgnoreTestSuites$1.evaluate(TestRuleIgnoreTestSuites.java:54)
	at com.carrotsearch.randomizedtesting.rules.StatementAdapter.evaluate(StatementAdapter.java:36)
	at com.carrotsearch.randomizedtesting.ThreadLeakControl$StatementRunner.run(ThreadLeakControl.java:367)
	at java.lang.Thread.run(Thread.java:745)


FAILED:  org.apache.solr.cloud.hdfs.HdfsCollectionsAPIDistributedZkTest.test

Error Message:
Timeout occured while waiting response from server at: http://127.0.0.1:59906/vo/yy

Stack Trace:
org.apache.solr.client.solrj.SolrServerException: Timeout occured while waiting response from server at: http://127.0.0.1:59906/vo/yy
	at org.apache.solr.client.solrj.impl.HttpSolrClient.executeMethod(HttpSolrClient.java:619)
	at org.apache.solr.client.solrj.impl.HttpSolrClient.request(HttpSolrClient.java:261)
	at org.apache.solr.client.solrj.impl.HttpSolrClient.request(HttpSolrClient.java:250)
	at org.apache.solr.client.solrj.SolrClient.request(SolrClient.java:1219)
	at org.apache.solr.cloud.CollectionsAPIDistributedZkTest.makeRequest(CollectionsAPIDistributedZkTest.java:400)
	at org.apache.solr.cloud.CollectionsAPIDistributedZkTest.testErrorHandling(CollectionsAPIDistributedZkTest.java:516)
	at org.apache.solr.cloud.CollectionsAPIDistributedZkTest.test(CollectionsAPIDistributedZkTest.java:180)
	at sun.reflect.NativeMethodAccessorImpl.invoke0(Native Method)
	at sun.reflect.NativeMethodAccessorImpl.invoke(NativeMethodAccessorImpl.java:62)
	at sun.reflect.DelegatingMethodAccessorImpl.invoke(DelegatingMethodAccessorImpl.java:43)
	at java.lang.reflect.Method.invoke(Method.java:498)
	at com.carrotsearch.randomizedtesting.RandomizedRunner.invoke(RandomizedRunner.java:1764)
	at com.carrotsearch.randomizedtesting.RandomizedRunner$8.evaluate(RandomizedRunner.java:871)
	at com.carrotsearch.randomizedtesting.RandomizedRunner$9.evaluate(RandomizedRunner.java:907)
	at com.carrotsearch.randomizedtesting.RandomizedRunner$10.evaluate(RandomizedRunner.java:921)
	at org.apache.solr.BaseDistributedSearchTestCase$ShardsRepeatRule$ShardsFixedStatement.callStatement(BaseDistributedSearchTestCase.java:985)
	at org.apache.solr.BaseDistributedSearchTestCase$ShardsRepeatRule$ShardsStatement.evaluate(BaseDistributedSearchTestCase.java:960)
	at com.carrotsearch.randomizedtesting.rules.SystemPropertiesRestoreRule$1.evaluate(SystemPropertiesRestoreRule.java:57)
	at org.apache.lucene.util.TestRuleSetupTeardownChained$1.evaluate(TestRuleSetupTeardownChained.java:49)
	at org.apache.lucene.util.AbstractBeforeAfterRule$1.evaluate(AbstractBeforeAfterRule.java:45)
	at org.apache.lucene.util.TestRuleThreadAndTestName$1.evaluate(TestRuleThreadAndTestName.java:48)
	at org.apache.lucene.util.TestRuleIgnoreAfterMaxFailures$1.evaluate(TestRuleIgnoreAfterMaxFailures.java:64)
	at org.apache.lucene.util.TestRuleMarkFailure$1.evaluate(TestRuleMarkFailure.java:47)
	at com.carrotsearch.randomizedtesting.rules.StatementAdapter.evaluate(StatementAdapter.java:36)
	at com.carrotsearch.randomizedtesting.ThreadLeakControl$StatementRunner.run(ThreadLeakControl.java:367)
	at com.carrotsearch.randomizedtesting.ThreadLeakControl.forkTimeoutingTask(ThreadLeakControl.java:809)
	at com.carrotsearch.randomizedtesting.ThreadLeakControl$3.evaluate(ThreadLeakControl.java:460)
	at com.carrotsearch.randomizedtesting.RandomizedRunner.runSingleTest(RandomizedRunner.java:880)
	at com.carrotsearch.randomizedtesting.RandomizedRunner$5.evaluate(RandomizedRunner.java:781)
	at com.carrotsearch.randomizedtesting.RandomizedRunner$6.evaluate(RandomizedRunner.java:816)
	at com.carrotsearch.randomizedtesting.RandomizedRunner$7.evaluate(RandomizedRunner.java:827)
	at com.carrotsearch.randomizedtesting.rules.StatementAdapter.evaluate(StatementAdapter.java:36)
	at com.carrotsearch.randomizedtesting.rules.SystemPropertiesRestoreRule$1.evaluate(SystemPropertiesRestoreRule.java:57)
	at org.apache.lucene.util.AbstractBeforeAfterRule$1.evaluate(AbstractBeforeAfterRule.java:45)
	at com.carrotsearch.randomizedtesting.rules.StatementAdapter.evaluate(StatementAdapter.java:36)
	at org.apache.lucene.util.TestRuleStoreClassName$1.evaluate(TestRuleStoreClassName.java:41)
	at com.carrotsearch.randomizedtesting.rules.NoShadowingOrOverridesOnMethodsRule$1.evaluate(NoShadowingOrOverridesOnMethodsRule.java:40)
	at com.carrotsearch.randomizedtesting.rules.NoShadowingOrOverridesOnMethodsRule$1.evaluate(NoShadowingOrOverridesOnMethodsRule.java:40)
	at com.carrotsearch.randomizedtesting.rules.StatementAdapter.evaluate(StatementAdapter.java:36)
	at com.carrotsearch.randomizedtesting.rules.StatementAdapter.evaluate(StatementAdapter.java:36)
	at com.carrotsearch.randomizedtesting.rules.StatementAdapter.evaluate(StatementAdapter.java:36)
	at org.apache.lucene.util.TestRuleAssertionsRequired$1.evaluate(TestRuleAssertionsRequired.java:53)
	at org.apache.lucene.util.TestRuleMarkFailure$1.evaluate(TestRuleMarkFailure.java:47)
	at org.apache.lucene.util.TestRuleIgnoreAfterMaxFailures$1.evaluate(TestRuleIgnoreAfterMaxFailures.java:64)
	at org.apache.lucene.util.TestRuleIgnoreTestSuites$1.evaluate(TestRuleIgnoreTestSuites.java:54)
	at com.carrotsearch.randomizedtesting.rules.StatementAdapter.evaluate(StatementAdapter.java:36)
	at com.carrotsearch.randomizedtesting.ThreadLeakControl$StatementRunner.run(ThreadLeakControl.java:367)
	at java.lang.Thread.run(Thread.java:745)
Caused by: java.net.SocketTimeoutException: Read timed out
	at java.net.SocketInputStream.socketRead0(Native Method)
	at java.net.SocketInputStream.socketRead(SocketInputStream.java:116)
	at java.net.SocketInputStream.read(SocketInputStream.java:170)
	at java.net.SocketInputStream.read(SocketInputStream.java:141)
	at org.apache.http.impl.io.SessionInputBufferImpl.streamRead(SessionInputBufferImpl.java:139)
	at org.apache.http.impl.io.SessionInputBufferImpl.fillBuffer(SessionInputBufferImpl.java:155)
	at org.apache.http.impl.io.SessionInputBufferImpl.readLine(SessionInputBufferImpl.java:284)
	at org.apache.http.impl.conn.DefaultHttpResponseParser.parseHead(DefaultHttpResponseParser.java:140)
	at org.apache.http.impl.conn.DefaultHttpResponseParser.parseHead(DefaultHttpResponseParser.java:57)
	at org.apache.http.impl.io.AbstractMessageParser.parse(AbstractMessageParser.java:261)
	at org.apache.http.impl.DefaultBHttpClientConnection.receiveResponseHeader(DefaultBHttpClientConnection.java:165)
	at org.apache.http.impl.conn.CPoolProxy.receiveResponseHeader(CPoolProxy.java:167)
	at org.apache.http.protocol.HttpRequestExecutor.doReceiveResponse(HttpRequestExecutor.java:272)
	at org.apache.http.protocol.HttpRequestExecutor.execute(HttpRequestExecutor.java:124)
	at org.apache.http.impl.execchain.MainClientExec.execute(MainClientExec.java:271)
	at org.apache.http.impl.execchain.ProtocolExec.execute(ProtocolExec.java:184)
	at org.apache.http.impl.execchain.RetryExec.execute(RetryExec.java:88)
	at org.apache.http.impl.execchain.RedirectExec.execute(RedirectExec.java:110)
	at org.apache.http.impl.client.InternalHttpClient.doExecute(InternalHttpClient.java:184)
	at org.apache.http.impl.client.CloseableHttpClient.execute(CloseableHttpClient.java:82)
	at org.apache.http.impl.client.CloseableHttpClient.execute(CloseableHttpClient.java:55)
	at org.apache.solr.client.solrj.impl.HttpSolrClient.executeMethod(HttpSolrClient.java:513)
	... 47 more


FAILED:  org.apache.solr.cloud.CollectionsAPIDistributedZkTest.test

Error Message:
Timeout occured while waiting response from server at: http://127.0.0.1:47352

Stack Trace:
org.apache.solr.client.solrj.SolrServerException: Timeout occured while waiting response from server at: http://127.0.0.1:47352
	at org.apache.solr.client.solrj.impl.HttpSolrClient.executeMethod(HttpSolrClient.java:619)
	at org.apache.solr.client.solrj.impl.HttpSolrClient.request(HttpSolrClient.java:261)
	at org.apache.solr.client.solrj.impl.HttpSolrClient.request(HttpSolrClient.java:250)
	at org.apache.solr.client.solrj.SolrClient.request(SolrClient.java:1219)
	at org.apache.solr.cloud.CollectionsAPIDistributedZkTest.makeRequest(CollectionsAPIDistributedZkTest.java:400)
	at org.apache.solr.cloud.CollectionsAPIDistributedZkTest.testErrorHandling(CollectionsAPIDistributedZkTest.java:516)
	at org.apache.solr.cloud.CollectionsAPIDistributedZkTest.test(CollectionsAPIDistributedZkTest.java:180)
	at sun.reflect.NativeMethodAccessorImpl.invoke0(Native Method)
	at sun.reflect.NativeMethodAccessorImpl.invoke(NativeMethodAccessorImpl.java:62)
	at sun.reflect.DelegatingMethodAccessorImpl.invoke(DelegatingMethodAccessorImpl.java:43)
	at java.lang.reflect.Method.invoke(Method.java:498)
	at com.carrotsearch.randomizedtesting.RandomizedRunner.invoke(RandomizedRunner.java:1764)
	at com.carrotsearch.randomizedtesting.RandomizedRunner$8.evaluate(RandomizedRunner.java:871)
	at com.carrotsearch.randomizedtesting.RandomizedRunner$9.evaluate(RandomizedRunner.java:907)
	at com.carrotsearch.randomizedtesting.RandomizedRunner$10.evaluate(RandomizedRunner.java:921)
	at org.apache.solr.BaseDistributedSearchTestCase$ShardsRepeatRule$ShardsFixedStatement.callStatement(BaseDistributedSearchTestCase.java:985)
	at org.apache.solr.BaseDistributedSearchTestCase$ShardsRepeatRule$ShardsStatement.evaluate(BaseDistributedSearchTestCase.java:960)
	at com.carrotsearch.randomizedtesting.rules.SystemPropertiesRestoreRule$1.evaluate(SystemPropertiesRestoreRule.java:57)
	at org.apache.lucene.util.TestRuleSetupTeardownChained$1.evaluate(TestRuleSetupTeardownChained.java:49)
	at org.apache.lucene.util.AbstractBeforeAfterRule$1.evaluate(AbstractBeforeAfterRule.java:45)
	at org.apache.lucene.util.TestRuleThreadAndTestName$1.evaluate(TestRuleThreadAndTestName.java:48)
	at org.apache.lucene.util.TestRuleIgnoreAfterMaxFailures$1.evaluate(TestRuleIgnoreAfterMaxFailures.java:64)
	at org.apache.lucene.util.TestRuleMarkFailure$1.evaluate(TestRuleMarkFailure.java:47)
	at com.carrotsearch.randomizedtesting.rules.StatementAdapter.evaluate(StatementAdapter.java:36)
	at com.carrotsearch.randomizedtesting.ThreadLeakControl$StatementRunner.run(ThreadLeakControl.java:367)
	at com.carrotsearch.randomizedtesting.ThreadLeakControl.forkTimeoutingTask(ThreadLeakControl.java:809)
	at com.carrotsearch.randomizedtesting.ThreadLeakControl$3.evaluate(ThreadLeakControl.java:460)
	at com.carrotsearch.randomizedtesting.RandomizedRunner.runSingleTest(RandomizedRunner.java:880)
	at com.carrotsearch.randomizedtesting.RandomizedRunner$5.evaluate(RandomizedRunner.java:781)
	at com.carrotsearch.randomizedtesting.RandomizedRunner$6.evaluate(RandomizedRunner.java:816)
	at com.carrotsearch.randomizedtesting.RandomizedRunner$7.evaluate(RandomizedRunner.java:827)
	at com.carrotsearch.randomizedtesting.rules.StatementAdapter.evaluate(StatementAdapter.java:36)
	at com.carrotsearch.randomizedtesting.rules.SystemPropertiesRestoreRule$1.evaluate(SystemPropertiesRestoreRule.java:57)
	at org.apache.lucene.util.AbstractBeforeAfterRule$1.evaluate(AbstractBeforeAfterRule.java:45)
	at com.carrotsearch.randomizedtesting.rules.StatementAdapter.evaluate(StatementAdapter.java:36)
	at org.apache.lucene.util.TestRuleStoreClassName$1.evaluate(TestRuleStoreClassName.java:41)
	at com.carrotsearch.randomizedtesting.rules.NoShadowingOrOverridesOnMethodsRule$1.evaluate(NoShadowingOrOverridesOnMethodsRule.java:40)
	at com.carrotsearch.randomizedtesting.rules.NoShadowingOrOverridesOnMethodsRule$1.evaluate(NoShadowingOrOverridesOnMethodsRule.java:40)
	at com.carrotsearch.randomizedtesting.rules.StatementAdapter.evaluate(StatementAdapter.java:36)
	at com.carrotsearch.randomizedtesting.rules.StatementAdapter.evaluate(StatementAdapter.java:36)
	at com.carrotsearch.randomizedtesting.rules.StatementAdapter.evaluate(StatementAdapter.java:36)
	at org.apache.lucene.util.TestRuleAssertionsRequired$1.evaluate(TestRuleAssertionsRequired.java:53)
	at org.apache.lucene.util.TestRuleMarkFailure$1.evaluate(TestRuleMarkFailure.java:47)
	at org.apache.lucene.util.TestRuleIgnoreAfterMaxFailures$1.evaluate(TestRuleIgnoreAfterMaxFailures.java:64)
	at org.apache.lucene.util.TestRuleIgnoreTestSuites$1.evaluate(TestRuleIgnoreTestSuites.java:54)
	at com.carrotsearch.randomizedtesting.rules.StatementAdapter.evaluate(StatementAdapter.java:36)
	at com.carrotsearch.randomizedtesting.ThreadLeakControl$StatementRunner.run(ThreadLeakControl.java:367)
	at java.lang.Thread.run(Thread.java:745)
Caused by: java.net.SocketTimeoutException: Read timed out
	at java.net.SocketInputStream.socketRead0(Native Method)
	at java.net.SocketInputStream.socketRead(SocketInputStream.java:116)
	at java.net.SocketInputStream.read(SocketInputStream.java:170)
	at java.net.SocketInputStream.read(SocketInputStream.java:141)
	at org.apache.http.impl.io.SessionInputBufferImpl.streamRead(SessionInputBufferImpl.java:139)
	at org.apache.http.impl.io.SessionInputBufferImpl.fillBuffer(SessionInputBufferImpl.java:155)
	at org.apache.http.impl.io.SessionInputBufferImpl.readLine(SessionInputBufferImpl.java:284)
	at org.apache.http.impl.conn.DefaultHttpResponseParser.parseHead(DefaultHttpResponseParser.java:140)
	at org.apache.http.impl.conn.DefaultHttpResponseParser.parseHead(DefaultHttpResponseParser.java:57)
	at org.apache.http.impl.io.AbstractMessageParser.parse(AbstractMessageParser.java:261)
	at org.apache.http.impl.DefaultBHttpClientConnection.receiveResponseHeader(DefaultBHttpClientConnection.java:165)
	at org.apache.http.impl.conn.CPoolProxy.receiveResponseHeader(CPoolProxy.java:167)
	at org.apache.http.protocol.HttpRequestExecutor.doReceiveResponse(HttpRequestExecutor.java:272)
	at org.apache.http.protocol.HttpRequestExecutor.execute(HttpRequestExecutor.java:124)
	at org.apache.http.impl.execchain.MainClientExec.execute(MainClientExec.java:271)
	at org.apache.http.impl.execchain.ProtocolExec.execute(ProtocolExec.java:184)
	at org.apache.http.impl.execchain.RetryExec.execute(RetryExec.java:88)
	at org.apache.http.impl.execchain.RedirectExec.execute(RedirectExec.java:110)
	at org.apache.http.impl.client.InternalHttpClient.doExecute(InternalHttpClient.java:184)
	at org.apache.http.impl.client.CloseableHttpClient.execute(CloseableHttpClient.java:82)
	at org.apache.http.impl.client.CloseableHttpClient.execute(CloseableHttpClient.java:55)
	at org.apache.solr.client.solrj.impl.HttpSolrClient.executeMethod(HttpSolrClient.java:513)
	... 47 more


FAILED:  junit.framework.TestSuite.org.apache.solr.cloud.ConcurrentDeleteAndCreateCollectionTest

Error Message:
ObjectTracker found 10 object(s) that were not released!!! [InternalHttpClient, InternalHttpClient, InternalHttpClient, InternalHttpClient, InternalHttpClient, InternalHttpClient, InternalHttpClient, InternalHttpClient, InternalHttpClient, InternalHttpClient]

Stack Trace:
java.lang.AssertionError: ObjectTracker found 10 object(s) that were not released!!! [InternalHttpClient, InternalHttpClient, InternalHttpClient, InternalHttpClient, InternalHttpClient, InternalHttpClient, InternalHttpClient, InternalHttpClient, InternalHttpClient, InternalHttpClient]
	at __randomizedtesting.SeedInfo.seed([327C025A1D389D1D]:0)
	at org.junit.Assert.fail(Assert.java:93)
	at org.junit.Assert.assertTrue(Assert.java:43)
	at org.junit.Assert.assertNull(Assert.java:551)
	at org.apache.solr.SolrTestCaseJ4.teardownTestCases(SolrTestCaseJ4.java:257)
	at sun.reflect.NativeMethodAccessorImpl.invoke0(Native Method)
	at sun.reflect.NativeMethodAccessorImpl.invoke(NativeMethodAccessorImpl.java:62)
	at sun.reflect.DelegatingMethodAccessorImpl.invoke(DelegatingMethodAccessorImpl.java:43)
	at java.lang.reflect.Method.invoke(Method.java:498)
	at com.carrotsearch.randomizedtesting.RandomizedRunner.invoke(RandomizedRunner.java:1764)
	at com.carrotsearch.randomizedtesting.RandomizedRunner$7.evaluate(RandomizedRunner.java:834)
	at com.carrotsearch.randomizedtesting.rules.StatementAdapter.evaluate(StatementAdapter.java:36)
	at com.carrotsearch.randomizedtesting.rules.SystemPropertiesRestoreRule$1.evaluate(SystemPropertiesRestoreRule.java:57)
	at org.apache.lucene.util.AbstractBeforeAfterRule$1.evaluate(AbstractBeforeAfterRule.java:45)
	at com.carrotsearch.randomizedtesting.rules.StatementAdapter.evaluate(StatementAdapter.java:36)
	at org.apache.lucene.util.TestRuleStoreClassName$1.evaluate(TestRuleStoreClassName.java:41)
	at com.carrotsearch.randomizedtesting.rules.NoShadowingOrOverridesOnMethodsRule$1.evaluate(NoShadowingOrOverridesOnMethodsRule.java:40)
	at com.carrotsearch.randomizedtesting.rules.NoShadowingOrOverridesOnMethodsRule$1.evaluate(NoShadowingOrOverridesOnMethodsRule.java:40)
	at com.carrotsearch.randomizedtesting.rules.StatementAdapter.evaluate(StatementAdapter.java:36)
	at com.carrotsearch.randomizedtesting.rules.StatementAdapter.evaluate(StatementAdapter.java:36)
	at com.carrotsearch.randomizedtesting.rules.StatementAdapter.evaluate(StatementAdapter.java:36)
	at org.apache.lucene.util.TestRuleAssertionsRequired$1.evaluate(TestRuleAssertionsRequired.java:53)
	at org.apache.lucene.util.TestRuleMarkFailure$1.evaluate(TestRuleMarkFailure.java:47)
	at org.apache.lucene.util.TestRuleIgnoreAfterMaxFailures$1.evaluate(TestRuleIgnoreAfterMaxFailures.java:64)
	at org.apache.lucene.util.TestRuleIgnoreTestSuites$1.evaluate(TestRuleIgnoreTestSuites.java:54)
	at com.carrotsearch.randomizedtesting.rules.StatementAdapter.evaluate(StatementAdapter.java:36)
	at com.carrotsearch.randomizedtesting.ThreadLeakControl$StatementRunner.run(ThreadLeakControl.java:367)
	at java.lang.Thread.run(Thread.java:745)


FAILED:  junit.framework.TestSuite.org.apache.solr.cloud.ConcurrentDeleteAndCreateCollectionTest

Error Message:
10 threads leaked from SUITE scope at org.apache.solr.cloud.ConcurrentDeleteAndCreateCollectionTest:     1) Thread[id=73355, name=Connection evictor, state=TIMED_WAITING, group=TGRP-ConcurrentDeleteAndCreateCollectionTest]         at java.lang.Thread.sleep(Native Method)         at org.apache.http.impl.client.IdleConnectionEvictor$1.run(IdleConnectionEvictor.java:66)         at java.lang.Thread.run(Thread.java:745)    2) Thread[id=73350, name=Connection evictor, state=TIMED_WAITING, group=TGRP-ConcurrentDeleteAndCreateCollectionTest]         at java.lang.Thread.sleep(Native Method)         at org.apache.http.impl.client.IdleConnectionEvictor$1.run(IdleConnectionEvictor.java:66)         at java.lang.Thread.run(Thread.java:745)    3) Thread[id=73340, name=Connection evictor, state=TIMED_WAITING, group=TGRP-ConcurrentDeleteAndCreateCollectionTest]         at java.lang.Thread.sleep(Native Method)         at org.apache.http.impl.client.IdleConnectionEvictor$1.run(IdleConnectionEvictor.java:66)         at java.lang.Thread.run(Thread.java:745)    4) Thread[id=73330, name=Connection evictor, state=TIMED_WAITING, group=TGRP-ConcurrentDeleteAndCreateCollectionTest]         at java.lang.Thread.sleep(Native Method)         at org.apache.http.impl.client.IdleConnectionEvictor$1.run(IdleConnectionEvictor.java:66)         at java.lang.Thread.run(Thread.java:745)    5) Thread[id=73335, name=Connection evictor, state=TIMED_WAITING, group=TGRP-ConcurrentDeleteAndCreateCollectionTest]         at java.lang.Thread.sleep(Native Method)         at org.apache.http.impl.client.IdleConnectionEvictor$1.run(IdleConnectionEvictor.java:66)         at java.lang.Thread.run(Thread.java:745)    6) Thread[id=73320, name=Connection evictor, state=TIMED_WAITING, group=TGRP-ConcurrentDeleteAndCreateCollectionTest]         at java.lang.Thread.sleep(Native Method)         at org.apache.http.impl.client.IdleConnectionEvictor$1.run(IdleConnectionEvictor.java:66)         at java.lang.Thread.run(Thread.java:745)    7) Thread[id=73325, name=Connection evictor, state=TIMED_WAITING, group=TGRP-ConcurrentDeleteAndCreateCollectionTest]         at java.lang.Thread.sleep(Native Method)         at org.apache.http.impl.client.IdleConnectionEvictor$1.run(IdleConnectionEvictor.java:66)         at java.lang.Thread.run(Thread.java:745)    8) Thread[id=73315, name=Connection evictor, state=TIMED_WAITING, group=TGRP-ConcurrentDeleteAndCreateCollectionTest]         at java.lang.Thread.sleep(Native Method)         at org.apache.http.impl.client.IdleConnectionEvictor$1.run(IdleConnectionEvictor.java:66)         at java.lang.Thread.run(Thread.java:745)    9) Thread[id=73345, name=Connection evictor, state=TIMED_WAITING, group=TGRP-ConcurrentDeleteAndCreateCollectionTest]         at java.lang.Thread.sleep(Native Method)         at org.apache.http.impl.client.IdleConnectionEvictor$1.run(IdleConnectionEvictor.java:66)         at java.lang.Thread.run(Thread.java:745)   10) Thread[id=73360, name=Connection evictor, state=TIMED_WAITING, group=TGRP-ConcurrentDeleteAndCreateCollectionTest]         at java.lang.Thread.sleep(Native Method)         at org.apache.http.impl.client.IdleConnectionEvictor$1.run(IdleConnectionEvictor.java:66)         at java.lang.Thread.run(Thread.java:745)

Stack Trace:
com.carrotsearch.randomizedtesting.ThreadLeakError: 10 threads leaked from SUITE scope at org.apache.solr.cloud.ConcurrentDeleteAndCreateCollectionTest: 
   1) Thread[id=73355, name=Connection evictor, state=TIMED_WAITING, group=TGRP-ConcurrentDeleteAndCreateCollectionTest]
        at java.lang.Thread.sleep(Native Method)
        at org.apache.http.impl.client.IdleConnectionEvictor$1.run(IdleConnectionEvictor.java:66)
        at java.lang.Thread.run(Thread.java:745)
   2) Thread[id=73350, name=Connection evictor, state=TIMED_WAITING, group=TGRP-ConcurrentDeleteAndCreateCollectionTest]
        at java.lang.Thread.sleep(Native Method)
        at org.apache.http.impl.client.IdleConnectionEvictor$1.run(IdleConnectionEvictor.java:66)
        at java.lang.Thread.run(Thread.java:745)
   3) Thread[id=73340, name=Connection evictor, state=TIMED_WAITING, group=TGRP-ConcurrentDeleteAndCreateCollectionTest]
        at java.lang.Thread.sleep(Native Method)
        at org.apache.http.impl.client.IdleConnectionEvictor$1.run(IdleConnectionEvictor.java:66)
        at java.lang.Thread.run(Thread.java:745)
   4) Thread[id=73330, name=Connection evictor, state=TIMED_WAITING, group=TGRP-ConcurrentDeleteAndCreateCollectionTest]
        at java.lang.Thread.sleep(Native Method)
        at org.apache.http.impl.client.IdleConnectionEvictor$1.run(IdleConnectionEvictor.java:66)
        at java.lang.Thread.run(Thread.java:745)
   5) Thread[id=73335, name=Connection evictor, state=TIMED_WAITING, group=TGRP-ConcurrentDeleteAndCreateCollectionTest]
        at java.lang.Thread.sleep(Native Method)
        at org.apache.http.impl.client.IdleConnectionEvictor$1.run(IdleConnectionEvictor.java:66)
        at java.lang.Thread.run(Thread.java:745)
   6) Thread[id=73320, name=Connection evictor, state=TIMED_WAITING, group=TGRP-ConcurrentDeleteAndCreateCollectionTest]
        at java.lang.Thread.sleep(Native Method)
        at org.apache.http.impl.client.IdleConnectionEvictor$1.run(IdleConnectionEvictor.java:66)
        at java.lang.Thread.run(Thread.java:745)
   7) Thread[id=73325, name=Connection evictor, state=TIMED_WAITING, group=TGRP-ConcurrentDeleteAndCreateCollectionTest]
        at java.lang.Thread.sleep(Native Method)
        at org.apache.http.impl.client.IdleConnectionEvictor$1.run(IdleConnectionEvictor.java:66)
        at java.lang.Thread.run(Thread.java:745)
   8) Thread[id=73315, name=Connection evictor, state=TIMED_WAITING, group=TGRP-ConcurrentDeleteAndCreateCollectionTest]
        at java.lang.Thread.sleep(Native Method)
        at org.apache.http.impl.client.IdleConnectionEvictor$1.run(IdleConnectionEvictor.java:66)
        at java.lang.Thread.run(Thread.java:745)
   9) Thread[id=73345, name=Connection evictor, state=TIMED_WAITING, group=TGRP-ConcurrentDeleteAndCreateCollectionTest]
        at java.lang.Thread.sleep(Native Method)
        at org.apache.http.impl.client.IdleConnectionEvictor$1.run(IdleConnectionEvictor.java:66)
        at java.lang.Thread.run(Thread.java:745)
  10) Thread[id=73360, name=Connection evictor, state=TIMED_WAITING, group=TGRP-ConcurrentDeleteAndCreateCollectionTest]
        at java.lang.Thread.sleep(Native Method)
        at org.apache.http.impl.client.IdleConnectionEvictor$1.run(IdleConnectionEvictor.java:66)
        at java.lang.Thread.run(Thread.java:745)
	at __randomizedtesting.SeedInfo.seed([327C025A1D389D1D]:0)




Build Log:
[...truncated 11251 lines...]
   [junit4] Suite: org.apache.solr.cloud.CollectionsAPIDistributedZkTest
   [junit4]   2> Creating dataDir: /x1/jenkins/jenkins-slave/workspace/Lucene-Solr-NightlyTests-master/checkout/solr/build/solr-core/test/J1/temp/solr.cloud.CollectionsAPIDistributedZkTest_327C025A1D389D1D-001/init-core-data-001
   [junit4]   2> 93531 INFO  (SUITE-CollectionsAPIDistributedZkTest-seed#[327C025A1D389D1D]-worker) [    ] o.a.s.SolrTestCaseJ4 Randomized ssl (false) and clientAuth (false) via: @org.apache.solr.util.RandomizeSSL(reason=, ssl=NaN, value=NaN, clientAuth=NaN)
   [junit4]   2> 93531 INFO  (SUITE-CollectionsAPIDistributedZkTest-seed#[327C025A1D389D1D]-worker) [    ] o.a.s.BaseDistributedSearchTestCase Setting hostContext system property: /
   [junit4]   2> 93567 INFO  (TEST-CollectionsAPIDistributedZkTest.test-seed#[327C025A1D389D1D]) [    ] o.a.s.c.ZkTestServer STARTING ZK TEST SERVER
   [junit4]   2> 93574 INFO  (Thread-82) [    ] o.a.s.c.ZkTestServer client port:0.0.0.0/0.0.0.0:0
   [junit4]   2> 93579 INFO  (Thread-82) [    ] o.a.s.c.ZkTestServer Starting server
   [junit4]   2> 94174 INFO  (TEST-CollectionsAPIDistributedZkTest.test-seed#[327C025A1D389D1D]) [    ] o.a.s.c.ZkTestServer start zk server on port:40962
   [junit4]   2> 94201 INFO  (TEST-CollectionsAPIDistributedZkTest.test-seed#[327C025A1D389D1D]) [    ] o.a.s.c.c.SolrZkClient Using default ZkCredentialsProvider
   [junit4]   2> 94456 INFO  (TEST-CollectionsAPIDistributedZkTest.test-seed#[327C025A1D389D1D]) [    ] o.a.s.c.c.ConnectionManager Waiting for client to connect to ZooKeeper
   [junit4]   2> 94523 WARN  (NIOServerCxn.Factory:0.0.0.0/0.0.0.0:0) [    ] o.a.z.s.NIOServerCnxn Exception causing close of session 0x0 due to java.io.IOException: ZooKeeperServer not running
   [junit4]   2> 95865 INFO  (zkCallback-41-thread-1) [    ] o.a.s.c.c.ConnectionManager Watcher org.apache.solr.common.cloud.ConnectionManager@2e3034b5 name:ZooKeeperConnection Watcher:127.0.0.1:40962 got event WatchedEvent state:SyncConnected type:None path:null path:null type:None
   [junit4]   2> 95865 INFO  (TEST-CollectionsAPIDistributedZkTest.test-seed#[327C025A1D389D1D]) [    ] o.a.s.c.c.ConnectionManager Client is connected to ZooKeeper
   [junit4]   2> 95865 INFO  (TEST-CollectionsAPIDistributedZkTest.test-seed#[327C025A1D389D1D]) [    ] o.a.s.c.c.SolrZkClient Using default ZkACLProvider
   [junit4]   2> 95867 INFO  (TEST-CollectionsAPIDistributedZkTest.test-seed#[327C025A1D389D1D]) [    ] o.a.s.c.c.SolrZkClient makePath: /solr
   [junit4]   2> 96424 INFO  (TEST-CollectionsAPIDistributedZkTest.test-seed#[327C025A1D389D1D]) [    ] o.a.s.c.c.SolrZkClient Using default ZkCredentialsProvider
   [junit4]   2> 96435 INFO  (TEST-CollectionsAPIDistributedZkTest.test-seed#[327C025A1D389D1D]) [    ] o.a.s.c.c.ConnectionManager Waiting for client to connect to ZooKeeper
   [junit4]   2> 96471 INFO  (zkCallback-42-thread-1) [    ] o.a.s.c.c.ConnectionManager Watcher org.apache.solr.common.cloud.ConnectionManager@234d5125 name:ZooKeeperConnection Watcher:127.0.0.1:40962/solr got event WatchedEvent state:SyncConnected type:None path:null path:null type:None
   [junit4]   2> 96471 INFO  (TEST-CollectionsAPIDistributedZkTest.test-seed#[327C025A1D389D1D]) [    ] o.a.s.c.c.ConnectionManager Client is connected to ZooKeeper
   [junit4]   2> 96472 INFO  (TEST-CollectionsAPIDistributedZkTest.test-seed#[327C025A1D389D1D]) [    ] o.a.s.c.c.SolrZkClient Using default ZkACLProvider
   [junit4]   2> 96472 INFO  (TEST-CollectionsAPIDistributedZkTest.test-seed#[327C025A1D389D1D]) [    ] o.a.s.c.c.SolrZkClient makePath: /collections/collection1
   [junit4]   2> 96479 INFO  (TEST-CollectionsAPIDistributedZkTest.test-seed#[327C025A1D389D1D]) [    ] o.a.s.c.c.SolrZkClient makePath: /collections/collection1/shards
   [junit4]   2> 96486 INFO  (TEST-CollectionsAPIDistributedZkTest.test-seed#[327C025A1D389D1D]) [    ] o.a.s.c.c.SolrZkClient makePath: /collections/control_collection
   [junit4]   2> 96497 INFO  (TEST-CollectionsAPIDistributedZkTest.test-seed#[327C025A1D389D1D]) [    ] o.a.s.c.c.SolrZkClient makePath: /collections/control_collection/shards
   [junit4]   2> 96504 INFO  (TEST-CollectionsAPIDistributedZkTest.test-seed#[327C025A1D389D1D]) [    ] o.a.s.c.AbstractZkTestCase put /x1/jenkins/jenkins-slave/workspace/Lucene-Solr-NightlyTests-master/checkout/solr/core/src/test-files/solr/collection1/conf/solrconfig-tlog.xml to /configs/conf1/solrconfig.xml
   [junit4]   2> 96511 INFO  (TEST-CollectionsAPIDistributedZkTest.test-seed#[327C025A1D389D1D]) [    ] o.a.s.c.c.SolrZkClient makePath: /configs/conf1/solrconfig.xml
   [junit4]   2> 96835 INFO  (TEST-CollectionsAPIDistributedZkTest.test-seed#[327C025A1D389D1D]) [    ] o.a.s.c.AbstractZkTestCase put /x1/jenkins/jenkins-slave/workspace/Lucene-Solr-NightlyTests-master/checkout/solr/core/src/test-files/solr/collection1/conf/schema.xml to /configs/conf1/schema.xml
   [junit4]   2> 96835 INFO  (TEST-CollectionsAPIDistributedZkTest.test-seed#[327C025A1D389D1D]) [    ] o.a.s.c.c.SolrZkClient makePath: /configs/conf1/schema.xml
   [junit4]   2> 96849 INFO  (TEST-CollectionsAPIDistributedZkTest.test-seed#[327C025A1D389D1D]) [    ] o.a.s.c.AbstractZkTestCase put /x1/jenkins/jenkins-slave/workspace/Lucene-Solr-NightlyTests-master/checkout/solr/core/src/test-files/solr/collection1/conf/solrconfig.snippet.randomindexconfig.xml to /configs/conf1/solrconfig.snippet.randomindexconfig.xml
   [junit4]   2> 96849 INFO  (TEST-CollectionsAPIDistributedZkTest.test-seed#[327C025A1D389D1D]) [    ] o.a.s.c.c.SolrZkClient makePath: /configs/conf1/solrconfig.snippet.randomindexconfig.xml
   [junit4]   2> 96863 INFO  (TEST-CollectionsAPIDistributedZkTest.test-seed#[327C025A1D389D1D]) [    ] o.a.s.c.AbstractZkTestCase put /x1/jenkins/jenkins-slave/workspace/Lucene-Solr-NightlyTests-master/checkout/solr/core/src/test-files/solr/collection1/conf/stopwords.txt to /configs/conf1/stopwords.txt
   [junit4]   2> 96863 INFO  (TEST-CollectionsAPIDistributedZkTest.test-seed#[327C025A1D389D1D]) [    ] o.a.s.c.c.SolrZkClient makePath: /configs/conf1/stopwords.txt
   [junit4]   2> 96872 INFO  (TEST-CollectionsAPIDistributedZkTest.test-seed#[327C025A1D389D1D]) [    ] o.a.s.c.AbstractZkTestCase put /x1/jenkins/jenkins-slave/workspace/Lucene-Solr-NightlyTests-master/checkout/solr/core/src/test-files/solr/collection1/conf/protwords.txt to /configs/conf1/protwords.txt
   [junit4]   2> 96872 INFO  (TEST-CollectionsAPIDistributedZkTest.test-seed#[327C025A1D389D1D]) [    ] o.a.s.c.c.SolrZkClient makePath: /configs/conf1/protwords.txt
   [junit4]   2> 96880 INFO  (TEST-CollectionsAPIDistributedZkTest.test-seed#[327C025A1D389D1D]) [    ] o.a.s.c.AbstractZkTestCase put /x1/jenkins/jenkins-slave/workspace/Lucene-Solr-NightlyTests-master/checkout/solr/core/src/test-files/solr/collection1/conf/currency.xml to /configs/conf1/currency.xml
   [junit4]   2> 96880 INFO  (TEST-CollectionsAPIDistributedZkTest.test-seed#[327C025A1D389D1D]) [    ] o.a.s.c.c.SolrZkClient makePath: /configs/conf1/currency.xml
   [junit4]   2> 96890 INFO  (TEST-CollectionsAPIDistributedZkTest.test-seed#[327C025A1D389D1D]) [    ] o.a.s.c.AbstractZkTestCase put /x1/jenkins/jenkins-slave/workspace/Lucene-Solr-NightlyTests-master/checkout/solr/core/src/test-files/solr/collection1/conf/enumsConfig.xml to /configs/conf1/enumsConfig.xml
   [junit4]   2> 96890 INFO  (TEST-CollectionsAPIDistributedZkTest.test-seed#[327C025A1D389D1D]) [    ] o.a.s.c.c.SolrZkClient makePath: /configs/conf1/enumsConfig.xml
   [junit4]   2> 96899 INFO  (TEST-CollectionsAPIDistributedZkTest.test-seed#[327C025A1D389D1D]) [    ] o.a.s.c.AbstractZkTestCase put /x1/jenkins/jenkins-slave/workspace/Lucene-Solr-NightlyTests-master/checkout/solr/core/src/test-files/solr/collection1/conf/open-exchange-rates.json to /configs/conf1/open-exchange-rates.json
   [junit4]   2> 96899 INFO  (TEST-CollectionsAPIDistributedZkTest.test-seed#[327C025A1D389D1D]) [    ] o.a.s.c.c.SolrZkClient makePath: /configs/conf1/open-exchange-rates.json
   [junit4]   2> 96903 INFO  (TEST-CollectionsAPIDistributedZkTest.test-seed#[327C025A1D389D1D]) [    ] o.a.s.c.AbstractZkTestCase put /x1/jenkins/jenkins-slave/workspace/Lucene-Solr-NightlyTests-master/checkout/solr/core/src/test-files/solr/collection1/conf/mapping-ISOLatin1Accent.txt to /configs/conf1/mapping-ISOLatin1Accent.txt
   [junit4]   2> 96904 INFO  (TEST-CollectionsAPIDistributedZkTest.test-seed#[327C025A1D389D1D]) [    ] o.a.s.c.c.SolrZkClient makePath: /configs/conf1/mapping-ISOLatin1Accent.txt
   [junit4]   2> 96911 INFO  (TEST-CollectionsAPIDistributedZkTest.test-seed#[327C025A1D389D1D]) [    ] o.a.s.c.AbstractZkTestCase put /x1/jenkins/jenkins-slave/workspace/Lucene-Solr-NightlyTests-master/checkout/solr/core/src/test-files/solr/collection1/conf/old_synonyms.txt to /configs/conf1/old_synonyms.txt
   [junit4]   2> 96911 INFO  (TEST-CollectionsAPIDistributedZkTest.test-seed#[327C025A1D389D1D]) [    ] o.a.s.c.c.SolrZkClient makePath: /configs/conf1/old_synonyms.txt
   [junit4]   2> 96917 INFO  (TEST-CollectionsAPIDistributedZkTest.test-seed#[327C025A1D389D1D]) [    ] o.a.s.c.AbstractZkTestCase put /x1/jenkins/jenkins-slave/workspace/Lucene-Solr-NightlyTests-master/checkout/solr/core/src/test-files/solr/collection1/conf/synonyms.txt to /configs/conf1/synonyms.txt
   [junit4]   2> 96918 INFO  (TEST-CollectionsAPIDistributedZkTest.test-seed#[327C025A1D389D1D]) [    ] o.a.s.c.c.SolrZkClient makePath: /configs/conf1/synonyms.txt
   [junit4]   2> 96925 INFO  (TEST-CollectionsAPIDistributedZkTest.test-seed#[327C025A1D389D1D]) [    ] o.a.s.c.c.SolrZkClient Using default ZkCredentialsProvider
   [junit4]   2> 96939 INFO  (TEST-CollectionsAPIDistributedZkTest.test-seed#[327C025A1D389D1D]) [    ] o.a.s.c.c.ConnectionManager Waiting for client to connect to ZooKeeper
   [junit4]   2> 97066 INFO  (zkCallback-43-thread-1) [    ] o.a.s.c.c.ConnectionManager Watcher org.apache.solr.common.cloud.ConnectionManager@5109ce92 name:ZooKeeperConnection Watcher:127.0.0.1:40962 got event WatchedEvent state:SyncConnected type:None path:null path:null type:None
   [junit4]   2> 97071 INFO  (TEST-CollectionsAPIDistributedZkTest.test-seed#[327C025A1D389D1D]) [    ] o.a.s.c.c.ConnectionManager Client is connected to ZooKeeper
   [junit4]   2> 97071 INFO  (TEST-CollectionsAPIDistributedZkTest.test-seed#[327C025A1D389D1D]) [    ] o.a.s.c.c.SolrZkClient Using default ZkACLProvider
   [junit4]   2> 97071 INFO  (TEST-CollectionsAPIDistributedZkTest.test-seed#[327C025A1D389D1D]) [    ] o.a.s.c.c.SolrZkClient makePath: /solr
   [junit4]   2> 97085 INFO  (TEST-CollectionsAPIDistributedZkTest.test-seed#[327C025A1D389D1D]) [    ] o.a.s.c.c.SolrZkClient Using default ZkCredentialsProvider
   [junit4]   2> 97091 INFO  (TEST-CollectionsAPIDistributedZkTest.test-seed#[327C025A1D389D1D]) [    ] o.a.s.c.c.ConnectionManager Waiting for client to connect to ZooKeeper
   [junit4]   2> 97111 INFO  (zkCallback-44-thread-1) [    ] o.a.s.c.c.ConnectionManager Watcher org.apache.solr.common.cloud.ConnectionManager@308ccc60 name:ZooKeeperConnection Watcher:127.0.0.1:40962/solr got event WatchedEvent state:SyncConnected type:None path:null path:null type:None
   [junit4]   2> 97111 INFO  (TEST-CollectionsAPIDistributedZkTest.test-seed#[327C025A1D389D1D]) [    ] o.a.s.c.c.ConnectionManager Client is connected to ZooKeeper
   [junit4]   2> 97111 INFO  (TEST-CollectionsAPIDistributedZkTest.test-seed#[327C025A1D389D1D]) [    ] o.a.s.c.c.SolrZkClient Using default ZkACLProvider
   [junit4]   2> 97112 INFO  (TEST-CollectionsAPIDistributedZkTest.test-seed#[327C025A1D389D1D]) [    ] o.a.s.c.AbstractZkTestCase put /x1/jenkins/jenkins-slave/workspace/Lucene-Solr-NightlyTests-master/checkout/solr/core/src/test-files/solr/collection1/conf/solrconfig-tlog.xml to /configs/conf2/solrconfig.xml
   [junit4]   2> 97112 INFO  (TEST-CollectionsAPIDistributedZkTest.test-seed#[327C025A1D389D1D]) [    ] o.a.s.c.c.SolrZkClient makePath: /configs/conf2/solrconfig.xml
   [junit4]   2> 97151 INFO  (TEST-CollectionsAPIDistributedZkTest.test-seed#[327C025A1D389D1D]) [    ] o.a.s.c.AbstractZkTestCase put /x1/jenkins/jenkins-slave/workspace/Lucene-Solr-NightlyTests-master/checkout/solr/core/src/test-files/solr/collection1/conf/schema.xml to /configs/conf2/schema.xml
   [junit4]   2> 97151 INFO  (TEST-CollectionsAPIDistributedZkTest.test-seed#[327C025A1D389D1D]) [    ] o.a.s.c.c.SolrZkClient makePath: /configs/conf2/schema.xml
   [junit4]   2> 97195 INFO  (TEST-CollectionsAPIDistributedZkTest.test-seed#[327C025A1D389D1D]) [    ] o.a.s.c.AbstractZkTestCase put /x1/jenkins/jenkins-slave/workspace/Lucene-Solr-NightlyTests-master/checkout/solr/core/src/test-files/solr/collection1/conf/enumsConfig.xml to /configs/conf2/enumsConfig.xml
   [junit4]   2> 97195 INFO  (TEST-CollectionsAPIDistributedZkTest.test-seed#[327C025A1D389D1D]) [    ] o.a.s.c.c.SolrZkClient makePath: /configs/conf2/enumsConfig.xml
   [junit4]   2> 97227 INFO  (TEST-CollectionsAPIDistributedZkTest.test-seed#[327C025A1D389D1D]) [    ] o.a.s.c.AbstractZkTestCase put /x1/jenkins/jenkins-slave/workspace/Lucene-Solr-NightlyTests-master/checkout/solr/core/src/test-files/solr/collection1/conf/solrconfig.snippet.randomindexconfig.xml to /configs/conf2/solrconfig.snippet.randomindexconfig.xml
   [junit4]   2> 97227 INFO  (TEST-CollectionsAPIDistributedZkTest.test-seed#[327C025A1D389D1D]) [    ] o.a.s.c.c.SolrZkClient makePath: /configs/conf2/solrconfig.snippet.randomindexconfig.xml
   [junit4]   2> 97251 INFO  (TEST-CollectionsAPIDistributedZkTest.test-seed#[327C025A1D389D1D]) [    ] o.a.s.c.AbstractZkTestCase put /x1/jenkins/jenkins-slave/workspace/Lucene-Solr-NightlyTests-master/checkout/solr/core/src/test-files/solr/collection1/conf/stopwords.txt to /configs/conf2/stopwords.txt
   [junit4]   2> 97251 INFO  (TEST-CollectionsAPIDistributedZkTest.test-seed#[327C025A1D389D1D]) [    ] o.a.s.c.c.SolrZkClient makePath: /configs/conf2/stopwords.txt
   [junit4]   2> 97307 INFO  (TEST-CollectionsAPIDistributedZkTest.test-seed#[327C025A1D389D1D]) [    ] o.a.s.c.AbstractZkTestCase put /x1/jenkins/jenkins-slave/workspace/Lucene-Solr-NightlyTests-master/checkout/solr/core/src/test-files/solr/collection1/conf/protwords.txt to /configs/conf2/protwords.txt
   [junit4]   2> 97307 INFO  (TEST-CollectionsAPIDistributedZkTest.test-seed#[327C025A1D389D1D]) [    ] o.a.s.c.c.SolrZkClient makePath: /configs/conf2/protwords.txt
   [junit4]   2> 97343 INFO  (TEST-CollectionsAPIDistributedZkTest.test-seed#[327C025A1D389D1D]) [    ] o.a.s.c.AbstractZkTestCase put /x1/jenkins/jenkins-slave/workspace/Lucene-Solr-NightlyTests-master/checkout/solr/core/src/test-files/solr/collection1/conf/currency.xml to /configs/conf2/currency.xml
   [junit4]   2> 97343 INFO  (TEST-CollectionsAPIDistributedZkTest.test-seed#[327C025A1D389D1D]) [    ] o.a.s.c.c.SolrZkClient makePath: /configs/conf2/currency.xml
   [junit4]   2> 97379 INFO  (TEST-CollectionsAPIDistributedZkTest.test-seed#[327C025A1D389D1D]) [    ] o.a.s.c.AbstractZkTestCase put /x1/jenkins/jenkins-slave/workspace/Lucene-Solr-NightlyTests-master/checkout/solr/core/src/test-files/solr/collection1/conf/open-exchange-rates.json to /configs/conf2/open-exchange-rates.json
   [junit4]   2> 97379 INFO  (TEST-CollectionsAPIDistributedZkTest.test-seed#[327C025A1D389D1D]) [    ] o.a.s.c.c.SolrZkClient makePath: /configs/conf2/open-exchange-rates.json
   [junit4]   2> 97427 INFO  (TEST-CollectionsAPIDistributedZkTest.test-seed#[327C025A1D389D1D]) [    ] o.a.s.c.AbstractZkTestCase put /x1/jenkins/jenkins-slave/workspace/Lucene-Solr-NightlyTests-master/checkout/solr/core/src/test-files/solr/collection1/conf/mapping-ISOLatin1Accent.txt to /configs/conf2/mapping-ISOLatin1Accent.txt
   [junit4]   2> 97427 INFO  (TEST-CollectionsAPIDistributedZkTest.test-seed#[327C025A1D389D1D]) [    ] o.a.s.c.c.SolrZkClient makePath: /configs/conf2/mapping-ISOLatin1Accent.txt
   [junit4]   2> 97519 INFO  (TEST-CollectionsAPIDistributedZkTest.test-seed#[327C025A1D389D1D]) [    ] o.a.s.c.AbstractZkTestCase put /x1/jenkins/jenkins-slave/workspace/Lucene-Solr-NightlyTests-master/checkout/solr/core/src/test-files/solr/collection1/conf/old_synonyms.txt to /configs/conf2/old_synonyms.txt
   [junit4]   2> 97519 INFO  (TEST-CollectionsAPIDistributedZkTest.test-seed#[327C025A1D389D1D]) [    ] o.a.s.c.c.SolrZkClient makePath: /configs/conf2/old_synonyms.txt
   [junit4]   2> 97575 INFO  (TEST-CollectionsAPIDistributedZkTest.test-seed#[327C025A1D389D1D]) [    ] o.a.s.c.AbstractZkTestCase put /x1/jenkins/jenkins-slave/workspace/Lucene-Solr-NightlyTests-master/checkout/solr/core/src/test-files/solr/collection1/conf/synonyms.txt to /configs/conf2/synonyms.txt
   [junit4]   2> 97575 INFO  (TEST-CollectionsAPIDistributedZkTest.test-seed#[327C025A1D389D1D]) [    ] o.a.s.c.c.SolrZkClient makePath: /configs/conf2/synonyms.txt
   [junit4]   2> 97627 INFO  (TEST-CollectionsAPIDistributedZkTest.test-seed#[327C025A1D389D1D]) [    ] o.a.s.c.AbstractZkTestCase put /x1/jenkins/jenkins-slave/workspace/Lucene-Solr-NightlyTests-master/checkout/solr/core/src/test-files/solr/collection1/conf/elevate.xml to /configs/conf2/elevate.xml
   [junit4]   2> 97627 INFO  (TEST-CollectionsAPIDistributedZkTest.test-seed#[327C025A1D389D1D]) [    ] o.a.s.c.c.SolrZkClient makePath: /configs/conf2/elevate.xml
   [junit4]   2> 97800 INFO  (TEST-CollectionsAPIDistributedZkTest.test-seed#[327C025A1D389D1D]) [    ] o.a.s.SolrTestCaseJ4 Writing core.properties file to /x1/jenkins/jenkins-slave/workspace/Lucene-Solr-NightlyTests-master/checkout/solr/build/solr-core/test/J1/temp/solr.cloud.CollectionsAPIDistributedZkTest_327C025A1D389D1D-001/control-001/cores/collection1
   [junit4]   2> 97809 INFO  (TEST-CollectionsAPIDistributedZkTest.test-seed#[327C025A1D389D1D]) [    ] o.e.j.s.Server jetty-9.3.8.v20160314
   [junit4]   2> 97814 INFO  (TEST-CollectionsAPIDistributedZkTest.test-seed#[327C025A1D389D1D]) [    ] o.e.j.s.h.ContextHandler Started o.e.j.s.ServletContextHandler@639d645b{/,null,AVAILABLE}
   [junit4]   2> 97831 INFO  (TEST-CollectionsAPIDistributedZkTest.test-seed#[327C025A1D389D1D]) [    ] o.e.j.s.ServerConnector Started ServerConnector@7f09d68f{HTTP/1.1,[http/1.1]}{127.0.0.1:52467}
   [junit4]   2> 97831 INFO  (TEST-CollectionsAPIDistributedZkTest.test-seed#[327C025A1D389D1D]) [    ] o.e.j.s.Server Started @105059ms
   [junit4]   2> 97831 INFO  (TEST-CollectionsAPIDistributedZkTest.test-seed#[327C025A1D389D1D]) [    ] o.a.s.c.s.e.JettySolrRunner Jetty properties: {solr.data.dir=/x1/jenkins/jenkins-slave/workspace/Lucene-Solr-NightlyTests-master/checkout/solr/build/solr-core/test/J1/temp/solr.cloud.CollectionsAPIDistributedZkTest_327C025A1D389D1D-001/tempDir-001/control/data, hostContext=/, hostPort=52467, coreRootDirectory=/x1/jenkins/jenkins-slave/workspace/Lucene-Solr-NightlyTests-master/checkout/solr/build/solr-core/test/J1/temp/solr.cloud.CollectionsAPIDistributedZkTest_327C025A1D389D1D-001/control-001/cores}
   [junit4]   2> 97831 INFO  (TEST-CollectionsAPIDistributedZkTest.test-seed#[327C025A1D389D1D]) [    ] o.a.s.s.SolrDispatchFilter SolrDispatchFilter.init(): sun.misc.Launcher$AppClassLoader@73d16e93
   [junit4]   2> 97831 INFO  (TEST-CollectionsAPIDistributedZkTest.test-seed#[327C025A1D389D1D]) [    ] o.a.s.c.SolrResourceLoader new SolrResourceLoader for directory: '/x1/jenkins/jenkins-slave/workspace/Lucene-Solr-NightlyTests-master/checkout/solr/build/solr-core/test/J1/temp/solr.cloud.CollectionsAPIDistributedZkTest_327C025A1D389D1D-001/control-001'
   [junit4]   2> 97831 INFO  (TEST-CollectionsAPIDistributedZkTest.test-seed#[327C025A1D389D1D]) [    ] o.a.s.c.SolrResourceLoader JNDI not configured for solr (NoInitialContextEx)
   [junit4]   2> 97831 INFO  (TEST-CollectionsAPIDistributedZkTest.test-seed#[327C025A1D389D1D]) [    ] o.a.s.c.SolrResourceLoader solr home defaulted to 'solr/' (could not find system property or JNDI)
   [junit4]   2> 97832 INFO  (TEST-CollectionsAPIDistributedZkTest.test-seed#[327C025A1D389D1D]) [    ] o.a.s.c.c.SolrZkClient Using default ZkCredentialsProvider
   [junit4]   2> 97851 INFO  (TEST-CollectionsAPIDistributedZkTest.test-seed#[327C025A1D389D1D]) [    ] o.a.s.c.c.ConnectionManager Waiting for client to connect to ZooKeeper
   [junit4]   2> 97887 INFO  (zkCallback-45-thread-1) [    ] o.a.s.c.c.ConnectionManager Watcher org.apache.solr.common.cloud.ConnectionManager@71354b85 name:ZooKeeperConnection Watcher:127.0.0.1:40962/solr got event WatchedEvent state:SyncConnected type:None path:null path:null type:None
   [junit4]   2> 97887 INFO  (TEST-CollectionsAPIDistributedZkTest.test-seed#[327C025A1D389D1D]) [    ] o.a.s.c.c.ConnectionManager Client is connected to ZooKeeper
   [junit4]   2> 97887 INFO  (TEST-CollectionsAPIDistributedZkTest.test-seed#[327C025A1D389D1D]) [    ] o.a.s.c.c.SolrZkClient Using default ZkACLProvider
   [junit4]   2> 97899 INFO  (TEST-CollectionsAPIDistributedZkTest.test-seed#[327C025A1D389D1D]) [    ] o.a.s.s.SolrDispatchFilter Loading solr.xml from SolrHome (not found in ZooKeeper)
   [junit4]   2> 97899 INFO  (TEST-CollectionsAPIDistributedZkTest.test-seed#[327C025A1D389D1D]) [    ] o.a.s.c.SolrXmlConfig Loading container configuration from /x1/jenkins/jenkins-slave/workspace/Lucene-Solr-NightlyTests-master/checkout/solr/build/solr-core/test/J1/temp/solr.cloud.CollectionsAPIDistributedZkTest_327C025A1D389D1D-001/control-001/solr.xml
   [junit4]   2> 97918 INFO  (TEST-CollectionsAPIDistributedZkTest.test-seed#[327C025A1D389D1D]) [    ] o.a.s.c.CorePropertiesLocator Config-defined core root directory: /x1/jenkins/jenkins-slave/workspace/Lucene-Solr-NightlyTests-master/checkout/solr/build/solr-core/test/J1/temp/solr.cloud.CollectionsAPIDistributedZkTest_327C025A1D389D1D-001/control-001/cores
   [junit4]   2> 97918 INFO  (TEST-CollectionsAPIDistributedZkTest.test-seed#[327C025A1D389D1D]) [    ] o.a.s.c.CoreContainer New CoreContainer 1565325419
   [junit4]   2> 97918 INFO  (TEST-CollectionsAPIDistributedZkTest.test-seed#[327C025A1D389D1D]) [    ] o.a.s.c.CoreContainer Loading cores into CoreContainer [instanceDir=/x1/jenkins/jenkins-slave/workspace/Lucene-Solr-NightlyTests-master/checkout/solr/build/solr-core/test/J1/temp/solr.cloud.CollectionsAPIDistributedZkTest_327C025A1D389D1D-001/control-001]
   [junit4]   2> 97919 WARN  (TEST-CollectionsAPIDistributedZkTest.test-seed#[327C025A1D389D1D]) [    ] o.a.s.c.CoreContainer Couldn't add files from /x1/jenkins/jenkins-slave/workspace/Lucene-Solr-NightlyTests-master/checkout/solr/build/solr-core/test/J1/temp/solr.cloud.CollectionsAPIDistributedZkTest_327C025A1D389D1D-001/control-001/lib to classpath: /x1/jenkins/jenkins-slave/workspace/Lucene-Solr-NightlyTests-master/checkout/solr/build/solr-core/test/J1/temp/solr.cloud.CollectionsAPIDistributedZkTest_327C025A1D389D1D-001/control-001/lib
   [junit4]   2> 97919 INFO  (TEST-CollectionsAPIDistributedZkTest.test-seed#[327C025A1D389D1D]) [    ] o.a.s.h.c.HttpShardHandlerFactory created with socketTimeout : 90000,urlScheme : ,connTimeout : 15000,maxConnectionsPerHost : 20,maxConnections : 10000,corePoolSize : 0,maximumPoolSize : 2147483647,maxThreadIdleTime : 5,sizeOfQueue : -1,fairnessPolicy : false,
   [junit4]   2> 97929 INFO  (TEST-CollectionsAPIDistributedZkTest.test-seed#[327C025A1D389D1D]) [    ] o.a.s.u.UpdateShardHandler Created UpdateShardHandler HTTP client with params: socketTimeout=340000&connTimeout=45000&maxConnections=100000&maxConnectionsPerHost=100000
   [junit4]   2> 97929 INFO  (TEST-CollectionsAPIDistributedZkTest.test-seed#[327C025A1D389D1D]) [    ] o.a.s.l.LogWatcher SLF4J impl is org.slf4j.impl.Log4jLoggerFactory
   [junit4]   2> 97929 INFO  (TEST-CollectionsAPIDistributedZkTest.test-seed#[327C025A1D389D1D]) [    ] o.a.s.l.LogWatcher Registering Log Listener [Log4j (org.slf4j.impl.Log4jLoggerFactory)]
   [junit4]   2> 97929 INFO  (TEST-CollectionsAPIDistributedZkTest.test-seed#[327C025A1D389D1D]) [    ] o.a.s.c.ZkContainer Zookeeper client=127.0.0.1:40962/solr
   [junit4]   2> 98129 INFO  (TEST-CollectionsAPIDistributedZkTest.test-seed#[327C025A1D389D1D]) [    ] o.a.s.c.ZkController zkHost includes chroot
   [junit4]   2> 98129 INFO  (TEST-CollectionsAPIDistributedZkTest.test-seed#[327C025A1D389D1D]) [    ] o.a.s.c.c.SolrZkClient Using default ZkCredentialsProvider
   [junit4]   2> 98130 INFO  (TEST-CollectionsAPIDistributedZkTest.test-seed#[327C025A1D389D1D]) [    ] o.a.s.c.c.ConnectionManager Waiting for client to connect to ZooKeeper
   [junit4]   2> 98135 INFO  (zkCallback-48-thread-1) [    ] o.a.s.c.c.ConnectionManager Watcher org.apache.solr.common.cloud.ConnectionManager@1f7537 name:ZooKeeperConnection Watcher:127.0.0.1:40962 got event WatchedEvent state:SyncConnected type:None path:null path:null type:None
   [junit4]   2> 98135 INFO  (TEST-CollectionsAPIDistributedZkTest.test-seed#[327C025A1D389D1D]) [    ] o.a.s.c.c.ConnectionManager Client is connected to ZooKeeper
   [junit4]   2> 98136 INFO  (TEST-CollectionsAPIDistributedZkTest.test-seed#[327C025A1D389D1D]) [    ] o.a.s.c.c.SolrZkClient Using default ZkACLProvider
   [junit4]   2> 98150 INFO  (TEST-CollectionsAPIDistributedZkTest.test-seed#[327C025A1D389D1D]) [n:127.0.0.1:52467_    ] o.a.s.c.ZkController Added new OnReconnect listener org.apache.solr.cloud.ZkController$$Lambda$108/20832659@798a2508
   [junit4]   2> 98155 INFO  (TEST-CollectionsAPIDistributedZkTest.test-seed#[327C025A1D389D1D]) [n:127.0.0.1:52467_    ] o.a.s.c.c.ConnectionManager Waiting for client to connect to ZooKeeper
   [junit4]   2> 98175 INFO  (zkCallback-49-thread-1-processing-n:127.0.0.1:52467_) [n:127.0.0.1:52467_    ] o.a.s.c.c.ConnectionManager Watcher org.apache.solr.common.cloud.ConnectionManager@6a22a12e name:ZooKeeperConnection Watcher:127.0.0.1:40962/solr got event WatchedEvent state:SyncConnected type:None path:null path:null type:None
   [junit4]   2> 98175 INFO  (TEST-CollectionsAPIDistributedZkTest.test-seed#[327C025A1D389D1D]) [n:127.0.0.1:52467_    ] o.a.s.c.c.ConnectionManager Client is connected to ZooKeeper
   [junit4]   2> 98199 INFO  (TEST-CollectionsAPIDistributedZkTest.test-seed#[327C025A1D389D1D]) [n:127.0.0.1:52467_    ] o.a.s.c.c.SolrZkClient makePath: /overseer/queue
   [junit4]   2> 98228 INFO  (TEST-CollectionsAPIDistributedZkTest.test-seed#[327C025A1D389D1D]) [n:127.0.0.1:52467_    ] o.a.s.c.c.SolrZkClient makePath: /overseer/collection-queue-work
   [junit4]   2> 98247 INFO  (TEST-CollectionsAPIDistributedZkTest.test-seed#[327C025A1D389D1D]) [n:127.0.0.1:52467_    ] o.a.s.c.c.SolrZkClient makePath: /overseer/collection-map-running
   [junit4]   2> 98259 INFO  (TEST-CollectionsAPIDistributedZkTest.test-seed#[327C025A1D389D1D]) [n:127.0.0.1:52467_    ] o.a.s.c.c.SolrZkClient makePath: /overseer/collection-map-completed
   [junit4]   2> 98262 INFO  (TEST-CollectionsAPIDistributedZkTest.test-seed#[327C025A1D389D1D]) [n:127.0.0.1:52467_    ] o.a.s.c.c.SolrZkClient makePath: /overseer/collection-map-failure
   [junit4]   2> 98284 INFO  (TEST-CollectionsAPIDistributedZkTest.test-seed#[327C025A1D389D1D]) [n:127.0.0.1:52467_    ] o.a.s.c.c.SolrZkClient makePath: /live_nodes
   [junit4]   2> 98287 INFO  (TEST-CollectionsAPIDistributedZkTest.test-seed#[327C025A1D389D1D]) [n:127.0.0.1:52467_    ] o.a.s.c.c.SolrZkClient makePath: /aliases.json
   [junit4]   2> 98289 INFO  (TEST-CollectionsAPIDistributedZkTest.test-seed#[327C025A1D389D1D]) [n:127.0.0.1:52467_    ] o.a.s.c.c.SolrZkClient makePath: /clusterstate.json
   [junit4]   2> 98291 INFO  (TEST-CollectionsAPIDistributedZkTest.test-seed#[327C025A1D389D1D]) [n:127.0.0.1:52467_    ] o.a.s.c.c.SolrZkClient makePath: /security.json
   [junit4]   2> 98293 INFO  (TEST-CollectionsAPIDistributedZkTest.test-seed#[327C025A1D389D1D]) [n:127.0.0.1:52467_    ] o.a.s.c.c.ZkStateReader Updating cluster state from ZooKeeper... 
   [junit4]   2> 98304 INFO  (TEST-CollectionsAPIDistributedZkTest.test-seed#[327C025A1D389D1D]) [n:127.0.0.1:52467_    ] o.a.s.c.c.ZkStateReader Loaded empty cluster properties
   [junit4]   2> 98314 INFO  (TEST-CollectionsAPIDistributedZkTest.test-seed#[327C025A1D389D1D]) [n:127.0.0.1:52467_    ] o.a.s.c.c.ZkStateReader Updated live nodes from ZooKeeper... (0) -> (0)
   [junit4]   2> 98366 INFO  (TEST-CollectionsAPIDistributedZkTest.test-seed#[327C025A1D389D1D]) [n:127.0.0.1:52467_    ] o.a.s.c.c.SolrZkClient makePath: /overseer_elect
   [junit4]   2> 98368 INFO  (TEST-CollectionsAPIDistributedZkTest.test-seed#[327C025A1D389D1D]) [n:127.0.0.1:52467_    ] o.a.s.c.c.SolrZkClient makePath: /overseer_elect/election
   [junit4]   2> 98371 INFO  (TEST-CollectionsAPIDistributedZkTest.test-seed#[327C025A1D389D1D]) [n:127.0.0.1:52467_    ] o.a.s.c.Overseer Overseer (id=null) closing
   [junit4]   2> 98374 INFO  (TEST-CollectionsAPIDistributedZkTest.test-seed#[327C025A1D389D1D]) [n:127.0.0.1:52467_    ] o.a.s.c.LeaderElector Joined leadership election with path: /overseer_elect/election/96560126554013702-127.0.0.1:52467_-n_0000000000
   [junit4]   2> 98378 INFO  (TEST-CollectionsAPIDistributedZkTest.test-seed#[327C025A1D389D1D]) [n:127.0.0.1:52467_    ] o.a.s.c.OverseerElectionContext I am going to be the leader 127.0.0.1:52467_
   [junit4]   2> 98378 INFO  (TEST-CollectionsAPIDistributedZkTest.test-seed#[327C025A1D389D1D]) [n:127.0.0.1:52467_    ] o.a.s.c.c.SolrZkClient makePath: /overseer_elect/leader
   [junit4]   2> 98431 INFO  (TEST-CollectionsAPIDistributedZkTest.test-seed#[327C025A1D389D1D]) [n:127.0.0.1:52467_    ] o.a.s.c.Overseer Overseer (id=96560126554013702-127.0.0.1:52467_-n_0000000000) starting
   [junit4]   2> 98503 INFO  (TEST-CollectionsAPIDistributedZkTest.test-seed#[327C025A1D389D1D]) [n:127.0.0.1:52467_    ] o.a.s.c.c.SolrZkClient makePath: /overseer/queue-work
   [junit4]   2> 98790 INFO  (TEST-CollectionsAPIDistributedZkTest.test-seed#[327C025A1D389D1D]) [n:127.0.0.1:52467_    ] o.a.s.c.OverseerAutoReplicaFailoverThread Starting OverseerAutoReplicaFailoverThread autoReplicaFailoverWorkLoopDelay=10000 autoReplicaFailoverWaitAfterExpiration=10000 autoReplicaFailoverBadNodeExpiration=60000
   [junit4]   2> 98800 INFO  (OverseerCollectionConfigSetProcessor-96560126554013702-127.0.0.1:52467_-n_0000000000) [n:127.0.0.1:52467_    ] o.a.s.c.OverseerTaskProcessor Process current queue of overseer operations
   [junit4]   2> 98799 INFO  (OverseerStateUpdate-96560126554013702-127.0.0.1:52467_-n_0000000000) [n:127.0.0.1:52467_    ] o.a.s.c.Overseer Starting to work on the main queue
   [junit4]   2> 98808 INFO  (TEST-CollectionsAPIDistributedZkTest.test-seed#[327C025A1D389D1D]) [n:127.0.0.1:52467_    ] o.a.s.c.ZkController Register node as live in ZooKeeper:/live_nodes/127.0.0.1:52467_
   [junit4]   2> 98808 INFO  (TEST-CollectionsAPIDistributedZkTest.test-seed#[327C025A1D389D1D]) [n:127.0.0.1:52467_    ] o.a.s.c.c.SolrZkClient makePath: /live_nodes/127.0.0.1:52467_
   [junit4]   2> 98827 INFO  (zkCallback-49-thread-1-processing-n:127.0.0.1:52467_) [n:127.0.0.1:52467_    ] o.a.s.c.c.ZkStateReader A live node change: [WatchedEvent state:SyncConnected type:NodeChildrenChanged path:/live_nodes], has occurred - updating... (live nodes size: [1])
   [junit4]   2> 98826 INFO  (OverseerStateUpdate-96560126554013702-127.0.0.1:52467_-n_0000000000) [n:127.0.0.1:52467_    ] o.a.s.c.c.ZkStateReader Updated live nodes from ZooKeeper... (0) -> (1)
   [junit4]   2> 98841 INFO  (zkCallback-49-thread-1-processing-n:127.0.0.1:52467_) [n:127.0.0.1:52467_    ] o.a.s.c.c.ZkStateReader Updated live nodes from ZooKeeper... (1) -> (1)
   [junit4]   2> 99096 INFO  (TEST-CollectionsAPIDistributedZkTest.test-seed#[327C025A1D389D1D]) [n:127.0.0.1:52467_    ] o.a.s.c.CoreContainer Security conf doesn't exist. Skipping setup for authorization module.
   [junit4]   2> 99096 INFO  (TEST-CollectionsAPIDistributedZkTest.test-seed#[327C025A1D389D1D]) [n:127.0.0.1:52467_    ] o.a.s.c.CoreContainer No authentication plugin used.
   [junit4]   2> 99102 INFO  (TEST-CollectionsAPIDistributedZkTest.test-seed#[327C025A1D389D1D]) [n:127.0.0.1:52467_    ] o.a.s.c.CorePropertiesLocator Looking for core definitions underneath /x1/jenkins/jenkins-slave/workspace/Lucene-Solr-NightlyTests-master/checkout/solr/build/solr-core/test/J1/temp/solr.cloud.CollectionsAPIDistributedZkTest_327C025A1D389D1D-001/control-001/cores
   [junit4]   2> 99115 INFO  (TEST-CollectionsAPIDistributedZkTest.test-seed#[327C025A1D389D1D]) [n:127.0.0.1:52467_    ] o.a.s.c.CoreDescriptor Created CoreDescriptor: {name=collection1, config=solrconfig.xml, transient=false, schema=schema.xml, loadOnStartup=true, configSetProperties=configsetprops.

[...truncated too long message...]

lassicSimilarity, locale=sr-Latn-RS, timezone=America/Virgin
   [junit4]   2> NOTE: Linux 3.13.0-85-generic amd64/Oracle Corporation 1.8.0_102 (64-bit)/cpus=4,threads=1,free=228931416,total=522190848
   [junit4]   2> NOTE: All tests run in this JVM: [TestObjectReleaseTracker, StatsComponentTest, MultiThreadedOCPTest, PluginInfoTest, TestMergePolicyConfig, StatelessScriptUpdateProcessorFactoryTest, TestGroupingSearch, SolrCoreCheckLockOnStartupTest, TestSolrXml, TestPostingsSolrHighlighter, SuggesterTSTTest, TestManagedSynonymFilterFactory, TestFreeTextSuggestions, DistributedFacetPivotSmallTest, FullSolrCloudDistribCmdsTest, TestAnalyzeInfixSuggestions, LukeRequestHandlerTest, TestDistributedMissingSort, NoCacheHeaderTest, DeleteStatusTest, TestDistribIDF, CircularListTest, AutoCommitTest, TestLFUCache, SuggesterTest, TestSolrQueryParserResource, BlockJoinFacetDistribTest, AddSchemaFieldsUpdateProcessorFactoryTest, SolrPluginUtilsTest, GraphQueryTest, DirectUpdateHandlerTest, CloneFieldUpdateProcessorFactoryTest, TolerantUpdateProcessorTest, TestSubQueryTransformerCrossCore, QueryParsingTest, DistribJoinFromCollectionTest, FieldAnalysisRequestHandlerTest, BlockDirectoryTest, TestSolrDeletionPolicy1, TestSchemaManager, ZkStateReaderTest, TestUninvertingReader, TestFieldResource, TestFilteredDocIdSet, TestExceedMaxTermLength, TestXIncludeConfig, SpatialHeatmapFacetsTest, EnumFieldTest, TestExtendedDismaxParser, DistributedQueryComponentOptimizationTest, TestSort, JSONWriterTest, TestPhraseSuggestions, InfoHandlerTest, TestComplexPhraseQParserPlugin, TestStressUserVersions, TestTestInjection, CoreAdminHandlerTest, BasicDistributedZk2Test, DocValuesMultiTest, TestOnReconnectListenerSupport, DeleteNodeTest, SharedFSAutoReplicaFailoverTest, CustomCollectionTest, TestLegacyFieldCache, TestCloudManagedSchema, TestTolerantUpdateProcessorCloud, TestConfigSetImmutable, UnloadDistributedZkTest, HdfsCollectionsAPIDistributedZkTest, CoreAdminCreateDiscoverTest, TimeZoneUtilsTest, DOMUtilTest, TestSolrCloudWithSecureImpersonation, HdfsThreadLeakTest, FieldMutatingUpdateProcessorTest, TestSlowCompositeReaderWrapper, TestSearcherReuse, HdfsWriteToMultipleCollectionsTest, ConfigSetsAPITest, RuleEngineTest, TestPerFieldSimilarityWithDefaultOverride, SSLMigrationTest, OpenExchangeRatesOrgProviderTest, SuggesterWFSTTest, SolrCLIZkUtilsTest, PrimitiveFieldTypeTest, TestIntervalFaceting, BitVectorTest, ChangedSchemaMergeTest, ResponseLogComponentTest, TestDynamicFieldCollectionResource, TestRequestStatusCollectionAPI, HdfsLockFactoryTest, TestZkChroot, TestQueryWrapperFilter, TestSchemaVersionResource, DirectoryFactoryTest, TestStressReorder, TestFieldCacheReopen, BadIndexSchemaTest, TestClassicSimilarityFactory, ChaosMonkeySafeLeaderTest, SyncSliceTest, OpenCloseCoreStressTest, OverseerTest, LeaderElectionIntegrationTest, ShardRoutingTest, RecoveryZkTest, TestRandomFaceting, LeaderElectionTest, ZkSolrClientTest, TestDistributedSearch, PreAnalyzedFieldTest, TestSystemIdResolver, PrimUtilsTest, RAMDirectoryFactoryTest, TestSolrJ, TestLRUCache, TestUtils, ZkNodePropsTest, SliceStateTest, FileUtilsTest, TestRTGBase, CursorPagingTest, DistributedIntervalFacetingTest, AsyncMigrateRouteKeyTest, CleanupOldIndexTest, CloudExitableDirectoryReaderTest, CollectionReloadTest, CollectionStateFormat2Test, CollectionsAPIAsyncDistributedZkTest, ConcurrentDeleteAndCreateCollectionTest]
   [junit4]   2> NOTE: download the large Jenkins line-docs file by running 'ant get-jenkins-line-docs' in the lucene directory.
   [junit4]   2> NOTE: reproduce with: ant test  -Dtestcase=ConcurrentDeleteAndCreateCollectionTest -Dtests.seed=327C025A1D389D1D -Dtests.multiplier=2 -Dtests.nightly=true -Dtests.slow=true -Dtests.linedocsfile=/home/jenkins/jenkins-slave/workspace/Lucene-Solr-NightlyTests-master/test-data/enwiki.random.lines.txt -Dtests.locale=sr-Latn-RS -Dtests.timezone=America/Virgin -Dtests.asserts=true -Dtests.file.encoding=US-ASCII
   [junit4] ERROR   0.00s J2 | ConcurrentDeleteAndCreateCollectionTest (suite) <<<
   [junit4]    > Throwable #1: java.lang.AssertionError: ObjectTracker found 10 object(s) that were not released!!! [InternalHttpClient, InternalHttpClient, InternalHttpClient, InternalHttpClient, InternalHttpClient, InternalHttpClient, InternalHttpClient, InternalHttpClient, InternalHttpClient, InternalHttpClient]
   [junit4]    > 	at __randomizedtesting.SeedInfo.seed([327C025A1D389D1D]:0)
   [junit4]    > 	at org.apache.solr.SolrTestCaseJ4.teardownTestCases(SolrTestCaseJ4.java:257)
   [junit4]    > 	at java.lang.Thread.run(Thread.java:745)Throwable #2: com.carrotsearch.randomizedtesting.ThreadLeakError: 10 threads leaked from SUITE scope at org.apache.solr.cloud.ConcurrentDeleteAndCreateCollectionTest: 
   [junit4]    >    1) Thread[id=73355, name=Connection evictor, state=TIMED_WAITING, group=TGRP-ConcurrentDeleteAndCreateCollectionTest]
   [junit4]    >         at java.lang.Thread.sleep(Native Method)
   [junit4]    >         at org.apache.http.impl.client.IdleConnectionEvictor$1.run(IdleConnectionEvictor.java:66)
   [junit4]    >         at java.lang.Thread.run(Thread.java:745)
   [junit4]    >    2) Thread[id=73350, name=Connection evictor, state=TIMED_WAITING, group=TGRP-ConcurrentDeleteAndCreateCollectionTest]
   [junit4]    >         at java.lang.Thread.sleep(Native Method)
   [junit4]    >         at org.apache.http.impl.client.IdleConnectionEvictor$1.run(IdleConnectionEvictor.java:66)
   [junit4]    >         at java.lang.Thread.run(Thread.java:745)
   [junit4]    >    3) Thread[id=73340, name=Connection evictor, state=TIMED_WAITING, group=TGRP-ConcurrentDeleteAndCreateCollectionTest]
   [junit4]    >         at java.lang.Thread.sleep(Native Method)
   [junit4]    >         at org.apache.http.impl.client.IdleConnectionEvictor$1.run(IdleConnectionEvictor.java:66)
   [junit4]    >         at java.lang.Thread.run(Thread.java:745)
   [junit4]    >    4) Thread[id=73330, name=Connection evictor, state=TIMED_WAITING, group=TGRP-ConcurrentDeleteAndCreateCollectionTest]
   [junit4]    >         at java.lang.Thread.sleep(Native Method)
   [junit4]    >         at org.apache.http.impl.client.IdleConnectionEvictor$1.run(IdleConnectionEvictor.java:66)
   [junit4]    >         at java.lang.Thread.run(Thread.java:745)
   [junit4]    >    5) Thread[id=73335, name=Connection evictor, state=TIMED_WAITING, group=TGRP-ConcurrentDeleteAndCreateCollectionTest]
   [junit4]    >         at java.lang.Thread.sleep(Native Method)
   [junit4]    >         at org.apache.http.impl.client.IdleConnectionEvictor$1.run(IdleConnectionEvictor.java:66)
   [junit4]    >         at java.lang.Thread.run(Thread.java:745)
   [junit4]    >    6) Thread[id=73320, name=Connection evictor, state=TIMED_WAITING, group=TGRP-ConcurrentDeleteAndCreateCollectionTest]
   [junit4]    >         at java.lang.Thread.sleep(Native Method)
   [junit4]    >         at org.apache.http.impl.client.IdleConnectionEvictor$1.run(IdleConnectionEvictor.java:66)
   [junit4]    >         at java.lang.Thread.run(Thread.java:745)
   [junit4]    >    7) Thread[id=73325, name=Connection evictor, state=TIMED_WAITING, group=TGRP-ConcurrentDeleteAndCreateCollectionTest]
   [junit4]    >         at java.lang.Thread.sleep(Native Method)
   [junit4]    >         at org.apache.http.impl.client.IdleConnectionEvictor$1.run(IdleConnectionEvictor.java:66)
   [junit4]    >         at java.lang.Thread.run(Thread.java:745)
   [junit4]    >    8) Thread[id=73315, name=Connection evictor, state=TIMED_WAITING, group=TGRP-ConcurrentDeleteAndCreateCollectionTest]
   [junit4]    >         at java.lang.Thread.sleep(Native Method)
   [junit4]    >         at org.apache.http.impl.client.IdleConnectionEvictor$1.run(IdleConnectionEvictor.java:66)
   [junit4]    >         at java.lang.Thread.run(Thread.java:745)
   [junit4]    >    9) Thread[id=73345, name=Connection evictor, state=TIMED_WAITING, group=TGRP-ConcurrentDeleteAndCreateCollectionTest]
   [junit4]    >         at java.lang.Thread.sleep(Native Method)
   [junit4]    >         at org.apache.http.impl.client.IdleConnectionEvictor$1.run(IdleConnectionEvictor.java:66)
   [junit4]    >         at java.lang.Thread.run(Thread.java:745)
   [junit4]    >   10) Thread[id=73360, name=Connection evictor, state=TIMED_WAITING, group=TGRP-ConcurrentDeleteAndCreateCollectionTest]
   [junit4]    >         at java.lang.Thread.sleep(Native Method)
   [junit4]    >         at org.apache.http.impl.client.IdleConnectionEvictor$1.run(IdleConnectionEvictor.java:66)
   [junit4]    >         at java.lang.Thread.run(Thread.java:745)
   [junit4]    > 	at __randomizedtesting.SeedInfo.seed([327C025A1D389D1D]:0)
   [junit4] Completed [452/631 (7!)] on J2 in 88.80s, 2 tests, 1 failure, 1 error <<< FAILURES!

[...truncated 625 lines...]
   [junit4] JVM J2: stdout was not empty, see: /x1/jenkins/jenkins-slave/workspace/Lucene-Solr-NightlyTests-master/checkout/solr/build/solr-core/test/temp/junit4-J2-20160909_030821_326.sysout
   [junit4] >>> JVM J2 emitted unexpected output (verbatim) ----
   [junit4] java.lang.OutOfMemoryError: GC overhead limit exceeded
   [junit4] Dumping heap to /x1/jenkins/jenkins-slave/workspace/Lucene-Solr-NightlyTests-master/checkout/heapdumps/java_pid24515.hprof ...
   [junit4] Heap dump file created [487528590 bytes in 2.761 secs]
   [junit4] <<< JVM J2: EOF ----

[...truncated 11040 lines...]
BUILD FAILED
/x1/jenkins/jenkins-slave/workspace/Lucene-Solr-NightlyTests-master/checkout/build.xml:771: The following error occurred while executing this line:
/x1/jenkins/jenkins-slave/workspace/Lucene-Solr-NightlyTests-master/checkout/build.xml:715: Some of the tests produced a heap dump, but did not fail. Maybe a suppressed OutOfMemoryError? Dumps created:
* java_pid24515.hprof

Total time: 400 minutes 4 seconds
Build step 'Invoke Ant' marked build as failure
Archiving artifacts
Recording test results
Email was triggered for: Failure - Any
Sending email for trigger: Failure - Any




Mime
View raw message