lucene-dev mailing list archives

Site index · List index
Message view « Date » · « Thread »
Top « Date » · « Thread »
From Policeman Jenkins Server <jenk...@thetaphi.de>
Subject [JENKINS] Lucene-Solr-master-Solaris (64bit/jdk1.8.0) - Build # 842 - Still Unstable!
Date Mon, 12 Sep 2016 22:03:24 GMT
Build: http://jenkins.thetaphi.de/job/Lucene-Solr-master-Solaris/842/
Java: 64bit/jdk1.8.0 -XX:+UseCompressedOops -XX:+UseG1GC

2 tests failed.
FAILED:  org.apache.solr.core.TestDynamicLoading.testDynamicLoading

Error Message:
Could not get expected value  'X val' for path 'x' full output: {   "responseHeader":{     "status":0,     "QTime":0},   "params":{"wt":"json"},   "context":{     "webapp":"/y_g/ad",     "path":"/test1",     "httpMethod":"GET"},   "class":"org.apache.solr.core.BlobStoreTestRequestHandler",   "x":null},  from server:  null

Stack Trace:
java.lang.AssertionError: Could not get expected value  'X val' for path 'x' full output: {
  "responseHeader":{
    "status":0,
    "QTime":0},
  "params":{"wt":"json"},
  "context":{
    "webapp":"/y_g/ad",
    "path":"/test1",
    "httpMethod":"GET"},
  "class":"org.apache.solr.core.BlobStoreTestRequestHandler",
  "x":null},  from server:  null
	at __randomizedtesting.SeedInfo.seed([BA1D201B936A3587:62500D4C64B79027]:0)
	at org.junit.Assert.fail(Assert.java:93)
	at org.junit.Assert.assertTrue(Assert.java:43)
	at org.apache.solr.core.TestSolrConfigHandler.testForResponseElement(TestSolrConfigHandler.java:535)
	at org.apache.solr.core.TestDynamicLoading.testDynamicLoading(TestDynamicLoading.java:232)
	at sun.reflect.NativeMethodAccessorImpl.invoke0(Native Method)
	at sun.reflect.NativeMethodAccessorImpl.invoke(NativeMethodAccessorImpl.java:62)
	at sun.reflect.DelegatingMethodAccessorImpl.invoke(DelegatingMethodAccessorImpl.java:43)
	at java.lang.reflect.Method.invoke(Method.java:498)
	at com.carrotsearch.randomizedtesting.RandomizedRunner.invoke(RandomizedRunner.java:1764)
	at com.carrotsearch.randomizedtesting.RandomizedRunner$8.evaluate(RandomizedRunner.java:871)
	at com.carrotsearch.randomizedtesting.RandomizedRunner$9.evaluate(RandomizedRunner.java:907)
	at com.carrotsearch.randomizedtesting.RandomizedRunner$10.evaluate(RandomizedRunner.java:921)
	at org.apache.solr.BaseDistributedSearchTestCase$ShardsRepeatRule$ShardsFixedStatement.callStatement(BaseDistributedSearchTestCase.java:985)
	at org.apache.solr.BaseDistributedSearchTestCase$ShardsRepeatRule$ShardsStatement.evaluate(BaseDistributedSearchTestCase.java:960)
	at com.carrotsearch.randomizedtesting.rules.SystemPropertiesRestoreRule$1.evaluate(SystemPropertiesRestoreRule.java:57)
	at org.apache.lucene.util.TestRuleSetupTeardownChained$1.evaluate(TestRuleSetupTeardownChained.java:49)
	at org.apache.lucene.util.AbstractBeforeAfterRule$1.evaluate(AbstractBeforeAfterRule.java:45)
	at org.apache.lucene.util.TestRuleThreadAndTestName$1.evaluate(TestRuleThreadAndTestName.java:48)
	at org.apache.lucene.util.TestRuleIgnoreAfterMaxFailures$1.evaluate(TestRuleIgnoreAfterMaxFailures.java:64)
	at org.apache.lucene.util.TestRuleMarkFailure$1.evaluate(TestRuleMarkFailure.java:47)
	at com.carrotsearch.randomizedtesting.rules.StatementAdapter.evaluate(StatementAdapter.java:36)
	at com.carrotsearch.randomizedtesting.ThreadLeakControl$StatementRunner.run(ThreadLeakControl.java:367)
	at com.carrotsearch.randomizedtesting.ThreadLeakControl.forkTimeoutingTask(ThreadLeakControl.java:809)
	at com.carrotsearch.randomizedtesting.ThreadLeakControl$3.evaluate(ThreadLeakControl.java:460)
	at com.carrotsearch.randomizedtesting.RandomizedRunner.runSingleTest(RandomizedRunner.java:880)
	at com.carrotsearch.randomizedtesting.RandomizedRunner$5.evaluate(RandomizedRunner.java:781)
	at com.carrotsearch.randomizedtesting.RandomizedRunner$6.evaluate(RandomizedRunner.java:816)
	at com.carrotsearch.randomizedtesting.RandomizedRunner$7.evaluate(RandomizedRunner.java:827)
	at com.carrotsearch.randomizedtesting.rules.StatementAdapter.evaluate(StatementAdapter.java:36)
	at com.carrotsearch.randomizedtesting.rules.SystemPropertiesRestoreRule$1.evaluate(SystemPropertiesRestoreRule.java:57)
	at org.apache.lucene.util.AbstractBeforeAfterRule$1.evaluate(AbstractBeforeAfterRule.java:45)
	at com.carrotsearch.randomizedtesting.rules.StatementAdapter.evaluate(StatementAdapter.java:36)
	at org.apache.lucene.util.TestRuleStoreClassName$1.evaluate(TestRuleStoreClassName.java:41)
	at com.carrotsearch.randomizedtesting.rules.NoShadowingOrOverridesOnMethodsRule$1.evaluate(NoShadowingOrOverridesOnMethodsRule.java:40)
	at com.carrotsearch.randomizedtesting.rules.NoShadowingOrOverridesOnMethodsRule$1.evaluate(NoShadowingOrOverridesOnMethodsRule.java:40)
	at com.carrotsearch.randomizedtesting.rules.StatementAdapter.evaluate(StatementAdapter.java:36)
	at com.carrotsearch.randomizedtesting.rules.StatementAdapter.evaluate(StatementAdapter.java:36)
	at com.carrotsearch.randomizedtesting.rules.StatementAdapter.evaluate(StatementAdapter.java:36)
	at org.apache.lucene.util.TestRuleAssertionsRequired$1.evaluate(TestRuleAssertionsRequired.java:53)
	at org.apache.lucene.util.TestRuleMarkFailure$1.evaluate(TestRuleMarkFailure.java:47)
	at org.apache.lucene.util.TestRuleIgnoreAfterMaxFailures$1.evaluate(TestRuleIgnoreAfterMaxFailures.java:64)
	at org.apache.lucene.util.TestRuleIgnoreTestSuites$1.evaluate(TestRuleIgnoreTestSuites.java:54)
	at com.carrotsearch.randomizedtesting.rules.StatementAdapter.evaluate(StatementAdapter.java:36)
	at com.carrotsearch.randomizedtesting.ThreadLeakControl$StatementRunner.run(ThreadLeakControl.java:367)
	at java.lang.Thread.run(Thread.java:745)


FAILED:  org.apache.solr.update.AutoCommitTest.testMaxTime

Error Message:
Exception during query

Stack Trace:
java.lang.RuntimeException: Exception during query
	at __randomizedtesting.SeedInfo.seed([BA1D201B936A3587:20E95DF90DF0A9BB]:0)
	at org.apache.solr.SolrTestCaseJ4.assertQ(SolrTestCaseJ4.java:782)
	at org.apache.solr.update.AutoCommitTest.testMaxTime(AutoCommitTest.java:243)
	at sun.reflect.NativeMethodAccessorImpl.invoke0(Native Method)
	at sun.reflect.NativeMethodAccessorImpl.invoke(NativeMethodAccessorImpl.java:62)
	at sun.reflect.DelegatingMethodAccessorImpl.invoke(DelegatingMethodAccessorImpl.java:43)
	at java.lang.reflect.Method.invoke(Method.java:498)
	at com.carrotsearch.randomizedtesting.RandomizedRunner.invoke(RandomizedRunner.java:1764)
	at com.carrotsearch.randomizedtesting.RandomizedRunner$8.evaluate(RandomizedRunner.java:871)
	at com.carrotsearch.randomizedtesting.RandomizedRunner$9.evaluate(RandomizedRunner.java:907)
	at com.carrotsearch.randomizedtesting.RandomizedRunner$10.evaluate(RandomizedRunner.java:921)
	at com.carrotsearch.randomizedtesting.rules.SystemPropertiesRestoreRule$1.evaluate(SystemPropertiesRestoreRule.java:57)
	at org.apache.lucene.util.TestRuleSetupTeardownChained$1.evaluate(TestRuleSetupTeardownChained.java:49)
	at org.apache.lucene.util.AbstractBeforeAfterRule$1.evaluate(AbstractBeforeAfterRule.java:45)
	at org.apache.lucene.util.TestRuleThreadAndTestName$1.evaluate(TestRuleThreadAndTestName.java:48)
	at org.apache.lucene.util.TestRuleIgnoreAfterMaxFailures$1.evaluate(TestRuleIgnoreAfterMaxFailures.java:64)
	at org.apache.lucene.util.TestRuleMarkFailure$1.evaluate(TestRuleMarkFailure.java:47)
	at com.carrotsearch.randomizedtesting.rules.StatementAdapter.evaluate(StatementAdapter.java:36)
	at com.carrotsearch.randomizedtesting.ThreadLeakControl$StatementRunner.run(ThreadLeakControl.java:367)
	at com.carrotsearch.randomizedtesting.ThreadLeakControl.forkTimeoutingTask(ThreadLeakControl.java:809)
	at com.carrotsearch.randomizedtesting.ThreadLeakControl$3.evaluate(ThreadLeakControl.java:460)
	at com.carrotsearch.randomizedtesting.RandomizedRunner.runSingleTest(RandomizedRunner.java:880)
	at com.carrotsearch.randomizedtesting.RandomizedRunner$5.evaluate(RandomizedRunner.java:781)
	at com.carrotsearch.randomizedtesting.RandomizedRunner$6.evaluate(RandomizedRunner.java:816)
	at com.carrotsearch.randomizedtesting.RandomizedRunner$7.evaluate(RandomizedRunner.java:827)
	at com.carrotsearch.randomizedtesting.rules.StatementAdapter.evaluate(StatementAdapter.java:36)
	at com.carrotsearch.randomizedtesting.rules.SystemPropertiesRestoreRule$1.evaluate(SystemPropertiesRestoreRule.java:57)
	at org.apache.lucene.util.AbstractBeforeAfterRule$1.evaluate(AbstractBeforeAfterRule.java:45)
	at com.carrotsearch.randomizedtesting.rules.StatementAdapter.evaluate(StatementAdapter.java:36)
	at org.apache.lucene.util.TestRuleStoreClassName$1.evaluate(TestRuleStoreClassName.java:41)
	at com.carrotsearch.randomizedtesting.rules.NoShadowingOrOverridesOnMethodsRule$1.evaluate(NoShadowingOrOverridesOnMethodsRule.java:40)
	at com.carrotsearch.randomizedtesting.rules.NoShadowingOrOverridesOnMethodsRule$1.evaluate(NoShadowingOrOverridesOnMethodsRule.java:40)
	at com.carrotsearch.randomizedtesting.rules.StatementAdapter.evaluate(StatementAdapter.java:36)
	at com.carrotsearch.randomizedtesting.rules.StatementAdapter.evaluate(StatementAdapter.java:36)
	at com.carrotsearch.randomizedtesting.rules.StatementAdapter.evaluate(StatementAdapter.java:36)
	at org.apache.lucene.util.TestRuleAssertionsRequired$1.evaluate(TestRuleAssertionsRequired.java:53)
	at org.apache.lucene.util.TestRuleMarkFailure$1.evaluate(TestRuleMarkFailure.java:47)
	at org.apache.lucene.util.TestRuleIgnoreAfterMaxFailures$1.evaluate(TestRuleIgnoreAfterMaxFailures.java:64)
	at org.apache.lucene.util.TestRuleIgnoreTestSuites$1.evaluate(TestRuleIgnoreTestSuites.java:54)
	at com.carrotsearch.randomizedtesting.rules.StatementAdapter.evaluate(StatementAdapter.java:36)
	at com.carrotsearch.randomizedtesting.ThreadLeakControl$StatementRunner.run(ThreadLeakControl.java:367)
	at java.lang.Thread.run(Thread.java:745)
Caused by: java.lang.RuntimeException: REQUEST FAILED: xpath=//result[@numFound=1]
	xml response was: <?xml version="1.0" encoding="UTF-8"?>
<response>
<lst name="responseHeader"><int name="status">0</int><int name="QTime">0</int></lst><result name="response" numFound="0" start="0"></result>
</response>

	request was:q=id:529&qt=standard&start=0&rows=20&version=2.2
	at org.apache.solr.SolrTestCaseJ4.assertQ(SolrTestCaseJ4.java:775)
	... 40 more




Build Log:
[...truncated 10724 lines...]
   [junit4] Suite: org.apache.solr.core.TestDynamicLoading
   [junit4]   2> Creating dataDir: /export/home/jenkins/workspace/Lucene-Solr-master-Solaris/solr/build/solr-core/test/J0/temp/solr.core.TestDynamicLoading_BA1D201B936A3587-001/init-core-data-001
   [junit4]   2> 293523 INFO  (SUITE-TestDynamicLoading-seed#[BA1D201B936A3587]-worker) [    ] o.a.s.SolrTestCaseJ4 Randomized ssl (false) and clientAuth (true) via: @org.apache.solr.util.RandomizeSSL(reason=, value=NaN, ssl=NaN, clientAuth=NaN)
   [junit4]   2> 293523 INFO  (SUITE-TestDynamicLoading-seed#[BA1D201B936A3587]-worker) [    ] o.a.s.BaseDistributedSearchTestCase Setting hostContext system property: /y_g/ad
   [junit4]   2> 293525 INFO  (TEST-TestDynamicLoading.testDynamicLoading-seed#[BA1D201B936A3587]) [    ] o.a.s.c.ZkTestServer STARTING ZK TEST SERVER
   [junit4]   2> 293525 INFO  (Thread-1936) [    ] o.a.s.c.ZkTestServer client port:0.0.0.0/0.0.0.0:0
   [junit4]   2> 293526 INFO  (Thread-1936) [    ] o.a.s.c.ZkTestServer Starting server
   [junit4]   2> 293626 INFO  (TEST-TestDynamicLoading.testDynamicLoading-seed#[BA1D201B936A3587]) [    ] o.a.s.c.ZkTestServer start zk server on port:54605
   [junit4]   2> 293626 INFO  (TEST-TestDynamicLoading.testDynamicLoading-seed#[BA1D201B936A3587]) [    ] o.a.s.c.c.SolrZkClient Using default ZkCredentialsProvider
   [junit4]   2> 293626 INFO  (TEST-TestDynamicLoading.testDynamicLoading-seed#[BA1D201B936A3587]) [    ] o.a.s.c.c.ConnectionManager Waiting for client to connect to ZooKeeper
   [junit4]   2> 293639 INFO  (zkCallback-342-thread-1) [    ] o.a.s.c.c.ConnectionManager Watcher org.apache.solr.common.cloud.ConnectionManager@65e3e120 name:ZooKeeperConnection Watcher:127.0.0.1:54605 got event WatchedEvent state:SyncConnected type:None path:null path:null type:None
   [junit4]   2> 293639 INFO  (TEST-TestDynamicLoading.testDynamicLoading-seed#[BA1D201B936A3587]) [    ] o.a.s.c.c.ConnectionManager Client is connected to ZooKeeper
   [junit4]   2> 293639 INFO  (TEST-TestDynamicLoading.testDynamicLoading-seed#[BA1D201B936A3587]) [    ] o.a.s.c.c.SolrZkClient Using default ZkACLProvider
   [junit4]   2> 293639 INFO  (TEST-TestDynamicLoading.testDynamicLoading-seed#[BA1D201B936A3587]) [    ] o.a.s.c.c.SolrZkClient makePath: /solr
   [junit4]   2> 293646 INFO  (TEST-TestDynamicLoading.testDynamicLoading-seed#[BA1D201B936A3587]) [    ] o.a.s.c.c.SolrZkClient Using default ZkCredentialsProvider
   [junit4]   2> 293646 INFO  (TEST-TestDynamicLoading.testDynamicLoading-seed#[BA1D201B936A3587]) [    ] o.a.s.c.c.ConnectionManager Waiting for client to connect to ZooKeeper
   [junit4]   2> 293648 INFO  (zkCallback-343-thread-1) [    ] o.a.s.c.c.ConnectionManager Watcher org.apache.solr.common.cloud.ConnectionManager@2a75c32e name:ZooKeeperConnection Watcher:127.0.0.1:54605/solr got event WatchedEvent state:SyncConnected type:None path:null path:null type:None
   [junit4]   2> 293648 INFO  (TEST-TestDynamicLoading.testDynamicLoading-seed#[BA1D201B936A3587]) [    ] o.a.s.c.c.ConnectionManager Client is connected to ZooKeeper
   [junit4]   2> 293648 INFO  (TEST-TestDynamicLoading.testDynamicLoading-seed#[BA1D201B936A3587]) [    ] o.a.s.c.c.SolrZkClient Using default ZkACLProvider
   [junit4]   2> 293648 INFO  (TEST-TestDynamicLoading.testDynamicLoading-seed#[BA1D201B936A3587]) [    ] o.a.s.c.c.SolrZkClient makePath: /collections/collection1
   [junit4]   2> 293650 INFO  (TEST-TestDynamicLoading.testDynamicLoading-seed#[BA1D201B936A3587]) [    ] o.a.s.c.c.SolrZkClient makePath: /collections/collection1/shards
   [junit4]   2> 293652 INFO  (TEST-TestDynamicLoading.testDynamicLoading-seed#[BA1D201B936A3587]) [    ] o.a.s.c.c.SolrZkClient makePath: /collections/control_collection
   [junit4]   2> 293653 INFO  (TEST-TestDynamicLoading.testDynamicLoading-seed#[BA1D201B936A3587]) [    ] o.a.s.c.c.SolrZkClient makePath: /collections/control_collection/shards
   [junit4]   2> 293655 INFO  (TEST-TestDynamicLoading.testDynamicLoading-seed#[BA1D201B936A3587]) [    ] o.a.s.c.AbstractZkTestCase put /export/home/jenkins/workspace/Lucene-Solr-master-Solaris/solr/core/src/test-files/solr/collection1/conf/solrconfig-tlog.xml to /configs/conf1/solrconfig.xml
   [junit4]   2> 293655 INFO  (TEST-TestDynamicLoading.testDynamicLoading-seed#[BA1D201B936A3587]) [    ] o.a.s.c.c.SolrZkClient makePath: /configs/conf1/solrconfig.xml
   [junit4]   2> 293658 INFO  (TEST-TestDynamicLoading.testDynamicLoading-seed#[BA1D201B936A3587]) [    ] o.a.s.c.AbstractZkTestCase put /export/home/jenkins/workspace/Lucene-Solr-master-Solaris/solr/core/src/test-files/solr/collection1/conf/schema.xml to /configs/conf1/schema.xml
   [junit4]   2> 293658 INFO  (TEST-TestDynamicLoading.testDynamicLoading-seed#[BA1D201B936A3587]) [    ] o.a.s.c.c.SolrZkClient makePath: /configs/conf1/schema.xml
   [junit4]   2> 293660 INFO  (TEST-TestDynamicLoading.testDynamicLoading-seed#[BA1D201B936A3587]) [    ] o.a.s.c.AbstractZkTestCase put /export/home/jenkins/workspace/Lucene-Solr-master-Solaris/solr/core/src/test-files/solr/collection1/conf/solrconfig.snippet.randomindexconfig.xml to /configs/conf1/solrconfig.snippet.randomindexconfig.xml
   [junit4]   2> 293660 INFO  (TEST-TestDynamicLoading.testDynamicLoading-seed#[BA1D201B936A3587]) [    ] o.a.s.c.c.SolrZkClient makePath: /configs/conf1/solrconfig.snippet.randomindexconfig.xml
   [junit4]   2> 293661 INFO  (TEST-TestDynamicLoading.testDynamicLoading-seed#[BA1D201B936A3587]) [    ] o.a.s.c.AbstractZkTestCase put /export/home/jenkins/workspace/Lucene-Solr-master-Solaris/solr/core/src/test-files/solr/collection1/conf/stopwords.txt to /configs/conf1/stopwords.txt
   [junit4]   2> 293661 INFO  (TEST-TestDynamicLoading.testDynamicLoading-seed#[BA1D201B936A3587]) [    ] o.a.s.c.c.SolrZkClient makePath: /configs/conf1/stopwords.txt
   [junit4]   2> 293663 INFO  (TEST-TestDynamicLoading.testDynamicLoading-seed#[BA1D201B936A3587]) [    ] o.a.s.c.AbstractZkTestCase put /export/home/jenkins/workspace/Lucene-Solr-master-Solaris/solr/core/src/test-files/solr/collection1/conf/protwords.txt to /configs/conf1/protwords.txt
   [junit4]   2> 293663 INFO  (TEST-TestDynamicLoading.testDynamicLoading-seed#[BA1D201B936A3587]) [    ] o.a.s.c.c.SolrZkClient makePath: /configs/conf1/protwords.txt
   [junit4]   2> 293665 INFO  (TEST-TestDynamicLoading.testDynamicLoading-seed#[BA1D201B936A3587]) [    ] o.a.s.c.AbstractZkTestCase put /export/home/jenkins/workspace/Lucene-Solr-master-Solaris/solr/core/src/test-files/solr/collection1/conf/currency.xml to /configs/conf1/currency.xml
   [junit4]   2> 293665 INFO  (TEST-TestDynamicLoading.testDynamicLoading-seed#[BA1D201B936A3587]) [    ] o.a.s.c.c.SolrZkClient makePath: /configs/conf1/currency.xml
   [junit4]   2> 293666 INFO  (TEST-TestDynamicLoading.testDynamicLoading-seed#[BA1D201B936A3587]) [    ] o.a.s.c.AbstractZkTestCase put /export/home/jenkins/workspace/Lucene-Solr-master-Solaris/solr/core/src/test-files/solr/collection1/conf/enumsConfig.xml to /configs/conf1/enumsConfig.xml
   [junit4]   2> 293666 INFO  (TEST-TestDynamicLoading.testDynamicLoading-seed#[BA1D201B936A3587]) [    ] o.a.s.c.c.SolrZkClient makePath: /configs/conf1/enumsConfig.xml
   [junit4]   2> 293668 INFO  (TEST-TestDynamicLoading.testDynamicLoading-seed#[BA1D201B936A3587]) [    ] o.a.s.c.AbstractZkTestCase put /export/home/jenkins/workspace/Lucene-Solr-master-Solaris/solr/core/src/test-files/solr/collection1/conf/open-exchange-rates.json to /configs/conf1/open-exchange-rates.json
   [junit4]   2> 293668 INFO  (TEST-TestDynamicLoading.testDynamicLoading-seed#[BA1D201B936A3587]) [    ] o.a.s.c.c.SolrZkClient makePath: /configs/conf1/open-exchange-rates.json
   [junit4]   2> 293670 INFO  (TEST-TestDynamicLoading.testDynamicLoading-seed#[BA1D201B936A3587]) [    ] o.a.s.c.AbstractZkTestCase put /export/home/jenkins/workspace/Lucene-Solr-master-Solaris/solr/core/src/test-files/solr/collection1/conf/mapping-ISOLatin1Accent.txt to /configs/conf1/mapping-ISOLatin1Accent.txt
   [junit4]   2> 293670 INFO  (TEST-TestDynamicLoading.testDynamicLoading-seed#[BA1D201B936A3587]) [    ] o.a.s.c.c.SolrZkClient makePath: /configs/conf1/mapping-ISOLatin1Accent.txt
   [junit4]   2> 293672 INFO  (TEST-TestDynamicLoading.testDynamicLoading-seed#[BA1D201B936A3587]) [    ] o.a.s.c.AbstractZkTestCase put /export/home/jenkins/workspace/Lucene-Solr-master-Solaris/solr/core/src/test-files/solr/collection1/conf/old_synonyms.txt to /configs/conf1/old_synonyms.txt
   [junit4]   2> 293672 INFO  (TEST-TestDynamicLoading.testDynamicLoading-seed#[BA1D201B936A3587]) [    ] o.a.s.c.c.SolrZkClient makePath: /configs/conf1/old_synonyms.txt
   [junit4]   2> 293673 INFO  (TEST-TestDynamicLoading.testDynamicLoading-seed#[BA1D201B936A3587]) [    ] o.a.s.c.AbstractZkTestCase put /export/home/jenkins/workspace/Lucene-Solr-master-Solaris/solr/core/src/test-files/solr/collection1/conf/synonyms.txt to /configs/conf1/synonyms.txt
   [junit4]   2> 293673 INFO  (TEST-TestDynamicLoading.testDynamicLoading-seed#[BA1D201B936A3587]) [    ] o.a.s.c.c.SolrZkClient makePath: /configs/conf1/synonyms.txt
   [junit4]   2> 293808 INFO  (TEST-TestDynamicLoading.testDynamicLoading-seed#[BA1D201B936A3587]) [    ] o.a.s.SolrTestCaseJ4 Writing core.properties file to /export/home/jenkins/workspace/Lucene-Solr-master-Solaris/solr/build/solr-core/test/J0/temp/solr.core.TestDynamicLoading_BA1D201B936A3587-001/control-001/cores/collection1
   [junit4]   2> 293809 INFO  (TEST-TestDynamicLoading.testDynamicLoading-seed#[BA1D201B936A3587]) [    ] o.e.j.s.Server jetty-9.3.8.v20160314
   [junit4]   2> 293811 INFO  (TEST-TestDynamicLoading.testDynamicLoading-seed#[BA1D201B936A3587]) [    ] o.e.j.s.h.ContextHandler Started o.e.j.s.ServletContextHandler@50327d29{/y_g/ad,null,AVAILABLE}
   [junit4]   2> 293813 INFO  (TEST-TestDynamicLoading.testDynamicLoading-seed#[BA1D201B936A3587]) [    ] o.e.j.s.ServerConnector Started ServerConnector@43b5e50f{HTTP/1.1,[http/1.1]}{127.0.0.1:54683}
   [junit4]   2> 293813 INFO  (TEST-TestDynamicLoading.testDynamicLoading-seed#[BA1D201B936A3587]) [    ] o.e.j.s.Server Started @298269ms
   [junit4]   2> 293813 INFO  (TEST-TestDynamicLoading.testDynamicLoading-seed#[BA1D201B936A3587]) [    ] o.a.s.c.s.e.JettySolrRunner Jetty properties: {solr.data.dir=/export/home/jenkins/workspace/Lucene-Solr-master-Solaris/solr/build/solr-core/test/J0/temp/solr.core.TestDynamicLoading_BA1D201B936A3587-001/tempDir-001/control/data, hostContext=/y_g/ad, hostPort=54683, coreRootDirectory=/export/home/jenkins/workspace/Lucene-Solr-master-Solaris/solr/build/solr-core/test/J0/temp/solr.core.TestDynamicLoading_BA1D201B936A3587-001/control-001/cores}
   [junit4]   2> 293814 INFO  (TEST-TestDynamicLoading.testDynamicLoading-seed#[BA1D201B936A3587]) [    ] o.a.s.s.SolrDispatchFilter SolrDispatchFilter.init(): sun.misc.Launcher$AppClassLoader@6d06d69c
   [junit4]   2> 293814 INFO  (TEST-TestDynamicLoading.testDynamicLoading-seed#[BA1D201B936A3587]) [    ] o.a.s.c.SolrResourceLoader new SolrResourceLoader for directory: '/export/home/jenkins/workspace/Lucene-Solr-master-Solaris/solr/build/solr-core/test/J0/temp/solr.core.TestDynamicLoading_BA1D201B936A3587-001/control-001'
   [junit4]   2> 293814 INFO  (TEST-TestDynamicLoading.testDynamicLoading-seed#[BA1D201B936A3587]) [    ] o.a.s.c.SolrResourceLoader JNDI not configured for solr (NoInitialContextEx)
   [junit4]   2> 293814 INFO  (TEST-TestDynamicLoading.testDynamicLoading-seed#[BA1D201B936A3587]) [    ] o.a.s.c.SolrResourceLoader solr home defaulted to 'solr/' (could not find system property or JNDI)
   [junit4]   2> 293814 INFO  (TEST-TestDynamicLoading.testDynamicLoading-seed#[BA1D201B936A3587]) [    ] o.a.s.c.c.SolrZkClient Using default ZkCredentialsProvider
   [junit4]   2> 293815 INFO  (TEST-TestDynamicLoading.testDynamicLoading-seed#[BA1D201B936A3587]) [    ] o.a.s.c.c.ConnectionManager Waiting for client to connect to ZooKeeper
   [junit4]   2> 293817 INFO  (zkCallback-344-thread-1) [    ] o.a.s.c.c.ConnectionManager Watcher org.apache.solr.common.cloud.ConnectionManager@433898bd name:ZooKeeperConnection Watcher:127.0.0.1:54605/solr got event WatchedEvent state:SyncConnected type:None path:null path:null type:None
   [junit4]   2> 293817 INFO  (TEST-TestDynamicLoading.testDynamicLoading-seed#[BA1D201B936A3587]) [    ] o.a.s.c.c.ConnectionManager Client is connected to ZooKeeper
   [junit4]   2> 293817 INFO  (TEST-TestDynamicLoading.testDynamicLoading-seed#[BA1D201B936A3587]) [    ] o.a.s.c.c.SolrZkClient Using default ZkACLProvider
   [junit4]   2> 293819 INFO  (TEST-TestDynamicLoading.testDynamicLoading-seed#[BA1D201B936A3587]) [    ] o.a.s.s.SolrDispatchFilter Loading solr.xml from SolrHome (not found in ZooKeeper)
   [junit4]   2> 293819 INFO  (TEST-TestDynamicLoading.testDynamicLoading-seed#[BA1D201B936A3587]) [    ] o.a.s.c.SolrXmlConfig Loading container configuration from /export/home/jenkins/workspace/Lucene-Solr-master-Solaris/solr/build/solr-core/test/J0/temp/solr.core.TestDynamicLoading_BA1D201B936A3587-001/control-001/solr.xml
   [junit4]   2> 293824 INFO  (TEST-TestDynamicLoading.testDynamicLoading-seed#[BA1D201B936A3587]) [    ] o.a.s.c.CorePropertiesLocator Config-defined core root directory: /export/home/jenkins/workspace/Lucene-Solr-master-Solaris/solr/build/solr-core/test/J0/temp/solr.core.TestDynamicLoading_BA1D201B936A3587-001/control-001/cores
   [junit4]   2> 293824 INFO  (TEST-TestDynamicLoading.testDynamicLoading-seed#[BA1D201B936A3587]) [    ] o.a.s.c.CoreContainer New CoreContainer 26872079
   [junit4]   2> 293824 INFO  (TEST-TestDynamicLoading.testDynamicLoading-seed#[BA1D201B936A3587]) [    ] o.a.s.c.CoreContainer Loading cores into CoreContainer [instanceDir=/export/home/jenkins/workspace/Lucene-Solr-master-Solaris/solr/build/solr-core/test/J0/temp/solr.core.TestDynamicLoading_BA1D201B936A3587-001/control-001]
   [junit4]   2> 293825 WARN  (TEST-TestDynamicLoading.testDynamicLoading-seed#[BA1D201B936A3587]) [    ] o.a.s.c.CoreContainer Couldn't add files from /export/home/jenkins/workspace/Lucene-Solr-master-Solaris/solr/build/solr-core/test/J0/temp/solr.core.TestDynamicLoading_BA1D201B936A3587-001/control-001/lib to classpath: /export/home/jenkins/workspace/Lucene-Solr-master-Solaris/solr/build/solr-core/test/J0/temp/solr.core.TestDynamicLoading_BA1D201B936A3587-001/control-001/lib
   [junit4]   2> 293825 INFO  (TEST-TestDynamicLoading.testDynamicLoading-seed#[BA1D201B936A3587]) [    ] o.a.s.h.c.HttpShardHandlerFactory created with socketTimeout : 90000,urlScheme : ,connTimeout : 15000,maxConnectionsPerHost : 20,maxConnections : 10000,corePoolSize : 0,maximumPoolSize : 2147483647,maxThreadIdleTime : 5,sizeOfQueue : -1,fairnessPolicy : false,
   [junit4]   2> 293827 INFO  (TEST-TestDynamicLoading.testDynamicLoading-seed#[BA1D201B936A3587]) [    ] o.a.s.u.UpdateShardHandler Created UpdateShardHandler HTTP client with params: socketTimeout=340000&connTimeout=45000&maxConnections=100000&maxConnectionsPerHost=100000
   [junit4]   2> 293827 INFO  (TEST-TestDynamicLoading.testDynamicLoading-seed#[BA1D201B936A3587]) [    ] o.a.s.l.LogWatcher SLF4J impl is org.slf4j.impl.Log4jLoggerFactory
   [junit4]   2> 293827 INFO  (TEST-TestDynamicLoading.testDynamicLoading-seed#[BA1D201B936A3587]) [    ] o.a.s.l.LogWatcher Registering Log Listener [Log4j (org.slf4j.impl.Log4jLoggerFactory)]
   [junit4]   2> 293827 INFO  (TEST-TestDynamicLoading.testDynamicLoading-seed#[BA1D201B936A3587]) [    ] o.a.s.c.ZkContainer Zookeeper client=127.0.0.1:54605/solr
   [junit4]   2> 293827 INFO  (TEST-TestDynamicLoading.testDynamicLoading-seed#[BA1D201B936A3587]) [    ] o.a.s.c.ZkController zkHost includes chroot
   [junit4]   2> 293827 INFO  (TEST-TestDynamicLoading.testDynamicLoading-seed#[BA1D201B936A3587]) [    ] o.a.s.c.c.SolrZkClient Using default ZkCredentialsProvider
   [junit4]   2> 293828 INFO  (TEST-TestDynamicLoading.testDynamicLoading-seed#[BA1D201B936A3587]) [    ] o.a.s.c.c.ConnectionManager Waiting for client to connect to ZooKeeper
   [junit4]   2> 293830 INFO  (zkCallback-347-thread-1) [    ] o.a.s.c.c.ConnectionManager Watcher org.apache.solr.common.cloud.ConnectionManager@12c72740 name:ZooKeeperConnection Watcher:127.0.0.1:54605 got event WatchedEvent state:SyncConnected type:None path:null path:null type:None
   [junit4]   2> 293831 INFO  (TEST-TestDynamicLoading.testDynamicLoading-seed#[BA1D201B936A3587]) [    ] o.a.s.c.c.ConnectionManager Client is connected to ZooKeeper
   [junit4]   2> 293831 INFO  (TEST-TestDynamicLoading.testDynamicLoading-seed#[BA1D201B936A3587]) [    ] o.a.s.c.c.SolrZkClient Using default ZkACLProvider
   [junit4]   2> 293832 INFO  (TEST-TestDynamicLoading.testDynamicLoading-seed#[BA1D201B936A3587]) [n:127.0.0.1:54683_y_g%2Fad    ] o.a.s.c.ZkController Added new OnReconnect listener org.apache.solr.cloud.ZkController$$Lambda$69/61290535@4fc307c9
   [junit4]   2> 293832 INFO  (TEST-TestDynamicLoading.testDynamicLoading-seed#[BA1D201B936A3587]) [n:127.0.0.1:54683_y_g%2Fad    ] o.a.s.c.c.ConnectionManager Waiting for client to connect to ZooKeeper
   [junit4]   2> 293837 INFO  (zkCallback-348-thread-1-processing-n:127.0.0.1:54683_y_g%2Fad) [n:127.0.0.1:54683_y_g%2Fad    ] o.a.s.c.c.ConnectionManager Watcher org.apache.solr.common.cloud.ConnectionManager@6c731c68 name:ZooKeeperConnection Watcher:127.0.0.1:54605/solr got event WatchedEvent state:SyncConnected type:None path:null path:null type:None
   [junit4]   2> 293838 INFO  (TEST-TestDynamicLoading.testDynamicLoading-seed#[BA1D201B936A3587]) [n:127.0.0.1:54683_y_g%2Fad    ] o.a.s.c.c.ConnectionManager Client is connected to ZooKeeper
   [junit4]   2> 293839 INFO  (TEST-TestDynamicLoading.testDynamicLoading-seed#[BA1D201B936A3587]) [n:127.0.0.1:54683_y_g%2Fad    ] o.a.s.c.c.SolrZkClient makePath: /overseer/queue
   [junit4]   2> 293842 INFO  (TEST-TestDynamicLoading.testDynamicLoading-seed#[BA1D201B936A3587]) [n:127.0.0.1:54683_y_g%2Fad    ] o.a.s.c.c.SolrZkClient makePath: /overseer/collection-queue-work
   [junit4]   2> 293846 INFO  (TEST-TestDynamicLoading.testDynamicLoading-seed#[BA1D201B936A3587]) [n:127.0.0.1:54683_y_g%2Fad    ] o.a.s.c.c.SolrZkClient makePath: /overseer/collection-map-running
   [junit4]   2> 293850 INFO  (TEST-TestDynamicLoading.testDynamicLoading-seed#[BA1D201B936A3587]) [n:127.0.0.1:54683_y_g%2Fad    ] o.a.s.c.c.SolrZkClient makePath: /overseer/collection-map-completed
   [junit4]   2> 293853 INFO  (TEST-TestDynamicLoading.testDynamicLoading-seed#[BA1D201B936A3587]) [n:127.0.0.1:54683_y_g%2Fad    ] o.a.s.c.c.SolrZkClient makePath: /overseer/collection-map-failure
   [junit4]   2> 293855 INFO  (TEST-TestDynamicLoading.testDynamicLoading-seed#[BA1D201B936A3587]) [n:127.0.0.1:54683_y_g%2Fad    ] o.a.s.c.c.SolrZkClient makePath: /live_nodes
   [junit4]   2> 293859 INFO  (TEST-TestDynamicLoading.testDynamicLoading-seed#[BA1D201B936A3587]) [n:127.0.0.1:54683_y_g%2Fad    ] o.a.s.c.c.SolrZkClient makePath: /aliases.json
   [junit4]   2> 293863 INFO  (TEST-TestDynamicLoading.testDynamicLoading-seed#[BA1D201B936A3587]) [n:127.0.0.1:54683_y_g%2Fad    ] o.a.s.c.c.SolrZkClient makePath: /clusterstate.json
   [junit4]   2> 293865 INFO  (TEST-TestDynamicLoading.testDynamicLoading-seed#[BA1D201B936A3587]) [n:127.0.0.1:54683_y_g%2Fad    ] o.a.s.c.c.SolrZkClient makePath: /security.json
   [junit4]   2> 293867 INFO  (TEST-TestDynamicLoading.testDynamicLoading-seed#[BA1D201B936A3587]) [n:127.0.0.1:54683_y_g%2Fad    ] o.a.s.c.c.ZkStateReader Updating cluster state from ZooKeeper... 
   [junit4]   2> 293867 INFO  (TEST-TestDynamicLoading.testDynamicLoading-seed#[BA1D201B936A3587]) [n:127.0.0.1:54683_y_g%2Fad    ] o.a.s.c.c.ZkStateReader Loaded empty cluster properties
   [junit4]   2> 293869 INFO  (TEST-TestDynamicLoading.testDynamicLoading-seed#[BA1D201B936A3587]) [n:127.0.0.1:54683_y_g%2Fad    ] o.a.s.c.c.ZkStateReader Updated live nodes from ZooKeeper... (0) -> (0)
   [junit4]   2> 293872 INFO  (TEST-TestDynamicLoading.testDynamicLoading-seed#[BA1D201B936A3587]) [n:127.0.0.1:54683_y_g%2Fad    ] o.a.s.c.c.SolrZkClient makePath: /overseer_elect
   [junit4]   2> 293874 INFO  (TEST-TestDynamicLoading.testDynamicLoading-seed#[BA1D201B936A3587]) [n:127.0.0.1:54683_y_g%2Fad    ] o.a.s.c.c.SolrZkClient makePath: /overseer_elect/election
   [junit4]   2> 293876 INFO  (TEST-TestDynamicLoading.testDynamicLoading-seed#[BA1D201B936A3587]) [n:127.0.0.1:54683_y_g%2Fad    ] o.a.s.c.Overseer Overseer (id=null) closing
   [junit4]   2> 293876 INFO  (TEST-TestDynamicLoading.testDynamicLoading-seed#[BA1D201B936A3587]) [n:127.0.0.1:54683_y_g%2Fad    ] o.a.s.c.LeaderElector Joined leadership election with path: /overseer_elect/election/96581303326343172-127.0.0.1:54683_y_g%2Fad-n_0000000000
   [junit4]   2> 293877 INFO  (TEST-TestDynamicLoading.testDynamicLoading-seed#[BA1D201B936A3587]) [n:127.0.0.1:54683_y_g%2Fad    ] o.a.s.c.OverseerElectionContext I am going to be the leader 127.0.0.1:54683_y_g%2Fad
   [junit4]   2> 293877 INFO  (TEST-TestDynamicLoading.testDynamicLoading-seed#[BA1D201B936A3587]) [n:127.0.0.1:54683_y_g%2Fad    ] o.a.s.c.c.SolrZkClient makePath: /overseer_elect/leader
   [junit4]   2> 293878 INFO  (TEST-TestDynamicLoading.testDynamicLoading-seed#[BA1D201B936A3587]) [n:127.0.0.1:54683_y_g%2Fad    ] o.a.s.c.Overseer Overseer (id=96581303326343172-127.0.0.1:54683_y_g%2Fad-n_0000000000) starting
   [junit4]   2> 293881 INFO  (TEST-TestDynamicLoading.testDynamicLoading-seed#[BA1D201B936A3587]) [n:127.0.0.1:54683_y_g%2Fad    ] o.a.s.c.c.SolrZkClient makePath: /overseer/queue-work
   [junit4]   2> 293889 INFO  (TEST-TestDynamicLoading.testDynamicLoading-seed#[BA1D201B936A3587]) [n:127.0.0.1:54683_y_g%2Fad    ] o.a.s.c.OverseerAutoReplicaFailoverThread Starting OverseerAutoReplicaFailoverThread autoReplicaFailoverWorkLoopDelay=10000 autoReplicaFailoverWaitAfterExpiration=10000 autoReplicaFailoverBadNodeExpiration=60000
   [junit4]   2> 293890 INFO  (OverseerCollectionConfigSetProcessor-96581303326343172-127.0.0.1:54683_y_g%2Fad-n_0000000000) [n:127.0.0.1:54683_y_g%2Fad    ] o.a.s.c.OverseerTaskProcessor Process current queue of overseer operations
   [junit4]   2> 293891 INFO  (OverseerStateUpdate-96581303326343172-127.0.0.1:54683_y_g%2Fad-n_0000000000) [n:127.0.0.1:54683_y_g%2Fad    ] o.a.s.c.Overseer Starting to work on the main queue
   [junit4]   2> 293891 INFO  (TEST-TestDynamicLoading.testDynamicLoading-seed#[BA1D201B936A3587]) [n:127.0.0.1:54683_y_g%2Fad    ] o.a.s.c.ZkController Register node as live in ZooKeeper:/live_nodes/127.0.0.1:54683_y_g%2Fad
   [junit4]   2> 293891 INFO  (TEST-TestDynamicLoading.testDynamicLoading-seed#[BA1D201B936A3587]) [n:127.0.0.1:54683_y_g%2Fad    ] o.a.s.c.c.SolrZkClient makePath: /live_nodes/127.0.0.1:54683_y_g%2Fad
   [junit4]   2> 293894 INFO  (OverseerStateUpdate-96581303326343172-127.0.0.1:54683_y_g%2Fad-n_0000000000) [n:127.0.0.1:54683_y_g%2Fad    ] o.a.s.c.c.ZkStateReader Updated live nodes from ZooKeeper... (0) -> (0)
   [junit4]   2> 293894 INFO  (zkCallback-348-thread-1-processing-n:127.0.0.1:54683_y_g%2Fad) [n:127.0.0.1:54683_y_g%2Fad    ] o.a.s.c.c.ZkStateReader A live node change: [WatchedEvent state:SyncConnected type:NodeChildrenChanged path:/live_nodes], has occurred - updating... (live nodes size: [0])
   [junit4]   2> 293895 INFO  (zkCallback-348-thread-1-processing-n:127.0.0.1:54683_y_g%2Fad) [n:127.0.0.1:54683_y_g%2Fad    ] o.a.s.c.c.ZkStateReader Updated live nodes from ZooKeeper... (0) -> (1)
   [junit4]   2> 293932 INFO  (TEST-TestDynamicLoading.testDynamicLoading-seed#[BA1D201B936A3587]) [n:127.0.0.1:54683_y_g%2Fad    ] o.a.s.c.CoreContainer Security conf doesn't exist. Skipping setup for authorization module.
   [junit4]   2> 293932 INFO  (TEST-TestDynamicLoading.testDynamicLoading-seed#[BA1D201B936A3587]) [n:127.0.0.1:54683_y_g%2Fad    ] o.a.s.c.CoreContainer No authentication plugin used.
   [junit4]   2> 293933 INFO  (TEST-TestDynamicLoading.testDynamicLoading-seed#[BA1D201B936A3587]) [n:127.0.0.1:54683_y_g%2Fad    ] o.a.s.c.CorePropertiesLocator Looking for core definitions underneath /export/home/jenkins/workspace/Lucene-Solr-master-Solaris/solr/build/solr-core/test/J0/temp/solr.core.TestDynamicLoading_BA1D201B936A3587-001/control-001/cores
   [junit4]   2> 293934 INFO  (TEST-TestDynamicLoading.testDynamicLoading-seed#[BA1D201B936A3587]) [n:127.0.0.1:54683_y_g%2Fad    ] o.a.s.c.CoreDescriptor Created CoreDescriptor: {name=collection1, config=solrconfig.xml, transient=false, schema=schema.xml, loadOnStartup=true, configSetProperties=configsetprops.json, collection=control_collection, coreNodeName=, dataDir=data/, shard=}
   [junit4]   2> 293934 INFO  (TEST-TestDynamicLoading.testDynamicLoading-seed#[BA1D201B936A3587]) [n:127.0.0.1:54683_y_g%2Fad    ] o.a.s.c.CorePropertiesLocator Found core collection1 in /export/home/jenkins/workspace/Lucene-Solr-master-Solaris/solr/build/solr-core/test/J0/temp/solr.core.TestDynamicLoading_BA1D201B936A3587-001/control-001/cores/collection1
   [junit4]   2> 293934 INFO  (TEST-TestDynamicLoading.testDynamicLoading-seed#[BA1D201B936A3587]) [n:127.0.0.1:54683_y_g%2Fad    ] o.a.s.c.CorePropertiesLocator Found 1 core definitions
   [junit4]   2> 293935 INFO  (TEST-TestDynamicLoading.testDynamicLoading-seed#[BA1D201B936A3587]) [n:127.0.0.1:54683_y_g%2Fad    ] o.a.s.s.SolrDispatchFilter user.dir=/export/home/jenkins/workspace/Lucene-Solr-master-Solaris/solr/build/solr-core/test/J0
   [junit4]   2> 293935 INFO  (TEST-TestDynamicLoading.testDynamicLoading-seed#[BA1D201B936A3587]) [n:127.0.0.1:54683_y_g%2Fad    ] o.a.s.s.SolrDispatchFilter SolrDispatchFilter.init() done
   [junit4]   2> 293935 INFO  (coreLoadExecutor-1039-thread-1-processing-n:127.0.0.1:54683_y_g%2Fad) [n:127.0.0.1:54683_y_g%2Fad c:control_collection   x:collection1] o.a.s.c.ZkController publishing state=down
   [junit4]   2> 293935 INFO  (coreLoadExecutor-1039-thread-1-processing-n:127.0.0.1:54683_y_g%2Fad) [n:127.0.0.1:54683_y_g%2Fad c:control_collection   x:collection1] o.a.s.c.ZkController numShards not found on descriptor - reading it from system property
   [junit4]   2> 293937 INFO  (coreLoadExecutor-1039-thread-1-processing-n:127.0.0.1:54683_y_g%2Fad) [n:127.0.0.1:54683_y_g%2Fad c:control_collection   x:collection1] o.a.s.c.ZkController Collection control_collection not visible yet, but flagging it so a watch is registered when it becomes visible
   [junit4]   2> 293937 INFO  (OverseerStateUpdate-96581303326343172-127.0.0.1:54683_y_g%2Fad-n_0000000000) [n:127.0.0.1:54683_y_g%2Fad    ] o.a.s.c.Overseer processMessage: queueSize: 1, message = {
   [junit4]   2>   "core":"collection1",
   [junit4]   2>   "roles":null,
   [junit4]   2>   "base_url":"http://127.0.0.1:54683/y_g/ad",
   [junit4]   2>   "node_name":"127.0.0.1:54683_y_g%2Fad",
   [junit4]   2>   "numShards":"1",
   [junit4]   2>   "state":"down",
   [junit4]   2>   "shard":null,
   [junit4]   2>   "collection":"control_collection",
   [junit4]   2>   "operation":"state"} current state version: 0
   [junit4]   2> 293937 INFO  (OverseerStateUpdate-96581303326343172-127.0.0.1:54683_y_g%2Fad-n_0000000000) [n:127.0.0.1:54683_y_g%2Fad    ] o.a.s.c.o.ReplicaMutator Update state numShards=1 message={
   [junit4]   2>   "core":"collection1",
   [junit4]   2>   "roles":null,
   [junit4]   2>   "base_url":"http://127.0.0.1:54683/y_g/ad",
   [junit4]   2>   "node_name":"127.0.0.1:54683_y_g%2Fad",
   [junit4]   2>   "numShards":"1",
   [junit4]   2>   "state":"down",
   [junit4]   2>   "shard":null,
   [junit4]   2>   "collection":"control_collection",
   [junit4]   2>   "operation":"state"}
   [junit4]   2> 293938 INFO  (OverseerStateUpdate-96581303326343172-127.0.0.1:54683_y_g%2Fad-n_0000000000) [n:127.0.0.1:54683_y_g%2Fad    ] o.a.s.c.o.ClusterStateMutator building a new cName: control_collection
   [junit4]   2> 293939 INFO  (coreLoadExecutor-1039-thread-1-processing-n:127.0.0.1:54683_y_g%2Fad) [n:127.0.0.1:54683_y_g%2Fad c:control_collection   x:collection1] o.a.s.c.c.ZkStateReader Deleting data for [control_collection]
   [junit4]   2> 293939 INFO  (OverseerStateUpdate-96581303326343172-127.0.0.1:54683_y_g%2Fad-n_0000000000) [n:127.0.0.1:54683_y_g%2Fad    ] o.a.s.c.o.ReplicaMutator Assigning new node to shard shard=shard1
   [junit4]   2> 293941 INFO  (coreLoadExecutor-1039-thread-1-processing-n:127.0.0.1:54683_y_g%2Fad) [n:127.0.0.1:54683_y_g%2Fad c:control_collection   x:collection1] o.a.s.c.ZkController look for our core node name
   [junit4]   2> 293942 INFO  (zkCallback-348-thread-1-processing-n:127.0.0.1:54683_y_g%2Fad) [n:127.0.0.1:54683_y_g%2Fad    ] o.a.s.c.c.ZkStateReader A cluster state change: [WatchedEvent state:SyncConnected type:NodeDataChanged path:/clusterstate.json], has occurred - updating... (live nodes size: [1])
   [junit4]   2> 294944 INFO  (coreLoadExecutor-1039-thread-1-processing-n:127.0.0.1:54683_y_g%2Fad) [n:127.0.0.1:54683_y_g%2Fad c:control_collection   x:collection1] o.a.s.c.ZkController waiting to find shard id in clusterstate for collection1
   [junit4]   2> 294944 INFO  (coreLoadExecutor-1039-thread-1-processing-n:127.0.0.1:54683_y_g%2Fad) [n:127.0.0.1:54683_y_g%2Fad c:control_collection   x:collection1] o.a.s.c.ZkController Check for collection zkNode:control_collection
   [junit4]   2> 294944 INFO  (coreLoadExecutor-1039-thread-1-processing-n:127.0.0.1:54683_y_g%2Fad) [n:127.0.0.1:54683_y_g%2Fad c:control_collection   x:collection1] o.a.s.c.ZkController Collection zkNode exists
   [junit4]   2> 294944 INFO  (coreLoadExecutor-1039-thread-1-processing-n:127.0.0.1:54683_y_g%2Fad) [n:127.0.0.1:54683_y_g%2Fad c:control_collection   x:collection1] o.a.s.c.c.ZkStateReader Load collection config from: [/collections/control_collection]
   [junit4]   2> 294946 INFO  (coreLoadExecutor-1039-thread-1-processing-n:127.0.0.1:54683_y_g%2Fad) [n:127.0.0.1:54683_y_g%2Fad c:control_collection   x:collection1] o.a.s.c.c.ZkStateReader path=[/collections/control_collection] [configName]=[conf1] specified config exists in ZooKeeper
   [junit4]   2> 294946 INFO  (coreLoadExecutor-1039-thread-1-processing-n:127.0.0.1:54683_y_g%2Fad) [n:127.0.0.1:54683_y_g%2Fad c:control_collection   x:collection1] o.a.s.c.SolrResourceLoader new SolrResourceLoader for directory: '/export/home/jenkins/workspace/Lucene-Solr-master-Solaris/solr/build/solr-core/test/J0/temp/solr.core.TestDynamicLoading_BA1D201B936A3587-001/control-001/cores/collection1'
   [junit4]   2> 294946 INFO  (coreLoadExecutor-1039-thread-1-processing-n:127.0.0.1:54683_y_g%2Fad) [n:127.0.0.1:54683_y_g%2Fad c:control_collection   x:collection1] o.a.s.c.SolrResourceLoader JNDI not configured for solr (NoInitialContextEx)
   [junit4]   2> 294946 INFO  (coreLoadExecutor-1039-thread-1-processing-n:127.0.0.1:54683_y_g%2Fad) [n:127.0.0.1:54683_y_g%2Fad c:control_collection   x:collection1] o.a.s.c.SolrResourceLoader solr home defaulted to 'solr/' (could not find system property or JNDI)
   [junit4]   2> 294948 INFO  (coreLoadExecutor-1039-thread-1-processing-n:127.0.0.1:54683_y_g%2Fad) [n:127.0.0.1:54683_y_g%2Fad c:control_collection   x:collection1] o.a.s.c.Config loaded config solrconfig.xml with version 0 
   [junit4]   2> 294954 INFO  (coreLoadExecutor-1039-thread-1-processing-n:127.0.0.1:54683_y_g%2Fad) [n:127.0.0.1:54683_y_g%2Fad c:control_collection   x:collection1] o.a.s.c.SolrConfig current version of requestparams : -1
   [junit4]   2> 294957 WARN  (coreLoadExecutor-1039-thread-1-processing-n:127.0.0.1:54683_y_g%2Fad) [n:127.0.0.1:54683_y_g%2Fad c:control_collection   x:collection1] o.a.s.c.Config Beginning with Solr 5.5, <mergePolicy> is deprecated, use <mergePolicyFactory> instead.
   [junit4]   2> 294958 INFO  (coreLoadExecutor-1039-thread-1-processing-n:127.0.0.1:54683_y_g%2Fad) [n:127.0.0.1:54683_y_g%2Fad c:control_collection   x:collection1] o.a.s.c.SolrConfig Using Lucene MatchVersion: 7.0.0
   [junit4]   2> 294963 INFO  (coreLoadExecutor-1039-thread-1-processing-n:127.0.0.1:54683_y_g%2Fad) [n:127.0.0.1:54683_y_g%2Fad c:control_collection   x:collection1] o.a.s.c.SolrConfig Loaded SolrConfig: solrconfig.xml
   [junit4]   2> 294971 INFO  (coreLoadExecutor-1039-thread-1-processing-n:127.0.0.1:54683_y_g%2Fad) [n:127.0.0.1:54683_y_g%2Fad c:control_collection   x:collection1] o.a.s.s.IndexSchema [collection1] Schema name=test
   [junit4]   2> 295036 INFO  (coreLoadExecutor-1039-thread-1-processing-n:127.0.0.1:54683_y_g%2Fad) [n:127.0.0.1:54683_y_g%2Fad c:control_collection   x:collection1] o.a.s.s.OpenExchangeRatesOrgProvider Initialized with rates=open-exchange-rates.json, refreshInterval=1440.
   [junit4]   2> 295042 INFO  (coreLoadExecutor-1039-thread-1-processing-n:127.0.0.1:54683_y_g%2Fad) [n:127.0.0.1:54683_y_g%2Fad c:control_collection   x:collection1] o.a.s.s.IndexSchema default search field in schema is text
   [junit4]   2> 295043 INFO  (coreLoadExecutor-1039-thread-1-processing-n:127.0.0.1:54683_y_g%2Fad) [n:127.0.0.1:54683_y_g%2Fad c:control_collection   x:collection1] o.a.s.s.IndexSchema unique key field: id
   [junit4]   2> 295056 INFO  (coreLoadExecutor-1039-thread-1-processing-n:127.0.0.1:54683_y_g%2Fad) [n:127.0.0.1:54683_y_g%2Fad c:control_collection   x:collection1] o.a.s.s.FileExchangeRateProvider Reloading exchange rates from file currency.xml
   [junit4]   2> 295058 INFO  (coreLoadExecutor-1039-thread-1-processing-n:127.0.0.1:54683_y_g%2Fad) [n:127.0.0.1:54683_y_g%2Fad c:control_collection   x:collection1] o.a.s.s.FileExchangeRateProvider Reloading exchange rates from file currency.xml
   [junit4]   2> 295060 INFO  (coreLoadExecutor-1039-thread-1-processing-n:127.0.0.1:54683_y_g%2Fad) [n:127.0.0.1:54683_y_g%2Fad c:control_collection   x:collection1] o.a.s.s.OpenExchangeRatesOrgProvider Reloading exchange rates from open-exchange-rates.json
   [junit4]   2> 295062 INFO  (coreLoadExecutor-1039-thread-1-processing-n:127.0.0.1:54683_y_g%2Fad) [n:127.0.0.1:54683_y_g%2Fad c:control_collection   x:collection1] o.a.s.s.OpenExchangeRatesOrgProvider Reloading exchange rates from open-exchange-rates.json
   [junit4]   2> 295063 INFO  (coreLoadExecutor-1039-thread-1-processing-n:127.0.0.1:54683_y_g%2Fad) [n:127.0.0.1:54683_y_g%2Fad c:control_collection   x:collection1] o.a.s.c.ConfigSetProperties Did not find ConfigSet properties, assuming default properties: Can't find resource 'configsetprops.json' in classpath or '/configs/conf1', cwd=/export/home/jenkins/workspace/Lucene-Solr-master-Solaris/solr/build/solr-core/test/J0
   [junit4]   2> 295064 INFO  (coreLoadExecutor-1039-thread-1-processing-n:127.0.0.1:54683_y_g%2Fad) [n:127.0.0.1:54683_y_g%2Fad c:control_collection   x:collection1] o.a.s.c.CoreContainer Creating SolrCore 'collection1' using configuration from collection control_collection
   [junit4]   2> 295064 INFO  (coreLoadExecutor-1039-thread-1-processing-n:127.0.0.1:54683_y_g%2Fad) [n:127.0.0.1:54683_y_g%2Fad c:control_collection s:shard1 r:core_node1 x:collection1] o.a.s.c.SolrCore org.apache.solr.core.MockDirectoryFactory
   [junit4]   2> 295064 INFO  (coreLoadExecutor-1039-thread-1-processing-n:127.0.0.1:54683_y_g%2Fad) [n:127.0.0.1:54683_y_g%2Fad c:control_collection s:shard1 r:core_node1 x:collection1] o.a.s.c.SolrCore [[collection1] ] Opening new SolrCore at [/export/home/jenkins/workspace/Lucene-Solr-master-Solaris/solr/build/solr-core/test/J0/temp/solr.core.TestDynamicLoading_BA1D201B936A3587-001/control-001/cores/collection1], dataDir=[/export/home/jenkins/workspace/Lucene-Solr-master-Solaris/solr/build/solr-core/test/J0/temp/solr.core.TestDynamicLoading_BA1D201B936A3587-001/control-001/cores/collection1/data/]
   [junit4]   2> 295064 INFO  (coreLoadExecutor-1039-thread-1-processing-n:127.0.0.1:54683_y_g%2Fad) [n:127.0.0.1:54683_y_g%2Fad c:control_collection s:shard1 r:core_node1 x:collection1] o.a.s.c.JmxMonitoredMap JMX monitoring is enabled. Adding Solr mbeans to JMX Server: com.sun.jmx.mbeanserver.JmxMBeanServer@553f5fa8
   [junit4]   2> 295064 INFO  (coreLoadExecutor-1039-thread-1-processing-n:127.0.0.1:54683_y_g%2Fad) [n:127.0.0.1:54683_y_g%2Fad c:control_collection s:shard1 r:core_node1 x:collection1] o.a.s.c.CachingDirectoryFactory return new directory for /export/home/jenkins/workspace/Lucene-Solr-master-Solaris/solr/build/solr-core/test/J0/temp/solr.core.TestDynamicLoading_BA1D201B936A3587-001/control-001/cores/collection1/data/snapshot_metadata
   [junit4]   2> 295064 INFO  (coreLoadExecutor-1039-thread-1-processing-n:127.0.0.1:54683_y_g%2Fad) [n:127.0.0.1:54683_y_g%2Fad c:control_collection s:shard1 r:core_node1 x:collection1] o.a.s.c.s.SolrSnapshotMetaDataManager Loading from snapshot metadata file...
   [junit4]   2> 295065 INFO  (coreLoadExecutor-1039-thread-1-processing-n:127.0.0.1:54683_y_g%2Fad) [n:127.0.0.1:54683_y_g%2Fad c:control_collection s:shard1 r:core_node1 x:collection1] o.a.s.c.CachingDirectoryFactory return new directory for /export/home/jenkins/workspace/Lucene-Solr-master-Solaris/solr/build/solr-core/test/J0/temp/solr.core.TestDynamicLoading_BA1D201B936A3587-001/control-001/cores/collection1/data
   [junit4]   2> 295065 INFO  (coreLoadExecutor-1039-thread-1-processing-n:127.0.0.1:54683_y_g%2Fad) [n:127.0.0.1:54683_y_g%2Fad c:control_collection s:shard1 r:core_node1 x:collection1] o.a.s.c.SolrCore New index directory detected: old=null new=/export/home/jenkins/workspace/Lucene-Solr-master-Solaris/solr/build/solr-core/test/J0/temp/solr.core.TestDynamicLoading_BA1D201B936A3587-001/control-001/cores/collection1/data/index/
   [junit4]   2> 295065 WARN  (coreLoadExecutor-1039-thread-1-processing-n:127.0.0.1:54683_y_g%2Fad) [n:127.0.0.1:54683_y_g%2Fad c:control_collection s:shard1 r:core_node1 x:collection1] o.a.s.c.SolrCore [collection1] Solr index directory '/export/home/jenkins/workspace/Lucene-Solr-master-Solaris/solr/build/solr-core/test/J0/temp/solr.core.TestDynamicLoading_BA1D201B936A3587-001/control-001/cores/collection1/data/index' doesn't exist. Creating new index...
   [junit4]   2> 295065 INFO  (coreLoadExecutor-1039-thread-1-processing-n:127.0.0.1:54683_y_g%2Fad) [n:127.0.0.1:54683_y_g%2Fad c:control_collection s:shard1 r:core_node1 x:collection1] o.a.s.c.CachingDirectoryFactory return new directory for /export/home/jenkins/workspace/Lucene-Solr-master-Solaris/solr/build/solr-core/test/J0/temp/solr.core.TestDynamicLoading_BA1D201B936A3587-001/control-001/cores/collection1/data/index
   [junit4]   2> 295065 INFO  (coreLoadExecutor-1039-thread-1-processing-n:127.0.0.1:54683_y_g%2Fad) [n:127.0.0.1:54683_y_g%2Fad c:control_collection s:shard1 r:core_node1 x:collection1] o.a.s.u.RandomMergePolicy RandomMergePolicy wrapping class org.apache.lucene.index.LogDocMergePolicy: [LogDocMergePolicy: minMergeSize=1000, mergeFactor=24, maxMergeSize=9223372036854775807, maxMergeSizeForForcedMerge=9223372036854775807, calibrateSizeByDeletes=false, maxMergeDocs=2147483647, maxCFSSegmentSizeMB=8.796093022207999E12, noCFSRatio=1.0]
   [junit4]   2> 295065 INFO  (coreLoadExecutor-1039-thread-1-processing-n:127.0.0.1:54683_y_g%2Fad) [n:127.0.0.1:54683_y_g%2Fad c:control_collection s:shard1 r:core_node1 x:collection1] o.a.s.c.SolrDeletionPolicy SolrDeletionPolicy.onCommit: commits: num=1
   [junit4]   2> 	commit{dir=MockDirectoryWrapper(RAMDirectory@50f9344d lockFactory=org.apache.lucene.store.SingleInstanceLockFactory@37c9e8f6),segFN=segments_1,generation=1}
   [junit4]   2> 295065 INFO  (coreLoadExecutor-1039-thread-1-processing-n:127.0.0.1:54683_y_g%2Fad) [n:127.0.0.1:54683_y_g%2Fad c:control_collection s:shard1 r:core_node1 x:collection1] o.a.s.c.SolrDeletionPolicy newest commit generation = 1
   [junit4]   2> 295066 INFO  (OldIndexDirectoryCleanupThreadForCore-collection1) [n:127.0.0.1:54683_y_g%2Fad c:control_collection s:shard1 r:core_node1 x:collection1] o.a.s.c.SolrCore Looking for old index directories to cleanup for core collection1 in /export/home/jenkins/workspace/Lucene-Solr-master-Solaris/solr/build/solr-core/test/J0/temp/solr.core.TestDynamicLoading_BA1D201B936A3587-001/control-001/cores/collection1/data/
   [junit4]   2> 295066 WARN  (OldIndexDirectoryCleanupThreadForCore-collection1) [n:127.0.0.1:54683_y_g%2Fad c:control_collection s:shard1 r:core_node1 x:collection1] o.a.s.c.DirectoryFactory /export/home/jenkins/workspace/Lucene-Solr-master-Solaris/solr/build/solr-core/test/J0/temp/solr.core.TestDynamicLoading_BA1D201B936A3587-001/control-001/cores/collection1/data/ does not point to a valid data directory; skipping clean-up of old index directories.
   [junit4]   2> 295069 INFO  (coreLoadExecutor-1039-thread-1-processing-n:127.0.0.1:54683_y_g%2Fad) [n:127.0.0.1:54683_y_g%2Fad c:control_collection s:shard1 r:core_node1 x:collection1] o.a.s.u.p.UpdateRequestProcessorChain creating updateRequestProcessorChain "nodistrib"
   [junit4]   2> 295069 INFO  (coreLoadExecutor-1039-thread-1-processing-n:127.0.0.1:54683_y_g%2Fad) [n:127.0.0.1:54683_y_g%2Fad c:control_collection s:shard1 r:core_node1 x:collection1] o.a.s.u.p.UpdateRequestProcessorChain creating updateRequestProcessorChain "dedupe"
   [junit4]   2> 295069 INFO  (coreLoadExecutor-1039-thread-1-processing-n:127.0.0.1:54683_y_g%2Fad) [n:127.0.0.1:54683_y_g%2Fad c:control_collection s:shard1 r:core_node1 x:collection1] o.a.s.u.p.UpdateRequestProcessorChain inserting DistributedUpdateProcessorFactory into updateRequestProcessorChain "dedupe"
   [junit4]   2> 295069 INFO  (coreLoadExecutor-1039-thread-1-processing-n:127.0.0.1:54683_y_g%2Fad) [n:127.0.0.1:54683_y_g%2Fad c:control_collection s:shard1 r:core_node1 x:collection1] o.a.s.u.p.UpdateRequestProcessorChain creating updateRequestProcessorChain "stored_sig"
   [junit4]   2> 295069 INFO  (coreLoadExecutor-1039-thread-1-processing-n:127.0.0.1:54683_y_g%2Fad) [n:127.0.0.1:54683_y_g%2Fad c:control_collection s:shard1 r:core_node1 x:collection1] o.a.s.u.p.UpdateRequestProcessorChain inserting DistributedUpdateProcessorFactory into updateRequestProcessorChain "stored_sig"
   [junit4]   2> 295069 INFO  (coreLoadExecutor-1039-thread-1-processing-n:127.0.0.1:54683_y_g%2Fad) [n:127.0.0.1:54683_y_g%2Fad c:control_collection s:shard1 r:core_node1 x:collection1] o.a.s.u.p.UpdateRequestProcessorChain creating updateRequestProcessorChain "distrib-dup-test-chain-explicit"
   [junit4]   2> 295069 INFO  (coreLoadExecutor-1039-thread-1-processing-n:127.0.0.1:54683_y_g%2Fad) [n:127.0.0.1:54683_y_g%2Fad c:control_collection s:shard1 r:core_node1 x:collection1] o.a.s.u.p.UpdateRequestProcessorChain creating updateRequestProcessorChain "distrib-dup-test-chain-implicit"
   [junit4]   2> 295069 INFO  (coreLoadExecutor-1039-thread-1-processing-n:127.0.0.1:54683_y_g%2Fad) [n:127.0.0.1:54683_y_g%2Fad c:control_collection s:shard1 r:core_node1 x:collection1] o.a.s.u.p.UpdateRequestProcessorChain inserting DistributedUpdateProcessorFactory into updateRequestProcessorChain "distrib-dup-test-chain-implicit"
   [junit4]   2> 295070 INFO  (coreLoadExecutor-1039-thread-1-processing-n:127.0.0.1:54683_y_g%2Fad) [n:127.0.0.1:54683_y_g%2Fad c:control_collection s:shard1 r:core_node1 x:collection1] o.a.s.c.SolrCore no updateRequestProcessorChain defined as default, creating implicit default
   [junit4]   2> 295070 WARN  (coreLoadExecutor-1039-thread-1-processing-n:127.0.0.1:54683_y_g%2Fad) [n:127.0.0.1:54683_y_g%2Fad c:control_collection s:shard1 r:core_node1 x:collection1] o.a.s.c.RequestHandlers INVALID paramSet a in requestHandler {type = requestHandler,name = /dump,class = DumpRequestHandler,args = {defaults={a=A,b=B}}}
   [junit4]   2> 295072 INFO  (coreLoadExecutor-1039-thread-1-processing-n:127.0.0.1:54683_y_g%2Fad) [n:127.0.0.1:54683_y_g%2Fad c:control_collection s:shard1 r:core_node1 x:collection1] o.a.s.h.l.XMLLoader xsltCacheLifetimeSeconds=60
   [junit4]   2> 295073 INFO  (coreLoadExecutor-1039-thread-1-processing-n:127.0.0.1:54683_y_g%2Fad) [n:127.0.0.1:54683_y_g%2Fad c:control_collection s:shard1 r:core_node1 x:collection1] o.a.s.h.l.XMLLoader xsltCacheLifetimeSeconds=60
   [junit4]   2> 295074 INFO  (coreLoadExecutor-1039-thread-1-processing-n:127.0.0.1:54683_y_g%2Fad) [n:127.0.0.1:54683_y_g%2Fad c:control_collection s:shard1 r:core_node1 x:collection1] o.a.s.h.l.XMLLoader xsltCacheLifetimeSeconds=60
   [junit4]   2> 295075 INFO  (coreLoadExecutor-1039-thread-1-processing-n:127.0.0.1:54683_y_g%2Fad) [n:127.0.0.1:54683_y_g%2Fad c:control_collection s:shard1 r:core_node1 x:collection1] o.a.s.h.l.XMLLoader xsltCacheLifetimeSeconds=60
   [junit4]   2> 295078 INFO  (coreLoadExecutor-1039-thread-1-processing-n:127.0.0.1:54683_y_g%2Fad) [n:127.0.0.1:54683_y_g%2Fad c:control_collection s:shard1 r:core_node1 x:collection1] o.a.s.c.RequestHandlers Registered paths: /admin/mbeans,standard,/update/json/docs,/admin/luke,/export,/get,/admin/properties,/update/json,/admin/threads,/dump,/update/csv,/sql,/graph,/admin/segments,/admin/system,/replication,/config,/stream,/schema,/admin/plugins,/admin/logging,/admin/ping,/update,/admin/file,/terms
   [junit4]   2> 295078 INFO  (coreLoadExecutor-1039-thread-1-processing-n:127.0.0.1:54683_y_g%2Fad) [n:127.0.0.1:54683_y_g%2Fad c:control_collection s:shard1 r:core_node1 x:collection1] o.a.s.c.SolrCore Using default statsCache cache: org.apache.solr.search.stats.LocalStatsCache
   [junit4]   2> 295079 INFO  (coreLoadExecutor-1039-thread-1-processing-n:127.0.0.1:54683_y_g%2Fad) [n:127.0.0.1:54683_y_g%2Fad c:control_collection s:shard1 r:core_node1 x:collection1] o.a.s.u.UpdateHandler Using UpdateLog implementation: org.apache.solr.update.UpdateLog
   [junit4]   2> 295079 INFO  (coreLoadExecutor-1039-thread-1-processing-n:127.0.0.1:54683_y_g%2Fad) [n:127.0.0.1:54683_y_g%2Fad c:control_collection s:shard1 r:core_node1 x:collection1] o.a.s.u.UpdateLog Initializing UpdateLog: dataDir= defaultSyncLevel=FLUSH numRecordsToKeep=100 maxNumLogsToKeep=10 numVersionBuckets=65536
   [junit4]   2> 295079 INFO  (coreLoadExecutor-1039-thread-1-processing-n:127.0.0.1:54683_y_g%2Fad) [n:127.0.0.1:54683_y_g%2Fad c:control_collection s:shard1 r:core_node1 x:collection1] o.a.s.u.CommitTracker Hard AutoCommit: disabled
   [junit4]   2> 295079 INFO  (coreLoadExecutor-1039-thread-1-processing-n:127.0.0.1:54683_y_g%2Fad) [n:127.0.0.1:54683_y_g%2Fad c:control_collection s:shard1 r:core_node1 x:collection1] o.a.s.u.CommitTracker Soft AutoCommit: disabled
   [junit4]   2> 295080 INFO  (coreLoadExecutor-1039-thread-1-processing-n:127.0.0.1:54683_y_g%2Fad) [n:127.0.0.1:54683_y_g%2Fad c:control_collection s:shard1 r:core_node1 x:collection1] o.a.s.u.RandomMergePolicy RandomMergePolicy wrapping class org.apache.lucene.index.LogDocMergePolicy: [LogDocMergePolicy: minMergeSize=1000, mergeFactor=24, maxMergeSize=9223372036854775807, maxMergeSizeForForcedMerge=9223372036854775807, calibrateSizeByDeletes=false, maxMergeDocs=2147483647, maxCFSSegmentSizeMB=8.796093022207999E12, noCFSRatio=0.5121487944344562]
   [junit4]   2> 295080 INFO  (coreLoadExecutor-1039-thread-1-processing-n:127.0.0.1:54683_y_g%2Fad) [n:127.0.0.1:54683_y_g%2Fad c:control_collection s:shard1 r:core_node1 x:collection1] o.a.s.c.SolrDeletionPolicy SolrDeletionPolicy.onInit: commits: num=1
   [junit4]   2> 	commit{dir=MockDirectoryWrapper(RAMDirectory@50f9344d lockFactory=org.apache.lucene.store.SingleInstanceLockFactory@37c9e8f6),segFN=segments_1,generation=1}
   [junit4]   2> 295080 INFO  (coreLoadExecutor-1039-thread-1-processing-n:127.0.0.1:54683_y_g%2Fad) [n:127.0.0.1:54683_y_g%2Fad c:control_collection s:shard1 r:core_node1 x:collection1] o.a.s.c.SolrDeletionPolicy newest commit generation = 1
   [junit4]   2> 295080 INFO  (coreLoadExecutor-1039-thread-1-processing-n:127.0.0.1:54683_y_g%2Fad) [n:127.0.0.1:54683_y_g%2Fad c:control_collection s:shard1 r:core_node1 x:collection1] o.a.s.s.SolrIndexSearcher Opening [Searcher@b40fa65[collection1] main]
   [junit4]   2> 295080 INFO  (coreLoadExecutor-1039-thread-1-processing-n:127.0.0.1:54683_y_g%2Fad) [n:127.0.0.1:54683_y_g%2Fad c:control_collection s:shard1 r:core_node1 x:collection1] o.a.s.c.c.ZkStateReader Load collection config from: [/collections/control_collection]
   [junit4]   2> 295082 INFO  (coreLoadExecutor-1039-thread-1-processing-n:127.0.0.1:54683_y_g%2Fad) [n:127.0.0.1:54683_y_g%2Fad c:control_collection s:shard1 r:core_node1 x:collection1] o.a.s.c.c.ZkStateReader path=[/collections/control_collection] [configName]=[conf1] specified config exists in ZooKeeper
   [junit4]   2> 295082 INFO  (coreLoadExecutor-1039-thread-1-processing-n:127.0.0.1:54683_y_g%2Fad) [n:127.0.0.1:54683_y_g%2Fad c:control_collection s:shard1 r:core_node1 x:collection1] o.a.s.r.ManagedResourceStorage Setting up ZooKeeper-based storage for the RestManager with znodeBase: /configs/conf1
   [junit4]   2> 295082 INFO  (coreLoadExecutor-1039-thread-1-processing-n:127.0.0.1:54683_y_g%2Fad) [n:127.0.0.1:54683_y_g%2Fad c:control_collection s:shard1 r:core_node1 x:collection1] o.a.s.r.ManagedResourceStorage Configured ZooKeeperStorageIO with znodeBase: /configs/conf1
   [junit4]   2> 295082 INFO  (coreLoadExecutor-1039-thread-1-processing-n:127.0.0.1:54683_y_g%2Fad) [n:127.0.0.1:54683_y_g%2Fad c:control_collection s:shard1 r:core_node1 x:collection1] o.a.s.r.RestManager Initializing RestManager with initArgs: {}
   [junit4]   2> 295082 INFO  (coreLoadExecutor-1039-thread-1-processing-n:127.0.0.1:54683_y_g%2Fad) [n:127.0.0.1:54683_y_g%2Fad c:control_collection s:shard1 r:core_node1 x:collection1] o.a.s.r.ManagedResourceStorage Reading _rest_managed.json using ZooKeeperStorageIO:path=/configs/conf1
   [junit4]   2> 295083 INFO  (coreLoadExecutor-1039-thread-1-processing-n:127.0.0.1:54683_y_g%2Fad) [n:127.0.0.1:54683_y_g%2Fad c:control_collection s:shard1 r:core_node1 x:collection1] o.a.s.r.ManagedResourceStorage No data found for znode /configs/conf1/_rest_managed.json
   [junit4]   2> 295083 INFO  (coreLoadExecutor-1039-thread-1-processing-n:127.0.0.1:54683_y_g%2Fad) [n:127.0.0.1:54683_y_g%2Fad c:control_collection s:shard1 r:core_node1 x:collection1] o.a.s.r.ManagedResourceStorage Loaded null at path _rest_managed.json using ZooKeeperStorageIO:path=/configs/conf1
   [junit4]   2> 295083 INFO  (coreLoadExecutor-1039-thread-1-processing-n:127.0.0.1:54683_y_g%2Fad) [n:127.0.0.1:54683_y_g%2Fad c:control_collection s:shard1 r:core_node1 x:collection1] o.a.s.r.RestManager Initializing 0 registered ManagedResources
   [junit4]   2> 295083 INFO  (coreLoadExecutor-1039-thread-1-processing-n:127.0.0.1:54683_y_g%2Fad) [n:127.0.0.1:54683_y_g%2Fad c:control_collection s:shard1 r:core_node1 x:collection1] o.a.s.h.ReplicationHandler Commits will be reserved for  10000
   [junit4]   2> 295083 INFO  (searcherExecutor-1040-thread-1-processing-n:127.0.0.1:54683_y_g%2Fad x:collection1 s:shard1 c:control_collection r:core_node1) [n:127.0.0.1:54683_y_g%2Fad c:control_collection s:shard1 r:core_node1 x:collection1] o.a.s.c.SolrCore [collection1] Registered new searcher Searcher@b40fa65[collection1] main{ExitableDirectoryReader(UninvertingDirectoryReader())}
   [junit4]   2> 295084 INFO  (coreLoadExecutor-1039-thread-1-processing-n:127.0.0.1:54683_y_g%2Fad) [n:127.0.0.1:54683_y_g%2Fad c:control_collection s:shard1 r:core_node1 x:collection1] o.a.s.u.UpdateLog Looking up max value of version field to seed version buckets
   [junit4]   2> 295084 INFO  (coreLoadExecutor-1039-thread-1-processing-n:127.0.0.1:54683_y_g%2Fad) [n:127.0.0.1:54683_y_g%2Fad c:control_collection s:shard1 r:core_node1 x:collection1] o.a.s.u.VersionInfo Refreshing highest value of _version_ for 65536 version buckets from index
   [junit4]   2> 295084 INFO  (coreLoadExecutor-1039-thread-1-processing-n:127.0.0.1:54683_y_g%2Fad) [n:127.0.0.1:54683_y_g%2Fad c:control_collection s:shard1 r:core_node1 x:collection1] o.a.s.u.VersionInfo No terms found for _version_, cannot seed version bucket highest value from index
   [junit4]   2> 295084 INFO  (coreLoadExecutor-1039-thread-1-processing-n:127.0.0.1:54683_y_g%2Fad) [n:127.0.0.1:54683_y_g%2Fad c:control_collection s:shard1 r:core_node1 x:collection1] o.a.s.u.UpdateLog Could not find max version in index or recent updates, using new clock 1545300854854123520
   [junit4]   2> 295086 INFO  (coreLoadExecutor-1039-thread-1-processing-n:127.0.0.1:54683_y_g%2Fad) [n:127.0.0.1:54683_y_g%2Fad c:control_collection s:shard1 r:core_node1 x:collection1] o.a.s.u.UpdateLog Took 2.0ms to seed version buckets with highest version 1545300854854123520
   [junit4]   2> 295086 INFO  (coreLoadExecutor-1039-thread-1-processing-n:127.0.0.1:54683_y_g%2Fad) [n:127.0.0.1:54683_y_g%2Fad c:control_collection s:shard1 r:core_node1 x:collection1] o.a.s.c.ZkController watch zkdir /configs/conf1
   [junit4]   2> 295086 INFO  (coreLoadExecutor-1039-thread-1-processing-n:127.0.0.1:54683_y_g%2Fad) [n:127.0.0.1:54683_y_g%2Fad c:control_collection s:shard1 r:core_node1 x:collection1] o.a.s.c.CoreContainer registering core: collection1
   [junit4]   2> 295087 INFO  (coreZkRegister-1032-thread-1-processing-n:127.0.0.1:54683_y_g%2Fad x:collection1 s:shard1 c:control_collection r:core_node1) [n:127.0.0.1:54683_y_g%2Fad c:control_collection s:shard1 r:core_node1 x:collection1] o.a.s.c.ZkController Register replica - core:collection1 address:http://127.0.0.1:54683/y_g/ad collection:control_collection shard:shard1
   [junit4]   2> 295088 INFO  (coreZkRegister-1032-thread-1-processing-n:127.0.0.1:54683_y_g%2Fad x:collection1 s:shard1 c:control_collection r:core_node1) [n:127.0.0.1:54683_y_g%2Fad c:control_collection s:shard1 r:core_node1 x:collection1] o.a.s.c.c.SolrZkClient makePath: /collections/control_collection/leader_elect/shard1/election
   [junit4]   2> 295094 INFO  (coreZkRegister-1032-thread-1-processing-n:127.0.0.1:54683_y_g%2Fad x:collection1 s:shard1 c:control_collection r:core_node1) [n:127.0.0.1:54683_y_g%2Fad c:control_collection s:shard1 r:core_node1 x:collection1] o.a.s.c.LeaderElector Joined leadership election with path: /collections/control_collection/leader_elect/shard1/election/96581303326343172-core_node1-n_0000000000
   [junit4]   2> 295094 INFO  (coreZkRegister-1032-thread-1-processing-n:127.0.0.1:54683_y_g%2Fad x:collection1 s:shard1 c:control_collection r:core_node1) [n:127.0.0.1:54683_y_g%2Fad c:control_collection s:shard1 r:core_node1 x:collection1] o.a.s.c.ShardLeaderElectionContext Running the leader process for shard=shard1 and weAreReplacement=false and leaderVoteWait=10000
   [junit4]   2> 295097 INFO  (coreZkRegister-1032-thread-1-processing-n:127.0.0.1:54683_y_g%2Fad x:collection1 s:shard1 c:control_collection r:core_node1) [n:127.0.0.1:54683_y_g%2Fad c:control_collection s:shard1 r:core_node1 x:collection1] o.a.s.c.ShardLeaderElectionContext Enough replicas found to continue.
   [junit4]   2> 295097 INFO  (coreZkRegister-1032-thread-1-processing-n:127.0.0.1:54683_y_g%2Fad x:collection1 s:shard1 c:control_collection r:core_node1) [n:127.0.0.1:54683_y_g%2Fad c:control_collection s:shard1 r:core_node1 x:collection1] o.a.s.c.ShardLeaderElectionContext I may be the new leader - try and sync
   [junit4]   2> 295097 INFO  (OverseerStateUpdate-96581303326343172-127.0.0.1:54683_y_g%2Fad-n_0000000000) [n:127.0.0.1:54683_y_g%2Fad    ] o.a.s.c.Overseer processMessage: queueSize: 1, message = {
   [junit4]   2>   "operation":"leader",
   [junit4]   2>   "shard":"shard1",
   [junit4]   2>   "collection":"control_collection"} current state version: 1
   [junit4]   2> 295097 INFO  (coreZkRegister-1032-thread-1-processing-n:127.0.0.1:54683_y_g%2Fad x:collection1 s:shard1 c:control_collection r:core_node1) [n:127.0.0.1:54683_y_g%2Fad c:control_collection s:shard1 r:core_node1 x:collection1] o.a.s.c.SyncStrategy Sync replicas to http://127.0.0.1:54683/y_g/ad/collection1/
   [junit4]   2> 295097 INFO  (coreZkRegister-1032-thread-1-processing-n:127.0.0.1:54683_y_g%2Fad x:collection1 s:shard1 c:control_collection r:core_node1) [n:127.0.0.1:54683_y_g%2Fad c:control_collection s:shard1 r:core_node1 x:collection1] o.a.s.c.SyncStrategy Sync Success - now sync replicas to me
   [junit4]   2> 295097 INFO  (coreZkRegister-1032-thread-1-processing-n:127.0.0.1:54683_y_g%2Fad x:collection1 s:shard1 c:control_collection r:core_node1) [n:127.0.0.1:54683_y_g%2Fad c:control_collection s:shard1 r:core_node1 x:collection1] o.a.s.c.SyncStrategy http://127.0.0.1:54683/y_g/ad/collection1/ has no replicas
   [junit4]   2> 295099 INFO  (coreZkRegister-1032-thread-1-processing-n:127.0.0.1:54683_y_g%2Fad x:collection1 s:shard1 c:control_collection r:core_node1) [n:127.0.0.1:54683_y_g%2Fad c:control_collection s:shard1 r:core_node1 x:collection1] o.a.s.c.c.SolrZkClient makePath: /collections/control_collection/leaders/shard1
   [junit4]   2> 295102 INFO  (coreZkRegister-1032-thread-1-processing-n:127.0.0.1:54683_y_g%2Fad x:collection1 s:shard1 c:control_collection r:core_node1) [n:127.0.0.1:54683_y_g%2Fad c:control_collection s:shard1 r:core_node1 x:collection1] o.a.s.c.ShardLeaderElectionContextBase Creating leader registration node /collections/control_collection/leaders/shard1/leader after winning as /collections/control_collection/leader_elect/shard1/election/96581303326343172-core_node1-n_0000000000
   [junit4]   2> 295105 INFO  (coreZkRegister-1032-thread-1-processing-n:127.0.0.1:54683_y_g%2Fad x:collection1 s:shard1 c:control_collection r:core_node1) [n:127.0.0.1:54683_y_g%2Fad c:control_collection s:shard1 r:core_node1 x:collection1] o.a.s.c.ShardLeaderElectionContext I am the new leader: http://127.0.0.1:54683/y_g/ad/collection1/ shard1
   [junit4]   2> 295106 INFO  (OverseerStateUpdate-96581303326343172-127.0.0.1:54683_y_g%2Fad-n_0000000000) [n:127.0.0.1:54683_y_g%2Fad    ] o.a.s.c.Overseer processMessage: queueSize: 1, message = {
   [junit4]   2>   "operation":"leader",
   [junit4]   2>   "shard":"shard1",
   [junit4]   2>   "collection":"control_collection",
   [junit4]   2>   "base_url":"http://127.0.0.1:54683/y_g/ad",
   [junit4]   2>   "core":"collection1",
   [junit4]   2>   "state":"active"} current state version: 1
   [junit4]   2> 295210 INFO  (zkCallback-348-thread-2-processing-n:127.0.0.1:54683_y_g%2Fad) [n:127.0.0.1:54683_y_g%2Fad    ] o.a.s.c.c.ZkStateReader A cluster state change: [WatchedEvent state:SyncConnected type:NodeDataChanged path:/clusterstate.json], has occurred - updating... (live nodes size: [1])
   [junit4]   2> 295257 INFO  (coreZkRegister-1032-thread-1-processing-n:127.0.0.1:54683_y_g%2Fad x:collection1 s:shard1 c:control_collection r:core_node1) [n:127.0.0.1:54683_y_g%2Fad c:control_collection s:shard1 r:core_node1 x:collection1] o.a.s.c.ZkController We are http://127.0.0.1:54683/y_g/ad/collection1/ and leader is http://127.0.0.1:54683/y_g/ad/collection1/
   [junit4]   2> 295257 INFO  (coreZkRegister-1032-thread-1-processing-n:127.0.0.1:54683_y_g%2Fad x:collection1 s:shard1 c:control_collection r:core_node1) [n:127.0.0.1:54683_y_g%2Fad c:control_collection s:shard1 r:core_node1 x:collection1] o.a.s.c.ZkController No LogReplay needed for core=collection1 baseURL=http://127.0.0.1:54683/y_g/ad
   [junit4]   2> 295257 INFO  (coreZkRegister-1032-thread-1-processing-n:127.0.0.1:54683_y_g%2Fad x:collection1 s:shard1 c:control_collection r:core_node1) [n:127.0.0.1:54683_y_g%2Fad c:control_collection s:shard1 r:core_node1 x:collection1] o.a.s.c.ZkController I am the leader, no recovery necessary
   [junit4]   2> 295257 INFO  (coreZkRegister-1032-thread-1-processing-n:127.0.0.1:54683_y_g%2Fad x:collection1 s:shard1 c:control_collection r:core_node1) [n:127.0.0.1:54683_y_g%2Fad c:control_collection s:shard1 r:core_node1 x:collection1] o.a.s.c.ZkController publishing state=active
   [junit4]   2> 295257 INFO  (coreZkRegister-1032-thread-1-processing-n:127.0.0.1:54683_y_g%2Fad x:collection1 s:shard1 c:control_collection r:core_node1) [n:127.0.0.1:54683_y_g%2Fad c:control_collection s:shard1 r:core_node1 x:collection1] o.a.s.c.ZkController numShards not found on descriptor - reading it from system property
   [junit4]   2> 295259 INFO  (coreZkRegister-1032-thread-1-processing-n:127.0.0.1:54683_y_g%2Fad x:collection1 s:shard1 c:control_collection r:core_node1) [n:127.0.0.1:54683_y_g%2Fad c:control_collection s:shard1 r:core_node1 x:collection1] o.a.s.c.c.ZkStateReader Checking legacy cluster state for collection control_collection
   [junit4]   2> 295261 INFO  (OverseerStateUpdate-96581303326343172-127.0.0.1:54683_y_g%2Fad-n_0000000000) [n:127.0.0.1:54683_y_g%2Fad    ] o.a.s.c.Overseer processMessage: queueSize: 1, message = {
   [junit4]   2>   "core":"collection1",
   [junit4]   2>   "core_node_name":"core_node1",
   [junit4]   2>   "roles":null,
   [junit4]   2>   "base_url":"http://127.0.0.1:54683/y_g/ad",
   [junit4]   2>   "node_name":"127.0.0.1:54683_y_g%2Fad",
   [junit4]   2>   "numShards":"1",
   [junit4]   2>   "state":"active",
   [junit4]   2>   "shard":"shard1",
   [junit4]   2>   "collection":"control_collection",
   [junit4]   2>   "operation":"state"} current state version: 2
   [junit4]   2> 295261 INFO  (OverseerStateUpdate-96581303326343172-127.0.0.1:54683_y_g%2Fad-n_0000000000) [n:127.0.0.1:54683_y_g%2Fad    ] o.a.s.c.o.ReplicaMutator Update state numShards=1 message={
   [junit4]   2>   "core":"collection1",
   [junit4]   2>   "core_node_name":"core_node1",
   [junit4]   2>   "roles":null,
   [junit4]   2>   "base_url":"http://127.0.0.1:54683/y_g/ad",
   [junit4]   2>   "node_name":"127.0.0.1:54683_y_g%2Fad",
   [junit4]   2>   "numShards":"1",
   [junit4]   2>   "state":"active",
   [junit4]   2>   "shard":"shard1",
   [junit4]   2>   "collection":"control_collection",
   [junit4]   2>   "operation":"state"}
   [junit4]   2> 295365 INFO  (zkCallback-348-thread-3-processing-n:127.0.0.1:54683_y_g%2Fad) [n:127.0.0.1:54683_y_g%2Fad    ] o.a.s.c.c.ZkStateReader A cluster state change: [WatchedEvent state:SyncConnected type:NodeDataChanged path:/clusterstate.json], has occurred - updating... (live nodes size: [1])
   [junit4]   2> 295450 INFO  (TEST-TestDynamicLoading.testDynamicLoading-seed#[BA1D201B936A3587]) [    ] o.a.s.c.c.SolrZkClient Using default ZkCredentialsProvider
   [junit4]   2> 295451 INFO  (TEST-TestDynamicLoading.testDynamicLoading-seed#[BA1D201B936A3587]) [    ] o.a.s.c.c.ConnectionManager Waiting for client to connect to ZooKeeper
   [junit4]   2> 295454 INFO  (zkCallback-352-thread-1) [    ] o.a.s.c.c.ConnectionManager Watcher org.apache.solr.common.cloud.ConnectionManager@5e601cd3 name:ZooKeeperConnection Watcher:127.0.0.1:54605/solr got event WatchedEvent state:SyncConnected type:None path:null path:null type:None
   [junit4]   2> 295454 INFO  (TEST-TestDynamicLoading.testDynamicLoading-seed#[BA1D201B936A3587]) [    ] o.a.s.c.c.ConnectionManager Client is connected to ZooKeeper
   [junit4]   2> 295454 INFO  (TEST-TestDynamicLoading.testDynamicLoading-seed#[BA1D201B936A3587]) [    ] o.a.s.c.c.SolrZkClient Using default ZkACLProvider
   [junit4]   2> 295454 INFO  (TEST-TestDynamicLoading.testDynamicLoading-seed#[BA1D201B936A3587]) [    ] o.a.s.c.c.ZkStateReader Updating cluster state from ZooKeeper... 
   [junit4]   2> 295455 INFO  (TEST-TestDynamicLoading.testDynamicLoading-seed#[BA1D201B936A3587]) [    ] o.a.s.c.c.ZkStateReader Loaded empty cluster properties
   [junit4]   2> 295456 INFO  (TEST-TestDynamicLoading.testDynamicLoading-seed#[BA1D201B936A3587]) [    ] o.a.s.c.c.ZkStateReader Updated live nodes from ZooKeeper... (0) -> (1)
   [junit4]   2> 295459 INFO  (TEST-TestDynamicLoading.testDynamicLoading-seed#[BA1D201B936A3587]) [    ] o.a.s.c.ChaosMonkey monkey: init - expire sessions:false cause connection loss:false
   [junit4]   2> 295620 INFO  (TEST-TestDynamicLoading.testDynamicLoading-seed#[BA1D201B936A3587]) [    ] o.a.s.SolrTestCaseJ4 Writing core.properties file to /export/home/jenkins/workspace/Lucene-Solr-master-Solaris/solr/build/solr-core/test/J0/temp/solr.core.TestDynamicLoading_BA1D201B936A3587-001/shard-1-001/cores/collection1
   [junit4]   2> 295620 INFO  (TEST-TestDynamicLoading.testDynamicLoading-seed#[BA1D201B936A3587]) [    ] o.a.s.c.AbstractFullDistribZkTestBase create jetty 1 in directory /export/home/jenkins/workspace/Lucene-Solr-master-Solaris/solr/build/solr-core/test/J0/temp/solr.core.TestDynamicLoading_BA1D201B936A3587-001/shard-1-001
   [junit4]   2> 295621 INFO  (TEST-TestDynamicLoading.testDynamicLoading-seed#[BA1D201B936A3587]) [    ] o.e.j.s.Server jetty-9.3.8.v20160314
   [junit4]   2> 295623 INFO  (TEST-TestDynamicLoading.testDynamicLoading-seed#[BA1D201B936A3587]) [    ] o.e.j.s.h.ContextHandler Started o.e.j.s.ServletContextHandler@5030ef32{/y_g/ad,null,AVAILABLE}
   [junit4]   2> 295623 INFO  (TEST-TestDynamicLoading.testDynamicLoading-seed#[BA1D201B936A3587]) [    ] o.e.j.s.ServerConnector Started ServerConnector@304bfa7a{HTTP/1.1,[http/1.1]}{127.0.0.1:63758}
   [junit4]   2> 295623 INFO  (TEST-TestDynamicLoading.testDynamicLoading-seed#[BA1D201B936A3587]) [    ] o.e.j.s.Server Started @300080ms
   [junit4]   2> 295623 INFO  (TEST-TestDynamicLoading.testDynamicLoading-seed#[BA1D201B936A3587]) [    ] o.a.s.c.s.e.JettySolrRunner Jetty properties: {solr.data.dir=/export/home/jenkins/workspace/Lucene-Solr-master-Solaris/solr/build/solr-core/test/J0/temp/solr.core.TestDynamicLoading_BA1D201B936A3587-001/tempDir-001/jetty1, solrconfig=solrconfig.xml, hostContext=/y_g/ad, hostPort=63758, coreRootDirectory=/export/home/jenkins/workspace/Lucene-Solr-master-Solaris/solr/build/solr-core/test/J0/temp/solr.core.TestDynamicLoading_BA1D201B936A3587-001/shard-1-001/cores}
   [junit4]   2> 295624 INFO  (TEST-TestDynamicLoading.testDynamicLoading-seed#[BA1D201B936A3587]) [    ] o.a.s.s.SolrDispatchFilter SolrDispatchFilter.init(): sun.misc.Launcher$AppClassLoader@6d06d69c
   [junit4]   2> 295624 INFO  (TEST-TestDynamicLoading.testDynamicLoading-seed#[BA1D201B936A3587]) [    ] o.a.s.c.SolrResourceLoader new SolrResourceLoader for directory: '/export/home/jenkins/workspace/Lucene-Solr-master-Solaris/solr/build/solr-core/test/J0/temp/solr.core.TestDynamicLoading_BA1D201B936A3587-001/shard-1-001'
   [junit4]   2> 295624 INFO  (TEST-TestDynamicLoading.testDynamicLoading-seed#[BA1D201B936A3587]) [    ] o.a.s.c.SolrResourceLoader JNDI not configured for solr (NoInitialContextEx)
   [junit4]   2> 295624 INFO  (TEST-TestDynamicLoading.testDynamicLoading-seed#[BA1D201B936A3587]) [    ] o.a.s.c.SolrResourceLoader solr home defaulted to 'solr/' (could not find system property or JNDI)
   [junit4]   2> 295624 INFO  (TEST-TestDynamicLoading.testDynamicLoading-seed#[BA1D201B936A3587]) [    ] o.a.s.c.c.SolrZkClient Using default ZkCredentialsProvider
   [junit4]   2> 295625 INFO  (TEST-TestDynamicLoading.testDynamicLoading-seed#[BA1D201B936A3587]) [    ] o.a.s.c.c.ConnectionManager Waiting for client to connect to ZooKeeper
   [junit4]   2> 295627 INFO  (zkCallback-353-thread-1) [    ] o.a.s.c.c.ConnectionManager Watcher org.apache.solr.common.cloud.ConnectionManager@6e014fc0 name:ZooKeeperConnection Watcher:127.0.0.1:54605/solr got event WatchedEvent state:SyncConnected type:None path:null path:null type:None
   [junit4]   2> 295627 INFO  (TEST-TestDynamicLoading.testDynamicLoading-seed#[BA1D201B936A3587]) [    ] o.a.s.c.c.ConnectionManager Client is connected to ZooKeeper
   [junit4]   2> 295627 INFO  (TEST-TestDynamicLoading.testDynamicLoading-seed#[BA1D201B936A3587]) [    ] o.a.s.c.c.SolrZkClient Using default ZkACLProvider
   [junit4]   2> 295629 INFO  (TEST-TestDynamicLoading.testDynamicLoading-seed#[BA1D201B936A3587]) [    ] o.a.s.s.SolrDispatchFilter Loading solr.xml from SolrHome (not found in ZooKeeper)
   [junit4]   2> 295629 INFO  (TEST-TestDynamicLoading.testDynamicLoading-seed#[BA1D201B936A3587]) [    ] o.a.s.c.SolrXmlConfig Loading container configuration from /export/home/jenkins/workspace/Lucene-Solr-master-Solaris/solr/build/solr-core/test/J0/temp/solr.core.TestDynamicLoading_BA1D201B936A3587-001/shard-1-001/solr.xml
   [junit4]   2> 295633 INFO  (TEST-TestDynamicLoading.testDynamicLoading-seed#[BA1D201B936A3587]) [    ] o.a.s.c.CorePropertiesLocator Config-defined core root directory: /export/home/jenkins/workspace/Lucene-Solr-master-Solaris/solr/build/solr-core/test/J0/temp/solr.core.TestDynamicLoading_BA1D201B936A3587-001/shard-1-001/cores
   [junit4]   2> 295633 INFO  (TEST-TestDynamicLoading.testDynamicLoading-seed#[BA1D201B936A3587]) [    ] o.a.s.c.CoreContainer New CoreContainer 1102488329
   [junit4]   2> 295633 INFO  (TEST-TestDynamicLoading.testDynamicLoading-seed#[BA1D201B936A3587]) [    ] o.a.s.c.CoreContainer Loading cores into CoreContainer [instanceDir=/export/home/jenkins/workspace/Lucene-Solr-master-Solaris/solr/build/solr-core/test/J0/temp/solr.core.TestDynamicLoading_BA1D201B936A3587-001/shard-1-001]
   [junit4]   2> 295633 WARN  (TEST-TestDynamicLoading.testDynamicLoading-seed#[BA1D201B936A3587]) [    ] o.a.s.c.CoreContainer Couldn't add files from /export/home/jenkins/workspace/Lucene-Solr-master-Solaris/solr/build/solr-core/test/J0/temp/solr.core.TestDynamicLoading_BA1D201B936A3587-001/shard-1-001/lib to classpath: /export/home/jenkins/workspace/Lucene-Solr-master-Solaris/solr/build/solr-core/test/J0/temp/solr.core.TestDynamicLoading_BA1D201B936A3587-001/shard-1-001/lib
   [junit4]   2> 295633 INFO  (TEST-TestDynamicLoading.testDynamicLoading-seed#[BA1D201B936A3587]) [    ] o.a.s.h.c.HttpShardHandlerFactory created with socketTimeout : 90000,urlScheme : ,connTimeout : 15000,maxConnectionsPerHost : 20,maxConnections : 10000,corePoolSize : 0,maximumPoolSize : 2147483647,maxThreadIdleTime : 5,sizeOfQueue : -1,fairnessPolicy : false,
   [junit4]   2> 295635 INFO  (TEST-TestDynamicLoading.testDynamicLoading-seed#[BA1D201B936A3587]) [    ] o.a.s.u.UpdateShardHandler Created UpdateShardHandler HTTP client with params: socketTimeout=340000&connTimeout=45000&maxConnections=100000&maxConnectionsPerHost=100000
   [junit4]   2> 295635 INFO  (TEST-TestDynamicLoading.testDynamicLoading-seed#[BA1D201B936A3587]) [    ] o.a.s.l.LogWatcher SLF4J impl is org.slf4j.impl.Log4jLoggerFactory
   [junit4]   2> 295635 INFO  (TEST-TestDynamicLoading.testDynamicLoading-seed#[BA1D201B936A3587]) [    ] o.a.s.l.LogWatcher Registering Log Listener [Log4j (org.slf4j.impl.Log4jLoggerFactory)]
   [junit4]   2> 295635 INFO  (TEST-TestDynamicLoading.testDynamicLoading-seed#[BA1D201B936A3587]) [    ] o.a.s.c.ZkContainer Zookeeper client=127.0.0.1:54605/solr
   [junit4]   2> 295635 INFO  (TEST-TestDynamicLoading.testDynamicLoading-seed#[BA1D201B936A3587]) [    ] o.a.s.c.ZkController zkHost includes chroot
   [junit4]   2> 295635 INFO  (TEST-TestDynamicLoading.testDynamicLoading-seed#[BA1D201B936A3587]) [    ] o.a.s.c.c.SolrZkClient Using default ZkCredentialsProvider
   [junit4]   2> 295636 INFO  (TEST-TestDynamicLoading.testDynamicLoading-seed#[BA1D201B936A3587]) [    ] o.a.s.c.c.ConnectionManager Waiting for client to connect to ZooKeeper
   [junit4]   2> 295638 INFO  (zkCallback-356-thread-1) [    ] o.a.s.c.c.ConnectionManager Watcher org.apache.solr.common.cloud.ConnectionManager@55485af0 name:ZooKeeperConnection Watcher:127.0.0.1:54605 got event WatchedEvent state:SyncConnected type:None path:null path:null type:None
   [junit4]   2> 295639 INFO  (TEST-TestDynamicLoading.testDynamicLoading-seed#[BA1D201B936A3587]) [    ] o.a.s.c.c.ConnectionManager Client is connected to ZooKeeper
   [junit4]   2> 295639 INFO  (TEST-TestDynamicLoading.testDynamicLoading-seed#[BA1D201B936A3587]) [    ] o.a.s.c.c.SolrZkClient Using default ZkACLProvider
   [junit4]   2> 295641 INFO  (TEST-TestDynamicLoading.testDynamicLoading-seed#[BA1D201B936A3587]) [n:127.0.0.1:63758_y_g%2Fad    ] o.a.s.c.ZkController Added new OnReconnect listener org.apache.solr.cloud.ZkController$$Lambda$69/61290535@19c6440d
   [junit4]   2> 295641 INFO  (TEST-TestDynamicLoading.testDynamicLoading-seed#[BA1D201B936A3587]) [n:127.0.0.1:63758_y_g%2Fad    ] o.a.s.c.c.ConnectionManager Waiting for client to connect to ZooKeeper
   [junit4]   2> 295643 INFO  (zkCallback-357-thread-1-processing-n:127.0.0.1:63758_y_g%2Fad) [n:127.0.0.1:63758_y_g%2Fad    ] o.a.s.c.c.ConnectionManager Watcher org.apache.solr.common.cloud.ConnectionManager@4f2c6497 name:ZooKeeperConnection Watcher:127.0.0.1:54605/solr got event WatchedEvent state:SyncConnected type:None path:null path:null type:None
   [junit4]   2> 295643 INFO  (TEST-TestDynamicLoading.testDynamicLoading-seed#[BA1D201B936A3587]) [n:127.0.0.1:63758_y_g%2Fad    ] o.a.s.c.c.ConnectionManager Client is connected to ZooKeeper
   [junit4]   2> 295653 INFO  (TEST-TestDynamicLoading.testDynamicLoading-seed#[BA1D201B936A3587]) [n:127.0.0.1:63758_y_g%2Fad    ] o.a.s.c.c.ZkStateReader Updating cluster state from ZooKeeper... 
   [junit4]   2> 295654 INFO  (TEST-TestDynamicLoading.testDynamicLoading-seed#[BA1D201B936A3587]) [n:127.0.0.1:63758_y_g%2Fad    ] o.a.s.c.c.ZkStateReader Loaded empty cluster properties
   [junit4]   2> 295655 INFO  (TEST-TestDynamicLoading.testDynamicLoading-seed#[BA1D201B936A3587]) [n:127.0.0.1:63758_y_g%2Fad    ] o.a.s.c.c.ZkStateReader Updated live nodes from ZooKeeper... (0) -> (1)
   [junit4]   2> 295660 INFO  (TEST-TestDynamicLoading.testDynamicLoading-seed#[BA1D201B936A3587]) [n:127.0.0.1:63758_y_g%2Fad    ] o.a.s.c.Overseer Overseer (id=null) closing
   [junit4]   2> 295660 INFO  (TEST-TestDynamicLoading.testDynamicLoading-seed#[BA1D201B936A3587]) [n:127.0.0.1:63758_y_g%2Fad    ] o.a.s.c.LeaderElector Joined leadership election with path: /overseer_elect/election/96581303326343176-127.0.0.1:63758_y_g%2Fad-n_0000000001
   [junit4]   2> 295661 INFO  (TEST-TestDynamicLoading.testDynamicLoading-seed#[BA1D201B936A3587]) [n:127.0.0.1:63758_y_g%2Fad    ] o.a.s.c.LeaderElector Watching path /overseer_elect/election/96581303326343172-127.0.0.1:54683_y_g%2Fad-n_0000000000 to know if I could be the leader
   [junit4]   2> 295662 INFO  (TEST-TestDynamicLoading.testDynamicLoading-seed#[BA1D201B936A3587]) [n:127.0.0.1:63758_y_g%2Fad    ] o.a.s.c.ZkController Publish node=127.0.0.1:63758_y_g%2Fad as DOWN
   [junit4]   2> 295664 INFO  (TEST-TestDynamicLoading.testDynamicLoading-seed#[BA1D201B936A3587]) [n:127.0.0.1:63758_y_g%2Fad    ] o.a.s.c.ZkController Register node as live in ZooKeeper:/live_nodes/127.0.0.1:63758_y_g%2Fad
   [junit4]   2> 295664 INFO  (TEST-TestDynamicLoading.testDynamicLoading-seed#[BA1D201B936A3587]) [n:127.0.0.1:63758_y_g%2Fad    ] o.a.s.c.c.SolrZkClient makePath: /live_nodes/127.0.0.1:63758_y_g%2Fad
   [junit4]   2> 295665 INFO  (OverseerStateUpdate-96581303326343172-127.0.0.1:54683_y_g%2Fad-n_0000000000) [n:127.0.0.1:54683_y_g%2Fad    ] o.a.s.c.Overseer processMessage: queueSize: 1, message = {
   [junit4]   2>   "operation":"downnode",
   [junit4]   2>   "node_name":"127.0.0.1:63758_y_g%2Fad"} current state version: 3
   [junit4]   2> 295666 INFO  (OverseerStateUpdate-96581303326343172-127.0.0.1:54683_y_g%2Fad-n_0000000000) [n:127.0.0.1:54683_y_g%2Fad    ] o.a.s.c.o.NodeMutator DownNode state invoked for node: 127.0.0.1:63758_y_g%2Fad
   [junit4]   2> 295666 INFO  (zkCallback-352-thread-1) [    ] o.a.s.c.c.ZkStateReader A live node change: [WatchedEvent state:SyncConnected type:NodeChildrenChanged path:/live_nodes], has occurred - updating... (live nodes size: [1])
   [junit4]   2> 295666 INFO  (zkCallback-348-thread-3-processing-n:127.0.0.1:54683_y_g%2Fad) [n:127.0.0.1:54683_y_g%2Fad    ] o.a.s.c.c.ZkStateReader A live node change: [WatchedEvent state:SyncConnected type:NodeChildrenChanged path:/live_nodes], has occurred - updating... (live nodes size: [1])
   [junit4]   2> 295666 INFO  (zkCallback-357-thread-1-processing-n:127.0.0.1:63758_y_g%2Fad) [n:127.0.0.1:63758_y_g%2Fad    ] o.a.s.c.c.ZkStateReader A live node change: [WatchedEvent state:SyncConnected type:NodeChildrenChanged path:/live_nodes], has occurred - updating... (live nodes size: [1])
   [junit4]   2> 295691 INFO  (TEST-TestDynamicLoading.testDynamicLoading-seed#[BA1D201B936A3587]) [n:127.0.0.1:63758_y_g%2Fad    ] o.a.s.c.CoreContainer Security conf doesn't exist. Skipping setup for authorization module.
   [junit4]   2> 295691 INFO  (TEST-TestDynamicLoading.testDynamicLoading-seed#[BA1D201B936A3587]) [n:127.0.0.1:63758_y_g%2Fad    ] o.a.s.c.CoreContainer No authentication plugin used.
   [junit4]   2> 295692 INFO  (TEST-TestDynamicLoading.testDynamicLoading-seed#[BA1D201B936A3587]) [n:127.0.0.1:63758_y_g%2Fad    ] o.a.s.c.CorePropertiesLocator Looking for core definitions underneath /export/home/jenkins/workspace/Lucene-Solr-master-Solaris/solr/build/solr-core/test/J0/temp/solr.core.TestDynamicLoading_BA1D201B936A3587-001/shard-1-001/cores
   [junit4]   2> 295693 INFO  (TEST-TestDynamicLoading.testDynamicLoading-seed#[BA1D201B936A3587]) [n:127.0.0.1:63758_y_g%2Fad    ] o.a.s.c.CoreDescriptor Created CoreDescriptor: {name=collection1, config=solrconfig.xml, transient=false, schema=schema.xml, loadOnStartup=true, configSetProperties=configsetprops.json, collection=collection1, coreNodeName=, dataDir=data/, shard=}
   [junit4]   2> 295693 INFO  (TEST-TestDynamicLoading.testDynamicLoading-seed#[BA1D201B936A3587]) [n:127.0.0.1:63758_y_g%2Fad    ] o.a.s.c.CorePropertiesLocator Found core collection1 in /export/home/jenkins/workspace/Lucene-Solr-master-Solaris/solr/build/solr-core/test/J0/temp/solr.core.TestDynamicLoading_BA1D201B936A3587-001/shard-1-001/cores/collection1
   [junit4]   2> 295693 INFO  (TEST-TestDynamicLoading.testDynamicLoading-seed#[BA1D201B936A3587]) [n:127.0.0.1:63758_y_g%2Fad    ] o.a.s.c.CorePropertiesLocator Found 1 core definitions
   [junit4]   2> 295695 INFO  (zkCallback-352-thread-1) [    ] o.a.s.c.c.ZkStateReader Updated live nodes from ZooKeeper... (1) -> (2)
   [junit4]   2> 295698 INFO  (zkCallback-348-thread-3-processing-n:127.0.0.1:54683_y_g%2Fad) [n:127.0.0.1:54683_y_g%2Fad    ] o.a.s.c.c.ZkStateReader Updated live nodes from ZooKeeper... (1) -> (2)
   [junit4]   2> 295698 INFO  (zkCallback-357-thread-1-processing-n:127.0.0.1:63758_y_g%2Fad) [n:127.0.0.1:63758_y_g%2Fad    ] o.a.s.c.c.ZkStateReader Updated live nodes from ZooKeeper... (1) -> (2)
   [junit4]   2> 295698 INFO  (coreLoadExecutor-1050-thread-1-processing-n:127.0.0.1:63758_y_g%2Fad) [n:127.0.0.1:63758_y_g%2Fad c:collection1   x:collection1] o.a.s.c.ZkController publishing state=down
   [junit4]   2> 295698 INFO  (coreLoadExecutor-1050-thread-1-processing-n:127.0.0.1:63758_y_g%2Fad) [n:127.0.0.1:63758_y_g%2Fad c:collection1   x:collection1] o.a.s.c.ZkController numShards not found on descriptor - reading it from system property
   [junit4]   2> 295699 INFO  (TEST-TestDynamicLoading.testDynamicLoading-seed#[BA1D201B936A3587]) [n:127.0.0.1:63758_y_g%2Fad    ] o.a.s.s.SolrDispatchFilter user.dir=/export/home/jenkins/workspace/Lucene-Solr-master-Solaris/solr/build/solr-core/test/J0
   [junit4]   2> 295699 INFO  (TEST-TestDynamicLoading.testDynamicLoading-seed#[BA1D201B936A3587]) [n:127.0.0.1:63758_y_g%2Fad    ] o.a.s.s.SolrDispatchFilter SolrDispatchFilter.init() done
   [junit4]   2> 295700 INFO  (coreLoadExecutor-1050-thread-1-processing-n:127.0.0.1:63758_y_g%2Fad) [n:127.0.0.1:63758_y_g%2Fad c:collection1   x:collection1] o.a.s.c.ZkController Collection collection1 not visible yet, but flagging it so a watch is registered when it becomes visible
   [junit4]   2> 295700 INFO  (OverseerStateUpdate-96581303326343172-127.0.0.1:54683_y_g%2Fad-n_0000000000) [n:127.0.0.1:54683_y_g%2Fad    ] o.a.s.c.Overseer processMessage: queueSize: 1, message = {
   [junit4]   2>   "core":"collection1",
   [junit4]   2>   "roles":null,
   [junit4]   2>   "base_url":"http://127.0.0.1:63758/y_g/ad",
   [junit4]   2>   "node_name":"127.0.0.1:63758_y_g%2Fad",
   [junit4]   2>   "numShards":"2",
   [junit4]   2>   "state":"down",
   [junit4]   2>   "shard":null,
   [junit4]   2>   "collection":"collection1",
   [junit4]   2>   "operation":"state"} current state version: 3
   [junit4]   2> 295700 INFO  (OverseerStateUpdate-96581303326343172-127.0.0.1:54683_y_g%2Fad-n_0000000000) [n:127.0.0.1:54683_y_g%2Fad    ] o.a.s.c.o.ReplicaMutator Update state numShards=2 message={
   [junit4]   2>   "core":"collection1",
   [junit4]   2>   "roles":null,
   [junit4]   2>   "base_url":"http://127.0.0.1:63758/y_g/ad",
   [junit4]   2>   "node_name":"127

[...truncated too long message...]

on1] o.a.s.u.DefaultSolrCoreState SolrCoreState ref count has reached 0 - closing IndexWriter
   [junit4]   2> 1814618 INFO  (coreCloseExecutor-7802-thread-1-processing-x:collection1) [    x:collection1] o.a.s.u.DefaultSolrCoreState closing IndexWriter with IndexWriterCloser
   [junit4]   2> 1814618 INFO  (coreCloseExecutor-7802-thread-1-processing-x:collection1) [    x:collection1] o.a.s.u.DirectUpdateHandler2 Committing on IndexWriter close.
   [junit4]   2> 1814624 INFO  (coreCloseExecutor-7802-thread-1-processing-x:collection1) [    x:collection1] o.a.s.c.SolrDeletionPolicy SolrDeletionPolicy.onCommit: commits: num=2
   [junit4]   2> 	commit{dir=MockDirectoryWrapper(RAMDirectory@4fbc00e5 lockFactory=org.apache.lucene.store.SingleInstanceLockFactory@7af5fd58),segFN=segments_3,generation=3}
   [junit4]   2> 	commit{dir=MockDirectoryWrapper(RAMDirectory@4fbc00e5 lockFactory=org.apache.lucene.store.SingleInstanceLockFactory@7af5fd58),segFN=segments_4,generation=4}
   [junit4]   2> 1814624 INFO  (coreCloseExecutor-7802-thread-1-processing-x:collection1) [    x:collection1] o.a.s.c.SolrDeletionPolicy newest commit generation = 4
   [junit4]   2> 1814625 INFO  (coreCloseExecutor-7802-thread-1-processing-x:collection1) [    x:collection1] o.a.s.c.SolrCore [collection1] Closing main searcher on request.
   [junit4]   2> 1814645 INFO  (coreCloseExecutor-7802-thread-1-processing-x:collection1) [    x:collection1] o.a.s.c.CachingDirectoryFactory Closing MockDirectoryFactory - 3 directories currently being tracked
   [junit4]   2> 1814645 INFO  (coreCloseExecutor-7802-thread-1-processing-x:collection1) [    x:collection1] o.a.s.c.CachingDirectoryFactory looking to close /export/home/jenkins/workspace/Lucene-Solr-master-Solaris/solr/build/solr-core/test/J1/temp/solr.update.AutoCommitTest_BA1D201B936A3587-001/init-core-data-001/index [CachedDir<<refCount=0;path=/export/home/jenkins/workspace/Lucene-Solr-master-Solaris/solr/build/solr-core/test/J1/temp/solr.update.AutoCommitTest_BA1D201B936A3587-001/init-core-data-001/index;done=false>>]
   [junit4]   2> 1814645 INFO  (coreCloseExecutor-7802-thread-1-processing-x:collection1) [    x:collection1] o.a.s.c.CachingDirectoryFactory Closing directory, CoreContainer#isShutdown=true
   [junit4]   2> 1814645 INFO  (coreCloseExecutor-7802-thread-1-processing-x:collection1) [    x:collection1] o.a.s.c.CachingDirectoryFactory Closing directory: /export/home/jenkins/workspace/Lucene-Solr-master-Solaris/solr/build/solr-core/test/J1/temp/solr.update.AutoCommitTest_BA1D201B936A3587-001/init-core-data-001/index
   [junit4]   2> 1814645 INFO  (coreCloseExecutor-7802-thread-1-processing-x:collection1) [    x:collection1] o.a.s.c.CachingDirectoryFactory looking to close /export/home/jenkins/workspace/Lucene-Solr-master-Solaris/solr/build/solr-core/test/J1/temp/solr.update.AutoCommitTest_BA1D201B936A3587-001/init-core-data-001 [CachedDir<<refCount=0;path=/export/home/jenkins/workspace/Lucene-Solr-master-Solaris/solr/build/solr-core/test/J1/temp/solr.update.AutoCommitTest_BA1D201B936A3587-001/init-core-data-001;done=false>>]
   [junit4]   2> 1814645 INFO  (coreCloseExecutor-7802-thread-1-processing-x:collection1) [    x:collection1] o.a.s.c.CachingDirectoryFactory Closing directory, CoreContainer#isShutdown=true
   [junit4]   2> 1814645 INFO  (coreCloseExecutor-7802-thread-1-processing-x:collection1) [    x:collection1] o.a.s.c.CachingDirectoryFactory Closing directory: /export/home/jenkins/workspace/Lucene-Solr-master-Solaris/solr/build/solr-core/test/J1/temp/solr.update.AutoCommitTest_BA1D201B936A3587-001/init-core-data-001
   [junit4]   2> 1814645 INFO  (coreCloseExecutor-7802-thread-1-processing-x:collection1) [    x:collection1] o.a.s.c.CachingDirectoryFactory looking to close /export/home/jenkins/workspace/Lucene-Solr-master-Solaris/solr/build/solr-core/test/J1/temp/solr.update.AutoCommitTest_BA1D201B936A3587-001/init-core-data-001/snapshot_metadata [CachedDir<<refCount=0;path=/export/home/jenkins/workspace/Lucene-Solr-master-Solaris/solr/build/solr-core/test/J1/temp/solr.update.AutoCommitTest_BA1D201B936A3587-001/init-core-data-001/snapshot_metadata;done=false>>]
   [junit4]   2> 1814645 INFO  (coreCloseExecutor-7802-thread-1-processing-x:collection1) [    x:collection1] o.a.s.c.CachingDirectoryFactory Closing directory, CoreContainer#isShutdown=true
   [junit4]   2> 1814645 INFO  (coreCloseExecutor-7802-thread-1-processing-x:collection1) [    x:collection1] o.a.s.c.CachingDirectoryFactory Closing directory: /export/home/jenkins/workspace/Lucene-Solr-master-Solaris/solr/build/solr-core/test/J1/temp/solr.update.AutoCommitTest_BA1D201B936A3587-001/init-core-data-001/snapshot_metadata
   [junit4]   2> NOTE: leaving temporary files on disk at: /export/home/jenkins/workspace/Lucene-Solr-master-Solaris/solr/build/solr-core/test/J1/temp/solr.update.AutoCommitTest_BA1D201B936A3587-001
   [junit4]   2> NOTE: test params are: codec=Asserting(Lucene62): {range_facet_l_dv=PostingsFormat(name=Memory doPackFST= true), _version_=PostingsFormat(name=Direct), field_t=PostingsFormat(name=Memory doPackFST= true), multiDefault=Lucene50(blocksize=128), subject=Lucene50(blocksize=128), intDefault=PostingsFormat(name=Direct), id=PostingsFormat(name=Memory doPackFST= true), range_facet_i_dv=Lucene50(blocksize=128), text=PostingsFormat(name=Asserting), range_facet_l=Lucene50(blocksize=128), timestamp=Lucene50(blocksize=128)}, docValues:{range_facet_l_dv=DocValuesFormat(name=Lucene54), range_facet_i_dv=DocValuesFormat(name=Lucene54), timestamp=DocValuesFormat(name=Lucene54)}, maxPointsInLeafNode=1860, maxMBSortInHeap=6.435729478469137, sim=RandomSimilarity(queryNorm=false): {}, locale=fr-FR, timezone=Brazil/Acre
   [junit4]   2> NOTE: SunOS 5.11 amd64/Oracle Corporation 1.8.0_102 (64-bit)/cpus=3,threads=1,free=380326544,total=536870912
   [junit4]   2> NOTE: All tests run in this JVM: [FieldMutatingUpdateProcessorTest, ConnectionReuseTest, TestFoldingMultitermQuery, ReturnFieldsTest, TestQuerySenderListener, TestDocTermOrds, TestLocalFSCloudBackupRestore, ZkStateWriterTest, DebugComponentTest, TestSolrFieldCacheMBean, TestDFRSimilarityFactory, TestLuceneMatchVersion, TestJsonFacets, MultiThreadedOCPTest, SpatialRPTFieldTypeTest, TermVectorComponentTest, SuggesterWFSTTest, ZkSolrClientTest, DirectoryFactoryTest, SuggesterTest, TestIndexSearcher, TestLMDirichletSimilarityFactory, SharedFSAutoReplicaFailoverTest, SpellPossibilityIteratorTest, DistributedFacetPivotLongTailTest, TestRestoreCore, OpenCloseCoreStressTest, TestValueSourceCache, FullSolrCloudDistribCmdsTest, DocExpirationUpdateProcessorFactoryTest, BinaryUpdateRequestHandlerTest, DeleteStatusTest, DistributedTermsComponentTest, TestCoreDiscovery, TestCustomDocTransformer, AddBlockUpdateTest, TestSystemIdResolver, BasicAuthIntegrationTest, QueryParsingTest, TestUtils, TestSolrQueryParser, TestExclusionRuleCollectionAccess, TestDocSet, TestFieldCacheSort, StatsComponentTest, ExternalFileFieldSortTest, SolrCmdDistributorTest, RequestLoggingTest, MergeStrategyTest, TestCloudPseudoReturnFields, PeerSyncReplicationTest, IndexSchemaTest, TestBackupRepositoryFactory, SpellingQueryConverterTest, TestRecovery, UpdateRequestProcessorFactoryTest, TestRandomFaceting, TestSizeLimitedDistributedMap, TestSSLRandomization, UUIDFieldTest, HdfsWriteToMultipleCollectionsTest, TestSolr4Spatial, TestRequestForwarding, TestCloudManagedSchema, BlockDirectoryTest, TestNumericTerms64, CoreMergeIndexesAdminHandlerTest, ReplicationFactorTest, TestRebalanceLeaders, TestBulkSchemaAPI, TestSchemaSimilarityResource, TestRecoveryHdfs, ConvertedLegacyTest, TestSortingResponseWriter, EchoParamsTest, TestInitParams, TestDynamicFieldCollectionResource, TestBadConfig, ResourceLoaderTest, TestQuerySenderNoQuery, TestSolrQueryParserResource, SpellCheckComponentTest, JsonLoaderTest, HdfsChaosMonkeySafeLeaderTest, TestConfig, TestConfigSetImmutable, FieldAnalysisRequestHandlerTest, TestDistributedGrouping, TestGraphMLResponseWriter, TestCopyFieldCollectionResource, TestLegacyFieldCache, TestStressCloudBlindAtomicUpdates, GraphQueryTest, ChaosMonkeySafeLeaderTest, ChangedSchemaMergeTest, HdfsTlogReplayBufferedWhileIndexingTest, SolrCoreCheckLockOnStartupTest, TestSmileRequest, TestSchemaManager, TestGraphTermsQParserPlugin, SpatialHeatmapFacetsTest, ClusterStateTest, TestReversedWildcardFilterFactory, SpellCheckCollatorTest, TestFileDictionaryLookup, PreAnalyzedFieldTest, CircularListTest, OverseerStatusTest, TestManagedStopFilterFactory, MinimalSchemaTest, TestExactStatsCache, ConnectionManagerTest, TestHighFrequencyDictionaryFactory, SolrInfoMBeanTest, TestNamedUpdateProcessors, VMParamsZkACLAndCredentialsProvidersTest, DistribDocExpirationUpdateProcessorTest, TestComplexPhraseQParserPlugin, AddSchemaFieldsUpdateProcessorFactoryTest, HighlighterConfigTest, BigEndianAscendingWordDeserializerTest, FullHLLTest, TestMacroExpander, TestFuzzyAnalyzedSuggestions, SolrIndexConfigTest, TestSolrXml, BJQParserTest, RegexBoostProcessorTest, TestNoOpRegenerator, CollectionsAPIAsyncDistributedZkTest, TestReload, WordBreakSolrSpellCheckerTest, DistributedDebugComponentTest, CdcrReplicationDistributedZkTest, BitVectorTest, TestSchemaNameResource, TestMaxScoreQueryParser, DefaultValueUpdateProcessorTest, TestDocBasedVersionConstraints, CollectionStateFormat2Test, TestOmitPositions, TestMiniSolrCloudCluster, BaseCdcrDistributedZkTest, TestSimpleTrackingShardHandler, UUIDUpdateProcessorFallbackTest, BasicZkTest, ScriptEngineTest, DistributedQueryComponentCustomSortTest, DeleteReplicaTest, TestFieldCacheReopen, TestCloudInspectUtil, MBeansHandlerTest, BasicDistributedZkTest, BasicDistributedZk2Test, CollectionsAPIDistributedZkTest, SyncSliceTest, OverseerTest, LeaderElectionIntegrationTest, ShardRoutingTest, TestReplicationHandler, LeaderElectionTest, TestRandomDVFaceting, ZkCLITest, AutoCommitTest]
   [junit4] Completed [330/631 (2!)] on J1 in 9.25s, 3 tests, 1 error <<< FAILURES!

[...truncated 61178 lines...]


Mime
View raw message