lucene-dev mailing list archives

Site index · List index
Message view « Date » · « Thread »
Top « Date » · « Thread »
From Policeman Jenkins Server <jenk...@thetaphi.de>
Subject [JENKINS-EA] Lucene-Solr-6.x-Linux (32bit/jdk-9-ea+134) - Build # 1694 - Still Unstable!
Date Sat, 10 Sep 2016 00:41:15 GMT
Build: http://jenkins.thetaphi.de/job/Lucene-Solr-6.x-Linux/1694/
Java: 32bit/jdk-9-ea+134 -client -XX:+UseG1GC

1 tests failed.
FAILED:  org.apache.solr.security.BasicAuthIntegrationTest.testBasicAuth

Error Message:
IOException occured when talking to server at: https://127.0.0.1:37268/solr

Stack Trace:
org.apache.solr.client.solrj.SolrServerException: IOException occured when talking to server at: https://127.0.0.1:37268/solr
	at __randomizedtesting.SeedInfo.seed([C7CBC8E9742D5C5B:7BA5BEFBD07EDF21]:0)
	at org.apache.solr.client.solrj.impl.HttpSolrClient.executeMethod(HttpSolrClient.java:606)
	at org.apache.solr.client.solrj.impl.HttpSolrClient.request(HttpSolrClient.java:261)
	at org.apache.solr.client.solrj.impl.HttpSolrClient.request(HttpSolrClient.java:250)
	at org.apache.solr.client.solrj.SolrClient.request(SolrClient.java:1219)
	at org.apache.solr.security.BasicAuthIntegrationTest.testBasicAuth(BasicAuthIntegrationTest.java:158)
	at jdk.internal.reflect.NativeMethodAccessorImpl.invoke0(java.base@9-ea/Native Method)
	at jdk.internal.reflect.NativeMethodAccessorImpl.invoke(java.base@9-ea/NativeMethodAccessorImpl.java:62)
	at jdk.internal.reflect.DelegatingMethodAccessorImpl.invoke(java.base@9-ea/DelegatingMethodAccessorImpl.java:43)
	at java.lang.reflect.Method.invoke(java.base@9-ea/Method.java:535)
	at com.carrotsearch.randomizedtesting.RandomizedRunner.invoke(RandomizedRunner.java:1764)
	at com.carrotsearch.randomizedtesting.RandomizedRunner$8.evaluate(RandomizedRunner.java:871)
	at com.carrotsearch.randomizedtesting.RandomizedRunner$9.evaluate(RandomizedRunner.java:907)
	at com.carrotsearch.randomizedtesting.RandomizedRunner$10.evaluate(RandomizedRunner.java:921)
	at com.carrotsearch.randomizedtesting.rules.SystemPropertiesRestoreRule$1.evaluate(SystemPropertiesRestoreRule.java:57)
	at org.apache.lucene.util.TestRuleSetupTeardownChained$1.evaluate(TestRuleSetupTeardownChained.java:49)
	at org.apache.lucene.util.AbstractBeforeAfterRule$1.evaluate(AbstractBeforeAfterRule.java:45)
	at org.apache.lucene.util.TestRuleThreadAndTestName$1.evaluate(TestRuleThreadAndTestName.java:48)
	at org.apache.lucene.util.TestRuleIgnoreAfterMaxFailures$1.evaluate(TestRuleIgnoreAfterMaxFailures.java:64)
	at org.apache.lucene.util.TestRuleMarkFailure$1.evaluate(TestRuleMarkFailure.java:47)
	at com.carrotsearch.randomizedtesting.rules.StatementAdapter.evaluate(StatementAdapter.java:36)
	at com.carrotsearch.randomizedtesting.ThreadLeakControl$StatementRunner.run(ThreadLeakControl.java:367)
	at com.carrotsearch.randomizedtesting.ThreadLeakControl.forkTimeoutingTask(ThreadLeakControl.java:809)
	at com.carrotsearch.randomizedtesting.ThreadLeakControl$3.evaluate(ThreadLeakControl.java:460)
	at com.carrotsearch.randomizedtesting.RandomizedRunner.runSingleTest(RandomizedRunner.java:880)
	at com.carrotsearch.randomizedtesting.RandomizedRunner$5.evaluate(RandomizedRunner.java:781)
	at com.carrotsearch.randomizedtesting.RandomizedRunner$6.evaluate(RandomizedRunner.java:816)
	at com.carrotsearch.randomizedtesting.RandomizedRunner$7.evaluate(RandomizedRunner.java:827)
	at com.carrotsearch.randomizedtesting.rules.StatementAdapter.evaluate(StatementAdapter.java:36)
	at com.carrotsearch.randomizedtesting.rules.SystemPropertiesRestoreRule$1.evaluate(SystemPropertiesRestoreRule.java:57)
	at org.apache.lucene.util.AbstractBeforeAfterRule$1.evaluate(AbstractBeforeAfterRule.java:45)
	at com.carrotsearch.randomizedtesting.rules.StatementAdapter.evaluate(StatementAdapter.java:36)
	at org.apache.lucene.util.TestRuleStoreClassName$1.evaluate(TestRuleStoreClassName.java:41)
	at com.carrotsearch.randomizedtesting.rules.NoShadowingOrOverridesOnMethodsRule$1.evaluate(NoShadowingOrOverridesOnMethodsRule.java:40)
	at com.carrotsearch.randomizedtesting.rules.NoShadowingOrOverridesOnMethodsRule$1.evaluate(NoShadowingOrOverridesOnMethodsRule.java:40)
	at com.carrotsearch.randomizedtesting.rules.StatementAdapter.evaluate(StatementAdapter.java:36)
	at com.carrotsearch.randomizedtesting.rules.StatementAdapter.evaluate(StatementAdapter.java:36)
	at com.carrotsearch.randomizedtesting.rules.StatementAdapter.evaluate(StatementAdapter.java:36)
	at org.apache.lucene.util.TestRuleAssertionsRequired$1.evaluate(TestRuleAssertionsRequired.java:53)
	at org.apache.lucene.util.TestRuleMarkFailure$1.evaluate(TestRuleMarkFailure.java:47)
	at org.apache.lucene.util.TestRuleIgnoreAfterMaxFailures$1.evaluate(TestRuleIgnoreAfterMaxFailures.java:64)
	at org.apache.lucene.util.TestRuleIgnoreTestSuites$1.evaluate(TestRuleIgnoreTestSuites.java:54)
	at com.carrotsearch.randomizedtesting.rules.StatementAdapter.evaluate(StatementAdapter.java:36)
	at com.carrotsearch.randomizedtesting.ThreadLeakControl$StatementRunner.run(ThreadLeakControl.java:367)
	at java.lang.Thread.run(java.base@9-ea/Thread.java:843)
Caused by: javax.net.ssl.SSLHandshakeException: sun.security.validator.ValidatorException: PKIX path building failed: sun.security.provider.certpath.SunCertPathBuilderException: unable to find valid certification path to requested target
	at sun.security.ssl.Alerts.getSSLException(java.base@9-ea/Alerts.java:198)
	at sun.security.ssl.SSLSocketImpl.fatal(java.base@9-ea/SSLSocketImpl.java:1962)
	at sun.security.ssl.Handshaker.fatalSE(java.base@9-ea/Handshaker.java:309)
	at sun.security.ssl.Handshaker.fatalSE(java.base@9-ea/Handshaker.java:303)
	at sun.security.ssl.ClientHandshaker.checkServerCerts(java.base@9-ea/ClientHandshaker.java:1843)
	at sun.security.ssl.ClientHandshaker.serverCertificate(java.base@9-ea/ClientHandshaker.java:1652)
	at sun.security.ssl.ClientHandshaker.processMessage(java.base@9-ea/ClientHandshaker.java:260)
	at sun.security.ssl.Handshaker.processLoop(java.base@9-ea/Handshaker.java:1061)
	at sun.security.ssl.Handshaker.processRecord(java.base@9-ea/Handshaker.java:995)
	at sun.security.ssl.SSLSocketImpl.processInputRecord(java.base@9-ea/SSLSocketImpl.java:1132)
	at sun.security.ssl.SSLSocketImpl.readRecord(java.base@9-ea/SSLSocketImpl.java:1069)
	at sun.security.ssl.SSLSocketImpl.readRecord(java.base@9-ea/SSLSocketImpl.java:968)
	at sun.security.ssl.SSLSocketImpl.performInitialHandshake(java.base@9-ea/SSLSocketImpl.java:1395)
	at sun.security.ssl.SSLSocketImpl.startHandshake(java.base@9-ea/SSLSocketImpl.java:1422)
	at sun.security.ssl.SSLSocketImpl.startHandshake(java.base@9-ea/SSLSocketImpl.java:1406)
	at org.apache.http.conn.ssl.SSLSocketFactory.connectSocket(SSLSocketFactory.java:543)
	at org.apache.http.conn.ssl.SSLSocketFactory.connectSocket(SSLSocketFactory.java:409)
	at org.apache.http.impl.conn.DefaultClientConnectionOperator.openConnection(DefaultClientConnectionOperator.java:177)
	at org.apache.http.impl.conn.ManagedClientConnectionImpl.open(ManagedClientConnectionImpl.java:304)
	at org.apache.http.impl.client.DefaultRequestDirector.tryConnect(DefaultRequestDirector.java:611)
	at org.apache.http.impl.client.DefaultRequestDirector.execute(DefaultRequestDirector.java:446)
	at org.apache.http.impl.client.AbstractHttpClient.doExecute(AbstractHttpClient.java:882)
	at org.apache.http.impl.client.CloseableHttpClient.execute(CloseableHttpClient.java:82)
	at org.apache.http.impl.client.CloseableHttpClient.execute(CloseableHttpClient.java:107)
	at org.apache.http.impl.client.CloseableHttpClient.execute(CloseableHttpClient.java:55)
	at org.apache.solr.client.solrj.impl.HttpSolrClient.executeMethod(HttpSolrClient.java:497)
	... 43 more
Caused by: sun.security.validator.ValidatorException: PKIX path building failed: sun.security.provider.certpath.SunCertPathBuilderException: unable to find valid certification path to requested target
	at sun.security.validator.PKIXValidator.doBuild(java.base@9-ea/PKIXValidator.java:386)
	at sun.security.validator.PKIXValidator.engineValidate(java.base@9-ea/PKIXValidator.java:291)
	at sun.security.validator.Validator.validate(java.base@9-ea/Validator.java:264)
	at sun.security.ssl.X509TrustManagerImpl.validate(java.base@9-ea/X509TrustManagerImpl.java:343)
	at sun.security.ssl.X509TrustManagerImpl.checkTrusted(java.base@9-ea/X509TrustManagerImpl.java:237)
	at sun.security.ssl.X509TrustManagerImpl.checkServerTrusted(java.base@9-ea/X509TrustManagerImpl.java:124)
	at sun.security.ssl.ClientHandshaker.checkServerCerts(java.base@9-ea/ClientHandshaker.java:1822)
	... 64 more
Caused by: sun.security.provider.certpath.SunCertPathBuilderException: unable to find valid certification path to requested target
	at sun.security.provider.certpath.SunCertPathBuilder.build(java.base@9-ea/SunCertPathBuilder.java:141)
	at sun.security.provider.certpath.SunCertPathBuilder.engineBuild(java.base@9-ea/SunCertPathBuilder.java:126)
	at java.security.cert.CertPathBuilder.build(java.base@9-ea/CertPathBuilder.java:288)
	at sun.security.validator.PKIXValidator.doBuild(java.base@9-ea/PKIXValidator.java:381)
	... 70 more




Build Log:
[...truncated 12541 lines...]
   [junit4] Suite: org.apache.solr.security.BasicAuthIntegrationTest
   [junit4]   2> Creating dataDir: /home/jenkins/workspace/Lucene-Solr-6.x-Linux/solr/build/solr-core/test/J2/temp/solr.security.BasicAuthIntegrationTest_C7CBC8E9742D5C5B-001/init-core-data-001
   [junit4]   2> 1937128 INFO  (SUITE-BasicAuthIntegrationTest-seed#[C7CBC8E9742D5C5B]-worker) [    ] o.a.s.SolrTestCaseJ4 Randomized ssl (true) and clientAuth (false) via: @org.apache.solr.util.RandomizeSSL(reason="", ssl=0.0/0.0, value=0.0/0.0, clientAuth=0.0/0.0)
   [junit4]   2> 1937129 INFO  (SUITE-BasicAuthIntegrationTest-seed#[C7CBC8E9742D5C5B]-worker) [    ] o.a.s.c.ZkTestServer STARTING ZK TEST SERVER
   [junit4]   2> 1937129 INFO  (Thread-4427) [    ] o.a.s.c.ZkTestServer client port:0.0.0.0/0.0.0.0:0
   [junit4]   2> 1937129 INFO  (Thread-4427) [    ] o.a.s.c.ZkTestServer Starting server
   [junit4]   2> 1937229 INFO  (SUITE-BasicAuthIntegrationTest-seed#[C7CBC8E9742D5C5B]-worker) [    ] o.a.s.c.ZkTestServer start zk server on port:45015
   [junit4]   2> 1937229 INFO  (SUITE-BasicAuthIntegrationTest-seed#[C7CBC8E9742D5C5B]-worker) [    ] o.a.s.c.c.SolrZkClient Using default ZkCredentialsProvider
   [junit4]   2> 1937230 INFO  (SUITE-BasicAuthIntegrationTest-seed#[C7CBC8E9742D5C5B]-worker) [    ] o.a.s.c.c.ConnectionManager Waiting for client to connect to ZooKeeper
   [junit4]   2> 1937231 INFO  (zkCallback-26571-thread-1) [    ] o.a.s.c.c.ConnectionManager Watcher org.apache.solr.common.cloud.ConnectionManager@1fd2535 name:ZooKeeperConnection Watcher:127.0.0.1:45015 got event WatchedEvent state:SyncConnected type:None path:null path:null type:None
   [junit4]   2> 1937231 INFO  (SUITE-BasicAuthIntegrationTest-seed#[C7CBC8E9742D5C5B]-worker) [    ] o.a.s.c.c.ConnectionManager Client is connected to ZooKeeper
   [junit4]   2> 1937231 INFO  (SUITE-BasicAuthIntegrationTest-seed#[C7CBC8E9742D5C5B]-worker) [    ] o.a.s.c.c.SolrZkClient Using default ZkACLProvider
   [junit4]   2> 1937231 INFO  (SUITE-BasicAuthIntegrationTest-seed#[C7CBC8E9742D5C5B]-worker) [    ] o.a.s.c.c.SolrZkClient makePath: /solr/solr.xml
   [junit4]   2> 1937232 INFO  (SUITE-BasicAuthIntegrationTest-seed#[C7CBC8E9742D5C5B]-worker) [    ] o.a.s.c.c.SolrZkClient makePath: /solr/clusterprops.json
   [junit4]   2> 1937235 INFO  (jetty-launcher-26570-thread-2) [    ] o.e.j.s.Server jetty-9.3.8.v20160314
   [junit4]   2> 1937235 INFO  (jetty-launcher-26570-thread-1) [    ] o.e.j.s.Server jetty-9.3.8.v20160314
   [junit4]   2> 1937236 INFO  (jetty-launcher-26570-thread-2) [    ] o.e.j.s.h.ContextHandler Started o.e.j.s.ServletContextHandler@dea38a{/solr,null,AVAILABLE}
   [junit4]   2> 1937236 INFO  (jetty-launcher-26570-thread-1) [    ] o.e.j.s.h.ContextHandler Started o.e.j.s.ServletContextHandler@9d6086{/solr,null,AVAILABLE}
   [junit4]   2> 1937236 INFO  (jetty-launcher-26570-thread-3) [    ] o.e.j.s.Server jetty-9.3.8.v20160314
   [junit4]   2> 1937237 INFO  (jetty-launcher-26570-thread-3) [    ] o.e.j.s.h.ContextHandler Started o.e.j.s.ServletContextHandler@ddec65{/solr,null,AVAILABLE}
   [junit4]   2> 1937239 INFO  (jetty-launcher-26570-thread-1) [    ] o.e.j.s.ServerConnector Started ServerConnector@27da7b{SSL,[ssl, http/1.1]}{127.0.0.1:43810}
   [junit4]   2> 1937239 INFO  (jetty-launcher-26570-thread-2) [    ] o.e.j.s.ServerConnector Started ServerConnector@139d58d{SSL,[ssl, http/1.1]}{127.0.0.1:37428}
   [junit4]   2> 1937239 INFO  (jetty-launcher-26570-thread-1) [    ] o.e.j.s.Server Started @1939165ms
   [junit4]   2> 1937240 INFO  (jetty-launcher-26570-thread-2) [    ] o.e.j.s.Server Started @1939165ms
   [junit4]   2> 1937240 INFO  (jetty-launcher-26570-thread-1) [    ] o.a.s.c.s.e.JettySolrRunner Jetty properties: {hostContext=/solr, hostPort=43810}
   [junit4]   2> 1937239 INFO  (jetty-launcher-26570-thread-3) [    ] o.e.j.s.ServerConnector Started ServerConnector@4acae7{SSL,[ssl, http/1.1]}{127.0.0.1:46592}
   [junit4]   2> 1937240 INFO  (jetty-launcher-26570-thread-2) [    ] o.a.s.c.s.e.JettySolrRunner Jetty properties: {hostContext=/solr, hostPort=37428}
   [junit4]   2> 1937240 INFO  (jetty-launcher-26570-thread-1) [    ] o.a.s.s.SolrDispatchFilter SolrDispatchFilter.init(): jdk.internal.loader.ClassLoaders$AppClassLoader@1223dd8
   [junit4]   2> 1937240 INFO  (jetty-launcher-26570-thread-3) [    ] o.e.j.s.Server Started @1939166ms
   [junit4]   2> 1937240 INFO  (jetty-launcher-26570-thread-2) [    ] o.a.s.s.SolrDispatchFilter SolrDispatchFilter.init(): jdk.internal.loader.ClassLoaders$AppClassLoader@1223dd8
   [junit4]   2> 1937240 INFO  (jetty-launcher-26570-thread-3) [    ] o.a.s.c.s.e.JettySolrRunner Jetty properties: {hostContext=/solr, hostPort=46592}
   [junit4]   2> 1937240 INFO  (jetty-launcher-26570-thread-2) [    ] o.a.s.c.SolrResourceLoader new SolrResourceLoader for directory: '/home/jenkins/workspace/Lucene-Solr-6.x-Linux/solr/build/solr-core/test/J2/temp/solr.security.BasicAuthIntegrationTest_C7CBC8E9742D5C5B-001/tempDir-001/node2'
   [junit4]   2> 1937240 INFO  (jetty-launcher-26570-thread-1) [    ] o.a.s.c.SolrResourceLoader new SolrResourceLoader for directory: '/home/jenkins/workspace/Lucene-Solr-6.x-Linux/solr/build/solr-core/test/J2/temp/solr.security.BasicAuthIntegrationTest_C7CBC8E9742D5C5B-001/tempDir-001/node1'
   [junit4]   2> 1937240 INFO  (jetty-launcher-26570-thread-3) [    ] o.a.s.s.SolrDispatchFilter SolrDispatchFilter.init(): jdk.internal.loader.ClassLoaders$AppClassLoader@1223dd8
   [junit4]   2> 1937240 INFO  (jetty-launcher-26570-thread-2) [    ] o.a.s.c.SolrResourceLoader JNDI not configured for solr (NoInitialContextEx)
   [junit4]   2> 1937240 INFO  (jetty-launcher-26570-thread-3) [    ] o.a.s.c.SolrResourceLoader new SolrResourceLoader for directory: '/home/jenkins/workspace/Lucene-Solr-6.x-Linux/solr/build/solr-core/test/J2/temp/solr.security.BasicAuthIntegrationTest_C7CBC8E9742D5C5B-001/tempDir-001/node3'
   [junit4]   2> 1937240 INFO  (jetty-launcher-26570-thread-2) [    ] o.a.s.c.SolrResourceLoader solr home defaulted to 'solr/' (could not find system property or JNDI)
   [junit4]   2> 1937240 INFO  (jetty-launcher-26570-thread-1) [    ] o.a.s.c.SolrResourceLoader JNDI not configured for solr (NoInitialContextEx)
   [junit4]   2> 1937241 INFO  (jetty-launcher-26570-thread-3) [    ] o.a.s.c.SolrResourceLoader JNDI not configured for solr (NoInitialContextEx)
   [junit4]   2> 1937241 INFO  (jetty-launcher-26570-thread-1) [    ] o.a.s.c.SolrResourceLoader solr home defaulted to 'solr/' (could not find system property or JNDI)
   [junit4]   2> 1937241 INFO  (jetty-launcher-26570-thread-2) [    ] o.a.s.c.c.SolrZkClient Using default ZkCredentialsProvider
   [junit4]   2> 1937241 INFO  (jetty-launcher-26570-thread-3) [    ] o.a.s.c.SolrResourceLoader solr home defaulted to 'solr/' (could not find system property or JNDI)
   [junit4]   2> 1937241 INFO  (jetty-launcher-26570-thread-1) [    ] o.a.s.c.c.SolrZkClient Using default ZkCredentialsProvider
   [junit4]   2> 1937241 INFO  (jetty-launcher-26570-thread-3) [    ] o.a.s.c.c.SolrZkClient Using default ZkCredentialsProvider
   [junit4]   2> 1937241 INFO  (jetty-launcher-26570-thread-2) [    ] o.a.s.c.c.ConnectionManager Waiting for client to connect to ZooKeeper
   [junit4]   2> 1937241 INFO  (jetty-launcher-26570-thread-1) [    ] o.a.s.c.c.ConnectionManager Waiting for client to connect to ZooKeeper
   [junit4]   2> 1937242 INFO  (jetty-launcher-26570-thread-3) [    ] o.a.s.c.c.ConnectionManager Waiting for client to connect to ZooKeeper
   [junit4]   2> 1937242 INFO  (zkCallback-26574-thread-1) [    ] o.a.s.c.c.ConnectionManager Watcher org.apache.solr.common.cloud.ConnectionManager@c3ec2b name:ZooKeeperConnection Watcher:127.0.0.1:45015/solr got event WatchedEvent state:SyncConnected type:None path:null path:null type:None
   [junit4]   2> 1937242 INFO  (jetty-launcher-26570-thread-3) [    ] o.a.s.c.c.ConnectionManager Client is connected to ZooKeeper
   [junit4]   2> 1937242 INFO  (zkCallback-26573-thread-1) [    ] o.a.s.c.c.ConnectionManager Watcher org.apache.solr.common.cloud.ConnectionManager@17cf623 name:ZooKeeperConnection Watcher:127.0.0.1:45015/solr got event WatchedEvent state:SyncConnected type:None path:null path:null type:None
   [junit4]   2> 1937242 INFO  (jetty-launcher-26570-thread-1) [    ] o.a.s.c.c.ConnectionManager Client is connected to ZooKeeper
   [junit4]   2> 1937242 INFO  (jetty-launcher-26570-thread-3) [    ] o.a.s.c.c.SolrZkClient Using default ZkACLProvider
   [junit4]   2> 1937242 INFO  (jetty-launcher-26570-thread-1) [    ] o.a.s.c.c.SolrZkClient Using default ZkACLProvider
   [junit4]   2> 1937242 INFO  (zkCallback-26572-thread-1) [    ] o.a.s.c.c.ConnectionManager Watcher org.apache.solr.common.cloud.ConnectionManager@18b1407 name:ZooKeeperConnection Watcher:127.0.0.1:45015/solr got event WatchedEvent state:SyncConnected type:None path:null path:null type:None
   [junit4]   2> 1937243 INFO  (jetty-launcher-26570-thread-2) [    ] o.a.s.c.c.ConnectionManager Client is connected to ZooKeeper
   [junit4]   2> 1937243 INFO  (jetty-launcher-26570-thread-3) [    ] o.a.s.s.SolrDispatchFilter solr.xml found in ZooKeeper. Loading...
   [junit4]   2> 1937243 INFO  (jetty-launcher-26570-thread-1) [    ] o.a.s.s.SolrDispatchFilter solr.xml found in ZooKeeper. Loading...
   [junit4]   2> 1937243 INFO  (jetty-launcher-26570-thread-2) [    ] o.a.s.c.c.SolrZkClient Using default ZkACLProvider
   [junit4]   2> 1937243 INFO  (jetty-launcher-26570-thread-2) [    ] o.a.s.s.SolrDispatchFilter solr.xml found in ZooKeeper. Loading...
   [junit4]   2> 1937248 WARN  (NIOServerCxn.Factory:0.0.0.0/0.0.0.0:0) [    ] o.a.z.s.NIOServerCnxn caught end of stream exception
   [junit4]   2> EndOfStreamException: Unable to read additional data from client sessionid 0x15711835a110003, likely client has closed socket
   [junit4]   2> 	at org.apache.zookeeper.server.NIOServerCnxn.doIO(NIOServerCnxn.java:228)
   [junit4]   2> 	at org.apache.zookeeper.server.NIOServerCnxnFactory.run(NIOServerCnxnFactory.java:208)
   [junit4]   2> 	at java.lang.Thread.run(java.base@9-ea/Thread.java:843)
   [junit4]   2> 1937248 INFO  (jetty-launcher-26570-thread-1) [    ] o.a.s.c.CorePropertiesLocator Config-defined core root directory: /home/jenkins/workspace/Lucene-Solr-6.x-Linux/solr/build/solr-core/test/J2/temp/solr.security.BasicAuthIntegrationTest_C7CBC8E9742D5C5B-001/tempDir-001/node1/.
   [junit4]   2> 1937248 INFO  (jetty-launcher-26570-thread-1) [    ] o.a.s.c.CoreContainer New CoreContainer 10707450
   [junit4]   2> 1937248 INFO  (jetty-launcher-26570-thread-1) [    ] o.a.s.c.CoreContainer Loading cores into CoreContainer [instanceDir=/home/jenkins/workspace/Lucene-Solr-6.x-Linux/solr/build/solr-core/test/J2/temp/solr.security.BasicAuthIntegrationTest_C7CBC8E9742D5C5B-001/tempDir-001/node1]
   [junit4]   2> 1937249 WARN  (jetty-launcher-26570-thread-1) [    ] o.a.s.c.CoreContainer Couldn't add files from /home/jenkins/workspace/Lucene-Solr-6.x-Linux/solr/build/solr-core/test/J2/temp/solr.security.BasicAuthIntegrationTest_C7CBC8E9742D5C5B-001/tempDir-001/node1/lib to classpath: /home/jenkins/workspace/Lucene-Solr-6.x-Linux/solr/build/solr-core/test/J2/temp/solr.security.BasicAuthIntegrationTest_C7CBC8E9742D5C5B-001/tempDir-001/node1/lib
   [junit4]   2> 1937249 INFO  (jetty-launcher-26570-thread-1) [    ] o.a.s.h.c.HttpShardHandlerFactory created with socketTimeout : 90000,urlScheme : https,connTimeout : 15000,maxConnectionsPerHost : 20,maxConnections : 10000,corePoolSize : 0,maximumPoolSize : 2147483647,maxThreadIdleTime : 5,sizeOfQueue : -1,fairnessPolicy : false,useRetries : false,connectionsEvictorSleepDelay : 5000,maxConnectionIdleTime : 40000,
   [junit4]   2> 1937254 INFO  (jetty-launcher-26570-thread-2) [    ] o.a.s.c.CorePropertiesLocator Config-defined core root directory: /home/jenkins/workspace/Lucene-Solr-6.x-Linux/solr/build/solr-core/test/J2/temp/solr.security.BasicAuthIntegrationTest_C7CBC8E9742D5C5B-001/tempDir-001/node2/.
   [junit4]   2> 1937254 INFO  (jetty-launcher-26570-thread-2) [    ] o.a.s.c.CoreContainer New CoreContainer 6325853
   [junit4]   2> 1937254 INFO  (jetty-launcher-26570-thread-2) [    ] o.a.s.c.CoreContainer Loading cores into CoreContainer [instanceDir=/home/jenkins/workspace/Lucene-Solr-6.x-Linux/solr/build/solr-core/test/J2/temp/solr.security.BasicAuthIntegrationTest_C7CBC8E9742D5C5B-001/tempDir-001/node2]
   [junit4]   2> 1937254 WARN  (jetty-launcher-26570-thread-2) [    ] o.a.s.c.CoreContainer Couldn't add files from /home/jenkins/workspace/Lucene-Solr-6.x-Linux/solr/build/solr-core/test/J2/temp/solr.security.BasicAuthIntegrationTest_C7CBC8E9742D5C5B-001/tempDir-001/node2/lib to classpath: /home/jenkins/workspace/Lucene-Solr-6.x-Linux/solr/build/solr-core/test/J2/temp/solr.security.BasicAuthIntegrationTest_C7CBC8E9742D5C5B-001/tempDir-001/node2/lib
   [junit4]   2> 1937254 INFO  (jetty-launcher-26570-thread-1) [    ] o.a.s.u.UpdateShardHandler Creating UpdateShardHandler HTTP client with params: socketTimeout=340000&connTimeout=45000&retry=true
   [junit4]   2> 1937255 INFO  (jetty-launcher-26570-thread-1) [    ] o.a.s.l.LogWatcher SLF4J impl is org.slf4j.impl.Log4jLoggerFactory
   [junit4]   2> 1937255 INFO  (jetty-launcher-26570-thread-1) [    ] o.a.s.l.LogWatcher Registering Log Listener [Log4j (org.slf4j.impl.Log4jLoggerFactory)]
   [junit4]   2> 1937255 INFO  (jetty-launcher-26570-thread-1) [    ] o.a.s.c.ZkContainer Zookeeper client=127.0.0.1:45015/solr
   [junit4]   2> 1937255 INFO  (jetty-launcher-26570-thread-1) [    ] o.a.s.c.ZkController zkHost includes chroot
   [junit4]   2> 1937255 INFO  (jetty-launcher-26570-thread-1) [    ] o.a.s.c.c.SolrZkClient Using default ZkCredentialsProvider
   [junit4]   2> 1937256 INFO  (jetty-launcher-26570-thread-1) [    ] o.a.s.c.c.ConnectionManager Waiting for client to connect to ZooKeeper
   [junit4]   2> 1937252 INFO  (jetty-launcher-26570-thread-3) [    ] o.a.s.c.CorePropertiesLocator Config-defined core root directory: /home/jenkins/workspace/Lucene-Solr-6.x-Linux/solr/build/solr-core/test/J2/temp/solr.security.BasicAuthIntegrationTest_C7CBC8E9742D5C5B-001/tempDir-001/node3/.
   [junit4]   2> 1937252 WARN  (NIOServerCxn.Factory:0.0.0.0/0.0.0.0:0) [    ] o.a.z.s.NIOServerCnxn caught end of stream exception
   [junit4]   2> EndOfStreamException: Unable to read additional data from client sessionid 0x15711835a110001, likely client has closed socket
   [junit4]   2> 	at org.apache.zookeeper.server.NIOServerCnxn.doIO(NIOServerCnxn.java:228)
   [junit4]   2> 	at org.apache.zookeeper.server.NIOServerCnxnFactory.run(NIOServerCnxnFactory.java:208)
   [junit4]   2> 	at java.lang.Thread.run(java.base@9-ea/Thread.java:843)
   [junit4]   2> 1937258 INFO  (jetty-launcher-26570-thread-3) [    ] o.a.s.c.CoreContainer New CoreContainer 18939636
   [junit4]   2> 1937254 INFO  (jetty-launcher-26570-thread-2) [    ] o.a.s.h.c.HttpShardHandlerFactory created with socketTimeout : 90000,urlScheme : https,connTimeout : 15000,maxConnectionsPerHost : 20,maxConnections : 10000,corePoolSize : 0,maximumPoolSize : 2147483647,maxThreadIdleTime : 5,sizeOfQueue : -1,fairnessPolicy : false,useRetries : false,connectionsEvictorSleepDelay : 5000,maxConnectionIdleTime : 40000,
   [junit4]   2> 1937258 INFO  (jetty-launcher-26570-thread-3) [    ] o.a.s.c.CoreContainer Loading cores into CoreContainer [instanceDir=/home/jenkins/workspace/Lucene-Solr-6.x-Linux/solr/build/solr-core/test/J2/temp/solr.security.BasicAuthIntegrationTest_C7CBC8E9742D5C5B-001/tempDir-001/node3]
   [junit4]   2> 1937258 WARN  (NIOServerCxn.Factory:0.0.0.0/0.0.0.0:0) [    ] o.a.z.s.NIOServerCnxn caught end of stream exception
   [junit4]   2> EndOfStreamException: Unable to read additional data from client sessionid 0x15711835a110002, likely client has closed socket
   [junit4]   2> 	at org.apache.zookeeper.server.NIOServerCnxn.doIO(NIOServerCnxn.java:228)
   [junit4]   2> 	at org.apache.zookeeper.server.NIOServerCnxnFactory.run(NIOServerCnxnFactory.java:208)
   [junit4]   2> 	at java.lang.Thread.run(java.base@9-ea/Thread.java:843)
   [junit4]   2> 1937259 WARN  (jetty-launcher-26570-thread-3) [    ] o.a.s.c.CoreContainer Couldn't add files from /home/jenkins/workspace/Lucene-Solr-6.x-Linux/solr/build/solr-core/test/J2/temp/solr.security.BasicAuthIntegrationTest_C7CBC8E9742D5C5B-001/tempDir-001/node3/lib to classpath: /home/jenkins/workspace/Lucene-Solr-6.x-Linux/solr/build/solr-core/test/J2/temp/solr.security.BasicAuthIntegrationTest_C7CBC8E9742D5C5B-001/tempDir-001/node3/lib
   [junit4]   2> 1937259 INFO  (jetty-launcher-26570-thread-3) [    ] o.a.s.h.c.HttpShardHandlerFactory created with socketTimeout : 90000,urlScheme : https,connTimeout : 15000,maxConnectionsPerHost : 20,maxConnections : 10000,corePoolSize : 0,maximumPoolSize : 2147483647,maxThreadIdleTime : 5,sizeOfQueue : -1,fairnessPolicy : false,useRetries : false,connectionsEvictorSleepDelay : 5000,maxConnectionIdleTime : 40000,
   [junit4]   2> 1937259 INFO  (jetty-launcher-26570-thread-2) [    ] o.a.s.u.UpdateShardHandler Creating UpdateShardHandler HTTP client with params: socketTimeout=340000&connTimeout=45000&retry=true
   [junit4]   2> 1937259 INFO  (zkCallback-26577-thread-1) [    ] o.a.s.c.c.ConnectionManager Watcher org.apache.solr.common.cloud.ConnectionManager@4329b0 name:ZooKeeperConnection Watcher:127.0.0.1:45015 got event WatchedEvent state:SyncConnected type:None path:null path:null type:None
   [junit4]   2> 1937259 INFO  (jetty-launcher-26570-thread-1) [    ] o.a.s.c.c.ConnectionManager Client is connected to ZooKeeper
   [junit4]   2> 1937259 INFO  (jetty-launcher-26570-thread-3) [    ] o.a.s.u.UpdateShardHandler Creating UpdateShardHandler HTTP client with params: socketTimeout=340000&connTimeout=45000&retry=true
   [junit4]   2> 1937260 INFO  (jetty-launcher-26570-thread-2) [    ] o.a.s.l.LogWatcher SLF4J impl is org.slf4j.impl.Log4jLoggerFactory
   [junit4]   2> 1937260 INFO  (jetty-launcher-26570-thread-1) [    ] o.a.s.c.c.SolrZkClient Using default ZkACLProvider
   [junit4]   2> 1937260 INFO  (jetty-launcher-26570-thread-2) [    ] o.a.s.l.LogWatcher Registering Log Listener [Log4j (org.slf4j.impl.Log4jLoggerFactory)]
   [junit4]   2> 1937260 INFO  (jetty-launcher-26570-thread-2) [    ] o.a.s.c.ZkContainer Zookeeper client=127.0.0.1:45015/solr
   [junit4]   2> 1937260 INFO  (jetty-launcher-26570-thread-3) [    ] o.a.s.l.LogWatcher SLF4J impl is org.slf4j.impl.Log4jLoggerFactory
   [junit4]   2> 1937260 INFO  (jetty-launcher-26570-thread-2) [    ] o.a.s.c.ZkController zkHost includes chroot
   [junit4]   2> 1937260 INFO  (jetty-launcher-26570-thread-3) [    ] o.a.s.l.LogWatcher Registering Log Listener [Log4j (org.slf4j.impl.Log4jLoggerFactory)]
   [junit4]   2> 1937260 INFO  (jetty-launcher-26570-thread-2) [    ] o.a.s.c.c.SolrZkClient Using default ZkCredentialsProvider
   [junit4]   2> 1937260 INFO  (jetty-launcher-26570-thread-3) [    ] o.a.s.c.ZkContainer Zookeeper client=127.0.0.1:45015/solr
   [junit4]   2> 1937260 INFO  (jetty-launcher-26570-thread-3) [    ] o.a.s.c.ZkController zkHost includes chroot
   [junit4]   2> 1937260 INFO  (jetty-launcher-26570-thread-3) [    ] o.a.s.c.c.SolrZkClient Using default ZkCredentialsProvider
   [junit4]   2> 1937260 INFO  (jetty-launcher-26570-thread-2) [    ] o.a.s.c.c.ConnectionManager Waiting for client to connect to ZooKeeper
   [junit4]   2> 1937260 INFO  (jetty-launcher-26570-thread-3) [    ] o.a.s.c.c.ConnectionManager Waiting for client to connect to ZooKeeper
   [junit4]   2> 1937260 INFO  (jetty-launcher-26570-thread-1) [    ] o.a.s.c.ZkController Added new OnReconnect listener org.apache.solr.cloud.ZkController$$Lambda$275/3351959@13eb651
   [junit4]   2> 1937261 INFO  (zkCallback-26582-thread-1) [    ] o.a.s.c.c.ConnectionManager Watcher org.apache.solr.common.cloud.ConnectionManager@1248123 name:ZooKeeperConnection Watcher:127.0.0.1:45015 got event WatchedEvent state:SyncConnected type:None path:null path:null type:None
   [junit4]   2> 1937261 INFO  (jetty-launcher-26570-thread-1) [    ] o.a.s.c.c.ConnectionManager Waiting for client to connect to ZooKeeper
   [junit4]   2> 1937261 INFO  (jetty-launcher-26570-thread-2) [    ] o.a.s.c.c.ConnectionManager Client is connected to ZooKeeper
   [junit4]   2> 1937261 INFO  (zkCallback-26583-thread-1) [    ] o.a.s.c.c.ConnectionManager Watcher org.apache.solr.common.cloud.ConnectionManager@1e37968 name:ZooKeeperConnection Watcher:127.0.0.1:45015 got event WatchedEvent state:SyncConnected type:None path:null path:null type:None
   [junit4]   2> 1937261 INFO  (jetty-launcher-26570-thread-3) [    ] o.a.s.c.c.ConnectionManager Client is connected to ZooKeeper
   [junit4]   2> 1937261 INFO  (jetty-launcher-26570-thread-2) [    ] o.a.s.c.c.SolrZkClient Using default ZkACLProvider
   [junit4]   2> 1937261 INFO  (jetty-launcher-26570-thread-3) [    ] o.a.s.c.c.SolrZkClient Using default ZkACLProvider
   [junit4]   2> 1937261 INFO  (zkCallback-26584-thread-1) [    ] o.a.s.c.c.ConnectionManager Watcher org.apache.solr.common.cloud.ConnectionManager@15815c9 name:ZooKeeperConnection Watcher:127.0.0.1:45015/solr got event WatchedEvent state:SyncConnected type:None path:null path:null type:None
   [junit4]   2> 1937262 INFO  (jetty-launcher-26570-thread-1) [    ] o.a.s.c.c.ConnectionManager Client is connected to ZooKeeper
   [junit4]   2> 1937262 INFO  (jetty-launcher-26570-thread-2) [    ] o.a.s.c.ZkController Added new OnReconnect listener org.apache.solr.cloud.ZkController$$Lambda$275/3351959@13c7888
   [junit4]   2> 1937263 INFO  (jetty-launcher-26570-thread-2) [    ] o.a.s.c.c.ConnectionManager Waiting for client to connect to ZooKeeper
   [junit4]   2> 1937263 INFO  (jetty-launcher-26570-thread-3) [    ] o.a.s.c.ZkController Added new OnReconnect listener org.apache.solr.cloud.ZkController$$Lambda$275/3351959@243470
   [junit4]   2> 1937263 INFO  (jetty-launcher-26570-thread-1) [    ] o.a.s.c.c.SolrZkClient makePath: /overseer/queue
   [junit4]   2> 1937263 INFO  (jetty-launcher-26570-thread-3) [    ] o.a.s.c.c.ConnectionManager Waiting for client to connect to ZooKeeper
   [junit4]   2> 1937264 INFO  (zkCallback-26585-thread-1) [    ] o.a.s.c.c.ConnectionManager Watcher org.apache.solr.common.cloud.ConnectionManager@156a807 name:ZooKeeperConnection Watcher:127.0.0.1:45015/solr got event WatchedEvent state:SyncConnected type:None path:null path:null type:None
   [junit4]   2> 1937264 INFO  (jetty-launcher-26570-thread-2) [    ] o.a.s.c.c.ConnectionManager Client is connected to ZooKeeper
   [junit4]   2> 1937264 INFO  (zkCallback-26586-thread-1) [    ] o.a.s.c.c.ConnectionManager Watcher org.apache.solr.common.cloud.ConnectionManager@fdd4c2 name:ZooKeeperConnection Watcher:127.0.0.1:45015/solr got event WatchedEvent state:SyncConnected type:None path:null path:null type:None
   [junit4]   2> 1937264 INFO  (jetty-launcher-26570-thread-3) [    ] o.a.s.c.c.ConnectionManager Client is connected to ZooKeeper
   [junit4]   2> 1937264 INFO  (jetty-launcher-26570-thread-1) [    ] o.a.s.c.c.SolrZkClient makePath: /overseer/collection-queue-work
   [junit4]   2> 1937265 INFO  (jetty-launcher-26570-thread-3) [    ] o.a.s.c.c.SolrZkClient makePath: /overseer/collection-queue-work
   [junit4]   2> 1937265 INFO  (jetty-launcher-26570-thread-2) [    ] o.a.s.c.c.SolrZkClient makePath: /overseer/collection-queue-work
   [junit4]   2> 1937266 INFO  (jetty-launcher-26570-thread-1) [    ] o.a.s.c.c.SolrZkClient makePath: /overseer/collection-map-running
   [junit4]   2> 1937266 INFO  (jetty-launcher-26570-thread-3) [    ] o.a.s.c.c.SolrZkClient makePath: /overseer/collection-map-running
   [junit4]   2> 1937266 INFO  (jetty-launcher-26570-thread-2) [    ] o.a.s.c.c.SolrZkClient makePath: /overseer/collection-map-running
   [junit4]   2> 1937267 INFO  (jetty-launcher-26570-thread-1) [    ] o.a.s.c.c.SolrZkClient makePath: /overseer/collection-map-completed
   [junit4]   2> 1937267 INFO  (jetty-launcher-26570-thread-3) [    ] o.a.s.c.c.SolrZkClient makePath: /overseer/collection-map-completed
   [junit4]   2> 1937267 INFO  (jetty-launcher-26570-thread-2) [    ] o.a.s.c.c.SolrZkClient makePath: /overseer/collection-map-completed
   [junit4]   2> 1937268 INFO  (jetty-launcher-26570-thread-3) [    ] o.a.s.c.c.SolrZkClient makePath: /overseer/collection-map-failure
   [junit4]   2> 1937268 INFO  (jetty-launcher-26570-thread-1) [    ] o.a.s.c.c.SolrZkClient makePath: /overseer/collection-map-failure
   [junit4]   2> 1937268 INFO  (jetty-launcher-26570-thread-2) [    ] o.a.s.c.c.SolrZkClient makePath: /overseer/collection-map-failure
   [junit4]   2> 1937268 INFO  (jetty-launcher-26570-thread-1) [    ] o.a.s.c.c.SolrZkClient makePath: /live_nodes
   [junit4]   2> 1937268 INFO  (jetty-launcher-26570-thread-2) [    ] o.a.s.c.c.SolrZkClient makePath: /live_nodes
   [junit4]   2> 1937268 INFO  (jetty-launcher-26570-thread-3) [    ] o.a.s.c.c.SolrZkClient makePath: /live_nodes
   [junit4]   2> 1937269 INFO  (jetty-launcher-26570-thread-2) [    ] o.a.s.c.c.SolrZkClient makePath: /collections
   [junit4]   2> 1937269 INFO  (jetty-launcher-26570-thread-1) [    ] o.a.s.c.c.SolrZkClient makePath: /collections
   [junit4]   2> 1937269 INFO  (jetty-launcher-26570-thread-3) [    ] o.a.s.c.c.SolrZkClient makePath: /collections
   [junit4]   2> 1937269 INFO  (jetty-launcher-26570-thread-1) [    ] o.a.s.c.c.SolrZkClient makePath: /aliases.json
   [junit4]   2> 1937269 INFO  (jetty-launcher-26570-thread-2) [    ] o.a.s.c.c.SolrZkClient makePath: /aliases.json
   [junit4]   2> 1937269 INFO  (jetty-launcher-26570-thread-3) [    ] o.a.s.c.c.SolrZkClient makePath: /aliases.json
   [junit4]   2> 1937270 INFO  (jetty-launcher-26570-thread-2) [    ] o.a.s.c.c.SolrZkClient makePath: /clusterstate.json
   [junit4]   2> 1937270 INFO  (jetty-launcher-26570-thread-1) [    ] o.a.s.c.c.SolrZkClient makePath: /clusterstate.json
   [junit4]   2> 1937270 INFO  (jetty-launcher-26570-thread-3) [    ] o.a.s.c.c.SolrZkClient makePath: /clusterstate.json
   [junit4]   2> 1937270 INFO  (jetty-launcher-26570-thread-1) [    ] o.a.s.c.c.SolrZkClient makePath: /security.json
   [junit4]   2> 1937271 INFO  (jetty-launcher-26570-thread-3) [    ] o.a.s.c.c.SolrZkClient makePath: /security.json
   [junit4]   2> 1937271 INFO  (jetty-launcher-26570-thread-2) [    ] o.a.s.c.c.SolrZkClient makePath: /security.json
   [junit4]   2> 1937271 INFO  (jetty-launcher-26570-thread-1) [    ] o.a.s.c.c.ZkStateReader Updating cluster state from ZooKeeper... 
   [junit4]   2> 1937271 INFO  (jetty-launcher-26570-thread-3) [    ] o.a.s.c.c.ZkStateReader Updating cluster state from ZooKeeper... 
   [junit4]   2> 1937271 INFO  (jetty-launcher-26570-thread-2) [    ] o.a.s.c.c.ZkStateReader Updating cluster state from ZooKeeper... 
   [junit4]   2> 1937271 INFO  (jetty-launcher-26570-thread-3) [    ] o.a.s.c.c.ZkStateReader Loaded cluster properties: {urlScheme=https}
   [junit4]   2> 1937271 INFO  (jetty-launcher-26570-thread-1) [    ] o.a.s.c.c.ZkStateReader Loaded cluster properties: {urlScheme=https}
   [junit4]   2> 1937271 INFO  (jetty-launcher-26570-thread-2) [    ] o.a.s.c.c.ZkStateReader Loaded cluster properties: {urlScheme=https}
   [junit4]   2> 1937271 INFO  (jetty-launcher-26570-thread-3) [    ] o.a.s.c.c.ZkStateReader Updated live nodes from ZooKeeper... (0) -> (0)
   [junit4]   2> 1937272 INFO  (jetty-launcher-26570-thread-1) [    ] o.a.s.c.c.ZkStateReader Updated live nodes from ZooKeeper... (0) -> (0)
   [junit4]   2> 1937272 INFO  (jetty-launcher-26570-thread-2) [    ] o.a.s.c.c.ZkStateReader Updated live nodes from ZooKeeper... (0) -> (0)
   [junit4]   2> 1937273 INFO  (jetty-launcher-26570-thread-3) [    ] o.a.s.c.c.SolrZkClient makePath: /overseer_elect
   [junit4]   2> 1937273 INFO  (jetty-launcher-26570-thread-1) [    ] o.a.s.c.c.SolrZkClient makePath: /overseer_elect
   [junit4]   2> 1937273 INFO  (jetty-launcher-26570-thread-2) [    ] o.a.s.c.c.SolrZkClient makePath: /overseer_elect
   [junit4]   2> 1937273 INFO  (jetty-launcher-26570-thread-3) [    ] o.a.s.c.c.SolrZkClient makePath: /overseer_elect/election
   [junit4]   2> 1937273 INFO  (jetty-launcher-26570-thread-1) [    ] o.a.s.c.c.SolrZkClient makePath: /overseer_elect/election
   [junit4]   2> 1937273 INFO  (jetty-launcher-26570-thread-2) [    ] o.a.s.c.c.SolrZkClient makePath: /overseer_elect/election
   [junit4]   2> 1937274 INFO  (jetty-launcher-26570-thread-3) [    ] o.a.s.c.Overseer Overseer (id=null) closing
   [junit4]   2> 1937274 INFO  (jetty-launcher-26570-thread-1) [    ] o.a.s.c.Overseer Overseer (id=null) closing
   [junit4]   2> 1937275 INFO  (jetty-launcher-26570-thread-2) [    ] o.a.s.c.Overseer Overseer (id=null) closing
   [junit4]   2> 1937275 INFO  (jetty-launcher-26570-thread-3) [    ] o.a.s.c.LeaderElector Joined leadership election with path: /overseer_elect/election/96565172861206537-127.0.0.1:46592_solr-n_0000000000
   [junit4]   2> 1937275 INFO  (jetty-launcher-26570-thread-1) [    ] o.a.s.c.LeaderElector Joined leadership election with path: /overseer_elect/election/96565172861206535-127.0.0.1:43810_solr-n_0000000001
   [junit4]   2> 1937275 INFO  (jetty-launcher-26570-thread-2) [    ] o.a.s.c.LeaderElector Joined leadership election with path: /overseer_elect/election/96565172861206536-127.0.0.1:37428_solr-n_0000000002
   [junit4]   2> 1937275 INFO  (jetty-launcher-26570-thread-3) [    ] o.a.s.c.OverseerElectionContext I am going to be the leader 127.0.0.1:46592_solr
   [junit4]   2> 1937275 INFO  (jetty-launcher-26570-thread-3) [    ] o.a.s.c.c.SolrZkClient makePath: /overseer_elect/leader
   [junit4]   2> 1937276 INFO  (jetty-launcher-26570-thread-1) [    ] o.a.s.c.LeaderElector Watching path /overseer_elect/election/96565172861206537-127.0.0.1:46592_solr-n_0000000000 to know if I could be the leader
   [junit4]   2> 1937276 INFO  (jetty-launcher-26570-thread-2) [    ] o.a.s.c.LeaderElector Watching path /overseer_elect/election/96565172861206535-127.0.0.1:43810_solr-n_0000000001 to know if I could be the leader
   [junit4]   2> 1937276 INFO  (jetty-launcher-26570-thread-2) [    ] o.a.s.c.ZkController Register node as live in ZooKeeper:/live_nodes/127.0.0.1:37428_solr
   [junit4]   2> 1937276 INFO  (jetty-launcher-26570-thread-1) [    ] o.a.s.c.ZkController Register node as live in ZooKeeper:/live_nodes/127.0.0.1:43810_solr
   [junit4]   2> 1937276 INFO  (jetty-launcher-26570-thread-2) [    ] o.a.s.c.c.SolrZkClient makePath: /live_nodes/127.0.0.1:37428_solr
   [junit4]   2> 1937276 INFO  (jetty-launcher-26570-thread-1) [    ] o.a.s.c.c.SolrZkClient makePath: /live_nodes/127.0.0.1:43810_solr
   [junit4]   2> 1937276 INFO  (jetty-launcher-26570-thread-3) [    ] o.a.s.c.Overseer Overseer (id=96565172861206537-127.0.0.1:46592_solr-n_0000000000) starting
   [junit4]   2> 1937277 INFO  (zkCallback-26584-thread-1) [    ] o.a.s.c.c.ZkStateReader A live node change: [WatchedEvent state:SyncConnected type:NodeChildrenChanged path:/live_nodes], has occurred - updating... (live nodes size: [0])
   [junit4]   2> 1937277 INFO  (zkCallback-26586-thread-1) [    ] o.a.s.c.c.ZkStateReader A live node change: [WatchedEvent state:SyncConnected type:NodeChildrenChanged path:/live_nodes], has occurred - updating... (live nodes size: [0])
   [junit4]   2> 1937277 INFO  (zkCallback-26585-thread-1) [    ] o.a.s.c.c.ZkStateReader A live node change: [WatchedEvent state:SyncConnected type:NodeChildrenChanged path:/live_nodes], has occurred - updating... (live nodes size: [0])
   [junit4]   2> 1937278 INFO  (zkCallback-26584-thread-1) [    ] o.a.s.c.c.ZkStateReader Updated live nodes from ZooKeeper... (0) -> (2)
   [junit4]   2> 1937278 INFO  (zkCallback-26585-thread-1) [    ] o.a.s.c.c.ZkStateReader Updated live nodes from ZooKeeper... (0) -> (2)
   [junit4]   2> 1937278 INFO  (zkCallback-26586-thread-1) [    ] o.a.s.c.c.ZkStateReader Updated live nodes from ZooKeeper... (0) -> (2)
   [junit4]   2> 1937278 INFO  (jetty-launcher-26570-thread-3) [    ] o.a.s.c.c.SolrZkClient makePath: /overseer/queue-work
   [junit4]   2> 1937281 INFO  (jetty-launcher-26570-thread-3) [    ] o.a.s.c.OverseerAutoReplicaFailoverThread Starting OverseerAutoReplicaFailoverThread autoReplicaFailoverWorkLoopDelay=10000 autoReplicaFailoverWaitAfterExpiration=30000 autoReplicaFailoverBadNodeExpiration=60000
   [junit4]   2> 1937281 INFO  (OverseerCollectionConfigSetProcessor-96565172861206537-127.0.0.1:46592_solr-n_0000000000) [    ] o.a.s.c.OverseerTaskProcessor Process current queue of overseer operations
   [junit4]   2> 1937281 INFO  (jetty-launcher-26570-thread-3) [    ] o.a.s.c.ZkController Publish node=127.0.0.1:46592_solr as DOWN
   [junit4]   2> 1937281 INFO  (OverseerStateUpdate-96565172861206537-127.0.0.1:46592_solr-n_0000000000) [    ] o.a.s.c.Overseer Starting to work on the main queue
   [junit4]   2> 1937282 INFO  (jetty-launcher-26570-thread-3) [    ] o.a.s.c.ZkController Register node as live in ZooKeeper:/live_nodes/127.0.0.1:46592_solr
   [junit4]   2> 1937282 INFO  (OverseerStateUpdate-96565172861206537-127.0.0.1:46592_solr-n_0000000000) [    ] o.a.s.c.c.ZkStateReader Updated live nodes from ZooKeeper... (2) -> (2)
   [junit4]   2> 1937282 INFO  (jetty-launcher-26570-thread-3) [    ] o.a.s.c.c.SolrZkClient makePath: /live_nodes/127.0.0.1:46592_solr
   [junit4]   2> 1937282 INFO  (zkCallback-26584-thread-1) [    ] o.a.s.c.c.ZkStateReader A live node change: [WatchedEvent state:SyncConnected type:NodeChildrenChanged path:/live_nodes], has occurred - updating... (live nodes size: [2])
   [junit4]   2> 1937282 INFO  (zkCallback-26586-thread-1) [    ] o.a.s.c.c.ZkStateReader A live node change: [WatchedEvent state:SyncConnected type:NodeChildrenChanged path:/live_nodes], has occurred - updating... (live nodes size: [2])
   [junit4]   2> 1937282 INFO  (zkCallback-26585-thread-1) [    ] o.a.s.c.c.ZkStateReader A live node change: [WatchedEvent state:SyncConnected type:NodeChildrenChanged path:/live_nodes], has occurred - updating... (live nodes size: [2])
   [junit4]   2> 1937283 INFO  (zkCallback-26585-thread-1) [    ] o.a.s.c.c.ZkStateReader Updated live nodes from ZooKeeper... (2) -> (3)
   [junit4]   2> 1937283 INFO  (zkCallback-26584-thread-1) [    ] o.a.s.c.c.ZkStateReader Updated live nodes from ZooKeeper... (2) -> (3)
   [junit4]   2> 1937290 INFO  (zkCallback-26586-thread-1) [    ] o.a.s.c.c.ZkStateReader Updated live nodes from ZooKeeper... (2) -> (3)
   [junit4]   2> 1937290 INFO  (jetty-launcher-26570-thread-2) [    ] o.a.s.c.CoreContainer Security conf doesn't exist. Skipping setup for authorization module.
   [junit4]   2> 1937290 INFO  (jetty-launcher-26570-thread-2) [    ] o.a.s.c.CoreContainer No authentication plugin used.
   [junit4]   2> 1937290 INFO  (jetty-launcher-26570-thread-2) [    ] o.a.s.c.CorePropertiesLocator Looking for core definitions underneath /home/jenkins/workspace/Lucene-Solr-6.x-Linux/solr/build/solr-core/test/J2/temp/solr.security.BasicAuthIntegrationTest_C7CBC8E9742D5C5B-001/tempDir-001/node2/.
   [junit4]   2> 1937291 INFO  (OverseerStateUpdate-96565172861206537-127.0.0.1:46592_solr-n_0000000000) [    ] o.a.s.c.Overseer processMessage: queueSize: 1, message = {
   [junit4]   2>   "operation":"downnode",
   [junit4]   2>   "node_name":"127.0.0.1:46592_solr"} current state version: 0
   [junit4]   2> 1937291 INFO  (jetty-launcher-26570-thread-1) [    ] o.a.s.c.CoreContainer Security conf doesn't exist. Skipping setup for authorization module.
   [junit4]   2> 1937291 INFO  (OverseerStateUpdate-96565172861206537-127.0.0.1:46592_solr-n_0000000000) [    ] o.a.s.c.o.NodeMutator DownNode state invoked for node: 127.0.0.1:46592_solr
   [junit4]   2> 1937291 INFO  (jetty-launcher-26570-thread-1) [    ] o.a.s.c.CoreContainer No authentication plugin used.
   [junit4]   2> 1937291 INFO  (jetty-launcher-26570-thread-2) [    ] o.a.s.c.CorePropertiesLocator Found 0 core definitions
   [junit4]   2> 1937291 INFO  (jetty-launcher-26570-thread-1) [    ] o.a.s.c.CorePropertiesLocator Looking for core definitions underneath /home/jenkins/workspace/Lucene-Solr-6.x-Linux/solr/build/solr-core/test/J2/temp/solr.security.BasicAuthIntegrationTest_C7CBC8E9742D5C5B-001/tempDir-001/node1/.
   [junit4]   2> 1937291 INFO  (jetty-launcher-26570-thread-1) [    ] o.a.s.c.CorePropertiesLocator Found 0 core definitions
   [junit4]   2> 1937292 INFO  (jetty-launcher-26570-thread-2) [    ] o.a.s.s.SolrDispatchFilter user.dir=/home/jenkins/workspace/Lucene-Solr-6.x-Linux/solr/build/solr-core/test/J2
   [junit4]   2> 1937292 INFO  (jetty-launcher-26570-thread-2) [    ] o.a.s.s.SolrDispatchFilter SolrDispatchFilter.init() done
   [junit4]   2> 1937292 INFO  (jetty-launcher-26570-thread-1) [    ] o.a.s.s.SolrDispatchFilter user.dir=/home/jenkins/workspace/Lucene-Solr-6.x-Linux/solr/build/solr-core/test/J2
   [junit4]   2> 1937292 INFO  (jetty-launcher-26570-thread-1) [    ] o.a.s.s.SolrDispatchFilter SolrDispatchFilter.init() done
   [junit4]   2> 1937307 INFO  (jetty-launcher-26570-thread-3) [    ] o.a.s.c.CoreContainer Security conf doesn't exist. Skipping setup for authorization module.
   [junit4]   2> 1937307 INFO  (jetty-launcher-26570-thread-3) [    ] o.a.s.c.CoreContainer No authentication plugin used.
   [junit4]   2> 1937307 INFO  (jetty-launcher-26570-thread-3) [    ] o.a.s.c.CorePropertiesLocator Looking for core definitions underneath /home/jenkins/workspace/Lucene-Solr-6.x-Linux/solr/build/solr-core/test/J2/temp/solr.security.BasicAuthIntegrationTest_C7CBC8E9742D5C5B-001/tempDir-001/node3/.
   [junit4]   2> 1937307 INFO  (jetty-launcher-26570-thread-3) [    ] o.a.s.c.CorePropertiesLocator Found 0 core definitions
   [junit4]   2> 1937308 INFO  (jetty-launcher-26570-thread-3) [    ] o.a.s.s.SolrDispatchFilter user.dir=/home/jenkins/workspace/Lucene-Solr-6.x-Linux/solr/build/solr-core/test/J2
   [junit4]   2> 1937308 INFO  (jetty-launcher-26570-thread-3) [    ] o.a.s.s.SolrDispatchFilter SolrDispatchFilter.init() done
   [junit4]   2> 1937308 INFO  (SUITE-BasicAuthIntegrationTest-seed#[C7CBC8E9742D5C5B]-worker) [    ] o.a.s.c.c.SolrZkClient Using default ZkCredentialsProvider
   [junit4]   2> 1937308 INFO  (SUITE-BasicAuthIntegrationTest-seed#[C7CBC8E9742D5C5B]-worker) [    ] o.a.s.c.c.ConnectionManager Waiting for client to connect to ZooKeeper
   [junit4]   2> 1937309 INFO  (zkCallback-26590-thread-1) [    ] o.a.s.c.c.ConnectionManager Watcher org.apache.solr.common.cloud.ConnectionManager@1d4030c name:ZooKeeperConnection Watcher:127.0.0.1:45015 got event WatchedEvent state:SyncConnected type:None path:null path:null type:None
   [junit4]   2> 1937309 INFO  (SUITE-BasicAuthIntegrationTest-seed#[C7CBC8E9742D5C5B]-worker) [    ] o.a.s.c.c.ConnectionManager Client is connected to ZooKeeper
   [junit4]   2> 1937309 INFO  (SUITE-BasicAuthIntegrationTest-seed#[C7CBC8E9742D5C5B]-worker) [    ] o.a.s.c.c.SolrZkClient Using default ZkACLProvider
   [junit4]   2> 1937310 INFO  (SUITE-BasicAuthIntegrationTest-seed#[C7CBC8E9742D5C5B]-worker) [    ] o.a.s.c.c.SolrZkClient Using default ZkCredentialsProvider
   [junit4]   2> 1937311 INFO  (SUITE-BasicAuthIntegrationTest-seed#[C7CBC8E9742D5C5B]-worker) [    ] o.a.s.c.c.ConnectionManager Waiting for client to connect to ZooKeeper
   [junit4]   2> 1937311 INFO  (zkCallback-26593-thread-1) [    ] o.a.s.c.c.ConnectionManager Watcher org.apache.solr.common.cloud.ConnectionManager@1f775b5 name:ZooKeeperConnection Watcher:127.0.0.1:45015/solr got event WatchedEvent state:SyncConnected type:None path:null path:null type:None
   [junit4]   2> 1937312 INFO  (SUITE-BasicAuthIntegrationTest-seed#[C7CBC8E9742D5C5B]-worker) [    ] o.a.s.c.c.ConnectionManager Client is connected to ZooKeeper
   [junit4]   2> 1937312 INFO  (SUITE-BasicAuthIntegrationTest-seed#[C7CBC8E9742D5C5B]-worker) [    ] o.a.s.c.c.SolrZkClient Using default ZkACLProvider
   [junit4]   2> 1937312 INFO  (SUITE-BasicAuthIntegrationTest-seed#[C7CBC8E9742D5C5B]-worker) [    ] o.a.s.c.c.ZkStateReader Updating cluster state from ZooKeeper... 
   [junit4]   2> 1937312 INFO  (SUITE-BasicAuthIntegrationTest-seed#[C7CBC8E9742D5C5B]-worker) [    ] o.a.s.c.c.ZkStateReader Loaded cluster properties: {urlScheme=https}
   [junit4]   2> 1937312 INFO  (SUITE-BasicAuthIntegrationTest-seed#[C7CBC8E9742D5C5B]-worker) [    ] o.a.s.c.c.ZkStateReader Updated live nodes from ZooKeeper... (0) -> (3)
   [junit4]   2> 1937313 INFO  (SUITE-BasicAuthIntegrationTest-seed#[C7CBC8E9742D5C5B]-worker) [    ] o.a.s.c.c.SolrZkClient makePath: /configs/conf/solrconfig.xml
   [junit4]   2> 1937314 INFO  (SUITE-BasicAuthIntegrationTest-seed#[C7CBC8E9742D5C5B]-worker) [    ] o.a.s.c.c.SolrZkClient makePath: /configs/conf/schema.xml
   [junit4]   2> 1937385 INFO  (qtp4339829-103392) [    ] o.a.s.h.a.CollectionsHandler Invoked Collection Action :create with params replicationFactor=1&collection.configName=conf&name=authCollection&action=CREATE&numShards=3&wt=javabin&version=2 and sendToOCPQueue=true
   [junit4]   2> 1937387 INFO  (OverseerCollectionConfigSetProcessor-96565172861206537-127.0.0.1:46592_solr-n_0000000000) [    ] o.a.s.c.OverseerTaskProcessor Overseer Collection Message Handler: Get the message id:/overseer/collection-queue-work/qn-0000000000 message:{
   [junit4]   2>   "name":"authCollection",
   [junit4]   2>   "fromApi":"true",
   [junit4]   2>   "replicationFactor":"1",
   [junit4]   2>   "collection.configName":"conf",
   [junit4]   2>   "numShards":"3",
   [junit4]   2>   "stateFormat":"2",
   [junit4]   2>   "operation":"create"}
   [junit4]   2> 1937387 INFO  (OverseerThreadFactory-13230-thread-1) [    ] o.a.s.c.OverseerCollectionMessageHandler OverseerCollectionMessageHandler.processMessage : create , {
   [junit4]   2>   "name":"authCollection",
   [junit4]   2>   "fromApi":"true",
   [junit4]   2>   "replicationFactor":"1",
   [junit4]   2>   "collection.configName":"conf",
   [junit4]   2>   "numShards":"3",
   [junit4]   2>   "stateFormat":"2",
   [junit4]   2>   "operation":"create"}
   [junit4]   2> 1937387 INFO  (OverseerThreadFactory-13230-thread-1) [    ] o.a.s.c.CreateCollectionCmd Create collection authCollection
   [junit4]   2> 1937387 INFO  (OverseerThreadFactory-13230-thread-1) [    ] o.a.s.c.OverseerCollectionMessageHandler creating collections conf node /collections/authCollection 
   [junit4]   2> 1937387 INFO  (OverseerThreadFactory-13230-thread-1) [    ] o.a.s.c.c.SolrZkClient makePath: /collections/authCollection
   [junit4]   2> 1937388 INFO  (zkCallback-26586-thread-1) [    ] o.a.s.c.c.ZkStateReader A collections change: [WatchedEvent state:SyncConnected type:NodeChildrenChanged path:/collections], has occurred - updating...
   [junit4]   2> 1937388 INFO  (zkCallback-26593-thread-1) [    ] o.a.s.c.c.ZkStateReader A collections change: [WatchedEvent state:SyncConnected type:NodeChildrenChanged path:/collections], has occurred - updating...
   [junit4]   2> 1937388 INFO  (zkCallback-26584-thread-1) [    ] o.a.s.c.c.ZkStateReader A collections change: [WatchedEvent state:SyncConnected type:NodeChildrenChanged path:/collections], has occurred - updating...
   [junit4]   2> 1937388 INFO  (zkCallback-26585-thread-1) [    ] o.a.s.c.c.ZkStateReader A collections change: [WatchedEvent state:SyncConnected type:NodeChildrenChanged path:/collections], has occurred - updating...
   [junit4]   2> 1937389 INFO  (OverseerStateUpdate-96565172861206537-127.0.0.1:46592_solr-n_0000000000) [    ] o.a.s.c.Overseer processMessage: queueSize: 1, message = {
   [junit4]   2>   "name":"authCollection",
   [junit4]   2>   "fromApi":"true",
   [junit4]   2>   "replicationFactor":"1",
   [junit4]   2>   "collection.configName":"conf",
   [junit4]   2>   "numShards":"3",
   [junit4]   2>   "stateFormat":"2",
   [junit4]   2>   "operation":"create"} current state version: 0
   [junit4]   2> 1937389 INFO  (OverseerStateUpdate-96565172861206537-127.0.0.1:46592_solr-n_0000000000) [    ] o.a.s.c.o.ClusterStateMutator building a new cName: authCollection
   [junit4]   2> 1937389 INFO  (OverseerStateUpdate-96565172861206537-127.0.0.1:46592_solr-n_0000000000) [    ] o.a.s.c.o.ZkStateWriter going to create_collection /collections/authCollection/state.json
   [junit4]   2> 1937489 INFO  (OverseerThreadFactory-13230-thread-1) [    ] o.a.s.c.CreateCollectionCmd Creating SolrCores for new collection authCollection, shardNames [shard1, shard2, shard3] , replicationFactor : 1
   [junit4]   2> 1937489 INFO  (OverseerThreadFactory-13230-thread-1) [    ] o.a.s.c.CreateCollectionCmd Creating core authCollection_shard3_replica1 as part of shard shard3 of collection authCollection on 127.0.0.1:46592_solr
   [junit4]   2> 1937490 INFO  (OverseerThreadFactory-13230-thread-1) [    ] o.a.s.c.CreateCollectionCmd Creating core authCollection_shard1_replica1 as part of shard shard1 of collection authCollection on 127.0.0.1:37428_solr
   [junit4]   2> 1937490 INFO  (OverseerThreadFactory-13230-thread-1) [    ] o.a.s.c.CreateCollectionCmd Creating core authCollection_shard2_replica1 as part of shard shard2 of collection authCollection on 127.0.0.1:43810_solr
   [junit4]   2> 1937494 INFO  (qtp4339829-103393) [    ] o.a.s.h.a.CoreAdminOperation core create command qt=/admin/cores&collection.configName=conf&name=authCollection_shard3_replica1&action=CREATE&numShards=3&collection=authCollection&shard=shard3&wt=javabin&version=2
   [junit4]   2> 1937495 INFO  (qtp4339829-103393) [    ] o.a.s.c.CoreDescriptor Created CoreDescriptor: {schema=schema.xml, dataDir=data/, collection.configName=conf, collection=authCollection, loadOnStartup=true, transient=false, name=authCollection_shard3_replica1, numShards=3, shard=shard3, config=solrconfig.xml, configSetProperties=configsetprops.json}
   [junit4]   2> 1937495 INFO  (qtp4339829-103393) [    ] o.a.s.c.ZkController publishing state=down
   [junit4]   2> 1937495 INFO  (qtp4339829-103393) [    ] o.a.s.c.ZkController Registering watch for collection authCollection
   [junit4]   2> 1937496 INFO  (OverseerStateUpdate-96565172861206537-127.0.0.1:46592_solr-n_0000000000) [    ] o.a.s.c.Overseer processMessage: queueSize: 1, message = {
   [junit4]   2>   "core":"authCollection_shard3_replica1",
   [junit4]   2>   "roles":null,
   [junit4]   2>   "base_url":"https://127.0.0.1:46592/solr",
   [junit4]   2>   "node_name":"127.0.0.1:46592_solr",
   [junit4]   2>   "numShards":"3",
   [junit4]   2>   "state":"down",
   [junit4]   2>   "shard":"shard3",
   [junit4]   2>   "collection":"authCollection",
   [junit4]   2>   "operation":"state"} current state version: 0
   [junit4]   2> 1937496 INFO  (qtp4339829-103393) [    ] o.a.s.c.c.ZkStateReader Add data for [authCollection] ver [0]
   [junit4]   2> 1937496 INFO  (OverseerStateUpdate-96565172861206537-127.0.0.1:46592_solr-n_0000000000) [    ] o.a.s.c.o.ReplicaMutator Update state numShards=3 message={
   [junit4]   2>   "core":"authCollection_shard3_replica1",
   [junit4]   2>   "roles":null,
   [junit4]   2>   "base_url":"https://127.0.0.1:46592/solr",
   [junit4]   2>   "node_name":"127.0.0.1:46592_solr",
   [junit4]   2>   "numShards":"3",
   [junit4]   2>   "state":"down",
   [junit4]   2>   "shard":"shard3",
   [junit4]   2>   "collection":"authCollection",
   [junit4]   2>   "operation":"state"}
   [junit4]   2> 1937496 INFO  (qtp4339829-103393) [    ] o.a.s.c.ZkController look for our core node name
   [junit4]   2> 1937555 INFO  (qtp30231690-103372) [    ] o.a.s.h.a.CoreAdminOperation core create command qt=/admin/cores&collection.configName=conf&name=authCollection_shard1_replica1&action=CREATE&numShards=3&collection=authCollection&shard=shard1&wt=javabin&version=2
   [junit4]   2> 1937556 INFO  (qtp30231690-103372) [    ] o.a.s.c.CoreDescriptor Created CoreDescriptor: {schema=schema.xml, dataDir=data/, collection.configName=conf, collection=authCollection, loadOnStartup=true, transient=false, name=authCollection_shard1_replica1, numShards=3, shard=shard1, config=solrconfig.xml, configSetProperties=configsetprops.json}
   [junit4]   2> 1937556 INFO  (qtp30231690-103372) [    ] o.a.s.c.ZkController publishing state=down
   [junit4]   2> 1937557 INFO  (qtp30231690-103372) [    ] o.a.s.c.ZkController Registering watch for collection authCollection
   [junit4]   2> 1937557 INFO  (OverseerStateUpdate-96565172861206537-127.0.0.1:46592_solr-n_0000000000) [    ] o.a.s.c.Overseer processMessage: queueSize: 1, message = {
   [junit4]   2>   "core":"authCollection_shard1_replica1",
   [junit4]   2>   "roles":null,
   [junit4]   2>   "base_url":"https://127.0.0.1:37428/solr",
   [junit4]   2>   "node_name":"127.0.0.1:37428_solr",
   [junit4]   2>   "numShards":"3",
   [junit4]   2>   "state":"down",
   [junit4]   2>   "shard":"shard1",
   [junit4]   2>   "collection":"authCollection",
   [junit4]   2>   "operation":"state"} current state version: 0
   [junit4]   2> 1937557 INFO  (qtp30231690-103372) [    ] o.a.s.c.c.ZkStateReader Add data for [authCollection] ver [0]
   [junit4]   2> 1937557 INFO  (OverseerStateUpdate-96565172861206537-127.0.0.1:46592_solr-n_0000000000) [    ] o.a.s.c.o.ReplicaMutator Update state numShards=3 message={
   [junit4]   2>   "core":"authCollection_shard1_replica1",
   [junit4]   2>   "roles":null,
   [junit4]   2>   "base_url":"https://127.0.0.1:37428/solr",
   [junit4]   2>   "node_name":"127.0.0.1:37428_solr",
   [junit4]   2>   "numShards":"3",
   [junit4]   2>   "state":"down",
   [junit4]   2>   "shard":"shard1",
   [junit4]   2>   "collection":"authCollection",
   [junit4]   2>   "operation":"state"}
   [junit4]   2> 1937557 INFO  (qtp30231690-103372) [    ] o.a.s.c.ZkController look for our core node name
   [junit4]   2> 1937559 INFO  (qtp14047446-103373) [    ] o.a.s.h.a.CoreAdminOperation core create command qt=/admin/cores&collection.configName=conf&name=authCollection_shard2_replica1&action=CREATE&numShards=3&collection=authCollection&shard=shard2&wt=javabin&version=2
   [junit4]   2> 1937559 INFO  (qtp14047446-103373) [    ] o.a.s.c.CoreDescriptor Created CoreDescriptor: {schema=schema.xml, dataDir=data/, collection.configName=conf, collection=authCollection, loadOnStartup=true, transient=false, name=authCollection_shard2_replica1, numShards=3, shard=shard2, config=solrconfig.xml, configSetProperties=configsetprops.json}
   [junit4]   2> 1937559 INFO  (qtp14047446-103373) [    ] o.a.s.c.ZkController publishing state=down
   [junit4]   2> 1937560 INFO  (qtp14047446-103373) [    ] o.a.s.c.ZkController Registering watch for collection authCollection
   [junit4]   2> 1937560 INFO  (OverseerStateUpdate-96565172861206537-127.0.0.1:46592_solr-n_0000000000) [    ] o.a.s.c.Overseer processMessage: queueSize: 1, message = {
   [junit4]   2>   "core":"authCollection_shard2_replica1",
   [junit4]   2>   "roles":null,
   [junit4]   2>   "base_url":"https://127.0.0.1:43810/solr",
   [junit4]   2>   "node_name":"127.0.0.1:43810_solr",
   [junit4]   2>   "numShards":"3",
   [junit4]   2>   "state":"down",
   [junit4]   2>   "shard":"shard2",
   [junit4]   2>   "collection":"authCollection",
   [junit4]   2>   "operation":"state"} current state version: 0
   [junit4]   2> 1937560 INFO  (qtp14047446-103373) [    ] o.a.s.c.c.ZkStateReader Add data for [authCollection] ver [0]
   [junit4]   2> 1937560 INFO  (OverseerStateUpdate-96565172861206537-127.0.0.1:46592_solr-n_0000000000) [    ] o.a.s.c.o.ReplicaMutator Update state numShards=3 message={
   [junit4]   2>   "core":"authCollection_shard2_replica1",
   [junit4]   2>   "roles":null,
   [junit4]   2>   "base_url":"https://127.0.0.1:43810/solr",
   [junit4]   2>   "node_name":"127.0.0.1:43810_solr",
   [junit4]   2>   "numShards":"3",
   [junit4]   2>   "state":"down",
   [junit4]   2>   "shard":"shard2",
   [junit4]   2>   "collection":"authCollection",
   [junit4]   2>   "operation":"state"}
   [junit4]   2> 1937560 INFO  (qtp14047446-103373) [    ] o.a.s.c.ZkController look for our core node name
   [junit4]   2> 1937661 INFO  (OverseerStateUpdate-96565172861206537-127.0.0.1:46592_solr-n_0000000000) [    ] o.a.s.c.o.ZkStateWriter going to update_collection /collections/authCollection/state.json version: 0
   [junit4]   2> 1937661 INFO  (zkCallback-26586-thread-1) [    ] o.a.s.c.c.ZkStateReader A cluster state change: [WatchedEvent state:SyncConnected type:NodeDataChanged path:/collections/authCollection/state.json] for collection [authCollection] has occurred - updating... (live nodes size: [3])
   [junit4]   2> 1937661 INFO  (zkCallback-26585-thread-1) [    ] o.a.s.c.c.ZkStateReader A cluster state change: [WatchedEvent state:SyncConnected type:NodeDataChanged path:/collections/authCollection/state.json] for collection [authCollection] has occurred - updating... (live nodes size: [3])
   [junit4]   2> 1937661 INFO  (zkCallback-26584-thread-1) [    ] o.a.s.c.c.ZkStateReader A cluster state change: [WatchedEvent state:SyncConnected type:NodeDataChanged path:/collections/authCollection/state.json] for collection [authCollection] has occurred - updating... (live nodes size: [3])
   [junit4]   2> 1937661 INFO  (zkCallback-26586-thread-1) [    ] o.a.s.c.c.ZkStateReader Updating data for [authCollection] from [0] to [1]
   [junit4]   2> 1937661 INFO  (zkCallback-26585-thread-1) [    ] o.a.s.c.c.ZkStateReader Updating data for [authCollection] from [0] to [1]
   [junit4]   2> 1937662 INFO  (zkCallback-26584-thread-1) [    ] o.a.s.c.c.ZkStateReader Updating data for [authCollection] from [0] to [1]
   [junit4]   2> 1938496 INFO  (qtp4339829-103393) [    ] o.a.s.c.ZkController waiting to find shard id in clusterstate for authCollection_shard3_replica1
   [junit4]   2> 1938496 INFO  (qtp4339829-103393) [    ] o.a.s.c.ZkController Check for collection zkNode:authCollection
   [junit4]   2> 1938496 INFO  (qtp4339829-103393) [    ] o.a.s.c.ZkController Collection zkNode exists
   [junit4]   2> 1938496 INFO  (qtp4339829-103393) [    ] o.a.s.c.c.ZkStateReader Load collection config from: [/collections/authCollection]
   [junit4]   2> 1938497 INFO  (qtp4339829-103393) [    ] o.a.s.c.c.ZkStateReader path=[/collections/authCollection] [configName]=[conf] specified config exists in ZooKeeper
   [junit4]   2> 1938497 INFO  (qtp4339829-103393) [    ] o.a.s.c.SolrResourceLoader new SolrResourceLoader for directory: '/home/jenkins/workspace/Lucene-Solr-6.x-Linux/solr/build/solr-core/test/J2/temp/solr.security.BasicAuthIntegrationTest_C7CBC8E9742D5C5B-001/tempDir-001/node3/authCollection_shard3_replica1'
   [junit4]   2> 1938497 INFO  (qtp4339829-103393) [    ] o.a.s.c.SolrResourceLoader JNDI not configured for solr (NoInitialContextEx)
   [junit4]   2> 1938497 INFO  (qtp4339829-103393) [    ] o.a.s.c.SolrResourceLoader solr home defaulted to 'solr/' (could not find system property or JNDI)
   [junit4]   2> 1938498 INFO  (qtp4339829-103393) [    ] o.a.s.c.Config loaded config solrconfig.xml with version 0 
   [junit4]   2> 1938500 INFO  (qtp4339829-103393) [    ] o.a.s.c.SolrConfig current version of requestparams : -1
   [junit4]   2> 1938501 INFO  (qtp4339829-103393) [    ] o.a.s.c.SolrConfig Using Lucene MatchVersion: 6.3.0
   [junit4]   2> 1938504 INFO  (qtp4339829-103393) [    ] o.a.s.c.SolrConfig Loaded SolrConfig: solrconfig.xml
   [junit4]   2> 1938506 INFO  (qtp4339829-103393) [    ] o.a.s.s.IndexSchema [authCollection_shard3_replica1] Schema name=minimal
   [junit4]   2> 1938508 INFO  (qtp4339829-103393) [    ] o.a.s.s.IndexSchema unique key field: id
   [junit4]   2> 1938508 INFO  (qtp4339829-103393) [    ] o.a.s.c.ConfigSetProperties Did not find ConfigSet properties, assuming default properties: Can't find resource 'configsetprops.json' in classpath or '/configs/conf', cwd=/home/jenkins/workspace/Lucene-Solr-6.x-Linux/solr/build/solr-core/test/J2
   [junit4]   2> 1938508 INFO  (qtp4339829-103393) [    ] o.a.s.c.CoreContainer Creating SolrCore 'authCollection_shard3_replica1' using configuration from collection authCollection
   [junit4]   2> 1938509 INFO  (qtp4339829-103393) [    ] o.a.s.c.SolrCore org.apache.solr.core.MockDirectoryFactory
   [junit4]   2> 1938509 INFO  (qtp4339829-103393) [    ] o.a.s.c.SolrCore [[authCollection_shard3_replica1] ] Opening new SolrCore at [/home/jenkins/workspace/Lucene-Solr-6.x-Linux/solr/build/solr-core/test/J2/temp/solr.security.BasicAuthIntegrationTest_C7CBC8E9742D5C5B-001/tempDir-001/node3/authCollection_shard3_replica1], dataDir=[/home/jenkins/workspace/Lucene-Solr-6.x-Linux/solr/build/solr-core/test/J2/temp/solr.security.BasicAuthIntegrationTest_C7CBC8E9742D5C5B-001/tempDir-001/node3/./authCollection_shard3_replica1/data/]
   [junit4]   2> 1938509 INFO  (qtp4339829-103393) [    ] o.a.s.c.SolrCore JMX monitoring not detected for core: authCollection_shard3_replica1
   [junit4]   2> 1938510 INFO  (qtp4339829-103393) [    ] o.a.s.c.CachingDirectoryFactory return new directory for /home/jenkins/workspace/Lucene-Solr-6.x-Linux/solr/build/solr-core/test/J2/temp/solr.security.BasicAuthIntegrationTest_C7CBC8E9742D5C5B-001/tempDir-001/node3/./authCollection_shard3_replica1/data/snapshot_metadata
   [junit4]   2> 1938510 INFO  (qtp4339829-103393) [    ] o.a.s.c.s.SolrSnapshotMetaDataManager Loading from snapshot metadata file...
   [junit4]   2> 1938511 INFO  (qtp4339829-103393) [    ] o.a.s.c.CachingDirectoryFactory return new directory for /home/jenkins/workspace/Lucene-Solr-6.x-Linux/solr/build/solr-core/test/J2/temp/solr.security.BasicAuthIntegrationTest_C7CBC8E9742D5C5B-001/tempDir-001/node3/./authCollection_shard3_replica1/data
   [junit4]   2> 1938511 INFO  (qtp4339829-103393) [    ] o.a.s.c.SolrCore New index directory detected: old=null new=/home/jenkins/workspace/Lucene-Solr-6.x-Linux/solr/build/solr-core/test/J2/temp/solr.security.BasicAuthIntegrationTest_C7CBC8E9742D5C5B-001/tempDir-001/node3/./authCollection_shard3_replica1/data/index/
   [junit4]   2> 1938511 WARN  (qtp4339829-103393) [    ] o.a.s.c.SolrCore [authCollection_shard3_replica1] Solr index directory '/home/jenkins/workspace/Lucene-Solr-6.x-Linux/solr/build/solr-core/test/J2/temp/solr.security.BasicAuthIntegrationTest_C7CBC8E9742D5C5B-001/tempDir-001/node3/./authCollection_shard3_replica1/data/index' doesn't exist. Creating new index...
   [junit4]   2> 1938511 INFO  (qtp4339829-103393) [    ] o.a.s.c.CachingDirectoryFactory return new directory for /home/jenkins/workspace/Lucene-Solr-6.x-Linux/solr/build/solr-core/test/J2/temp/solr.security.BasicAuthIntegrationTest_C7CBC8E9742D5C5B-001/tempDir-001/node3/./authCollection_shard3_replica1/data/index
   [junit4]   2> 1938512 INFO  (qtp4339829-103393) [    ] o.a.s.c.SolrDeletionPolicy SolrDeletionPolicy.onCommit: commits: num=1
   [junit4]   2> 	commit{dir=MockDirectoryWrapper(RAMDirectory@169075c lockFactory=org.apache.lucene.store.SingleInstanceLockFactory@1f1059),segFN=segments_1,generation=1}
   [junit4]   2> 1938512 INFO  (qtp4339829-103393) [    ] o.a.s.c.SolrDeletionPolicy newest commit generation = 1
   [junit4]   2> 1938512 INFO  (OldIndexDirectoryCleanupThreadForCore-authCollection_shard3_replica1) [    ] o.a.s.c.SolrCore Looking for old index directories to cleanup for core authCollection_shard3_replica1 in /home/jenkins/workspace/Lucene-Solr-6.x-Linux/solr/build/solr-core/test/J2/temp/solr.security.BasicAuthIntegrationTest_C7CBC8E9742D5C5B-001/tempDir-001/node3/./authCollection_shard3_replica1/data/
   [junit4]   2> 1938512 WARN  (OldIndexDirectoryCleanupThreadForCore-authCollection_shard3_replica1) [    ] o.a.s.c.DirectoryFactory /home/jenkins/workspace/Lucene-Solr-6.x-Linux/solr/build/solr-core/test/J2/temp/solr.security.BasicAuthIntegrationTest_C7CBC8E9742D5C5B-001/tempDir-001/node3/./authCollection_shard3_replica1/data/ does not point to a valid data directory; skipping clean-up of old index directories.
   [junit4]   2> 1938513 INFO  (qtp4339829-103393) [    ] o.a.s.c.SolrCore no updateRequestProcessorChain defined as default, creating implicit default
   [junit4]   2> 1938514 INFO  (qtp4339829-103393) [    ] o.a.s.h.l.XMLLoader xsltCacheLifetimeSeconds=60
   [junit4]   2> 1938515 INFO  (qtp4339829-103393) [    ] o.a.s.h.l.XMLLoader xsltCacheLifetimeSeconds=60
   [junit4]   2> 1938515 INFO  (qtp4339829-103393) [    ] o.a.s.h.l.XMLLoader xsltCacheLifetimeSeconds=60
   [junit4]   2> 1938516 INFO  (qtp4339829-103393) [    ] o.a.s.h.l.XMLLoader xsltCacheLifetimeSeconds=60
   [junit4]   2> 1938516 INFO  (qtp4339829-103393) [    ] o.a.s.c.RequestHandlers Registered paths: /admin/mbeans,/update/json/docs,/admin/luke,/export,/get,/admin/properties,/update/json,/admin/threads,/update/csv,/sql,/graph,/select,/admin/segments,/admin/system,/replication,/config,/stream,/schema,/admin/plugins,/admin/logging,/admin/ping,/update,/admin/file,/terms
   [junit4]   2> 1938517 INFO  (qtp4339829-103393) [    ] o.a.s.c.SolrCore Using default statsCache cache: org.apache.solr.search.stats.LocalStatsCache
   [junit4]   2> 1938517 INFO  (qtp4339829-103393) [    ] o.a.s.u.UpdateHandler Using UpdateLog implementation: org.apache.solr.update.UpdateLog
   [junit4]   2> 1938517 INFO  (qtp4339829-103393) [    ] o.a.s.u.UpdateLog Initializing UpdateLog: dataDir=null defaultSyncLevel=FLUSH numRecordsToKeep=100 maxNumLogsToKeep=10 numVersionBuckets=65536
   [junit4]   2> 1938518 INFO  (qtp4339829-103393) [    ] o.a.s.u.CommitTracker Hard AutoCommit: disabled
   [junit4]   2> 1938518 INFO  (qtp4339829-103393) [    ] o.a.s.u.CommitTracker Soft AutoCommit: disabled
   [junit4]   2> 1938518 INFO  (qtp4339829-103393) [    ] o.a.s.c.SolrDeletionPolicy SolrDeletionPolicy.onInit: commits: num=1
   [junit4]   2> 	commit{dir=MockDirectoryWrapper(RAMDirectory@169075c lockFactory=org.apache.lucene.store.SingleInstanceLockFactory@1f1059),segFN=segments_1,generation=1}
   [junit4]   2> 1938518 INFO  (qtp4339829-103393) [    ] o.a.s.c.SolrDeletionPolicy newest commit generation = 1
   [junit4]   2> 1938518 INFO  (qtp4339829-103393) [    ] o.a.s.s.SolrIndexSearcher Opening [Searcher@c67101[authCollection_shard3_replica1] main]
   [junit4]   2> 1938518 INFO  (qtp4339829-103393) [    ] o.a.s.c.c.ZkStateReader Load collection config from: [/collections/authCollection]
   [junit4]   2> 1938521 INFO  (qtp4339829-103393) [    ] o.a.s.c.c.ZkStateReader path=[/collections/authCollection] [configName]=[conf] specified config exists in ZooKeeper
   [junit4]   2> 1938521 INFO  (qtp4339829-103393) [    ] o.a.s.r.ManagedResourceStorage Setting up ZooKeeper-based storage for the RestManager with znodeBase: /configs/conf
   [junit4]   2> 1938521 INFO  (qtp4339829-103393) [    ] o.a.s.r.ManagedResourceStorage Configured ZooKeeperStorageIO with znodeBase: /configs/conf
   [junit4]   2> 1938521 INFO  (qtp4339829-103393) [    ] o.a.s.r.RestManager Initializing RestManager with initArgs: {}
   [junit4]   2> 1938521 INFO  (qtp4339829-103393) [    ] o.a.s.r.ManagedResourceStorage Reading _rest_managed.json using ZooKeeperStorageIO:path=/configs/conf
   [junit4]   2> 1938521 INFO  (qtp4339829-103393) [    ] o.a.s.r.ManagedResourceStorage No data found for znode /configs/conf/_rest_managed.json
   [junit4]   2> 1938521 INFO  (qtp4339829-103393) [    ] o.a.s.r.ManagedResourceStorage Loaded null at path _rest_managed.json using ZooKeeperStorageIO:path=/configs/conf
   [junit4]   2> 1938521 INFO  (qtp4339829-103393) [    ] o.a.s.r.RestManager Initializing 0 registered ManagedResources
   [junit4]   2> 1938521 INFO  (qtp4339829-103393) [    ] o.a.s.h.ReplicationHandler Commits will be reserved for  10000
   [junit4]   2> 1938521 INFO  (searcherExecutor-13237-thread-1) [    ] o.a.s.c.SolrCore [authCollection_shard3_replica1] Registered new searcher Searcher@c67101[authCollection_shard3_replica1] main{ExitableDirectoryReader(UninvertingDirectoryReader())}
   [junit4]   2> 1938522 INFO  (qtp4339829-103393) [    ] o.a.s.u.UpdateLog Looking up max value of version field to seed version buckets
   [junit4]   2> 1938522 INFO  (qtp4339829-103393) [    ] o.a.s.u.VersionInfo Refreshing highest value of _version_ for 65536 version buckets from index
   [junit4]   2> 1938522 INFO  (qtp4339829-103393) [    ] o.a.s.u.VersionInfo No terms found for _version_, cannot seed version bucket highest value from index
   [junit4]   2> 1938522 INFO  (qtp4339829-103393) [    ] o.a.s.u.UpdateLog Could not find max version in index or recent updates, using new clock 1545042767237873664
   [junit4]   2> 1938524 INFO  (qtp4339829-103393) [    ] o.a.s.u.UpdateLog Took 2.0ms to seed version buckets with highest version 1545042767237873664
   [junit4]   2> 1938524 INFO  (qtp4339829-103393) [    ] o.a.s.c.ZkController watch zkdir /configs/conf
   [junit4]   2> 1938525 INFO  (qtp4339829-103393) [    ] o.a.s.c.CoreContainer registering core: authCollection_shard3_replica1
   [junit4]   2> 1938525 INFO  (qtp4339829-103393) [    ] o.a.s.c.ZkController Register replica - core:authCollection_shard3_replica1 address:https://127.0.0.1:46592/solr collection:authCollection shard:shard3
   [junit4]   2> 1938525 INFO  (qtp4339829-103393) [    ] o.a.s.c.c.SolrZkClient makePath: /collections/authCollection/leader_elect/shard3/election
   [junit4]   2> 1938526 INFO  (qtp4339829-103393) [    ] o.a.s.c.LeaderElector Joined leadership election with path: /collections/authCollection/leader_elect/shard3/election/96565172861206537-core_node1-n_0000000000
   [junit4]   2> 1938527 INFO  (qtp4339829-103393) [    ] o.a.s.c.ShardLeaderElectionContext Running the leader process for shard=shard3 and weAreReplacement=false and leaderVoteWait=10000
   [junit4]   2> 1938527 INFO  (qtp4339829-103393) [    ] o.a.s.c.ShardLeaderElectionContext Enough replicas found to continue.
   [junit4]   2> 1938527 INFO  (qtp4339829-103393) [    ] o.a.s.c.ShardLeaderElectionContext I may be the new leader - try and sync
   [junit4]   2> 1938527 INFO  (qtp4339829-103393) [    ] o.a.s.c.SyncStrategy Sync replicas to https://127.0.0.1:46592/solr/authCollection_shard3_replica1/
   [junit4]   2> 1938528 INFO  (qtp4339829-103393) [    ] o.a.s.c.SyncStrategy Sync Success - now sync replicas to me
   [junit4]   2> 1938528 INFO  (qtp4339829-103393) [    ] o.a.s.c.SyncStrategy https://127.0.0.1:46592/solr/authCollection_shard3_replica1/ has no replicas
   [junit4]   2> 1938528 INFO  (OverseerStateUpdate-96565172861206537-127.0.0.1:46592_solr-n_0000000000) [    ] o.a.s.c.Overseer processMessage: queueSize: 1, message = {
   [junit4]   2>   "operation":"leader",
   [junit4]   2>   "shard":"shard3",
   [junit4]   2>   "collection":"authCollection"} current state version: 0
   [junit4]   2> 1938528 INFO  (qtp4339829-103393) [    ] o.a.s.c.c.SolrZkClient makePath: /collections/authCollection/leaders/shard3
   [junit4]   2> 1938529 INFO  (qtp4339829-103393) [    ] o.a.s.c.ShardLeaderElectionContextBase Creating leader registration node /collections/authCollection/leaders/shard3/leader after winning as /collections/authCollection/leader_elect/shard3/election/96565172861206537-core_node1-n_0000000000
   [junit4]   2> 1938530 INFO  (qtp4339829-103393) [    ] o.a.s.c.ShardLeaderElectionContext I am the new leader: https://127.0.0.1:46592/solr/authCollection_shard3_replica1/ shard3
   [junit4]   2> 1938530 INFO  (OverseerStateUpdate-96565172861206537-127.0.0.1:46592_solr-n_0000000000) [    ] o.a.s.c.Overseer processMessage: queueSize: 1, message = {
   [junit4]   2>   "operation":"leader",
   [junit4]   2>   "shard":"shard3",
   [junit4]   2>   "collection":"authCollection",
   [junit4]   2>   "base_url":"https://127.0.0.1:46592/solr",
   [junit4]   2>   "core":"authCollection_shard3_replica1",
   [junit4]   2>   "state":"active"} current state version: 0
   [junit4]   2> 1938557 INFO  (qtp30231690-103372) [    ] o.a.s.c.ZkController waiting to find shard id in clusterstate for authCollection_shard1_replica1
   [junit4]   2> 1938557 INFO  (qtp30231690-103372) [    ] o.a.s.c.ZkController Check for collection zkNode:authCollection
   [junit4]   2> 1938557 INFO  (qtp30231690-103372) [    ] o.a.s.c.ZkController Collection zkNode exists
   [junit4]   2> 1938558 INFO  (qtp30231690-103372) [    ] o.a.s.c.c.ZkStateReader Load collection config from: [/collections/authCollection]
   [junit4]   2> 1938558 INFO  (qtp30231690-103372) [    ] o.a.s.c.c.ZkStateReader path=[/collections/authCollection] [configName]=[conf] specified config exists in ZooKeeper
   [junit4]   2> 1938558 INFO  (qtp30231690-103372) [    ] o.a.s.c.SolrResourceLoader new SolrResourceLoader for directory: '/home/jenkins/workspace/Lucene-Solr-6.x-Linux/solr/build/solr-core/test/J2/temp/solr.security.BasicAuthIntegrationTest_C7CBC8E9742D5C5B-001/tempDir-001/node2/authCollection_shard1_replica1'
   [junit4]   2> 1938559 INFO  (qtp30231690-103372) [    ] o.a.s.c.SolrResourceLoader JNDI not configured for solr (NoInitialContextEx)
   [junit4]   2> 1938559 INFO  (qtp30231690-103372) [    ] o.a.s.c.SolrResourceLoader solr home defaulted to 'solr/' (could not find system property or JNDI)
   [junit4]   2> 1938560 INFO  (qtp14047446-103373) [    ] o.a.s.c.ZkController waiting to find shard id in clusterstate for authCollection_shard2_replica1
   [junit4]   2> 1938560 INFO  (qtp30231690-103372) [    ] o.a.s.c.Config loaded config solrconfig.xml with version 0 
   [junit4]   2> 1938560 INFO  (qtp14047446-103373) [    ] o.a.s.c.ZkController Check for collection zkNode:authCollection
   [junit4]   2> 1938560 INFO  (qtp14047446-103373) [    ] o.a.s.c.ZkController Collection zkNode exists
   [junit4]   2> 1938560 INFO  (qtp14047446-103373) [    ] o.a.s.c.c.ZkStateReader Load collection config from: [/collections/authCollection]
   [junit4]   2> 1938561 INFO  (qtp14047446-103373) [    ] o.a.s.c.c.ZkStateReader path=[/collections/authCollection] [configName]=[conf] specified config exists in ZooKeeper
   [junit4]   2> 1938561 INFO  (qtp14047446-103373) [    ] o.a.s.c.SolrResourceLoader new SolrResourceLoader for directory: '/home/jenkins/workspace/Lucene-Solr-6.x-Linux/solr/build/solr-core/test/J2/temp/solr.security.BasicAuthIntegrationTest_C7CBC8E9742D5C5B-001/tempDir-001/node1/authCollection_shard2_replica1'
   [junit4]   2> 1938561 INFO  (qtp14047446-103373) [    ] o.a.s.c.SolrResourceLoader JNDI not configured for solr (NoInitialContextEx)
   [junit4]   2> 1938561 INFO  (qtp14047446-103373) [    ] o.a.s.c.SolrResourceLoader solr home defaulted to 'solr/' (could not find system property or JNDI)
   [junit4]   2> 1938561 INFO  (qtp14047446-103373) [    ] o.a.s.c.Config loaded config solrconfig.xml with version 0 
   [junit4]   2> 1938562 INFO  (qtp30231690-103372) [    ] o.a.s.c.SolrConfig current version of requestparams : -1
   [junit4]   2> 1938563 INFO  (qtp30231690-103372) [    ] o.a.s.c.SolrConfig Using Lucene MatchVersion: 6.3.0
   [junit4]   2> 1938563 INFO  (qtp14047446-103373) [    ] o.a.s.c.SolrConfig current version of requestparams : -1
   [junit4]   2> 1938564 INFO  (qtp14047446-103373) [    ] o.a.s.c.SolrConfig Using Lucene MatchVersion: 6.3.0
   [junit4]   2> 1938566 INFO  (qtp30231690-103372) [    ] o.a.s.c.SolrConfig Loaded SolrConfig: solrconfig.xml
   [junit4]   2> 1938567 INFO  (qtp14047446-103373) [    ] o.a.s.c.SolrConfig Loaded SolrConfig: solrconfig.xml
   [junit4]   2> 1938568 INFO  (qtp30231690-103372) [    ] o.a.s.s.IndexSchema [authCollection_shard1_replica1] Schema name=minimal
   [junit4]   2> 1938569 INFO  (qtp14047446-103373) [    ] o.a.s.s.IndexSchema [authCollection_shard2_replica1] Schema name=minimal
   [junit4]   2> 1938608 INFO  (qtp30231690-103372) [    ] o.a.s.s.IndexSchema unique key field: id
   [junit4]   2> 1938610 INFO  (qtp30231690-103372) [    ] o.a.s.c.ConfigSetProperties Did not find ConfigSet properties, assuming default properties: Can't find resource 'configsetprops.json' in classpath or '/configs/conf', cwd=/home/jenkins/workspace/Lucene-Solr-6.x-Linux/solr/build/solr-core/test/J2
   [junit4]   2> 1938610 INFO  (qtp30231690-103372) [    ] o.a.s.c.CoreContainer Creating SolrCore 'authCollection_shard1_replica1' using configuration from collection authCollection
   [junit4]   2> 1938610 INFO  (qtp14047446-103373) [    ] o.a.s.s.IndexSchema unique key field: id
   [junit4]   2> 1938610 INFO  (qtp30231690-103372) [    ] o.a.s.c.SolrCore org.apache.solr.core.MockDirectoryFactory
   [junit4]   2> 1938611 INFO  (qtp14047446-103373) [    ] o.a.s.c.ConfigSetProperties Did not find ConfigSet properties, assuming default properties: Can't find resource 'configsetprops.json' in classpath or '/configs/conf', cwd=/home/jenkins/workspace/Lucene-Solr-6.x-Linux/solr/build/solr-core/test/J2
   [junit4]   2> 1938611 INFO  (qtp14047446-103373) [    ] o.a.s.c.CoreContainer Creating SolrCore 'authCollection_shard2_replica1' using configuration from collection authCollection
   [junit4]   2> 1938611 INFO  (qtp30231690-103372) [    ] o.a.s.c.SolrCore [[authCollection_shard1_replica1] ] Opening new SolrCore at [/home/jenkins/workspace/Lucene-Solr-6.x-Linux/solr/build/solr-core/test/J2/temp/solr.security.BasicAuthIntegrationTest_C7CBC8E9742D5C5B-001/tempDir-001/node2/authCollection_shard1_replica1], dataDir=[/home/jenkins/workspace/Lucene-Solr-6.x-Linux/solr/build/solr-core/test/J2/temp/solr.security.BasicAuthIntegrationTest_C7CBC8E9742D5C5B-001/tempDir-001/node2/./authCollection_shard1_replica1/data/]
   [junit4]   2> 1938611 INFO  (qtp30231690-103372) [    ] o.a.s.c.SolrCore JMX monitoring not detected for core: authCollection_shard1_replica1
   [junit4]   2> 1938611 INFO  (qtp14047446-103373) [    ] o.a.s.c.SolrCore org.apache.solr.core.MockDirectoryFactory
   [junit4]   2> 1938611 INFO  (qtp14047446-103373) [    ] o.a.s.c.SolrCore [[authCollection_shard2_replica1] ] Opening new SolrCore at [/home/jenkins/workspace/Lucene-Solr-6.x-Linux/solr/build/solr-core/test/J2/temp/solr.security.BasicAuthIntegrationTest_C7CBC8E9742D5C5B-001/tempDir-001/node1/authCollection_shard2_replica1], dataDir=[/home/jenkins/workspace/Lucene-Solr-6.x-Linux/solr/build/solr-core/test/J2/temp/solr.security.BasicAuthIntegrationTest_C7CBC8E9742D5C5B-001/tempDir-001/node1/./authCollection_shard2_replica1/data/]
   [junit4]   2> 1938611 INFO  (qtp14047446-103373) [    ] o.a.s.c.SolrCore JMX monitoring not detected for core: authCollection_shard2_replica1
   [junit4]   2> 1938612 INFO  (qtp30231690-103372) [    ] o.a.s.c.CachingDirectoryFactory return new directory for /home/jenkins/workspace/Lucene-Solr-6.x-Linux/solr/build/solr-core/test/J2/temp/solr.security.BasicAuthIntegrationTest_C7CBC8E9742D5C5B-001/tempDir-001/node2/./authCollection_shard1_replica1/data/snapshot_metadata
   [junit4]   2> 1938612 INFO  (qtp30231690-103372) [    ] o.a.s.c.s.SolrSnapshotMetaDataManager Loading from snapshot metadata file...
   [junit4]   2> 1938612 INFO  (qtp14047446-103373) [    ] o.a.s.c.CachingDirectoryFactory return new directory for /home/jenkins/workspace/Lucene-Solr-6.x-Linux/solr/build/solr-core/test/J2/temp/solr.security.BasicAuthIntegrationTest_C7CBC8E9742D5C5B-001/tempDir-001/node1/./authCollection_shard2_replica1/data/snapshot_metadata
   [junit4]   2> 1938612 INFO  (qtp14047446-103373) [    ] o.a.s.c.s.SolrSnapshotMetaDataManager Loading from snapshot metadata file...
   [junit4]   2> 1938612 INFO  (qtp30231690-103372) [    ] o.a.s.c.CachingDirectoryFactory return new directory for /home/jenkins/workspace/Lucene-Solr-6.x-Linux/solr/build/solr-core/test/J2/temp/solr.security.BasicAuthIntegrationTest_C7CBC8E9742D5C5B-001/tempDir-001/node2/./authCollection_shard1_replica1/data
   [junit4]   2> 1938612 INFO  (qtp14047446-103373) [    ] o.a.s.c.CachingDirectoryFactory return new directory for /home/jenkins/workspace/Lucene-Solr-6.x-Linux/solr/build/solr-core/test/J2/temp/solr.security.BasicAuthIntegrationTest_C7CBC8E9742D5C5B-001/tempDir-001/node1/./authCollection_shard2_replica1/data
   [junit4]   2> 1938612 INFO  (qtp30231690-103372) [    ] o.a.s.c.SolrCore New index directory detected: old=null new=/home/jenkins/workspace/Lucene-Solr-6.x-Linux/solr/build/solr-core/test/J2/temp/solr.security.BasicAuthIntegrationTest_C7CBC8E9742D5C5B-001/tempDir-001/node2/./authCollection_shard1_replica1/data/index/
   [junit4]   2> 1938613 INFO  (qtp14047446-103373) [    ] o.a.s.c.SolrCore New index directory detected: old=null new=/home/jenkins/workspace/Lucene-Solr-6.x-Linux/solr/build/solr-core/test/J2/temp/solr.security.BasicAuthIntegrationTest_C7CBC8E9742D5C5B-001/tempDir-001/node1/./authCollection_shard2_replica1/data/index/
   [junit4]   2> 1938613 WARN  (qtp30231690-103372) [    ] o.a.s.c.SolrCore [authCollection_shard1_replica1] Solr index directory '/home/jenkins/workspace/Lucene-Solr-6.x-Linux/solr/build/solr-core/test/J2/temp/solr.security.BasicAuthIntegrationTest_C7CBC8E9742D5C5B-001/tempDir-001/node2/./authCollection_shard1_replica1/data/index' doesn't exist. Creating new index...
   [junit4]   2> 1938613 WARN  (qtp14047446-103373) [    ] o.a.s.c.SolrCore [authCollection_shard2_replica1] Solr index directory '/home/jenkins/workspace/Lucene-Solr-6.x-Linux/solr/build/solr-core/test/J2/temp/solr.security.BasicAuthIntegrationTest_C7CBC8E9742D5C5B-001/tempDir-001/node1/./authCollection_shard2_replica1/data/index' doesn't exist. Creating new index...
   [junit4]   2> 1938613 INFO  (qtp30231690-103372) [    ] o.a.s.c.CachingDirectoryFactory return new directory for /home/jenkins/workspace/Lucene-Solr-6.x-Linux/solr/build/solr-core/test/J2/temp/solr.security.BasicAuthIntegrationTest_C7CBC8E9742D5C5B-001/tempDir-001/node2/./authCollection_shard1_replica1/data/index
   [junit4]   2> 1938613 INFO  (qtp14047446-103373) [    ] o.a.s.c.CachingDirectoryFactory return new directory for /home/jenkins/workspace/Lucene-Solr-6.x-Linux/solr/build/solr-core/test/J2/temp/solr.security.BasicAuthIntegrationTest_C7CBC8E9742D5C5B-001/tempDir-001/node1/./authCollection_shard2_replica1/data/index
   [junit4]   2> 1938614 INFO  (qtp14047446-103373) [    ] o.a.s.c.SolrDeletionPolicy SolrDeletionPolicy.onCommit: commits: num=1
   [junit4]   2> 	commit{dir=MockDirectoryWrapper(RAMDirectory@3fcd15 lockFactory=org.apache.lucene.store.SingleInstanceLockFactory@663c2f),segFN=segments_1,generation=1}
   [junit4]   2> 1938614 INFO  (qtp30231690-103372) [    ] o.a.s.c.SolrDeletionPolicy SolrDeletionPolicy.onCommit: commits: num=1
   [junit4]   2> 	commit{dir=MockDirectoryWrapper(RAMDirectory@10203 lockFactory=org.apache.lucene.store.SingleInstanceLockFactory@bc8057),segFN=segments_1,generation=1}
   [junit4]   2> 1938614 INFO  (qtp30231690-103372) [    ] o.a.s.c.SolrDeletionPolicy newest commit generation = 1
   [junit4]   2> 1938614 INFO  (qtp14047446-103373) [    ] o.a.s.c.SolrDeletionPolicy newest commit generation = 1
   [junit4]   2> 1938614 INFO  (OldIndexDirectoryCleanupThreadForCore-authCollection_shard1_replica1) [    ] o.a.s.c.SolrCore Looking for old index directories to cleanup for core authCollection_shard1_replica1 in /home/jenkins/workspace/Lucene-Solr-6.x-Linux/solr/build/solr-core/test/J2/temp/solr.security.BasicAuthIntegrationTest_C7CBC8E9742D5C5B-001/tempDir-001/node2/./authCollection_shard1_replica1/data/
   [junit4]   2> 1938614 INFO  (OldIndexDirectoryCleanupThreadForCore-authCollection_shard2_replica1) [    ] o.a.s.c.SolrCore Looking for old index directories to cleanup for core authCollection_shard2_replica1 in /home/jenkins/workspace/Lucene-Solr-6.x-Linux/solr/build/solr-core/test/J2/temp/solr.security.BasicAuthIntegrationTest_C7CBC8E9742D5C5B-001/tempDir-001/node1/./authCollection_shard2_replica1/data/
   [junit4]   2> 1938614 WARN  (OldIndexDirectoryCleanupThreadForCore-authCollection_shard1_replica1) [    ] o.a.s.c.DirectoryFactory /home/jenkins/workspace/Lucene-Solr-6.x-Linux/solr/build/solr-core/test/J2/temp/solr.security.BasicAuthIntegrationTest_C7CBC8E9742D5C5B-001/tempDir-001/node2/./authCollection_shard1_replica1/data/ does not point to a valid data directory; skipping clean-up of old index directories.
   [junit4]   2> 1938614 WARN  (OldIndexDirectoryCleanupThreadForCore-authCollection_shard2_replica1) [    ] o.a.s.c.DirectoryFactory /home/jenkins/workspace/Lucene-Solr-6.x-Linux/solr/build/solr-core/test/J2/temp/solr.security.BasicAuthIntegrationTest_C7CBC8E9742D5C5B-001/tempDir-001/node1/./authCollection_shard2_replica1/data/ does not point to a valid data directory; skipping clean-up of old index directories.
   [junit4]   2> 1938615 INFO  (qtp14047446-103373) [    ] o.a.s.c.SolrCore no updateRequestProcessorChain defined as default, creating implicit default
   [junit4]   2> 1938615 INFO  (qtp30231690-103372) [    ] o.a.s.c.SolrCore no updateRequestProcessorChain defined as default, creating implicit default
   [junit4]   2> 1938616 INFO  (qtp14047446-103373) [    ] o.a.s.h.l.XMLLoader xsltCacheLifetimeSeconds=60
   [junit4]   2> 1938616 INFO  (qtp30231690-103372) [    ] o.a.s.h.l.XMLLoader xsltCacheLifetimeSeconds=60
   [junit4]   2> 1938616 INFO  (qtp14047446-103373) [    ] o.a.s.h.l.XMLLoader xsltCacheLifetimeSeconds=60
   [junit4]   2> 1938617 INFO  (qtp14047446-103373) [    ] o.a.s.h.l.XMLLoader xsltCacheLifetimeSeconds=60
   [junit4]   2> 1938617 INFO  (qtp30231690-103372) [    ] o.a.s.h.l.XMLLoader xsltCacheLifetimeSeconds=60
   [junit4]   2> 1938617 INFO  (qtp14047446-103373) [    ] o.a.s.h.l.XMLLoader 

[...truncated too long message...]

d.Overseer.start(Overseer.java:820)
   [junit4]   2> 	at org.apache.solr.cloud.OverseerElectionContext.runLeaderProcess(ElectionContext.java:735)
   [junit4]   2> 	at org.apache.solr.cloud.LeaderElector.runIamLeaderProcess(LeaderElector.java:170)
   [junit4]   2> 	at org.apache.solr.cloud.LeaderElector.checkIfIamLeader(LeaderElector.java:135)
   [junit4]   2> 	at org.apache.solr.cloud.LeaderElector.access$200(LeaderElector.java:56)
   [junit4]   2> 	at org.apache.solr.cloud.LeaderElector$ElectionWatcher.process(LeaderElector.java:348)
   [junit4]   2> 	at org.apache.solr.common.cloud.SolrZkClient$3.lambda$process$0(SolrZkClient.java:266)
   [junit4]   2> 	at java.util.concurrent.Executors$RunnableAdapter.call(java.base@9-ea/Executors.java:514)
   [junit4]   2> 	at java.util.concurrent.FutureTask.run(java.base@9-ea/FutureTask.java:264)
   [junit4]   2> 	at org.apache.solr.common.util.ExecutorUtil$MDCAwareThreadPoolExecutor.lambda$execute$0(ExecutorUtil.java:229)
   [junit4]   2> 	at java.util.concurrent.ThreadPoolExecutor.runWorker(java.base@9-ea/ThreadPoolExecutor.java:1158)
   [junit4]   2> 	at java.util.concurrent.ThreadPoolExecutor$Worker.run(java.base@9-ea/ThreadPoolExecutor.java:632)
   [junit4]   2> 	at java.lang.Thread.run(java.base@9-ea/Thread.java:843)
   [junit4]   2> Caused by: org.apache.zookeeper.KeeperException$SessionExpiredException: KeeperErrorCode = Session expired for /overseer
   [junit4]   2> 	at org.apache.zookeeper.KeeperException.create(KeeperException.java:127)
   [junit4]   2> 	at org.apache.zookeeper.KeeperException.create(KeeperException.java:51)
   [junit4]   2> 	at org.apache.zookeeper.ZooKeeper.create(ZooKeeper.java:783)
   [junit4]   2> 	at org.apache.solr.common.cloud.SolrZkClient$9.execute(SolrZkClient.java:383)
   [junit4]   2> 	at org.apache.solr.common.cloud.SolrZkClient$9.execute(SolrZkClient.java:380)
   [junit4]   2> 	at org.apache.solr.common.cloud.ZkCmdExecutor.retryOperation(ZkCmdExecutor.java:60)
   [junit4]   2> 	at org.apache.solr.common.cloud.SolrZkClient.create(SolrZkClient.java:380)
   [junit4]   2> 	at org.apache.solr.cloud.Overseer.createOverseerNode(Overseer.java:1048)
   [junit4]   2> 	... 13 more
   [junit4]   2> 1943099 INFO  (jetty-launcher-26570-thread-1) [    ] o.e.j.s.h.ContextHandler Stopped o.e.j.s.ServletContextHandler@9d6086{/solr,null,UNAVAILABLE}
   [junit4]   2> 1943100 INFO  (SUITE-BasicAuthIntegrationTest-seed#[C7CBC8E9742D5C5B]-worker) [    ] o.a.s.c.ZkTestServer connecting to 127.0.0.1:45015 45015
   [junit4]   2> 1943120 INFO  (Thread-4427) [    ] o.a.s.c.ZkTestServer connecting to 127.0.0.1:45015 45015
   [junit4]   2> 1943121 WARN  (Thread-4427) [    ] o.a.s.c.ZkTestServer Watch limit violations: 
   [junit4]   2> Maximum concurrent create/delete watches above limit:
   [junit4]   2> 
   [junit4]   2> 	5	/solr/aliases.json
   [junit4]   2> 	4	/solr/security.json
   [junit4]   2> 	4	/solr/configs/conf
   [junit4]   2> 
   [junit4]   2> Maximum concurrent data watches above limit:
   [junit4]   2> 
   [junit4]   2> 	5	/solr/clusterstate.json
   [junit4]   2> 	5	/solr/clusterprops.json
   [junit4]   2> 	4	/solr/collections/authCollection/state.json
   [junit4]   2> 	2	/solr/overseer_elect/election/96565172861206535-127.0.0.1:43810_solr-n_0000000001
   [junit4]   2> 
   [junit4]   2> Maximum concurrent children watches above limit:
   [junit4]   2> 
   [junit4]   2> 	9	/solr/overseer/queue
   [junit4]   2> 	5	/solr/collections
   [junit4]   2> 	5	/solr/overseer/collection-queue-work
   [junit4]   2> 	4	/solr/live_nodes
   [junit4]   2> 	2	/solr/overseer/queue-work
   [junit4]   2> 
   [junit4]   2> 1943121 INFO  (SUITE-BasicAuthIntegrationTest-seed#[C7CBC8E9742D5C5B]-worker) [    ] o.a.s.SolrTestCaseJ4 ###deleteCore
   [junit4]   2> NOTE: leaving temporary files on disk at: /home/jenkins/workspace/Lucene-Solr-6.x-Linux/solr/build/solr-core/test/J2/temp/solr.security.BasicAuthIntegrationTest_C7CBC8E9742D5C5B-001
   [junit4]   2> Sep 10, 2016 12:33:29 AM com.carrotsearch.randomizedtesting.ThreadLeakControl checkThreadLeaks
   [junit4]   2> WARNING: Will linger awaiting termination of 1 leaked thread(s).
   [junit4]   2> NOTE: test params are: codec=Asserting(Lucene62): {}, docValues:{}, maxPointsInLeafNode=1639, maxMBSortInHeap=5.896051524446253, sim=ClassicSimilarity, locale=yi, timezone=Antarctica/Macquarie
   [junit4]   2> NOTE: Linux 4.4.0-36-generic i386/Oracle Corporation 9-ea (32-bit)/cpus=12,threads=1,free=314063640,total=536870912
   [junit4]   2> NOTE: All tests run in this JVM: [TestUniqueKeyFieldResource, SpatialRPTFieldTypeTest, TestIndexingPerformance, TestDistributedMissingSort, TestChildDocTransformer, StatelessScriptUpdateProcessorFactoryTest, CachingDirectoryFactoryTest, HardAutoCommitTest, OpenExchangeRatesOrgProviderTest, TestConfig, DeleteStatusTest, TestNRTOpen, TestRawTransformer, CdcrReplicationHandlerTest, FieldMutatingUpdateProcessorTest, TestCollationField, TestSerializedLuceneMatchVersion, PreAnalyzedFieldTest, JSONWriterTest, SOLR749Test, SuggesterWFSTTest, TestSolrDeletionPolicy1, TestCoreDiscovery, RankQueryTest, RulesTest, RecoveryAfterSoftCommitTest, TestJmxMonitoredMap, TestRestManager, TestStressReorder, HdfsNNFailoverTest, TestIndexSearcher, TestAnalyzedSuggestions, ExplicitHLLTest, CoreAdminRequestStatusTest, SolrTestCaseJ4Test, TestScoreJoinQPScore, TestRTimerTree, TestSubQueryTransformerDistrib, ResponseLogComponentTest, TestExpandComponent, TestSolrQueryParser, AddBlockUpdateTest, TestTolerantUpdateProcessorRandomCloud, TestSmileRequest, TestExactSharedStatsCache, TestFieldCacheSanityChecker, SuggestComponentContextFilterQueryTest, UpdateParamsTest, TestMiniSolrCloudCluster, DirectUpdateHandlerOptimizeTest, DistributedExpandComponentTest, TestSolrConfigHandler, DistributedFacetPivotWhiteBoxTest, ResponseHeaderTest, SecurityConfHandlerTest, TestMergePolicyConfig, BigEndianAscendingWordDeserializerTest, TestXmlQParser, CollectionsAPIAsyncDistributedZkTest, XmlUpdateRequestHandlerTest, AnalyticsQueryTest, ConfigSetsAPITest, TestOnReconnectListenerSupport, RequestHandlersTest, TermVectorComponentDistributedTest, BadCopyFieldTest, TestReversedWildcardFilterFactory, DOMUtilTest, QueryParsingTest, BaseCdcrDistributedZkTest, TestBackupRepositoryFactory, FieldAnalysisRequestHandlerTest, ForceLeaderTest, TestFieldCacheVsDocValues, HLLUtilTest, TestMinMaxOnMultiValuedField, TestGraphTermsQParserPlugin, FullSolrCloudDistribCmdsTest, SuggesterTest, ReplicationFactorTest, PrimitiveFieldTypeTest, TestBlendedInfixSuggestions, SSLMigrationTest, AssignTest, PluginInfoTest, JavabinLoaderTest, TestTolerantSearch, DistributedSuggestComponentTest, CircularListTest, BinaryUpdateRequestHandlerTest, PingRequestHandlerTest, PrimUtilsTest, SpellPossibilityIteratorTest, TestStandardQParsers, TestDFRSimilarityFactory, DocExpirationUpdateProcessorFactoryTest, UUIDUpdateProcessorFallbackTest, TestRequestStatusCollectionAPI, TestReload, RecoveryZkTest, SyncSliceTest, ShardRoutingTest, TestRandomFaceting, TestZkChroot, ShardRoutingCustomTest, AutoCommitTest, TestFaceting, TestRecovery, TestRealTimeGet, TestStressVersions, DistributedTermsComponentTest, TestRangeQuery, SolrCoreTest, SpellCheckComponentTest, PeerSyncTest, TestSort, TestFunctionQuery, DirectUpdateHandlerTest, TestBadConfig, ShowFileRequestHandlerTest, DistributedQueryElevationComponentTest, CurrencyFieldXmlFileTest, TestExtendedDismaxParser, SuggesterFSTTest, DocValuesTest, LukeRequestHandlerTest, TermVectorComponentTest, IndexSchemaRuntimeFieldTest, TestJmxIntegration, TestPartialUpdateDeduplication, HighlighterConfigTest, BadComponentTest, TestStressRecovery, TestUtils, SystemInfoHandlerTest, DistributedIntervalFacetingTest, CdcrBootstrapTest, DistribJoinFromCollectionTest, LeaderInitiatedRecoveryOnCommitTest, MultiThreadedOCPTest, OverseerStatusTest, OverseerTaskQueueTest, RemoteQueryErrorTest, SharedFSAutoReplicaFailoverTest, SimpleCollectionCreateDeleteTest, SolrCLIZkUtilsTest, SolrCloudExampleTest, TestCloudPivotFacet, TestConfigSetsAPI, TestConfigSetsAPIExclusivity, TestCryptoKeys, TestDownShardTolerantSearch, TestExclusionRuleCollectionAccess, TestLocalFSCloudBackupRestore, TestLockTree, TestMiniSolrCloudClusterSSL, TestRebalanceLeaders, TestStressLiveNodes, VMParamsZkACLAndCredentialsProvidersTest, HdfsBasicDistributedZk2Test, HdfsBasicDistributedZkTest, HdfsChaosMonkeyNothingIsSafeTest, HdfsChaosMonkeySafeLeaderTest, HdfsRestartWhileUpdatingTest, HdfsTlogReplayBufferedWhileIndexingTest, HdfsUnloadDistributedZkTest, HdfsWriteToMultipleCollectionsTest, StressHdfsTest, TestClusterStateMutator, ZkStateReaderTest, ZkStateWriterTest, RuleEngineTest, CoreSorterTest, ExitableDirectoryReaderTest, HdfsDirectoryFactoryTest, QueryResultKeyTest, TestConfigOverlay, TestConfigSetImmutable, TestConfigSetProperties, TestImplicitCoreProperties, TestInfoStreamLogging, TestReloadAndDeleteDocs, TestSolrXml, TestConfigReload, TestReqParamsAPI, TestSolrConfigHandlerCloud, DistributedQueryComponentCustomSortTest, DistributedQueryComponentOptimizationTest, TestSlowCompositeReaderWrapper, WrapperMergePolicyFactoryTest, TestMacroExpander, TestCustomDocTransformer, TestGeoJSONResponseWriter, TestSolrQueryResponse, TestManagedResourceStorage, TestCopyFieldCollectionResource, TestDynamicFieldCollectionResource, TestFieldTypeCollectionResource, TestSchemaNameResource, TestSchemaSimilarityResource, TestManagedStopFilterFactory, TestCloudSchemaless, CursorMarkTest, MergeStrategyTest, SortSpecParsingTest, TestCustomSort, TestFilteredDocIdSet, TestInitQParser, TestMaxScoreQueryParser, TestOverriddenPrefixQueryForCustomFieldType, TestReRankQParserPlugin, TestReloadDeadlock, TestSimpleQParserPlugin, TestOrdValues, BJQParserTest, BlockJoinFacetDistribTest, SimpleMLTQParserTest, TestClassicSimilarityFactory, TestNonDefinedSimilarityFactory, TestDefaultStatsCache, BasicAuthIntegrationTest]
   [junit4] Completed [605/630 (1!)] on J2 in 6.76s, 1 test, 1 error <<< FAILURES!

[...truncated 49925 lines...]


Mime
View raw message