lucene-dev mailing list archives

Site index · List index
Message view « Date » · « Thread »
Top « Date » · « Thread »
From Apache Jenkins Server <jenk...@builds.apache.org>
Subject [JENKINS] Lucene-Solr-Tests-5.5 - Build # 5 - Failure
Date Thu, 01 Sep 2016 13:41:04 GMT
Build: https://builds.apache.org/job/Lucene-Solr-Tests-5.5/5/

1 tests failed.
FAILED:  org.apache.lucene.index.TestAllFilesCheckIndexHeader.test

Error Message:
file "_h.tvx" was already written to

Stack Trace:
java.io.IOException: file "_h.tvx" was already written to
	at __randomizedtesting.SeedInfo.seed([B232491ED9634EC5:3A6676C4779F233D]:0)
	at org.apache.lucene.store.MockDirectoryWrapper.createOutput(MockDirectoryWrapper.java:558)
	at org.apache.lucene.index.TestAllFilesCheckIndexHeader.checkOneFile(TestAllFilesCheckIndexHeader.java:111)
	at org.apache.lucene.index.TestAllFilesCheckIndexHeader.checkIndexHeader(TestAllFilesCheckIndexHeader.java:87)
	at org.apache.lucene.index.TestAllFilesCheckIndexHeader.test(TestAllFilesCheckIndexHeader.java:80)
	at sun.reflect.NativeMethodAccessorImpl.invoke0(Native Method)
	at sun.reflect.NativeMethodAccessorImpl.invoke(NativeMethodAccessorImpl.java:57)
	at sun.reflect.DelegatingMethodAccessorImpl.invoke(DelegatingMethodAccessorImpl.java:43)
	at java.lang.reflect.Method.invoke(Method.java:606)
	at com.carrotsearch.randomizedtesting.RandomizedRunner.invoke(RandomizedRunner.java:1764)
	at com.carrotsearch.randomizedtesting.RandomizedRunner$8.evaluate(RandomizedRunner.java:871)
	at com.carrotsearch.randomizedtesting.RandomizedRunner$9.evaluate(RandomizedRunner.java:907)
	at com.carrotsearch.randomizedtesting.RandomizedRunner$10.evaluate(RandomizedRunner.java:921)
	at org.apache.lucene.util.TestRuleSetupTeardownChained$1.evaluate(TestRuleSetupTeardownChained.java:49)
	at org.apache.lucene.util.AbstractBeforeAfterRule$1.evaluate(AbstractBeforeAfterRule.java:45)
	at org.apache.lucene.util.TestRuleThreadAndTestName$1.evaluate(TestRuleThreadAndTestName.java:48)
	at org.apache.lucene.util.TestRuleIgnoreAfterMaxFailures$1.evaluate(TestRuleIgnoreAfterMaxFailures.java:64)
	at org.apache.lucene.util.TestRuleMarkFailure$1.evaluate(TestRuleMarkFailure.java:47)
	at com.carrotsearch.randomizedtesting.rules.StatementAdapter.evaluate(StatementAdapter.java:36)
	at com.carrotsearch.randomizedtesting.ThreadLeakControl$StatementRunner.run(ThreadLeakControl.java:367)
	at com.carrotsearch.randomizedtesting.ThreadLeakControl.forkTimeoutingTask(ThreadLeakControl.java:809)
	at com.carrotsearch.randomizedtesting.ThreadLeakControl$3.evaluate(ThreadLeakControl.java:460)
	at com.carrotsearch.randomizedtesting.RandomizedRunner.runSingleTest(RandomizedRunner.java:880)
	at com.carrotsearch.randomizedtesting.RandomizedRunner$5.evaluate(RandomizedRunner.java:781)
	at com.carrotsearch.randomizedtesting.RandomizedRunner$6.evaluate(RandomizedRunner.java:816)
	at com.carrotsearch.randomizedtesting.RandomizedRunner$7.evaluate(RandomizedRunner.java:827)
	at org.apache.lucene.util.AbstractBeforeAfterRule$1.evaluate(AbstractBeforeAfterRule.java:45)
	at com.carrotsearch.randomizedtesting.rules.StatementAdapter.evaluate(StatementAdapter.java:36)
	at org.apache.lucene.util.TestRuleStoreClassName$1.evaluate(TestRuleStoreClassName.java:41)
	at com.carrotsearch.randomizedtesting.rules.NoShadowingOrOverridesOnMethodsRule$1.evaluate(NoShadowingOrOverridesOnMethodsRule.java:40)
	at com.carrotsearch.randomizedtesting.rules.NoShadowingOrOverridesOnMethodsRule$1.evaluate(NoShadowingOrOverridesOnMethodsRule.java:40)
	at com.carrotsearch.randomizedtesting.rules.StatementAdapter.evaluate(StatementAdapter.java:36)
	at com.carrotsearch.randomizedtesting.rules.StatementAdapter.evaluate(StatementAdapter.java:36)
	at com.carrotsearch.randomizedtesting.rules.StatementAdapter.evaluate(StatementAdapter.java:36)
	at org.apache.lucene.util.TestRuleAssertionsRequired$1.evaluate(TestRuleAssertionsRequired.java:53)
	at org.apache.lucene.util.TestRuleMarkFailure$1.evaluate(TestRuleMarkFailure.java:47)
	at org.apache.lucene.util.TestRuleIgnoreAfterMaxFailures$1.evaluate(TestRuleIgnoreAfterMaxFailures.java:64)
	at org.apache.lucene.util.TestRuleIgnoreTestSuites$1.evaluate(TestRuleIgnoreTestSuites.java:54)
	at com.carrotsearch.randomizedtesting.rules.StatementAdapter.evaluate(StatementAdapter.java:36)
	at com.carrotsearch.randomizedtesting.ThreadLeakControl$StatementRunner.run(ThreadLeakControl.java:367)
	at java.lang.Thread.run(Thread.java:745)




Build Log:
[...truncated 276 lines...]
   [junit4] Suite: org.apache.lucene.index.TestAllFilesCheckIndexHeader
   [junit4]   2> NOTE: reproduce with: ant test  -Dtestcase=TestAllFilesCheckIndexHeader
-Dtests.method=test -Dtests.seed=B232491ED9634EC5 -Dtests.multiplier=2 -Dtests.slow=true -Dtests.locale=it
-Dtests.timezone=America/Jujuy -Dtests.asserts=true -Dtests.file.encoding=UTF-8
   [junit4] ERROR   3.29s J2 | TestAllFilesCheckIndexHeader.test <<<
   [junit4]    > Throwable #1: java.io.IOException: file "_h.tvx" was already written to
   [junit4]    > 	at __randomizedtesting.SeedInfo.seed([B232491ED9634EC5:3A6676C4779F233D]:0)
   [junit4]    > 	at org.apache.lucene.store.MockDirectoryWrapper.createOutput(MockDirectoryWrapper.java:558)
   [junit4]    > 	at org.apache.lucene.index.TestAllFilesCheckIndexHeader.checkOneFile(TestAllFilesCheckIndexHeader.java:111)
   [junit4]    > 	at org.apache.lucene.index.TestAllFilesCheckIndexHeader.checkIndexHeader(TestAllFilesCheckIndexHeader.java:87)
   [junit4]    > 	at org.apache.lucene.index.TestAllFilesCheckIndexHeader.test(TestAllFilesCheckIndexHeader.java:80)
   [junit4]    > 	at java.lang.Thread.run(Thread.java:745)
   [junit4]   2> NOTE: leaving temporary files on disk at: /x1/jenkins/jenkins-slave/workspace/Lucene-Solr-Tests-5.5/lucene/build/core/test/J2/temp/lucene.index.TestAllFilesCheckIndexHeader_B232491ED9634EC5-001
   [junit4]   2> NOTE: test params are: codec=Asserting(Lucene54): {}, docValues:{}, sim=RandomSimilarity(queryNorm=false,coord=crazy):
{body=DFR GL1, titleTokenized=IB LL-D1}, locale=it, timezone=America/Jujuy
   [junit4]   2> NOTE: Linux 3.13.0-85-generic amd64/Oracle Corporation 1.7.0_80 (64-bit)/cpus=4,threads=1,free=196789792,total=307757056
   [junit4]   2> NOTE: All tests run in this JVM: [TestIndexWriterConfig, TestNumericTokenStream,
TestSegmentTermEnum, TestCloseableThreadLocal, TestNorms, TestFuzzyQuery, TestOmitTf, TestSpanExplanationsOfNonMatches,
TestRegexpRandom, TestCharsRefBuilder, TestFrequencyTrackingRingBuffer, TestBM25Similarity,
TestAllFilesCheckIndexHeader]
   [junit4] Completed [22/422 (1!)] on J2 in 3.38s, 1 test, 1 error <<< FAILURES!

[...truncated 1302 lines...]
BUILD FAILED
/x1/jenkins/jenkins-slave/workspace/Lucene-Solr-Tests-5.5/build.xml:750: The following error
occurred while executing this line:
/x1/jenkins/jenkins-slave/workspace/Lucene-Solr-Tests-5.5/build.xml:694: The following error
occurred while executing this line:
/x1/jenkins/jenkins-slave/workspace/Lucene-Solr-Tests-5.5/build.xml:59: The following error
occurred while executing this line:
/x1/jenkins/jenkins-slave/workspace/Lucene-Solr-Tests-5.5/lucene/build.xml:50: The following
error occurred while executing this line:
/x1/jenkins/jenkins-slave/workspace/Lucene-Solr-Tests-5.5/lucene/common-build.xml:1477: The
following error occurred while executing this line:
/x1/jenkins/jenkins-slave/workspace/Lucene-Solr-Tests-5.5/lucene/common-build.xml:1033: There
were test failures: 422 suites (1 ignored), 3464 tests, 1 error, 50 ignored (46 assumptions)
[seed: B232491ED9634EC5]

Total time: 9 minutes 53 seconds
Build step 'Invoke Ant' marked build as failure
Archiving artifacts
Recording test results
Email was triggered for: Failure - Any
Sending email for trigger: Failure - Any




Mime
View raw message