lucene-dev mailing list archives

Site index · List index
Message view « Date » · « Thread »
Top « Date » · « Thread »
From Policeman Jenkins Server <jenk...@thetaphi.de>
Subject [JENKINS] Lucene-Solr-6.x-Windows (32bit/jdk1.8.0_102) - Build # 448 - Still Unstable!
Date Mon, 12 Sep 2016 02:48:09 GMT
Build: http://jenkins.thetaphi.de/job/Lucene-Solr-6.x-Windows/448/
Java: 32bit/jdk1.8.0_102 -server -XX:+UseParallelGC

1 tests failed.
FAILED:  org.apache.solr.cloud.LeaderFailoverAfterPartitionTest.test

Error Message:
org.apache.solr.client.solrj.SolrServerException: No live SolrServers available to handle this request:[http://127.0.0.1:59105/c8n_1x3_lf_shard1_replica1]

Stack Trace:
org.apache.solr.client.solrj.SolrServerException: org.apache.solr.client.solrj.SolrServerException: No live SolrServers available to handle this request:[http://127.0.0.1:59105/c8n_1x3_lf_shard1_replica1]
	at __randomizedtesting.SeedInfo.seed([8A464A899C1AE6CF:212755332E68B37]:0)
	at org.apache.solr.client.solrj.impl.CloudSolrClient.directUpdate(CloudSolrClient.java:769)
	at org.apache.solr.client.solrj.impl.CloudSolrClient.sendRequest(CloudSolrClient.java:1161)
	at org.apache.solr.client.solrj.impl.CloudSolrClient.requestWithRetryOnStaleState(CloudSolrClient.java:1050)
	at org.apache.solr.client.solrj.impl.CloudSolrClient.request(CloudSolrClient.java:992)
	at org.apache.solr.client.solrj.SolrClient.request(SolrClient.java:1219)
	at org.apache.solr.cloud.HttpPartitionTest.sendDoc(HttpPartitionTest.java:592)
	at org.apache.solr.cloud.HttpPartitionTest.sendDoc(HttpPartitionTest.java:578)
	at org.apache.solr.cloud.LeaderFailoverAfterPartitionTest.testRf3WithLeaderFailover(LeaderFailoverAfterPartitionTest.java:174)
	at org.apache.solr.cloud.LeaderFailoverAfterPartitionTest.test(LeaderFailoverAfterPartitionTest.java:55)
	at sun.reflect.NativeMethodAccessorImpl.invoke0(Native Method)
	at sun.reflect.NativeMethodAccessorImpl.invoke(NativeMethodAccessorImpl.java:62)
	at sun.reflect.DelegatingMethodAccessorImpl.invoke(DelegatingMethodAccessorImpl.java:43)
	at java.lang.reflect.Method.invoke(Method.java:498)
	at com.carrotsearch.randomizedtesting.RandomizedRunner.invoke(RandomizedRunner.java:1764)
	at com.carrotsearch.randomizedtesting.RandomizedRunner$8.evaluate(RandomizedRunner.java:871)
	at com.carrotsearch.randomizedtesting.RandomizedRunner$9.evaluate(RandomizedRunner.java:907)
	at com.carrotsearch.randomizedtesting.RandomizedRunner$10.evaluate(RandomizedRunner.java:921)
	at org.apache.solr.BaseDistributedSearchTestCase$ShardsRepeatRule$ShardsFixedStatement.callStatement(BaseDistributedSearchTestCase.java:992)
	at org.apache.solr.BaseDistributedSearchTestCase$ShardsRepeatRule$ShardsStatement.evaluate(BaseDistributedSearchTestCase.java:967)
	at com.carrotsearch.randomizedtesting.rules.SystemPropertiesRestoreRule$1.evaluate(SystemPropertiesRestoreRule.java:57)
	at org.apache.lucene.util.TestRuleSetupTeardownChained$1.evaluate(TestRuleSetupTeardownChained.java:49)
	at org.apache.lucene.util.AbstractBeforeAfterRule$1.evaluate(AbstractBeforeAfterRule.java:45)
	at org.apache.lucene.util.TestRuleThreadAndTestName$1.evaluate(TestRuleThreadAndTestName.java:48)
	at org.apache.lucene.util.TestRuleIgnoreAfterMaxFailures$1.evaluate(TestRuleIgnoreAfterMaxFailures.java:64)
	at org.apache.lucene.util.TestRuleMarkFailure$1.evaluate(TestRuleMarkFailure.java:47)
	at com.carrotsearch.randomizedtesting.rules.StatementAdapter.evaluate(StatementAdapter.java:36)
	at com.carrotsearch.randomizedtesting.ThreadLeakControl$StatementRunner.run(ThreadLeakControl.java:367)
	at com.carrotsearch.randomizedtesting.ThreadLeakControl.forkTimeoutingTask(ThreadLeakControl.java:809)
	at com.carrotsearch.randomizedtesting.ThreadLeakControl$3.evaluate(ThreadLeakControl.java:460)
	at com.carrotsearch.randomizedtesting.RandomizedRunner.runSingleTest(RandomizedRunner.java:880)
	at com.carrotsearch.randomizedtesting.RandomizedRunner$5.evaluate(RandomizedRunner.java:781)
	at com.carrotsearch.randomizedtesting.RandomizedRunner$6.evaluate(RandomizedRunner.java:816)
	at com.carrotsearch.randomizedtesting.RandomizedRunner$7.evaluate(RandomizedRunner.java:827)
	at com.carrotsearch.randomizedtesting.rules.StatementAdapter.evaluate(StatementAdapter.java:36)
	at com.carrotsearch.randomizedtesting.rules.SystemPropertiesRestoreRule$1.evaluate(SystemPropertiesRestoreRule.java:57)
	at org.apache.lucene.util.AbstractBeforeAfterRule$1.evaluate(AbstractBeforeAfterRule.java:45)
	at com.carrotsearch.randomizedtesting.rules.StatementAdapter.evaluate(StatementAdapter.java:36)
	at org.apache.lucene.util.TestRuleStoreClassName$1.evaluate(TestRuleStoreClassName.java:41)
	at com.carrotsearch.randomizedtesting.rules.NoShadowingOrOverridesOnMethodsRule$1.evaluate(NoShadowingOrOverridesOnMethodsRule.java:40)
	at com.carrotsearch.randomizedtesting.rules.NoShadowingOrOverridesOnMethodsRule$1.evaluate(NoShadowingOrOverridesOnMethodsRule.java:40)
	at com.carrotsearch.randomizedtesting.rules.StatementAdapter.evaluate(StatementAdapter.java:36)
	at com.carrotsearch.randomizedtesting.rules.StatementAdapter.evaluate(StatementAdapter.java:36)
	at com.carrotsearch.randomizedtesting.rules.StatementAdapter.evaluate(StatementAdapter.java:36)
	at org.apache.lucene.util.TestRuleAssertionsRequired$1.evaluate(TestRuleAssertionsRequired.java:53)
	at org.apache.lucene.util.TestRuleMarkFailure$1.evaluate(TestRuleMarkFailure.java:47)
	at org.apache.lucene.util.TestRuleIgnoreAfterMaxFailures$1.evaluate(TestRuleIgnoreAfterMaxFailures.java:64)
	at org.apache.lucene.util.TestRuleIgnoreTestSuites$1.evaluate(TestRuleIgnoreTestSuites.java:54)
	at com.carrotsearch.randomizedtesting.rules.StatementAdapter.evaluate(StatementAdapter.java:36)
	at com.carrotsearch.randomizedtesting.ThreadLeakControl$StatementRunner.run(ThreadLeakControl.java:367)
	at java.lang.Thread.run(Thread.java:745)
Caused by: org.apache.solr.client.solrj.SolrServerException: No live SolrServers available to handle this request:[http://127.0.0.1:59105/c8n_1x3_lf_shard1_replica1]
	at org.apache.solr.client.solrj.impl.LBHttpSolrClient.request(LBHttpSolrClient.java:384)
	at org.apache.solr.client.solrj.impl.CloudSolrClient.directUpdate(CloudSolrClient.java:763)
	... 49 more
Caused by: org.apache.solr.client.solrj.SolrServerException: Server refused connection at: http://127.0.0.1:59105/c8n_1x3_lf_shard1_replica1
	at org.apache.solr.client.solrj.impl.HttpSolrClient.executeMethod(HttpSolrClient.java:599)
	at org.apache.solr.client.solrj.impl.HttpSolrClient.request(HttpSolrClient.java:261)
	at org.apache.solr.client.solrj.impl.HttpSolrClient.request(HttpSolrClient.java:250)
	at org.apache.solr.client.solrj.impl.LBHttpSolrClient.doRequest(LBHttpSolrClient.java:405)
	at org.apache.solr.client.solrj.impl.LBHttpSolrClient.request(LBHttpSolrClient.java:357)
	... 50 more
Caused by: java.net.ConnectException: Connection refused: connect
	at java.net.DualStackPlainSocketImpl.waitForConnect(Native Method)
	at java.net.DualStackPlainSocketImpl.socketConnect(DualStackPlainSocketImpl.java:85)
	at java.net.AbstractPlainSocketImpl.doConnect(AbstractPlainSocketImpl.java:350)
	at java.net.AbstractPlainSocketImpl.connectToAddress(AbstractPlainSocketImpl.java:206)
	at java.net.AbstractPlainSocketImpl.connect(AbstractPlainSocketImpl.java:188)
	at java.net.PlainSocketImpl.connect(PlainSocketImpl.java:172)
	at java.net.SocksSocketImpl.connect(SocksSocketImpl.java:392)
	at java.net.Socket.connect(Socket.java:589)
	at org.apache.http.conn.scheme.PlainSocketFactory.connectSocket(PlainSocketFactory.java:117)
	at org.apache.http.impl.conn.DefaultClientConnectionOperator.openConnection(DefaultClientConnectionOperator.java:177)
	at org.apache.http.impl.conn.ManagedClientConnectionImpl.open(ManagedClientConnectionImpl.java:304)
	at org.apache.http.impl.client.DefaultRequestDirector.tryConnect(DefaultRequestDirector.java:611)
	at org.apache.http.impl.client.DefaultRequestDirector.execute(DefaultRequestDirector.java:446)
	at org.apache.http.impl.client.AbstractHttpClient.doExecute(AbstractHttpClient.java:882)
	at org.apache.http.impl.client.CloseableHttpClient.execute(CloseableHttpClient.java:82)
	at org.apache.http.impl.client.CloseableHttpClient.execute(CloseableHttpClient.java:107)
	at org.apache.http.impl.client.CloseableHttpClient.execute(CloseableHttpClient.java:55)
	at org.apache.solr.client.solrj.impl.HttpSolrClient.executeMethod(HttpSolrClient.java:497)
	... 54 more




Build Log:
[...truncated 11293 lines...]
   [junit4] Suite: org.apache.solr.cloud.LeaderFailoverAfterPartitionTest
   [junit4]   2> Creating dataDir: C:\Users\jenkins\workspace\Lucene-Solr-6.x-Windows\solr\build\solr-core\test\J1\temp\solr.cloud.LeaderFailoverAfterPartitionTest_8A464A899C1AE6CF-001\init-core-data-001
   [junit4]   2> 967748 INFO  (SUITE-LeaderFailoverAfterPartitionTest-seed#[8A464A899C1AE6CF]-worker) [    ] o.a.s.SolrTestCaseJ4 Randomized ssl (false) and clientAuth (false) via: @org.apache.solr.SolrTestCaseJ4$SuppressSSL(bugUrl=https://issues.apache.org/jira/browse/SOLR-5776)
   [junit4]   2> 967749 INFO  (SUITE-LeaderFailoverAfterPartitionTest-seed#[8A464A899C1AE6CF]-worker) [    ] o.a.s.BaseDistributedSearchTestCase Setting hostContext system property: /
   [junit4]   2> 967752 INFO  (TEST-LeaderFailoverAfterPartitionTest.test-seed#[8A464A899C1AE6CF]) [    ] o.a.s.c.ZkTestServer STARTING ZK TEST SERVER
   [junit4]   2> 967753 INFO  (Thread-1737) [    ] o.a.s.c.ZkTestServer client port:0.0.0.0/0.0.0.0:0
   [junit4]   2> 967753 INFO  (Thread-1737) [    ] o.a.s.c.ZkTestServer Starting server
   [junit4]   2> 967853 INFO  (TEST-LeaderFailoverAfterPartitionTest.test-seed#[8A464A899C1AE6CF]) [    ] o.a.s.c.ZkTestServer start zk server on port:59048
   [junit4]   2> 967853 INFO  (TEST-LeaderFailoverAfterPartitionTest.test-seed#[8A464A899C1AE6CF]) [    ] o.a.s.c.c.SolrZkClient Using default ZkCredentialsProvider
   [junit4]   2> 967855 INFO  (TEST-LeaderFailoverAfterPartitionTest.test-seed#[8A464A899C1AE6CF]) [    ] o.a.s.c.c.ConnectionManager Waiting for client to connect to ZooKeeper
   [junit4]   2> 967862 INFO  (zkCallback-7041-thread-1) [    ] o.a.s.c.c.ConnectionManager Watcher org.apache.solr.common.cloud.ConnectionManager@e2e5a0 name:ZooKeeperConnection Watcher:127.0.0.1:59048 got event WatchedEvent state:SyncConnected type:None path:null path:null type:None
   [junit4]   2> 967862 INFO  (TEST-LeaderFailoverAfterPartitionTest.test-seed#[8A464A899C1AE6CF]) [    ] o.a.s.c.c.ConnectionManager Client is connected to ZooKeeper
   [junit4]   2> 967863 INFO  (TEST-LeaderFailoverAfterPartitionTest.test-seed#[8A464A899C1AE6CF]) [    ] o.a.s.c.c.SolrZkClient Using default ZkACLProvider
   [junit4]   2> 967863 INFO  (TEST-LeaderFailoverAfterPartitionTest.test-seed#[8A464A899C1AE6CF]) [    ] o.a.s.c.c.SolrZkClient makePath: /solr
   [junit4]   2> 967865 INFO  (TEST-LeaderFailoverAfterPartitionTest.test-seed#[8A464A899C1AE6CF]) [    ] o.a.s.c.c.SolrZkClient Using default ZkCredentialsProvider
   [junit4]   2> 967866 INFO  (TEST-LeaderFailoverAfterPartitionTest.test-seed#[8A464A899C1AE6CF]) [    ] o.a.s.c.c.ConnectionManager Waiting for client to connect to ZooKeeper
   [junit4]   2> 967867 INFO  (zkCallback-7042-thread-1) [    ] o.a.s.c.c.ConnectionManager Watcher org.apache.solr.common.cloud.ConnectionManager@51c5a6 name:ZooKeeperConnection Watcher:127.0.0.1:59048/solr got event WatchedEvent state:SyncConnected type:None path:null path:null type:None
   [junit4]   2> 967867 INFO  (TEST-LeaderFailoverAfterPartitionTest.test-seed#[8A464A899C1AE6CF]) [    ] o.a.s.c.c.ConnectionManager Client is connected to ZooKeeper
   [junit4]   2> 967868 INFO  (TEST-LeaderFailoverAfterPartitionTest.test-seed#[8A464A899C1AE6CF]) [    ] o.a.s.c.c.SolrZkClient Using default ZkACLProvider
   [junit4]   2> 967868 INFO  (TEST-LeaderFailoverAfterPartitionTest.test-seed#[8A464A899C1AE6CF]) [    ] o.a.s.c.c.SolrZkClient makePath: /collections/collection1
   [junit4]   2> 967871 INFO  (TEST-LeaderFailoverAfterPartitionTest.test-seed#[8A464A899C1AE6CF]) [    ] o.a.s.c.c.SolrZkClient makePath: /collections/collection1/shards
   [junit4]   2> 967873 INFO  (TEST-LeaderFailoverAfterPartitionTest.test-seed#[8A464A899C1AE6CF]) [    ] o.a.s.c.c.SolrZkClient makePath: /collections/control_collection
   [junit4]   2> 967873 INFO  (TEST-LeaderFailoverAfterPartitionTest.test-seed#[8A464A899C1AE6CF]) [    ] o.a.s.c.c.SolrZkClient makePath: /collections/control_collection/shards
   [junit4]   2> 967875 INFO  (TEST-LeaderFailoverAfterPartitionTest.test-seed#[8A464A899C1AE6CF]) [    ] o.a.s.c.AbstractZkTestCase put C:\Users\jenkins\workspace\Lucene-Solr-6.x-Windows\solr\core\src\test-files\solr\collection1\conf\solrconfig-tlog.xml to /configs/conf1/solrconfig.xml
   [junit4]   2> 967876 INFO  (TEST-LeaderFailoverAfterPartitionTest.test-seed#[8A464A899C1AE6CF]) [    ] o.a.s.c.c.SolrZkClient makePath: /configs/conf1/solrconfig.xml
   [junit4]   2> 967879 INFO  (TEST-LeaderFailoverAfterPartitionTest.test-seed#[8A464A899C1AE6CF]) [    ] o.a.s.c.AbstractZkTestCase put C:\Users\jenkins\workspace\Lucene-Solr-6.x-Windows\solr\core\src\test-files\solr\collection1\conf\schema.xml to /configs/conf1/schema.xml
   [junit4]   2> 967879 INFO  (TEST-LeaderFailoverAfterPartitionTest.test-seed#[8A464A899C1AE6CF]) [    ] o.a.s.c.c.SolrZkClient makePath: /configs/conf1/schema.xml
   [junit4]   2> 967882 INFO  (TEST-LeaderFailoverAfterPartitionTest.test-seed#[8A464A899C1AE6CF]) [    ] o.a.s.c.AbstractZkTestCase put C:\Users\jenkins\workspace\Lucene-Solr-6.x-Windows\solr\core\src\test-files\solr\collection1\conf\solrconfig.snippet.randomindexconfig.xml to /configs/conf1/solrconfig.snippet.randomindexconfig.xml
   [junit4]   2> 967882 INFO  (TEST-LeaderFailoverAfterPartitionTest.test-seed#[8A464A899C1AE6CF]) [    ] o.a.s.c.c.SolrZkClient makePath: /configs/conf1/solrconfig.snippet.randomindexconfig.xml
   [junit4]   2> 967884 INFO  (TEST-LeaderFailoverAfterPartitionTest.test-seed#[8A464A899C1AE6CF]) [    ] o.a.s.c.AbstractZkTestCase put C:\Users\jenkins\workspace\Lucene-Solr-6.x-Windows\solr\core\src\test-files\solr\collection1\conf\stopwords.txt to /configs/conf1/stopwords.txt
   [junit4]   2> 967884 INFO  (TEST-LeaderFailoverAfterPartitionTest.test-seed#[8A464A899C1AE6CF]) [    ] o.a.s.c.c.SolrZkClient makePath: /configs/conf1/stopwords.txt
   [junit4]   2> 967886 INFO  (TEST-LeaderFailoverAfterPartitionTest.test-seed#[8A464A899C1AE6CF]) [    ] o.a.s.c.AbstractZkTestCase put C:\Users\jenkins\workspace\Lucene-Solr-6.x-Windows\solr\core\src\test-files\solr\collection1\conf\protwords.txt to /configs/conf1/protwords.txt
   [junit4]   2> 967887 INFO  (TEST-LeaderFailoverAfterPartitionTest.test-seed#[8A464A899C1AE6CF]) [    ] o.a.s.c.c.SolrZkClient makePath: /configs/conf1/protwords.txt
   [junit4]   2> 967889 INFO  (TEST-LeaderFailoverAfterPartitionTest.test-seed#[8A464A899C1AE6CF]) [    ] o.a.s.c.AbstractZkTestCase put C:\Users\jenkins\workspace\Lucene-Solr-6.x-Windows\solr\core\src\test-files\solr\collection1\conf\currency.xml to /configs/conf1/currency.xml
   [junit4]   2> 967889 INFO  (TEST-LeaderFailoverAfterPartitionTest.test-seed#[8A464A899C1AE6CF]) [    ] o.a.s.c.c.SolrZkClient makePath: /configs/conf1/currency.xml
   [junit4]   2> 967892 INFO  (TEST-LeaderFailoverAfterPartitionTest.test-seed#[8A464A899C1AE6CF]) [    ] o.a.s.c.AbstractZkTestCase put C:\Users\jenkins\workspace\Lucene-Solr-6.x-Windows\solr\core\src\test-files\solr\collection1\conf\enumsConfig.xml to /configs/conf1/enumsConfig.xml
   [junit4]   2> 967892 INFO  (TEST-LeaderFailoverAfterPartitionTest.test-seed#[8A464A899C1AE6CF]) [    ] o.a.s.c.c.SolrZkClient makePath: /configs/conf1/enumsConfig.xml
   [junit4]   2> 967895 INFO  (TEST-LeaderFailoverAfterPartitionTest.test-seed#[8A464A899C1AE6CF]) [    ] o.a.s.c.AbstractZkTestCase put C:\Users\jenkins\workspace\Lucene-Solr-6.x-Windows\solr\core\src\test-files\solr\collection1\conf\open-exchange-rates.json to /configs/conf1/open-exchange-rates.json
   [junit4]   2> 967895 INFO  (TEST-LeaderFailoverAfterPartitionTest.test-seed#[8A464A899C1AE6CF]) [    ] o.a.s.c.c.SolrZkClient makePath: /configs/conf1/open-exchange-rates.json
   [junit4]   2> 967897 INFO  (TEST-LeaderFailoverAfterPartitionTest.test-seed#[8A464A899C1AE6CF]) [    ] o.a.s.c.AbstractZkTestCase put C:\Users\jenkins\workspace\Lucene-Solr-6.x-Windows\solr\core\src\test-files\solr\collection1\conf\mapping-ISOLatin1Accent.txt to /configs/conf1/mapping-ISOLatin1Accent.txt
   [junit4]   2> 967898 INFO  (TEST-LeaderFailoverAfterPartitionTest.test-seed#[8A464A899C1AE6CF]) [    ] o.a.s.c.c.SolrZkClient makePath: /configs/conf1/mapping-ISOLatin1Accent.txt
   [junit4]   2> 967900 INFO  (TEST-LeaderFailoverAfterPartitionTest.test-seed#[8A464A899C1AE6CF]) [    ] o.a.s.c.AbstractZkTestCase put C:\Users\jenkins\workspace\Lucene-Solr-6.x-Windows\solr\core\src\test-files\solr\collection1\conf\old_synonyms.txt to /configs/conf1/old_synonyms.txt
   [junit4]   2> 967900 INFO  (TEST-LeaderFailoverAfterPartitionTest.test-seed#[8A464A899C1AE6CF]) [    ] o.a.s.c.c.SolrZkClient makePath: /configs/conf1/old_synonyms.txt
   [junit4]   2> 967902 INFO  (TEST-LeaderFailoverAfterPartitionTest.test-seed#[8A464A899C1AE6CF]) [    ] o.a.s.c.AbstractZkTestCase put C:\Users\jenkins\workspace\Lucene-Solr-6.x-Windows\solr\core\src\test-files\solr\collection1\conf\synonyms.txt to /configs/conf1/synonyms.txt
   [junit4]   2> 967902 INFO  (TEST-LeaderFailoverAfterPartitionTest.test-seed#[8A464A899C1AE6CF]) [    ] o.a.s.c.c.SolrZkClient makePath: /configs/conf1/synonyms.txt
   [junit4]   2> 968488 INFO  (TEST-LeaderFailoverAfterPartitionTest.test-seed#[8A464A899C1AE6CF]) [    ] o.a.s.SolrTestCaseJ4 Writing core.properties file to C:\Users\jenkins\workspace\Lucene-Solr-6.x-Windows\solr\build\solr-core\test\J1\temp\solr.cloud.LeaderFailoverAfterPartitionTest_8A464A899C1AE6CF-001\control-001\cores\collection1
   [junit4]   2> 968492 INFO  (TEST-LeaderFailoverAfterPartitionTest.test-seed#[8A464A899C1AE6CF]) [    ] o.e.j.s.Server jetty-9.3.8.v20160314
   [junit4]   2> 968494 INFO  (TEST-LeaderFailoverAfterPartitionTest.test-seed#[8A464A899C1AE6CF]) [    ] o.e.j.s.h.ContextHandler Started o.e.j.s.ServletContextHandler@cf589f{/,null,AVAILABLE}
   [junit4]   2> 968497 INFO  (TEST-LeaderFailoverAfterPartitionTest.test-seed#[8A464A899C1AE6CF]) [    ] o.e.j.s.ServerConnector Started ServerConnector@13f676c{HTTP/1.1,[http/1.1]}{127.0.0.1:59057}
   [junit4]   2> 968497 INFO  (TEST-LeaderFailoverAfterPartitionTest.test-seed#[8A464A899C1AE6CF]) [    ] o.e.j.s.Server Started @972470ms
   [junit4]   2> 968497 INFO  (TEST-LeaderFailoverAfterPartitionTest.test-seed#[8A464A899C1AE6CF]) [    ] o.a.s.c.s.e.JettySolrRunner Jetty properties: {solr.data.dir=C:\Users\jenkins\workspace\Lucene-Solr-6.x-Windows\solr\build\solr-core\test\J1\temp\solr.cloud.LeaderFailoverAfterPartitionTest_8A464A899C1AE6CF-001\tempDir-001/control/data, hostContext=/, hostPort=59056, coreRootDirectory=C:\Users\jenkins\workspace\Lucene-Solr-6.x-Windows\solr\build\solr-core\test\J1\temp\solr.cloud.LeaderFailoverAfterPartitionTest_8A464A899C1AE6CF-001\control-001\cores}
   [junit4]   2> 968498 INFO  (TEST-LeaderFailoverAfterPartitionTest.test-seed#[8A464A899C1AE6CF]) [    ] o.a.s.s.SolrDispatchFilter SolrDispatchFilter.init(): sun.misc.Launcher$AppClassLoader@1d16e93
   [junit4]   2> 968498 INFO  (TEST-LeaderFailoverAfterPartitionTest.test-seed#[8A464A899C1AE6CF]) [    ] o.a.s.c.SolrResourceLoader new SolrResourceLoader for directory: 'C:\Users\jenkins\workspace\Lucene-Solr-6.x-Windows\solr\build\solr-core\test\J1\temp\solr.cloud.LeaderFailoverAfterPartitionTest_8A464A899C1AE6CF-001\control-001'
   [junit4]   2> 968498 INFO  (TEST-LeaderFailoverAfterPartitionTest.test-seed#[8A464A899C1AE6CF]) [    ] o.a.s.c.SolrResourceLoader JNDI not configured for solr (NoInitialContextEx)
   [junit4]   2> 968498 INFO  (TEST-LeaderFailoverAfterPartitionTest.test-seed#[8A464A899C1AE6CF]) [    ] o.a.s.c.SolrResourceLoader solr home defaulted to 'solr/' (could not find system property or JNDI)
   [junit4]   2> 968499 INFO  (TEST-LeaderFailoverAfterPartitionTest.test-seed#[8A464A899C1AE6CF]) [    ] o.a.s.c.c.SolrZkClient Using default ZkCredentialsProvider
   [junit4]   2> 968500 INFO  (TEST-LeaderFailoverAfterPartitionTest.test-seed#[8A464A899C1AE6CF]) [    ] o.a.s.c.c.ConnectionManager Waiting for client to connect to ZooKeeper
   [junit4]   2> 968502 INFO  (zkCallback-7043-thread-1) [    ] o.a.s.c.c.ConnectionManager Watcher org.apache.solr.common.cloud.ConnectionManager@1f18324 name:ZooKeeperConnection Watcher:127.0.0.1:59048/solr got event WatchedEvent state:SyncConnected type:None path:null path:null type:None
   [junit4]   2> 968502 INFO  (TEST-LeaderFailoverAfterPartitionTest.test-seed#[8A464A899C1AE6CF]) [    ] o.a.s.c.c.ConnectionManager Client is connected to ZooKeeper
   [junit4]   2> 968502 INFO  (TEST-LeaderFailoverAfterPartitionTest.test-seed#[8A464A899C1AE6CF]) [    ] o.a.s.c.c.SolrZkClient Using default ZkACLProvider
   [junit4]   2> 968504 INFO  (TEST-LeaderFailoverAfterPartitionTest.test-seed#[8A464A899C1AE6CF]) [    ] o.a.s.s.SolrDispatchFilter Loading solr.xml from SolrHome (not found in ZooKeeper)
   [junit4]   2> 968504 INFO  (TEST-LeaderFailoverAfterPartitionTest.test-seed#[8A464A899C1AE6CF]) [    ] o.a.s.c.SolrXmlConfig Loading container configuration from C:\Users\jenkins\workspace\Lucene-Solr-6.x-Windows\solr\build\solr-core\test\J1\temp\solr.cloud.LeaderFailoverAfterPartitionTest_8A464A899C1AE6CF-001\control-001\solr.xml
   [junit4]   2> 968521 INFO  (TEST-LeaderFailoverAfterPartitionTest.test-seed#[8A464A899C1AE6CF]) [    ] o.a.s.c.CorePropertiesLocator Config-defined core root directory: C:\Users\jenkins\workspace\Lucene-Solr-6.x-Windows\solr\build\solr-core\test\J1\temp\solr.cloud.LeaderFailoverAfterPartitionTest_8A464A899C1AE6CF-001\control-001\cores
   [junit4]   2> 968521 INFO  (TEST-LeaderFailoverAfterPartitionTest.test-seed#[8A464A899C1AE6CF]) [    ] o.a.s.c.CoreContainer New CoreContainer 7270945
   [junit4]   2> 968521 INFO  (TEST-LeaderFailoverAfterPartitionTest.test-seed#[8A464A899C1AE6CF]) [    ] o.a.s.c.CoreContainer Loading cores into CoreContainer [instanceDir=C:\Users\jenkins\workspace\Lucene-Solr-6.x-Windows\solr\build\solr-core\test\J1\temp\solr.cloud.LeaderFailoverAfterPartitionTest_8A464A899C1AE6CF-001\control-001]
   [junit4]   2> 968521 WARN  (TEST-LeaderFailoverAfterPartitionTest.test-seed#[8A464A899C1AE6CF]) [    ] o.a.s.c.CoreContainer Couldn't add files from C:\Users\jenkins\workspace\Lucene-Solr-6.x-Windows\solr\build\solr-core\test\J1\temp\solr.cloud.LeaderFailoverAfterPartitionTest_8A464A899C1AE6CF-001\control-001\lib to classpath: C:\Users\jenkins\workspace\Lucene-Solr-6.x-Windows\solr\build\solr-core\test\J1\temp\solr.cloud.LeaderFailoverAfterPartitionTest_8A464A899C1AE6CF-001\control-001\lib
   [junit4]   2> 968522 INFO  (TEST-LeaderFailoverAfterPartitionTest.test-seed#[8A464A899C1AE6CF]) [    ] o.a.s.h.c.HttpShardHandlerFactory created with socketTimeout : 90000,urlScheme : ,connTimeout : 15000,maxConnectionsPerHost : 20,maxConnections : 10000,corePoolSize : 0,maximumPoolSize : 2147483647,maxThreadIdleTime : 5,sizeOfQueue : -1,fairnessPolicy : false,useRetries : false,connectionsEvictorSleepDelay : 5000,maxConnectionIdleTime : 40000,
   [junit4]   2> 968528 INFO  (TEST-LeaderFailoverAfterPartitionTest.test-seed#[8A464A899C1AE6CF]) [    ] o.a.s.u.UpdateShardHandler Creating UpdateShardHandler HTTP client with params: socketTimeout=340000&connTimeout=45000&retry=true
   [junit4]   2> 968530 INFO  (TEST-LeaderFailoverAfterPartitionTest.test-seed#[8A464A899C1AE6CF]) [    ] o.a.s.l.LogWatcher SLF4J impl is org.slf4j.impl.Log4jLoggerFactory
   [junit4]   2> 968531 INFO  (TEST-LeaderFailoverAfterPartitionTest.test-seed#[8A464A899C1AE6CF]) [    ] o.a.s.l.LogWatcher Registering Log Listener [Log4j (org.slf4j.impl.Log4jLoggerFactory)]
   [junit4]   2> 968532 INFO  (TEST-LeaderFailoverAfterPartitionTest.test-seed#[8A464A899C1AE6CF]) [    ] o.a.s.c.ZkContainer Zookeeper client=127.0.0.1:59048/solr
   [junit4]   2> 968532 INFO  (TEST-LeaderFailoverAfterPartitionTest.test-seed#[8A464A899C1AE6CF]) [    ] o.a.s.c.ZkController zkHost includes chroot
   [junit4]   2> 968532 INFO  (TEST-LeaderFailoverAfterPartitionTest.test-seed#[8A464A899C1AE6CF]) [    ] o.a.s.c.c.SolrZkClient Using default ZkCredentialsProvider
   [junit4]   2> 968533 INFO  (TEST-LeaderFailoverAfterPartitionTest.test-seed#[8A464A899C1AE6CF]) [    ] o.a.s.c.c.ConnectionManager Waiting for client to connect to ZooKeeper
   [junit4]   2> 968536 INFO  (zkCallback-7046-thread-1) [    ] o.a.s.c.c.ConnectionManager Watcher org.apache.solr.common.cloud.ConnectionManager@7c3863 name:ZooKeeperConnection Watcher:127.0.0.1:59048 got event WatchedEvent state:SyncConnected type:None path:null path:null type:None
   [junit4]   2> 968537 INFO  (TEST-LeaderFailoverAfterPartitionTest.test-seed#[8A464A899C1AE6CF]) [    ] o.a.s.c.c.ConnectionManager Client is connected to ZooKeeper
   [junit4]   2> 968538 INFO  (TEST-LeaderFailoverAfterPartitionTest.test-seed#[8A464A899C1AE6CF]) [    ] o.a.s.c.c.SolrZkClient Using default ZkACLProvider
   [junit4]   2> 968539 INFO  (TEST-LeaderFailoverAfterPartitionTest.test-seed#[8A464A899C1AE6CF]) [n:127.0.0.1:59056_    ] o.a.s.c.ZkController Added new OnReconnect listener org.apache.solr.cloud.ZkController$$Lambda$106/19207081@19ce700
   [junit4]   2> 968541 INFO  (TEST-LeaderFailoverAfterPartitionTest.test-seed#[8A464A899C1AE6CF]) [n:127.0.0.1:59056_    ] o.a.s.c.c.ConnectionManager Waiting for client to connect to ZooKeeper
   [junit4]   2> 968547 INFO  (zkCallback-7047-thread-1-processing-n:127.0.0.1:59056_) [n:127.0.0.1:59056_    ] o.a.s.c.c.ConnectionManager Watcher org.apache.solr.common.cloud.ConnectionManager@13c83e5 name:ZooKeeperConnection Watcher:127.0.0.1:59048/solr got event WatchedEvent state:SyncConnected type:None path:null path:null type:None
   [junit4]   2> 968547 INFO  (TEST-LeaderFailoverAfterPartitionTest.test-seed#[8A464A899C1AE6CF]) [n:127.0.0.1:59056_    ] o.a.s.c.c.ConnectionManager Client is connected to ZooKeeper
   [junit4]   2> 968552 INFO  (TEST-LeaderFailoverAfterPartitionTest.test-seed#[8A464A899C1AE6CF]) [n:127.0.0.1:59056_    ] o.a.s.c.c.SolrZkClient makePath: /overseer/queue
   [junit4]   2> 968566 INFO  (TEST-LeaderFailoverAfterPartitionTest.test-seed#[8A464A899C1AE6CF]) [n:127.0.0.1:59056_    ] o.a.s.c.c.SolrZkClient makePath: /overseer/collection-queue-work
   [junit4]   2> 968572 INFO  (TEST-LeaderFailoverAfterPartitionTest.test-seed#[8A464A899C1AE6CF]) [n:127.0.0.1:59056_    ] o.a.s.c.c.SolrZkClient makePath: /overseer/collection-map-running
   [junit4]   2> 968577 INFO  (TEST-LeaderFailoverAfterPartitionTest.test-seed#[8A464A899C1AE6CF]) [n:127.0.0.1:59056_    ] o.a.s.c.c.SolrZkClient makePath: /overseer/collection-map-completed
   [junit4]   2> 968580 INFO  (TEST-LeaderFailoverAfterPartitionTest.test-seed#[8A464A899C1AE6CF]) [n:127.0.0.1:59056_    ] o.a.s.c.c.SolrZkClient makePath: /overseer/collection-map-failure
   [junit4]   2> 968582 INFO  (TEST-LeaderFailoverAfterPartitionTest.test-seed#[8A464A899C1AE6CF]) [n:127.0.0.1:59056_    ] o.a.s.c.c.SolrZkClient makePath: /live_nodes
   [junit4]   2> 968585 INFO  (TEST-LeaderFailoverAfterPartitionTest.test-seed#[8A464A899C1AE6CF]) [n:127.0.0.1:59056_    ] o.a.s.c.c.SolrZkClient makePath: /aliases.json
   [junit4]   2> 968586 INFO  (TEST-LeaderFailoverAfterPartitionTest.test-seed#[8A464A899C1AE6CF]) [n:127.0.0.1:59056_    ] o.a.s.c.c.SolrZkClient makePath: /clusterstate.json
   [junit4]   2> 968588 INFO  (TEST-LeaderFailoverAfterPartitionTest.test-seed#[8A464A899C1AE6CF]) [n:127.0.0.1:59056_    ] o.a.s.c.c.SolrZkClient makePath: /security.json
   [junit4]   2> 968590 INFO  (TEST-LeaderFailoverAfterPartitionTest.test-seed#[8A464A899C1AE6CF]) [n:127.0.0.1:59056_    ] o.a.s.c.c.ZkStateReader Updating cluster state from ZooKeeper... 
   [junit4]   2> 968591 INFO  (TEST-LeaderFailoverAfterPartitionTest.test-seed#[8A464A899C1AE6CF]) [n:127.0.0.1:59056_    ] o.a.s.c.c.ZkStateReader Loaded empty cluster properties
   [junit4]   2> 968592 INFO  (TEST-LeaderFailoverAfterPartitionTest.test-seed#[8A464A899C1AE6CF]) [n:127.0.0.1:59056_    ] o.a.s.c.c.ZkStateReader Updated live nodes from ZooKeeper... (0) -> (0)
   [junit4]   2> 968597 INFO  (TEST-LeaderFailoverAfterPartitionTest.test-seed#[8A464A899C1AE6CF]) [n:127.0.0.1:59056_    ] o.a.s.c.c.SolrZkClient makePath: /overseer_elect
   [junit4]   2> 968599 INFO  (TEST-LeaderFailoverAfterPartitionTest.test-seed#[8A464A899C1AE6CF]) [n:127.0.0.1:59056_    ] o.a.s.c.c.SolrZkClient makePath: /overseer_elect/election
   [junit4]   2> 968601 INFO  (TEST-LeaderFailoverAfterPartitionTest.test-seed#[8A464A899C1AE6CF]) [n:127.0.0.1:59056_    ] o.a.s.c.Overseer Overseer (id=null) closing
   [junit4]   2> 968602 INFO  (TEST-LeaderFailoverAfterPartitionTest.test-seed#[8A464A899C1AE6CF]) [n:127.0.0.1:59056_    ] o.a.s.c.LeaderElector Joined leadership election with path: /overseer_elect/election/96576780172656644-127.0.0.1:59056_-n_0000000000
   [junit4]   2> 968603 INFO  (TEST-LeaderFailoverAfterPartitionTest.test-seed#[8A464A899C1AE6CF]) [n:127.0.0.1:59056_    ] o.a.s.c.OverseerElectionContext I am going to be the leader 127.0.0.1:59056_
   [junit4]   2> 968603 INFO  (TEST-LeaderFailoverAfterPartitionTest.test-seed#[8A464A899C1AE6CF]) [n:127.0.0.1:59056_    ] o.a.s.c.c.SolrZkClient makePath: /overseer_elect/leader
   [junit4]   2> 968605 INFO  (TEST-LeaderFailoverAfterPartitionTest.test-seed#[8A464A899C1AE6CF]) [n:127.0.0.1:59056_    ] o.a.s.c.Overseer Overseer (id=96576780172656644-127.0.0.1:59056_-n_0000000000) starting
   [junit4]   2> 968607 INFO  (TEST-LeaderFailoverAfterPartitionTest.test-seed#[8A464A899C1AE6CF]) [n:127.0.0.1:59056_    ] o.a.s.c.c.SolrZkClient makePath: /overseer/queue-work
   [junit4]   2> 968614 INFO  (TEST-LeaderFailoverAfterPartitionTest.test-seed#[8A464A899C1AE6CF]) [n:127.0.0.1:59056_    ] o.a.s.c.OverseerAutoReplicaFailoverThread Starting OverseerAutoReplicaFailoverThread autoReplicaFailoverWorkLoopDelay=10000 autoReplicaFailoverWaitAfterExpiration=10000 autoReplicaFailoverBadNodeExpiration=60000
   [junit4]   2> 968615 INFO  (OverseerCollectionConfigSetProcessor-96576780172656644-127.0.0.1:59056_-n_0000000000) [n:127.0.0.1:59056_    ] o.a.s.c.OverseerTaskProcessor Process current queue of overseer operations
   [junit4]   2> 968616 INFO  (TEST-LeaderFailoverAfterPartitionTest.test-seed#[8A464A899C1AE6CF]) [n:127.0.0.1:59056_    ] o.a.s.c.ZkController Register node as live in ZooKeeper:/live_nodes/127.0.0.1:59056_
   [junit4]   2> 968616 INFO  (OverseerStateUpdate-96576780172656644-127.0.0.1:59056_-n_0000000000) [n:127.0.0.1:59056_    ] o.a.s.c.Overseer Starting to work on the main queue
   [junit4]   2> 968616 INFO  (TEST-LeaderFailoverAfterPartitionTest.test-seed#[8A464A899C1AE6CF]) [n:127.0.0.1:59056_    ] o.a.s.c.c.SolrZkClient makePath: /live_nodes/127.0.0.1:59056_
   [junit4]   2> 968618 INFO  (OverseerStateUpdate-96576780172656644-127.0.0.1:59056_-n_0000000000) [n:127.0.0.1:59056_    ] o.a.s.c.c.ZkStateReader Updated live nodes from ZooKeeper... (0) -> (0)
   [junit4]   2> 968618 INFO  (zkCallback-7047-thread-1-processing-n:127.0.0.1:59056_) [n:127.0.0.1:59056_    ] o.a.s.c.c.ZkStateReader A live node change: [WatchedEvent state:SyncConnected type:NodeChildrenChanged path:/live_nodes], has occurred - updating... (live nodes size: [0])
   [junit4]   2> 968619 INFO  (zkCallback-7047-thread-1-processing-n:127.0.0.1:59056_) [n:127.0.0.1:59056_    ] o.a.s.c.c.ZkStateReader Updated live nodes from ZooKeeper... (0) -> (1)
   [junit4]   2> 968635 INFO  (TEST-LeaderFailoverAfterPartitionTest.test-seed#[8A464A899C1AE6CF]) [n:127.0.0.1:59056_    ] o.a.s.c.CoreContainer Security conf doesn't exist. Skipping setup for authorization module.
   [junit4]   2> 968635 INFO  (TEST-LeaderFailoverAfterPartitionTest.test-seed#[8A464A899C1AE6CF]) [n:127.0.0.1:59056_    ] o.a.s.c.CoreContainer No authentication plugin used.
   [junit4]   2> 968636 INFO  (TEST-LeaderFailoverAfterPartitionTest.test-seed#[8A464A899C1AE6CF]) [n:127.0.0.1:59056_    ] o.a.s.c.CorePropertiesLocator Looking for core definitions underneath C:\Users\jenkins\workspace\Lucene-Solr-6.x-Windows\solr\build\solr-core\test\J1\temp\solr.cloud.LeaderFailoverAfterPartitionTest_8A464A899C1AE6CF-001\control-001\cores
   [junit4]   2> 968639 INFO  (TEST-LeaderFailoverAfterPartitionTest.test-seed#[8A464A899C1AE6CF]) [n:127.0.0.1:59056_    ] o.a.s.c.CoreDescriptor Created CoreDescriptor: {name=collection1, config=solrconfig.xml, transient=false, schema=schema.xml, loadOnStartup=true, configSetProperties=configsetprops.json, collection=control_collection, coreNodeName=, dataDir=data\, shard=}
   [junit4]   2> 968639 INFO  (TEST-LeaderFailoverAfterPartitionTest.test-seed#[8A464A899C1AE6CF]) [n:127.0.0.1:59056_    ] o.a.s.c.CorePropertiesLocator Found core collection1 in C:\Users\jenkins\workspace\Lucene-Solr-6.x-Windows\solr\build\solr-core\test\J1\temp\solr.cloud.LeaderFailoverAfterPartitionTest_8A464A899C1AE6CF-001\control-001\cores\collection1
   [junit4]   2> 968639 INFO  (TEST-LeaderFailoverAfterPartitionTest.test-seed#[8A464A899C1AE6CF]) [n:127.0.0.1:59056_    ] o.a.s.c.CorePropertiesLocator Found 1 core definitions
   [junit4]   2> 968640 INFO  (coreLoadExecutor-5069-thread-1-processing-n:127.0.0.1:59056_) [n:127.0.0.1:59056_ c:control_collection   x:collection1] o.a.s.c.ZkController publishing state=down
   [junit4]   2> 968640 INFO  (TEST-LeaderFailoverAfterPartitionTest.test-seed#[8A464A899C1AE6CF]) [n:127.0.0.1:59056_    ] o.a.s.s.SolrDispatchFilter user.dir=C:\Users\jenkins\workspace\Lucene-Solr-6.x-Windows\solr\build\solr-core\test\J1
   [junit4]   2> 968640 INFO  (TEST-LeaderFailoverAfterPartitionTest.test-seed#[8A464A899C1AE6CF]) [n:127.0.0.1:59056_    ] o.a.s.s.SolrDispatchFilter SolrDispatchFilter.init() done
   [junit4]   2> 968640 INFO  (coreLoadExecutor-5069-thread-1-processing-n:127.0.0.1:59056_) [n:127.0.0.1:59056_ c:control_collection   x:collection1] o.a.s.c.ZkController numShards not found on descriptor - reading it from system property
   [junit4]   2> 968641 INFO  (coreLoadExecutor-5069-thread-1-processing-n:127.0.0.1:59056_) [n:127.0.0.1:59056_ c:control_collection   x:collection1] o.a.s.c.ZkController Collection control_collection not visible yet, but flagging it so a watch is registered when it becomes visible
   [junit4]   2> 968642 INFO  (OverseerStateUpdate-96576780172656644-127.0.0.1:59056_-n_0000000000) [n:127.0.0.1:59056_    ] o.a.s.c.Overseer processMessage: queueSize: 1, message = {
   [junit4]   2>   "core":"collection1",
   [junit4]   2>   "roles":null,
   [junit4]   2>   "base_url":"http://127.0.0.1:59056",
   [junit4]   2>   "node_name":"127.0.0.1:59056_",
   [junit4]   2>   "numShards":"1",
   [junit4]   2>   "state":"down",
   [junit4]   2>   "shard":null,
   [junit4]   2>   "collection":"control_collection",
   [junit4]   2>   "operation":"state"} current state version: 0
   [junit4]   2> 968642 INFO  (OverseerStateUpdate-96576780172656644-127.0.0.1:59056_-n_0000000000) [n:127.0.0.1:59056_    ] o.a.s.c.o.ReplicaMutator Update state numShards=1 message={
   [junit4]   2>   "core":"collection1",
   [junit4]   2>   "roles":null,
   [junit4]   2>   "base_url":"http://127.0.0.1:59056",
   [junit4]   2>   "node_name":"127.0.0.1:59056_",
   [junit4]   2>   "numShards":"1",
   [junit4]   2>   "state":"down",
   [junit4]   2>   "shard":null,
   [junit4]   2>   "collection":"control_collection",
   [junit4]   2>   "operation":"state"}
   [junit4]   2> 968642 INFO  (coreLoadExecutor-5069-thread-1-processing-n:127.0.0.1:59056_) [n:127.0.0.1:59056_ c:control_collection   x:collection1] o.a.s.c.c.ZkStateReader Deleting data for [control_collection]
   [junit4]   2> 968643 INFO  (OverseerStateUpdate-96576780172656644-127.0.0.1:59056_-n_0000000000) [n:127.0.0.1:59056_    ] o.a.s.c.o.ClusterStateMutator building a new cName: control_collection
   [junit4]   2> 968643 INFO  (OverseerStateUpdate-96576780172656644-127.0.0.1:59056_-n_0000000000) [n:127.0.0.1:59056_    ] o.a.s.c.o.ReplicaMutator Assigning new node to shard shard=shard1
   [junit4]   2> 968644 INFO  (coreLoadExecutor-5069-thread-1-processing-n:127.0.0.1:59056_) [n:127.0.0.1:59056_ c:control_collection   x:collection1] o.a.s.c.ZkController look for our core node name
   [junit4]   2> 968645 INFO  (zkCallback-7047-thread-1-processing-n:127.0.0.1:59056_) [n:127.0.0.1:59056_    ] o.a.s.c.c.ZkStateReader A cluster state change: [WatchedEvent state:SyncConnected type:NodeDataChanged path:/clusterstate.json], has occurred - updating... (live nodes size: [1])
   [junit4]   2> 969645 INFO  (coreLoadExecutor-5069-thread-1-processing-n:127.0.0.1:59056_) [n:127.0.0.1:59056_ c:control_collection   x:collection1] o.a.s.c.ZkController waiting to find shard id in clusterstate for collection1
   [junit4]   2> 969646 INFO  (coreLoadExecutor-5069-thread-1-processing-n:127.0.0.1:59056_) [n:127.0.0.1:59056_ c:control_collection   x:collection1] o.a.s.c.ZkController Check for collection zkNode:control_collection
   [junit4]   2> 969646 INFO  (coreLoadExecutor-5069-thread-1-processing-n:127.0.0.1:59056_) [n:127.0.0.1:59056_ c:control_collection   x:collection1] o.a.s.c.ZkController Collection zkNode exists
   [junit4]   2> 969646 INFO  (coreLoadExecutor-5069-thread-1-processing-n:127.0.0.1:59056_) [n:127.0.0.1:59056_ c:control_collection   x:collection1] o.a.s.c.c.ZkStateReader Load collection config from: [/collections/control_collection]
   [junit4]   2> 969647 INFO  (coreLoadExecutor-5069-thread-1-processing-n:127.0.0.1:59056_) [n:127.0.0.1:59056_ c:control_collection   x:collection1] o.a.s.c.c.ZkStateReader path=[/collections/control_collection] [configName]=[conf1] specified config exists in ZooKeeper
   [junit4]   2> 969647 INFO  (coreLoadExecutor-5069-thread-1-processing-n:127.0.0.1:59056_) [n:127.0.0.1:59056_ c:control_collection   x:collection1] o.a.s.c.SolrResourceLoader new SolrResourceLoader for directory: 'C:\Users\jenkins\workspace\Lucene-Solr-6.x-Windows\solr\build\solr-core\test\J1\temp\solr.cloud.LeaderFailoverAfterPartitionTest_8A464A899C1AE6CF-001\control-001\cores\collection1'
   [junit4]   2> 969647 INFO  (coreLoadExecutor-5069-thread-1-processing-n:127.0.0.1:59056_) [n:127.0.0.1:59056_ c:control_collection   x:collection1] o.a.s.c.SolrResourceLoader JNDI not configured for solr (NoInitialContextEx)
   [junit4]   2> 969647 INFO  (coreLoadExecutor-5069-thread-1-processing-n:127.0.0.1:59056_) [n:127.0.0.1:59056_ c:control_collection   x:collection1] o.a.s.c.SolrResourceLoader solr home defaulted to 'solr/' (could not find system property or JNDI)
   [junit4]   2> 969650 INFO  (coreLoadExecutor-5069-thread-1-processing-n:127.0.0.1:59056_) [n:127.0.0.1:59056_ c:control_collection   x:collection1] o.a.s.c.Config loaded config solrconfig.xml with version 0 
   [junit4]   2> 969658 INFO  (coreLoadExecutor-5069-thread-1-processing-n:127.0.0.1:59056_) [n:127.0.0.1:59056_ c:control_collection   x:collection1] o.a.s.c.SolrConfig current version of requestparams : -1
   [junit4]   2> 969661 INFO  (coreLoadExecutor-5069-thread-1-processing-n:127.0.0.1:59056_) [n:127.0.0.1:59056_ c:control_collection   x:collection1] o.a.s.c.SolrConfig Using Lucene MatchVersion: 6.3.0
   [junit4]   2> 969667 INFO  (coreLoadExecutor-5069-thread-1-processing-n:127.0.0.1:59056_) [n:127.0.0.1:59056_ c:control_collection   x:collection1] o.a.s.c.SolrConfig Loaded SolrConfig: solrconfig.xml
   [junit4]   2> 969674 INFO  (coreLoadExecutor-5069-thread-1-processing-n:127.0.0.1:59056_) [n:127.0.0.1:59056_ c:control_collection   x:collection1] o.a.s.s.IndexSchema [collection1] Schema name=test
   [junit4]   2> 969775 INFO  (coreLoadExecutor-5069-thread-1-processing-n:127.0.0.1:59056_) [n:127.0.0.1:59056_ c:control_collection   x:collection1] o.a.s.s.OpenExchangeRatesOrgProvider Initialized with rates=open-exchange-rates.json, refreshInterval=1440.
   [junit4]   2> 969787 INFO  (coreLoadExecutor-5069-thread-1-processing-n:127.0.0.1:59056_) [n:127.0.0.1:59056_ c:control_collection   x:collection1] o.a.s.s.IndexSchema default search field in schema is text
   [junit4]   2> 969790 INFO  (coreLoadExecutor-5069-thread-1-processing-n:127.0.0.1:59056_) [n:127.0.0.1:59056_ c:control_collection   x:collection1] o.a.s.s.IndexSchema unique key field: id
   [junit4]   2> 969799 INFO  (coreLoadExecutor-5069-thread-1-processing-n:127.0.0.1:59056_) [n:127.0.0.1:59056_ c:control_collection   x:collection1] o.a.s.s.FileExchangeRateProvider Reloading exchange rates from file currency.xml
   [junit4]   2> 969802 INFO  (coreLoadExecutor-5069-thread-1-processing-n:127.0.0.1:59056_) [n:127.0.0.1:59056_ c:control_collection   x:collection1] o.a.s.s.FileExchangeRateProvider Reloading exchange rates from file currency.xml
   [junit4]   2> 969805 INFO  (coreLoadExecutor-5069-thread-1-processing-n:127.0.0.1:59056_) [n:127.0.0.1:59056_ c:control_collection   x:collection1] o.a.s.s.OpenExchangeRatesOrgProvider Reloading exchange rates from open-exchange-rates.json
   [junit4]   2> 969806 INFO  (coreLoadExecutor-5069-thread-1-processing-n:127.0.0.1:59056_) [n:127.0.0.1:59056_ c:control_collection   x:collection1] o.a.s.s.OpenExchangeRatesOrgProvider Reloading exchange rates from open-exchange-rates.json
   [junit4]   2> 969810 INFO  (coreLoadExecutor-5069-thread-1-processing-n:127.0.0.1:59056_) [n:127.0.0.1:59056_ c:control_collection   x:collection1] o.a.s.c.ConfigSetProperties Did not find ConfigSet properties, assuming default properties: Can't find resource 'configsetprops.json' in classpath or '/configs/conf1', cwd=C:\Users\jenkins\workspace\Lucene-Solr-6.x-Windows\solr\build\solr-core\test\J1
   [junit4]   2> 969810 INFO  (coreLoadExecutor-5069-thread-1-processing-n:127.0.0.1:59056_) [n:127.0.0.1:59056_ c:control_collection   x:collection1] o.a.s.c.CoreContainer Creating SolrCore 'collection1' using configuration from collection control_collection
   [junit4]   2> 969810 INFO  (coreLoadExecutor-5069-thread-1-processing-n:127.0.0.1:59056_) [n:127.0.0.1:59056_ c:control_collection s:shard1 r:core_node1 x:collection1] o.a.s.c.SolrCore org.apache.solr.core.MockDirectoryFactory
   [junit4]   2> 969810 INFO  (coreLoadExecutor-5069-thread-1-processing-n:127.0.0.1:59056_) [n:127.0.0.1:59056_ c:control_collection s:shard1 r:core_node1 x:collection1] o.a.s.c.SolrCore [[collection1] ] Opening new SolrCore at [C:\Users\jenkins\workspace\Lucene-Solr-6.x-Windows\solr\build\solr-core\test\J1\temp\solr.cloud.LeaderFailoverAfterPartitionTest_8A464A899C1AE6CF-001\control-001\cores\collection1], dataDir=[C:\Users\jenkins\workspace\Lucene-Solr-6.x-Windows\solr\build\solr-core\test\J1\temp\solr.cloud.LeaderFailoverAfterPartitionTest_8A464A899C1AE6CF-001\control-001\cores\collection1\data\]
   [junit4]   2> 969810 INFO  (coreLoadExecutor-5069-thread-1-processing-n:127.0.0.1:59056_) [n:127.0.0.1:59056_ c:control_collection s:shard1 r:core_node1 x:collection1] o.a.s.c.JmxMonitoredMap JMX monitoring is enabled. Adding Solr mbeans to JMX Server: com.sun.jmx.mbeanserver.JmxMBeanServer@1c71312
   [junit4]   2> 969811 INFO  (coreLoadExecutor-5069-thread-1-processing-n:127.0.0.1:59056_) [n:127.0.0.1:59056_ c:control_collection s:shard1 r:core_node1 x:collection1] o.a.s.c.CachingDirectoryFactory return new directory for C:\Users\jenkins\workspace\Lucene-Solr-6.x-Windows\solr\build\solr-core\test\J1\temp\solr.cloud.LeaderFailoverAfterPartitionTest_8A464A899C1AE6CF-001\control-001\cores\collection1\data\snapshot_metadata
   [junit4]   2> 969811 INFO  (coreLoadExecutor-5069-thread-1-processing-n:127.0.0.1:59056_) [n:127.0.0.1:59056_ c:control_collection s:shard1 r:core_node1 x:collection1] o.a.s.c.s.SolrSnapshotMetaDataManager Loading from snapshot metadata file...
   [junit4]   2> 969811 INFO  (coreLoadExecutor-5069-thread-1-processing-n:127.0.0.1:59056_) [n:127.0.0.1:59056_ c:control_collection s:shard1 r:core_node1 x:collection1] o.a.s.c.CachingDirectoryFactory return new directory for C:\Users\jenkins\workspace\Lucene-Solr-6.x-Windows\solr\build\solr-core\test\J1\temp\solr.cloud.LeaderFailoverAfterPartitionTest_8A464A899C1AE6CF-001\control-001\cores\collection1\data\
   [junit4]   2> 969811 INFO  (coreLoadExecutor-5069-thread-1-processing-n:127.0.0.1:59056_) [n:127.0.0.1:59056_ c:control_collection s:shard1 r:core_node1 x:collection1] o.a.s.c.SolrCore New index directory detected: old=null new=C:\Users\jenkins\workspace\Lucene-Solr-6.x-Windows\solr\build\solr-core\test\J1\temp\solr.cloud.LeaderFailoverAfterPartitionTest_8A464A899C1AE6CF-001\control-001\cores\collection1\data\index/
   [junit4]   2> 969811 WARN  (coreLoadExecutor-5069-thread-1-processing-n:127.0.0.1:59056_) [n:127.0.0.1:59056_ c:control_collection s:shard1 r:core_node1 x:collection1] o.a.s.c.SolrCore [collection1] Solr index directory 'C:\Users\jenkins\workspace\Lucene-Solr-6.x-Windows\solr\build\solr-core\test\J1\temp\solr.cloud.LeaderFailoverAfterPartitionTest_8A464A899C1AE6CF-001\control-001\cores\collection1\data\index' doesn't exist. Creating new index...
   [junit4]   2> 969811 INFO  (coreLoadExecutor-5069-thread-1-processing-n:127.0.0.1:59056_) [n:127.0.0.1:59056_ c:control_collection s:shard1 r:core_node1 x:collection1] o.a.s.c.CachingDirectoryFactory return new directory for C:\Users\jenkins\workspace\Lucene-Solr-6.x-Windows\solr\build\solr-core\test\J1\temp\solr.cloud.LeaderFailoverAfterPartitionTest_8A464A899C1AE6CF-001\control-001\cores\collection1\data\index
   [junit4]   2> 969812 INFO  (coreLoadExecutor-5069-thread-1-processing-n:127.0.0.1:59056_) [n:127.0.0.1:59056_ c:control_collection s:shard1 r:core_node1 x:collection1] o.a.s.u.RandomMergePolicy RandomMergePolicy wrapping class org.apache.lucene.index.TieredMergePolicy: [TieredMergePolicy: maxMergeAtOnce=37, maxMergeAtOnceExplicit=49, maxMergedSegmentMB=99.4775390625, floorSegmentMB=0.9833984375, forceMergeDeletesPctAllowed=13.687384773950082, segmentsPerTier=12.0, maxCFSSegmentSizeMB=8.796093022207999E12, noCFSRatio=0.32728109702151126
   [junit4]   2> 969812 INFO  (coreLoadExecutor-5069-thread-1-processing-n:127.0.0.1:59056_) [n:127.0.0.1:59056_ c:control_collection s:shard1 r:core_node1 x:collection1] o.a.s.c.SolrDeletionPolicy SolrDeletionPolicy.onCommit: commits: num=1
   [junit4]   2> 	commit{dir=MockDirectoryWrapper(RAMDirectory@1012f8b lockFactory=org.apache.lucene.store.SingleInstanceLockFactory@36f396),segFN=segments_1,generation=1}
   [junit4]   2> 969812 INFO  (coreLoadExecutor-5069-thread-1-processing-n:127.0.0.1:59056_) [n:127.0.0.1:59056_ c:control_collection s:shard1 r:core_node1 x:collection1] o.a.s.c.SolrDeletionPolicy newest commit generation = 1
   [junit4]   2> 969813 INFO  (OldIndexDirectoryCleanupThreadForCore-collection1) [n:127.0.0.1:59056_ c:control_collection s:shard1 r:core_node1 x:collection1] o.a.s.c.SolrCore Looking for old index directories to cleanup for core collection1 in C:\Users\jenkins\workspace\Lucene-Solr-6.x-Windows\solr\build\solr-core\test\J1\temp\solr.cloud.LeaderFailoverAfterPartitionTest_8A464A899C1AE6CF-001\control-001\cores\collection1\data\
   [junit4]   2> 969814 WARN  (OldIndexDirectoryCleanupThreadForCore-collection1) [n:127.0.0.1:59056_ c:control_collection s:shard1 r:core_node1 x:collection1] o.a.s.c.DirectoryFactory C:\Users\jenkins\workspace\Lucene-Solr-6.x-Windows\solr\build\solr-core\test\J1\temp\solr.cloud.LeaderFailoverAfterPartitionTest_8A464A899C1AE6CF-001\control-001\cores\collection1\data\ does not point to a valid data directory; skipping clean-up of old index directories.
   [junit4]   2> 969815 INFO  (coreLoadExecutor-5069-thread-1-processing-n:127.0.0.1:59056_) [n:127.0.0.1:59056_ c:control_collection s:shard1 r:core_node1 x:collection1] o.a.s.u.p.UpdateRequestProcessorChain creating updateRequestProcessorChain "nodistrib"
   [junit4]   2> 969815 INFO  (coreLoadExecutor-5069-thread-1-processing-n:127.0.0.1:59056_) [n:127.0.0.1:59056_ c:control_collection s:shard1 r:core_node1 x:collection1] o.a.s.u.p.UpdateRequestProcessorChain creating updateRequestProcessorChain "dedupe"
   [junit4]   2> 969815 INFO  (coreLoadExecutor-5069-thread-1-processing-n:127.0.0.1:59056_) [n:127.0.0.1:59056_ c:control_collection s:shard1 r:core_node1 x:collection1] o.a.s.u.p.UpdateRequestProcessorChain inserting DistributedUpdateProcessorFactory into updateRequestProcessorChain "dedupe"
   [junit4]   2> 969815 INFO  (coreLoadExecutor-5069-thread-1-processing-n:127.0.0.1:59056_) [n:127.0.0.1:59056_ c:control_collection s:shard1 r:core_node1 x:collection1] o.a.s.u.p.UpdateRequestProcessorChain creating updateRequestProcessorChain "stored_sig"
   [junit4]   2> 969815 INFO  (coreLoadExecutor-5069-thread-1-processing-n:127.0.0.1:59056_) [n:127.0.0.1:59056_ c:control_collection s:shard1 r:core_node1 x:collection1] o.a.s.u.p.UpdateRequestProcessorChain inserting DistributedUpdateProcessorFactory into updateRequestProcessorChain "stored_sig"
   [junit4]   2> 969815 INFO  (coreLoadExecutor-5069-thread-1-processing-n:127.0.0.1:59056_) [n:127.0.0.1:59056_ c:control_collection s:shard1 r:core_node1 x:collection1] o.a.s.u.p.UpdateRequestProcessorChain creating updateRequestProcessorChain "distrib-dup-test-chain-explicit"
   [junit4]   2> 969816 INFO  (coreLoadExecutor-5069-thread-1-processing-n:127.0.0.1:59056_) [n:127.0.0.1:59056_ c:control_collection s:shard1 r:core_node1 x:collection1] o.a.s.u.p.UpdateRequestProcessorChain creating updateRequestProcessorChain "distrib-dup-test-chain-implicit"
   [junit4]   2> 969816 INFO  (coreLoadExecutor-5069-thread-1-processing-n:127.0.0.1:59056_) [n:127.0.0.1:59056_ c:control_collection s:shard1 r:core_node1 x:collection1] o.a.s.u.p.UpdateRequestProcessorChain inserting DistributedUpdateProcessorFactory into updateRequestProcessorChain "distrib-dup-test-chain-implicit"
   [junit4]   2> 969816 INFO  (coreLoadExecutor-5069-thread-1-processing-n:127.0.0.1:59056_) [n:127.0.0.1:59056_ c:control_collection s:shard1 r:core_node1 x:collection1] o.a.s.c.SolrCore no updateRequestProcessorChain defined as default, creating implicit default
   [junit4]   2> 969816 WARN  (coreLoadExecutor-5069-thread-1-processing-n:127.0.0.1:59056_) [n:127.0.0.1:59056_ c:control_collection s:shard1 r:core_node1 x:collection1] o.a.s.c.RequestHandlers INVALID paramSet a in requestHandler {type = requestHandler,name = /dump,class = DumpRequestHandler,args = {defaults={a=A,b=B}}}
   [junit4]   2> 969821 INFO  (coreLoadExecutor-5069-thread-1-processing-n:127.0.0.1:59056_) [n:127.0.0.1:59056_ c:control_collection s:shard1 r:core_node1 x:collection1] o.a.s.h.l.XMLLoader xsltCacheLifetimeSeconds=60
   [junit4]   2> 969822 INFO  (coreLoadExecutor-5069-thread-1-processing-n:127.0.0.1:59056_) [n:127.0.0.1:59056_ c:control_collection s:shard1 r:core_node1 x:collection1] o.a.s.h.l.XMLLoader xsltCacheLifetimeSeconds=60
   [junit4]   2> 969823 INFO  (coreLoadExecutor-5069-thread-1-processing-n:127.0.0.1:59056_) [n:127.0.0.1:59056_ c:control_collection s:shard1 r:core_node1 x:collection1] o.a.s.h.l.XMLLoader xsltCacheLifetimeSeconds=60
   [junit4]   2> 969824 INFO  (coreLoadExecutor-5069-thread-1-processing-n:127.0.0.1:59056_) [n:127.0.0.1:59056_ c:control_collection s:shard1 r:core_node1 x:collection1] o.a.s.h.l.XMLLoader xsltCacheLifetimeSeconds=60
   [junit4]   2> 969827 INFO  (coreLoadExecutor-5069-thread-1-processing-n:127.0.0.1:59056_) [n:127.0.0.1:59056_ c:control_collection s:shard1 r:core_node1 x:collection1] o.a.s.c.RequestHandlers Registered paths: /admin/mbeans,standard,/update/json/docs,/admin/luke,/export,/get,/admin/properties,/update/json,/admin/threads,/dump,/update/csv,/sql,/graph,/admin/segments,/admin/system,/replication,/config,/stream,/schema,/admin/plugins,/admin/logging,/admin/ping,/update,/admin/file,/terms
   [junit4]   2> 969827 INFO  (coreLoadExecutor-5069-thread-1-processing-n:127.0.0.1:59056_) [n:127.0.0.1:59056_ c:control_collection s:shard1 r:core_node1 x:collection1] o.a.s.c.SolrCore Using default statsCache cache: org.apache.solr.search.stats.LocalStatsCache
   [junit4]   2> 969828 INFO  (coreLoadExecutor-5069-thread-1-processing-n:127.0.0.1:59056_) [n:127.0.0.1:59056_ c:control_collection s:shard1 r:core_node1 x:collection1] o.a.s.u.UpdateHandler Using UpdateLog implementation: org.apache.solr.update.UpdateLog
   [junit4]   2> 969828 INFO  (coreLoadExecutor-5069-thread-1-processing-n:127.0.0.1:59056_) [n:127.0.0.1:59056_ c:control_collection s:shard1 r:core_node1 x:collection1] o.a.s.u.UpdateLog Initializing UpdateLog: dataDir= defaultSyncLevel=FLUSH numRecordsToKeep=100 maxNumLogsToKeep=10 numVersionBuckets=65536
   [junit4]   2> 969829 INFO  (coreLoadExecutor-5069-thread-1-processing-n:127.0.0.1:59056_) [n:127.0.0.1:59056_ c:control_collection s:shard1 r:core_node1 x:collection1] o.a.s.u.CommitTracker Hard AutoCommit: disabled
   [junit4]   2> 969829 INFO  (coreLoadExecutor-5069-thread-1-processing-n:127.0.0.1:59056_) [n:127.0.0.1:59056_ c:control_collection s:shard1 r:core_node1 x:collection1] o.a.s.u.CommitTracker Soft AutoCommit: disabled
   [junit4]   2> 969829 INFO  (coreLoadExecutor-5069-thread-1-processing-n:127.0.0.1:59056_) [n:127.0.0.1:59056_ c:control_collection s:shard1 r:core_node1 x:collection1] o.a.s.u.RandomMergePolicy RandomMergePolicy wrapping class org.apache.lucene.index.TieredMergePolicy: [TieredMergePolicy: maxMergeAtOnce=30, maxMergeAtOnceExplicit=38, maxMergedSegmentMB=90.771484375, floorSegmentMB=2.185546875, forceMergeDeletesPctAllowed=19.682222861166327, segmentsPerTier=49.0, maxCFSSegmentSizeMB=8.796093022207999E12, noCFSRatio=0.0
   [junit4]   2> 969829 INFO  (coreLoadExecutor-5069-thread-1-processing-n:127.0.0.1:59056_) [n:127.0.0.1:59056_ c:control_collection s:shard1 r:core_node1 x:collection1] o.a.s.c.SolrDeletionPolicy SolrDeletionPolicy.onInit: commits: num=1
   [junit4]   2> 	commit{dir=MockDirectoryWrapper(RAMDirectory@1012f8b lockFactory=org.apache.lucene.store.SingleInstanceLockFactory@36f396),segFN=segments_1,generation=1}
   [junit4]   2> 969829 INFO  (coreLoadExecutor-5069-thread-1-processing-n:127.0.0.1:59056_) [n:127.0.0.1:59056_ c:control_collection s:shard1 r:core_node1 x:collection1] o.a.s.c.SolrDeletionPolicy newest commit generation = 1
   [junit4]   2> 969830 INFO  (coreLoadExecutor-5069-thread-1-processing-n:127.0.0.1:59056_) [n:127.0.0.1:59056_ c:control_collection s:shard1 r:core_node1 x:collection1] o.a.s.s.SolrIndexSearcher Opening [Searcher@1538576[collection1] main]
   [junit4]   2> 969830 INFO  (coreLoadExecutor-5069-thread-1-processing-n:127.0.0.1:59056_) [n:127.0.0.1:59056_ c:control_collection s:shard1 r:core_node1 x:collection1] o.a.s.c.c.ZkStateReader Load collection config from: [/collections/control_collection]
   [junit4]   2> 969831 INFO  (coreLoadExecutor-5069-thread-1-processing-n:127.0.0.1:59056_) [n:127.0.0.1:59056_ c:control_collection s:shard1 r:core_node1 x:collection1] o.a.s.c.c.ZkStateReader path=[/collections/control_collection] [configName]=[conf1] specified config exists in ZooKeeper
   [junit4]   2> 969831 INFO  (coreLoadExecutor-5069-thread-1-processing-n:127.0.0.1:59056_) [n:127.0.0.1:59056_ c:control_collection s:shard1 r:core_node1 x:collection1] o.a.s.r.ManagedResourceStorage Setting up ZooKeeper-based storage for the RestManager with znodeBase: /configs/conf1
   [junit4]   2> 969831 INFO  (coreLoadExecutor-5069-thread-1-processing-n:127.0.0.1:59056_) [n:127.0.0.1:59056_ c:control_collection s:shard1 r:core_node1 x:collection1] o.a.s.r.ManagedResourceStorage Configured ZooKeeperStorageIO with znodeBase: /configs/conf1
   [junit4]   2> 969831 INFO  (coreLoadExecutor-5069-thread-1-processing-n:127.0.0.1:59056_) [n:127.0.0.1:59056_ c:control_collection s:shard1 r:core_node1 x:collection1] o.a.s.r.RestManager Initializing RestManager with initArgs: {}
   [junit4]   2> 969831 INFO  (coreLoadExecutor-5069-thread-1-processing-n:127.0.0.1:59056_) [n:127.0.0.1:59056_ c:control_collection s:shard1 r:core_node1 x:collection1] o.a.s.r.ManagedResourceStorage Reading _rest_managed.json using ZooKeeperStorageIO:path=/configs/conf1
   [junit4]   2> 969832 INFO  (coreLoadExecutor-5069-thread-1-processing-n:127.0.0.1:59056_) [n:127.0.0.1:59056_ c:control_collection s:shard1 r:core_node1 x:collection1] o.a.s.r.ManagedResourceStorage No data found for znode /configs/conf1/_rest_managed.json
   [junit4]   2> 969832 INFO  (coreLoadExecutor-5069-thread-1-processing-n:127.0.0.1:59056_) [n:127.0.0.1:59056_ c:control_collection s:shard1 r:core_node1 x:collection1] o.a.s.r.ManagedResourceStorage Loaded null at path _rest_managed.json using ZooKeeperStorageIO:path=/configs/conf1
   [junit4]   2> 969832 INFO  (coreLoadExecutor-5069-thread-1-processing-n:127.0.0.1:59056_) [n:127.0.0.1:59056_ c:control_collection s:shard1 r:core_node1 x:collection1] o.a.s.r.RestManager Initializing 0 registered ManagedResources
   [junit4]   2> 969832 INFO  (coreLoadExecutor-5069-thread-1-processing-n:127.0.0.1:59056_) [n:127.0.0.1:59056_ c:control_collection s:shard1 r:core_node1 x:collection1] o.a.s.h.ReplicationHandler Commits will be reserved for  10000
   [junit4]   2> 969832 INFO  (searcherExecutor-5070-thread-1-processing-n:127.0.0.1:59056_ x:collection1 s:shard1 c:control_collection r:core_node1) [n:127.0.0.1:59056_ c:control_collection s:shard1 r:core_node1 x:collection1] o.a.s.c.SolrCore [collection1] Registered new searcher Searcher@1538576[collection1] main{ExitableDirectoryReader(UninvertingDirectoryReader())}
   [junit4]   2> 969833 INFO  (coreLoadExecutor-5069-thread-1-processing-n:127.0.0.1:59056_) [n:127.0.0.1:59056_ c:control_collection s:shard1 r:core_node1 x:collection1] o.a.s.u.UpdateLog Looking up max value of version field to seed version buckets
   [junit4]   2> 969833 INFO  (coreLoadExecutor-5069-thread-1-processing-n:127.0.0.1:59056_) [n:127.0.0.1:59056_ c:control_collection s:shard1 r:core_node1 x:collection1] o.a.s.u.VersionInfo Refreshing highest value of _version_ for 65536 version buckets from index
   [junit4]   2> 969833 INFO  (coreLoadExecutor-5069-thread-1-processing-n:127.0.0.1:59056_) [n:127.0.0.1:59056_ c:control_collection s:shard1 r:core_node1 x:collection1] o.a.s.u.VersionInfo No terms found for _version_, cannot seed version bucket highest value from index
   [junit4]   2> 969833 INFO  (coreLoadExecutor-5069-thread-1-processing-n:127.0.0.1:59056_) [n:127.0.0.1:59056_ c:control_collection s:shard1 r:core_node1 x:collection1] o.a.s.u.UpdateLog Could not find max version in index or recent updates, using new clock 1545228484937252864
   [junit4]   2> 969834 INFO  (coreLoadExecutor-5069-thread-1-processing-n:127.0.0.1:59056_) [n:127.0.0.1:59056_ c:control_collection s:shard1 r:core_node1 x:collection1] o.a.s.u.UpdateLog Took 1.0ms to seed version buckets with highest version 1545228484937252864
   [junit4]   2> 969834 INFO  (coreLoadExecutor-5069-thread-1-processing-n:127.0.0.1:59056_) [n:127.0.0.1:59056_ c:control_collection s:shard1 r:core_node1 x:collection1] o.a.s.c.ZkController watch zkdir /configs/conf1
   [junit4]   2> 969835 INFO  (coreLoadExecutor-5069-thread-1-processing-n:127.0.0.1:59056_) [n:127.0.0.1:59056_ c:control_collection s:shard1 r:core_node1 x:collection1] o.a.s.c.CoreContainer registering core: collection1
   [junit4]   2> 969836 INFO  (coreZkRegister-5062-thread-1-processing-n:127.0.0.1:59056_ x:collection1 s:shard1 c:control_collection r:core_node1) [n:127.0.0.1:59056_ c:control_collection s:shard1 r:core_node1 x:collection1] o.a.s.c.ZkController Register replica - core:collection1 address:http://127.0.0.1:59056 collection:control_collection shard:shard1
   [junit4]   2> 969837 INFO  (coreZkRegister-5062-thread-1-processing-n:127.0.0.1:59056_ x:collection1 s:shard1 c:control_collection r:core_node1) [n:127.0.0.1:59056_ c:control_collection s:shard1 r:core_node1 x:collection1] o.a.s.c.c.SolrZkClient makePath: /collections/control_collection/leader_elect/shard1/election
   [junit4]   2> 969840 INFO  (coreZkRegister-5062-thread-1-processing-n:127.0.0.1:59056_ x:collection1 s:shard1 c:control_collection r:core_node1) [n:127.0.0.1:59056_ c:control_collection s:shard1 r:core_node1 x:collection1] o.a.s.c.LeaderElector Joined leadership election with path: /collections/control_collection/leader_elect/shard1/election/96576780172656644-core_node1-n_0000000000
   [junit4]   2> 969841 INFO  (coreZkRegister-5062-thread-1-processing-n:127.0.0.1:59056_ x:collection1 s:shard1 c:control_collection r:core_node1) [n:127.0.0.1:59056_ c:control_collection s:shard1 r:core_node1 x:collection1] o.a.s.c.ShardLeaderElectionContext Running the leader process for shard=shard1 and weAreReplacement=false and leaderVoteWait=10000
   [junit4]   2> 969843 INFO  (coreZkRegister-5062-thread-1-processing-n:127.0.0.1:59056_ x:collection1 s:shard1 c:control_collection r:core_node1) [n:127.0.0.1:59056_ c:control_collection s:shard1 r:core_node1 x:collection1] o.a.s.c.ShardLeaderElectionContext Enough replicas found to continue.
   [junit4]   2> 969843 INFO  (coreZkRegister-5062-thread-1-processing-n:127.0.0.1:59056_ x:collection1 s:shard1 c:control_collection r:core_node1) [n:127.0.0.1:59056_ c:control_collection s:shard1 r:core_node1 x:collection1] o.a.s.c.ShardLeaderElectionContext I may be the new leader - try and sync
   [junit4]   2> 969843 INFO  (coreZkRegister-5062-thread-1-processing-n:127.0.0.1:59056_ x:collection1 s:shard1 c:control_collection r:core_node1) [n:127.0.0.1:59056_ c:control_collection s:shard1 r:core_node1 x:collection1] o.a.s.c.SyncStrategy Sync replicas to http://127.0.0.1:59056/collection1/
   [junit4]   2> 969843 INFO  (OverseerStateUpdate-96576780172656644-127.0.0.1:59056_-n_0000000000) [n:127.0.0.1:59056_    ] o.a.s.c.Overseer processMessage: queueSize: 1, message = {
   [junit4]   2>   "operation":"leader",
   [junit4]   2>   "shard":"shard1",
   [junit4]   2>   "collection":"control_collection"} current state version: 1
   [junit4]   2> 969843 INFO  (coreZkRegister-5062-thread-1-processing-n:127.0.0.1:59056_ x:collection1 s:shard1 c:control_collection r:core_node1) [n:127.0.0.1:59056_ c:control_collection s:shard1 r:core_node1 x:collection1] o.a.s.c.SyncStrategy Sync Success - now sync replicas to me
   [junit4]   2> 969843 INFO  (coreZkRegister-5062-thread-1-processing-n:127.0.0.1:59056_ x:collection1 s:shard1 c:control_collection r:core_node1) [n:127.0.0.1:59056_ c:control_collection s:shard1 r:core_node1 x:collection1] o.a.s.c.SyncStrategy http://127.0.0.1:59056/collection1/ has no replicas
   [junit4]   2> 969844 INFO  (coreZkRegister-5062-thread-1-processing-n:127.0.0.1:59056_ x:collection1 s:shard1 c:control_collection r:core_node1) [n:127.0.0.1:59056_ c:control_collection s:shard1 r:core_node1 x:collection1] o.a.s.c.c.SolrZkClient makePath: /collections/control_collection/leaders/shard1
   [junit4]   2> 969847 INFO  (coreZkRegister-5062-thread-1-processing-n:127.0.0.1:59056_ x:collection1 s:shard1 c:control_collection r:core_node1) [n:127.0.0.1:59056_ c:control_collection s:shard1 r:core_node1 x:collection1] o.a.s.c.ShardLeaderElectionContextBase Creating leader registration node /collections/control_collection/leaders/shard1/leader after winning as /collections/control_collection/leader_elect/shard1/election/96576780172656644-core_node1-n_0000000000
   [junit4]   2> 969849 INFO  (coreZkRegister-5062-thread-1-processing-n:127.0.0.1:59056_ x:collection1 s:shard1 c:control_collection r:core_node1) [n:127.0.0.1:59056_ c:control_collection s:shard1 r:core_node1 x:collection1] o.a.s.c.ShardLeaderElectionContext I am the new leader: http://127.0.0.1:59056/collection1/ shard1
   [junit4]   2> 969850 INFO  (OverseerStateUpdate-96576780172656644-127.0.0.1:59056_-n_0000000000) [n:127.0.0.1:59056_    ] o.a.s.c.Overseer processMessage: queueSize: 1, message = {
   [junit4]   2>   "operation":"leader",
   [junit4]   2>   "shard":"shard1",
   [junit4]   2>   "collection":"control_collection",
   [junit4]   2>   "base_url":"http://127.0.0.1:59056",
   [junit4]   2>   "core":"collection1",
   [junit4]   2>   "state":"active"} current state version: 1
   [junit4]   2> 969952 INFO  (zkCallback-7047-thread-1-processing-n:127.0.0.1:59056_) [n:127.0.0.1:59056_    ] o.a.s.c.c.ZkStateReader A cluster state change: [WatchedEvent state:SyncConnected type:NodeDataChanged path:/clusterstate.json], has occurred - updating... (live nodes size: [1])
   [junit4]   2> 970002 INFO  (coreZkRegister-5062-thread-1-processing-n:127.0.0.1:59056_ x:collection1 s:shard1 c:control_collection r:core_node1) [n:127.0.0.1:59056_ c:control_collection s:shard1 r:core_node1 x:collection1] o.a.s.c.ZkController We are http://127.0.0.1:59056/collection1/ and leader is http://127.0.0.1:59056/collection1/
   [junit4]   2> 970002 INFO  (coreZkRegister-5062-thread-1-processing-n:127.0.0.1:59056_ x:collection1 s:shard1 c:control_collection r:core_node1) [n:127.0.0.1:59056_ c:control_collection s:shard1 r:core_node1 x:collection1] o.a.s.c.ZkController No LogReplay needed for core=collection1 baseURL=http://127.0.0.1:59056
   [junit4]   2> 970002 INFO  (coreZkRegister-5062-thread-1-processing-n:127.0.0.1:59056_ x:collection1 s:shard1 c:control_collection r:core_node1) [n:127.0.0.1:59056_ c:control_collection s:shard1 r:core_node1 x:collection1] o.a.s.c.ZkController I am the leader, no recovery necessary
   [junit4]   2> 970002 INFO  (coreZkRegister-5062-thread-1-processing-n:127.0.0.1:59056_ x:collection1 s:shard1 c:control_collection r:core_node1) [n:127.0.0.1:59056_ c:control_collection s:shard1 r:core_node1 x:collection1] o.a.s.c.ZkController publishing state=active
   [junit4]   2> 970002 INFO  (coreZkRegister-5062-thread-1-processing-n:127.0.0.1:59056_ x:collection1 s:shard1 c:control_collection r:core_node1) [n:127.0.0.1:59056_ c:control_collection s:shard1 r:core_node1 x:collection1] o.a.s.c.ZkController numShards not found on descriptor - reading it from system property
   [junit4]   2> 970003 INFO  (coreZkRegister-5062-thread-1-processing-n:127.0.0.1:59056_ x:collection1 s:shard1 c:control_collection r:core_node1) [n:127.0.0.1:59056_ c:control_collection s:shard1 r:core_node1 x:collection1] o.a.s.c.c.ZkStateReader Checking legacy cluster state for collection control_collection
   [junit4]   2> 970004 INFO  (OverseerStateUpdate-96576780172656644-127.0.0.1:59056_-n_0000000000) [n:127.0.0.1:59056_    ] o.a.s.c.Overseer processMessage: queueSize: 1, message = {
   [junit4]   2>   "core":"collection1",
   [junit4]   2>   "core_node_name":"core_node1",
   [junit4]   2>   "roles":null,
   [junit4]   2>   "base_url":"http://127.0.0.1:59056",
   [junit4]   2>   "node_name":"127.0.0.1:59056_",
   [junit4]   2>   "numShards":"1",
   [junit4]   2>   "state":"active",
   [junit4]   2>   "shard":"shard1",
   [junit4]   2>   "collection":"control_collection",
   [junit4]   2>   "operation":"state"} current state version: 2
   [junit4]   2> 970004 INFO  (OverseerStateUpdate-96576780172656644-127.0.0.1:59056_-n_0000000000) [n:127.0.0.1:59056_    ] o.a.s.c.o.ReplicaMutator Update state numShards=1 message={
   [junit4]   2>   "core":"collection1",
   [junit4]   2>   "core_node_name":"core_node1",
   [junit4]   2>   "roles":null,
   [junit4]   2>   "base_url":"http://127.0.0.1:59056",
   [junit4]   2>   "node_name":"127.0.0.1:59056_",
   [junit4]   2>   "numShards":"1",
   [junit4]   2>   "state":"active",
   [junit4]   2>   "shard":"shard1",
   [junit4]   2>   "collection":"control_collection",
   [junit4]   2>   "operation":"state"}
   [junit4]   2> 970107 INFO  (zkCallback-7047-thread-2-processing-n:127.0.0.1:59056_) [n:127.0.0.1:59056_    ] o.a.s.c.c.ZkStateReader A cluster state change: [WatchedEvent state:SyncConnected type:NodeDataChanged path:/clusterstate.json], has occurred - updating... (live nodes size: [1])
   [junit4]   2> 970146 INFO  (TEST-LeaderFailoverAfterPartitionTest.test-seed#[8A464A899C1AE6CF]) [    ] o.a.s.c.c.SolrZkClient Using default ZkCredentialsProvider
   [junit4]   2> 970147 INFO  (TEST-LeaderFailoverAfterPartitionTest.test-seed#[8A464A899C1AE6CF]) [    ] o.a.s.c.c.ConnectionManager Waiting for client to connect to ZooKeeper
   [junit4]   2> 970149 INFO  (zkCallback-7051-thread-1) [    ] o.a.s.c.c.ConnectionManager Watcher org.apache.solr.common.cloud.ConnectionManager@1b2dcc4 name:ZooKeeperConnection Watcher:127.0.0.1:59048/solr got event WatchedEvent state:SyncConnected type:None path:null path:null type:None
   [junit4]   2> 970149 INFO  (TEST-LeaderFailoverAfterPartitionTest.test-seed#[8A464A899C1AE6CF]) [    ] o.a.s.c.c.ConnectionManager Client is connected to ZooKeeper
   [junit4]   2> 970150 INFO  (TEST-LeaderFailoverAfterPartitionTest.test-seed#[8A464A899C1AE6CF]) [    ] o.a.s.c.c.SolrZkClient Using default ZkACLProvider
   [junit4]   2> 970150 INFO  (TEST-LeaderFailoverAfterPartitionTest.test-seed#[8A464A899C1AE6CF]) [    ] o.a.s.c.c.ZkStateReader Updating cluster state from ZooKeeper... 
   [junit4]   2> 970151 INFO  (TEST-LeaderFailoverAfterPartitionTest.test-seed#[8A464A899C1AE6CF]) [    ] o.a.s.c.c.ZkStateReader Loaded empty cluster properties
   [junit4]   2> 970151 INFO  (TEST-LeaderFailoverAfterPartitionTest.test-seed#[8A464A899C1AE6CF]) [    ] o.a.s.c.c.ZkStateReader Updated live nodes from ZooKeeper... (0) -> (1)
   [junit4]   2> 970153 INFO  (TEST-LeaderFailoverAfterPartitionTest.test-seed#[8A464A899C1AE6CF]) [    ] o.a.s.c.ChaosMonkey monkey: init - expire sessions:false cause connection loss:false
   [junit4]   2> 970153 INFO  (TEST-LeaderFailoverAfterPartitionTest.test-seed#[8A464A899C1AE6CF]) [    ] o.a.s.c.AbstractFullDistribZkTestBase Creating collection1 with stateFormat=2
   [junit4]   2> 970153 INFO  (TEST-LeaderFailoverAfterPartitionTest.test-seed#[8A464A899C1AE6CF]) [    ] o.a.s.c.c.SolrZkClient Using default ZkCredentialsProvider
   [junit4]   2> 970154 INFO  (TEST-LeaderFailoverAfterPartitionTest.test-seed#[8A464A899C1AE6CF]) [    ] o.a.s.c.c.ConnectionManager Waiting for client to connect to ZooKeeper
   [junit4]   2> 970155 INFO  (zkCallback-7052-thread-1) [    ] o.a.s.c.c.ConnectionManager Watcher org.apache.solr.common.cloud.ConnectionManager@1bc1d8c name:ZooKeeperConnection Watcher:127.0.0.1:59048/solr got event WatchedEvent state:SyncConnected type:None path:null path:null type:None
   [junit4]   2> 970155 INFO  (TEST-LeaderFailoverAfterPartitionTest.test-seed#[8A464A899C1AE6CF]) [    ] o.a.s.c.c.ConnectionManager Client is connected to ZooKeeper
   [junit4]   2> 970155 INFO  (TEST-LeaderFailoverAfterPartitionTest.test-seed#[8A464A899C1AE6CF]) [    ] o.a.s.c.c.SolrZkClient Using default ZkACLProvider
   [junit4]   2> 970157 WARN  (NIOServerCxn.Factory:0.0.0.0/0.0.0.0:0) [    ] o.a.z.s.NIOServerCnxn caught end of stream exception
   [junit4]   2> EndOfStreamException: Unable to read additional data from client sessionid 0x1571c11e3be0006, likely client has closed socket
   [junit4]   2> 	at org.apache.zookeeper.server.NIOServerCnxn.doIO(NIOServerCnxn.java:228)
   [junit4]   2> 	at org.apache.zookeeper.server.NIOServerCnxnFactory.run(NIOServerCnxnFactory.java:208)
   [junit4]   2> 	at java.lang.Thread.run(Thread.java:745)
   [junit4]   2> 970158 INFO  (OverseerStateUpdate-96576780172656644-127.0.0.1:59056_-n_0000000000) [n:127.0.0.1:59056_    ] o.a.s.c.Overseer processMessage: queueSize: 1, message = {
   [junit4]   2>   "operation":"create",
   [junit4]   2>   "name":"collection1",
   [junit4]   2>   "numShards":"2",
   [junit4]   2>   "stateFormat":"2"} current state version: 3
   [junit4]   2> 970158 INFO  (OverseerStateUpdate-96576780172656644-127.0.0.1:59056_-n_0000000000) [n:127.0.0.1:59056_    ] o.a.s.c.o.ClusterStateMutator building a new cName: collection1
   [junit4]   2> 970263 INFO  (OverseerStateUpdate-96576780172656644-127.0.0.1:59056_-n_0000000000) [n:127.0.0.1:59056_    ] o.a.s.c.o.ZkStateWriter going to create_collection /collections/collection1/state.json
   [junit4]   2> 970614 INFO  (TEST-LeaderFailoverAfterPartitionTest.test-seed#[8A464A899C1AE6CF]) [    ] o.a.s.SolrTestCaseJ4 Writing core.properties file to C:\Users\jenkins\workspace\Lucene-Solr-6.x-Windows\solr\build\solr-core\test\J1\temp\solr.cloud.LeaderFailoverAfterPartitionTest_8A464A899C1AE6CF-001\shard-1-001\cores\collection1
   [junit4]   2> 970616 INFO  (TEST-LeaderFailoverAfterPartitionTest.test-seed#[8A464A899C1AE6CF]) [    ] o.a.s.c.AbstractFullDistribZkTestBase create jetty 1 in directory C:\Users\jenkins\workspace\Lucene-Solr-6.x-Windows\solr\build\solr-core\test\J1\temp\solr.cloud.LeaderFailoverAfterPartitionTest_8A464A899C1AE6CF-001\shard-1-001
   [junit4]   2> 970617 INFO  (TEST-LeaderFailoverAfterPartitionTest.test-seed#[8A464A899C1AE6CF]) [    ] o.e.j.s.Server jetty-9.3.8.v20160314
   [junit4]   2> 970618 INFO  (TEST-LeaderFailoverAfterPartitionTest.test-seed#[8A464A899C1AE6CF]) [    ] o.e.j.s.h.ContextHandler Started o.e.j.s.ServletContextHandler@1f387c2{/,null,AVAILABLE}
   [junit4]   2> 970619 INFO  (TEST-LeaderFailoverAfterPartitionTest.test-seed#[8A464A899C1AE6CF]) [    ] o.e.j.s.ServerConnector Started ServerConnector@1f5d9d4{HTTP/1.1,[http/1.1]}{127.0.0.1:59078}
   [junit4]   2> 970619 INFO  (TEST-LeaderFailoverAfterPartitionTest.test-seed#[8A464A899C1AE6CF]) [    ] o.e.j.s.Server Started @974591ms
   [junit4]   2> 970619 INFO  (TEST-LeaderFailoverAfterPartitionTest.test-seed#[8A464A899C1AE6CF]) [    ] o.a.s.c.s.e.JettySolrRunner Jetty properties: {solr.data.dir=C:\Users\jenkins\workspace\Lucene-Solr-6.x-Windows\solr\build\solr-core\test\J1\temp\solr.cloud.LeaderFailoverAfterPartitionTest_8A464A899C1AE6CF-001\tempDir-001/jetty1, solrconfig=solrconfig.xml, hostContext=/, hostPort=59077, coreRootDirectory=C:\Users\jenkins\workspace\Lucene-Solr-6.x-Windows\solr\build\solr-core\test\J1\temp\solr.cloud.LeaderFailoverAfterPartitionTest_8A464A899C1AE6CF-001\shard-1-001\cores}
   [junit4]   2> 970620 INFO  (TEST-LeaderFailoverAfterPartitionTest.test-seed#[8A464A899C1AE6CF]) [    ] o.a.s.s.SolrDispatchFilter SolrDispatchFilter.init(): sun.misc.Launcher$AppClassLoader@1d16e93
   [junit4]   2> 970620 INFO  (TEST-LeaderFailoverAfterPartitionTest.test-seed#[8A464A899C1AE6CF]) [    ] o.a.s.c.SolrResourceLoader new SolrResourceLoader for directory: 'C:\Users\jenkins\workspace\Lucene-Solr-6.x-Windows\solr\build\solr-core\test\J1\temp\solr.cloud.LeaderFailoverAfterPartitionTest_8A464A899C1AE6CF-001\shard-1-001'
   [junit4]   2> 970620 INFO  (TEST-LeaderFailoverAfterPartitionTest.test-seed#[8A464A899C1AE6CF]) [    ] o.a.s.c.SolrResourceLoader JNDI not configured for solr (NoInitialContextEx)
   [junit4]   2> 970620 INFO  (TEST-LeaderFailoverAfterPartitionTest.test-seed#[8A464A899C1AE6CF]) [    ] o.a.s.c.SolrResourceLoader solr home defaulted to 'solr/' (could not find system property or JNDI)
   [junit4]   2> 970621 INFO  (TEST-LeaderFailoverAfterPartitionTest.test-seed#[8A464A899C1AE6CF]) [    ] o.a.s.c.c.SolrZkClient Using default ZkCredentialsProvider
   [junit4]   2> 970621 INFO  (TEST-LeaderFailoverAfterPartitionTest.test-seed#[8A464A899C1AE6CF]) [    ] o.a.s.c.c.ConnectionManager Waiting for client to connect to ZooKeeper
   [junit4]   2> 970624 INFO  (zkCallback-7053-thread-1) [    ] o.a.s.c.c.ConnectionManager Watcher org.apache.solr.common.cloud.ConnectionManager@1210ebf name:ZooKeeperConnection Watcher:127.0.0.1:59048/solr got event WatchedEvent state:SyncConnected type:None path:null path:null type:None
   [junit4]   2> 970624 INFO  (TEST-LeaderFailoverAfterPartitionTest.test-seed#[8A464A899C1AE6CF]) [    ] o.a.s.c.c.ConnectionManager Client is connected to ZooKeeper
   [junit4]   2> 970624 INFO  (TEST-LeaderFailoverAfterPartitionTest.test-seed#[8A464A899C1AE6CF]) [    ] o.a.s.c.c.SolrZkClient Using default ZkACLProvider
   [junit4]   2> 970626 INFO  (TEST-LeaderFailoverAfterPartitionTest.test-seed#[8A464A899C1AE6CF]) [    ] o.a.s.s.SolrDispatchFilter Loading solr.xml from SolrHome (not found in ZooKeeper)
   [junit4]   2> 970626 INFO  (TEST-LeaderFailoverAfterPartitionTest.test-seed#[8A464A899C1AE6CF]) [    ] o.a.s.c.SolrXmlConfig Loading container configuration from C:\Users\jenkins\workspace\Lucene-Solr-6.x-Windows\solr\build\solr-core\test\J1\temp\solr.cloud.LeaderFailoverAfterPartitionTest_8A464A899C1AE6CF-001\shard-1-001\solr.xml
   [junit4]   2> 970633 INFO  (TEST-LeaderFailoverAfterPartitionTest.test-seed#[8A464A899C1AE6CF]) [    ] o.a.s.c.CorePropertiesLocator Config-defined core root directory: C:\Users\jenkins\workspace\Lucene-Solr-6.x-Windows\solr\build\solr-core\test\J1\temp\solr.cloud.LeaderFailoverAfterPartitionTest_8A464A899C1AE6CF-001\shard-1-001\cores
   [junit4]   2> 970633 INFO  (TEST-LeaderFailoverAfterPartitionTest.test-seed#[8A464A899C1AE6CF]) [    ] o.a.s.c.CoreContainer New CoreContainer 19911595
   [junit4]   2> 970633 INFO  (TEST-LeaderFailoverAfterPartitionTest.test-seed#[8A464A899C1AE6CF]) [    ] o.a.s.c.CoreContainer Loading cores into CoreContainer [instanceDir=C:\Users\jenkins\workspace\Lucene-Solr-6.x-Windows\solr\build\solr-core\test\J1\temp\solr.cloud.LeaderFailoverAfterPartitionTest_8A464A899C1AE6CF-001\shard-1-001]
   [junit4]   2> 970633 WARN  (TEST-LeaderFailoverAfterPartitionTest.test-seed#[8A464A899C1AE6CF]) [    ] o.a.s.c.CoreContainer Couldn't add files from C:\Users\jenkins\workspace\Lucene-Solr-6.x-Windows\solr\build\solr-core\test\J1\temp\solr.cloud.LeaderFailoverAfterPartitionTest_8A464A899C1AE6CF-001\shard-1-001\lib to classpath: C:\Users\jenkins\workspace\Lucene-Solr-6.x-Windows\solr\build\solr-core\test\J1\temp\solr.cloud.LeaderFailoverAfterPartitionTest_8A464A899C1AE6CF-001\shard-1-001\lib
   [junit4]   2> 970634 INFO  (TEST-LeaderFailoverAfterPartitionTest.test-seed#[8A464A899C1AE6CF]) [    ] o.a.s.h.c.HttpShardHandlerFactory created with socketTimeout : 90000,urlScheme : ,connTimeout : 15000,maxConnectionsPerHost : 20,maxConnections : 10000,corePoolSize : 0,maximumPoolSize : 2147483647,maxThreadIdleTime : 5,sizeOfQueue : -1,fairnessPolicy : false,useRetries : false,connectionsEvictorSleepDelay : 5000,maxConnectionIdleTime : 40000,
   [junit4]   2> 970637 INFO  (TEST-LeaderFailoverAfterPartitionTest.test-seed#[8A464A899C1AE6CF]) [    ] o.a.s.u.UpdateShardHandler Creating UpdateShardHandler HTTP client with params: socketTimeout=340000&connTimeout=45000&retry=true
   [junit4]   2> 970638 INFO  (TEST-LeaderFailoverAfterPartitionTest.test-seed#[8A464A899C1AE6CF]) [    ] o.a.s.l.LogWatcher SLF4J impl is org.slf4j.impl.Log4jLoggerFactory
   [junit4]   2> 970638 INFO  (TEST-LeaderFailoverAfterPartitionTest.test-seed#[8A464A899C1AE6CF]) [    ] o.a.s.l.LogWatcher Registering Log Listener [Log4j (org.slf4j.impl.Log4jLoggerFactory)]
   [junit4]   2> 970638 INFO  (TEST-LeaderFailoverAfterPartitionTest.test-seed#[8A464A899C1AE6CF]) [    ] o.a.s.c.ZkContainer Zookeeper client=127.0.0.1:59048/solr
   [junit4]   2> 970638 INFO  (TEST-LeaderFailoverAfterPartitionTest.test-seed#[8A464A899C1AE6CF]) [    ] o.a.s.c.ZkController zkHost includes chroot
   [junit4]   2> 970638 INFO  (TEST-LeaderFailoverAfterPartitionTest.test-seed#[8A464A899C1AE6CF]) [    ] o.a.s.c.c.SolrZkClient Using default ZkCredentialsProvider
   [junit4]   2> 970639 INFO  (TEST-LeaderFailoverAfterPartitionTest.test-seed#[8A464A899C1AE6CF]) [    ] o.a.s.c.c.ConnectionManager Waiting for client to connect to ZooKeeper
   [junit4]   2> 970641 INFO  (zkCallback-7056-thread-1) [    ] o.a.s.c.c.ConnectionManager Watcher org.apache.solr.common.cloud.ConnectionManager@5cc6ec name:ZooKeeperConnection Watcher:127.0.0.1:59048 got event WatchedEvent state:SyncConnected type:None path:null path:null type:None
   [junit4]   2> 970642 INFO  (TEST-LeaderFailoverAfterPartitionTest.test-seed#[8A464A899C1AE6CF]) [    ] o.a.s.c.c.ConnectionManager Client is connected to ZooKeeper
   [junit4]   2> 970642 INFO  (TEST-LeaderFailoverAfterPartitionTest.test-seed#[8A464A899C1AE6CF]) [    ] o.a.s.c.c.SolrZkClient Using default ZkACLProvider
   [junit4]   2> 970643 INFO  (TEST-LeaderFailoverAfterPartitionTest.test-seed#[8A464A899C1AE6CF]) [n:127.0.0.1:59077_    ] o.a.s.c.ZkController Added new OnReconnect listener org.apache.solr.cloud.ZkController$$Lambda$106/19207081@70b5d1
   [junit4]   2> 970644 INFO  (TEST-LeaderFailoverAfterPartitionTest.test-seed#[8A464A899C1AE6CF]) [n:127.0.0.1:59077_    ] o.a.s.c.c.ConnectionManager Waiting for client to connect to ZooKeeper
   [junit4]   2> 970645 INFO  (zkCallback-7057-thread-1-processing-n:127.0.0.1:59077_) [n:127.0.0.1:59077_    ] o.a.s.c.c.ConnectionManager Watcher org.apache.solr.common.cloud.ConnectionManager@1044638 name:ZooKeeperConnection Watcher:127.0.0.1:59048/solr got event WatchedEvent state:SyncConnected type:None path:null path:null type:None
   [junit4]   2> 970645 INFO  (TEST-LeaderFailoverAfterPartitionTest.test-seed#[8A464A899C1AE6CF]) [n:127.0.0.1:59077_    ] o.a.s.c.c.ConnectionManager Client is connected to ZooKeeper
   [junit4]   2> 970653 INFO  (TEST-LeaderFailoverAfterPartitionTest.test-seed#[8A464A899C1AE6CF]) [n:127.0.0.1:59077_    ] o.a.s.c.c.ZkStateReader Updating cluster state from ZooKeeper... 
   [junit4]   2> 970654 INFO  (TEST-LeaderFailoverAfterPartitionTest.test-seed#[8A464A899C1AE6CF]) [n:127.0.0.1:59077_    ] o.a.s.c.c.ZkStateReader Loaded empty cluster properties
   [junit4]   2> 970655 INFO  (TEST-LeaderFailoverAfterPartitionTest.test-seed#[8A464A899C1AE6CF]) [n:127.0.0.1:59077_    ] o.a.s.c.c.ZkStateReader Updated live nodes from ZooKeeper... (0) -> (1)
   [junit4]   2> 970658 INFO  (TEST-LeaderFailoverAfterPartitionTest.test-seed#[8A464A899C1AE6CF]) [n:127.0.0.1:59077_    ] o.a.s.c.Overseer Overseer (id=null) closing
   [junit4]   2> 970659 INFO  (TEST-LeaderFailoverAfterPartitionTest.test-seed#[8A464A899C1AE6CF]) [n:127.0.0.1:59077_    ] o.a.s.c.LeaderElector Joined leadership election with path: /overseer_elect/election/96576780172656649-127.0.0.1:59077_-n_0000000001
   [junit4]   2> 970660 INFO  (TEST-LeaderFailoverAfterPartitionTest.test-seed#[8A464A899C1AE6CF]) [n:127.0.0.1:59077_    ] o.a.s.c.LeaderElector Watching path /overseer_elect/election/96576780172656644-127.0.0.1:59056_-n_0000000000 to know if I could be the leader
   [junit4]   2> 970660 INFO  (TEST-LeaderFailoverAfterPartitionTest.test-seed#[8A464A899C1AE6CF]) [n:127.0.0.1:59077_    ] o.a.s.c.ZkController Publish node=127.0.0.1:59077_ as DOWN
   [junit4]   2> 970661 INFO  (TEST-LeaderFailoverAfterPartitionTest.test-seed#[8A464A899C1AE6CF]) [n:127.0.0.1:59077_    ] o.a.s.c.ZkController Register node as live in ZooKeeper:/live_nodes/127.0.0.1:59077_
   [junit4]   2> 970661 INFO  (TEST-LeaderFailoverAfterPartitionTest.test-seed#[8A464A899C1AE6CF]) [n:127.0.0.1:59077_    ] o.a.s.c.c.SolrZkClient makePath: /live_nodes/127.0.0.1:59077_
   [junit4]   2> 970662 INFO  (OverseerStateUpdate-96576780172656644-127.0.0.1:59056_-n_0000000000) [n:127.0.0.1:59056_    ] o.a.s.c.Overseer processMessage: queueSize: 1, message = {
   [junit4]   2>   "operation":"downnode",
   [junit4]   2>   "node_name":"127.0.0.1:59077_"} current state version: 3
   [junit4]   2> 970662 INFO  (OverseerStateUpdate-96576780172656644-127.0.0.1:59056_-n_0000000000) [n:127.0.0.1:59056_    ] o.a.s.c.o.NodeMutator DownNode state invoked for node: 127.0.0.1:59077_
   [junit4]   2> 970662 INFO  (zkCallback-7057-thread-1-processing-n:127.0.0.1:59077_) [n:127.0.0.1:59077_    ] o.a.s.c.c.ZkStateReader A live node change: [WatchedEvent state:SyncConnected type:NodeChildrenChanged path:/live_nodes], has occurred - updating... (live nodes size: [1])
   [junit4]   2> 970662 INFO  (zkCallback-7047-thread-2-processing-n:127.0.0.1:59056_) [n:127.0.0.1:59056_    ] o.a.s.c.c.ZkStateReader A live node change: [WatchedEvent state:SyncConnected type:NodeChildrenChanged path:/live_nodes], has occurred - updating... (live nodes size: [1])
   [junit4]   2> 970662 INFO  (zkCallback-7051-thread-1) [    ] o.a.s.c.c.ZkStateReader A live node change: [WatchedEvent state:SyncConnected type:NodeChildrenChanged path:/live_nodes], has occurred - updating... (live nodes size: [1])
   [junit4]   2> 970663 INFO  (zkCallback-7057-thread-1-processing-n:127.0.0.1:59077_) [n:127.0.0.1:59077_    ] o.a.s.c.c.ZkStateReader Updated live nodes from ZooKeeper... (1) -> (2)
   [junit4]   2> 970664 INFO  (zkCallback-7047-thread-2-processing-n:127.0.0.1:59056_) [n:127.0.0.1:59056_    ] o.a.s.c.c.ZkStateReader Updated live nodes from ZooKeeper... (1) -> (2)
   [junit4]   2> 970664 INFO  (zkCallback-7051-thread-1) [    ] o.a.s.c.c.ZkStateReader Updated live nodes from ZooKeeper... (1) -> (2)
   [junit4]   2> 970664 INFO  (zkCallback-7057-thread-1-processing-n:127.0.0.1:59077_) [n:127.0.0.1:59077_    ] o.a.s.c.c.ZkStateReader A cluster state change: [WatchedEvent state:SyncConnected type:NodeDataChanged path:/clusterstate.json], has occurred - updating... (live nodes size: [2])
   [junit4]   2> 970664 INFO  (zkCallback-7047-thread-2-processing-n:127.0.0.1:59056_) [n:127.0.0.1:59056_    ] o.a.s.c.c.ZkStateReader A cluster state change: [WatchedEvent state:SyncConnected type:NodeDataChanged path:/clusterstate.json], has occurred - updating... (live nodes size: [2])
   [junit4]   2> 970664 INFO  (zkCallback-7051-thread-1) [    ] o.a.s.c.c.ZkStateReader A cluster state change: [WatchedEvent state:SyncConnected type:NodeDataChanged path:/clusterstate.json], has occurred - updating... (live nodes size: [2])
   [junit4]   2> 970688 INFO  (TEST-LeaderFailoverAfterPartitionTest.test-seed#[8A464A899C1AE6CF]) [n:127.0.0.1:59077_    ] o.a.s.c.CoreContainer Security conf doesn't exist. Skipping setup for authorization module.
   [junit4]   2> 970688 INFO  (TEST-LeaderFailoverAfterPartitionTest.test-seed#[8A464A899C1AE6CF]) [n:127.0.0.1:59077_    ] o.a.s.c.CoreContainer No authentication plugin used.
   [junit4]   2> 970690 INFO  (TEST-LeaderFailoverAfterPartitionTest.test-seed#[8A464A899C1AE6CF]) [n:127.0.0.1:59077_    ] o.a.s.c.CorePropertiesLocator Looking for core definitions underneath C:\Users\jenkins\workspace\Lucene-Solr-6.x-Windows\solr\build\solr-core\test\J1\temp\solr.cloud.LeaderFailoverAfterPartitionTest_8A464A899C1AE6CF-001\shard-1-001\cores
   [junit4]   2> 970692 INFO  (TEST-LeaderFailoverAfterPartitionTest.test-seed#[8A464A899C1AE6CF]) [n:127.0.0.1:59077_    ] o.a.s.c.CoreDescriptor Created CoreDescriptor: {name=collection1, config=solrconfig.xml, transient=false, schema=schema.xml, loadOnStartup=true, configSetProperties=configsetprops.json, collection=collection1, coreNodeName=, dataDir=data\, shard=}
   [junit4]   2> 970692 INFO  (TEST-LeaderFailoverAfterPartitionTest.test-seed#[8A464A899C1AE6CF]) [n:127.0.0.1:59077_    ] o.a.s.c.CorePropertiesLocator Found core collection1 in C:\Users\jenkins\workspace\Lucene-Solr-6.x-Windows\solr\build\solr-core\test\J1\temp\solr.cloud.LeaderFailoverAfterPartitionTest_8A464A899C1AE6CF-001\shard-1-001\cores\collection1
   [junit4]   2> 970692 INFO  (TEST-LeaderFailoverAfterPartitionTest.test-seed#[8A464A899C1AE6CF]) [n:127.0.0.1:59077_    ] o.a.s.c.CorePropertiesLocator Found 1 core definitions
   [junit4]   2> 970697 INFO  (TEST-LeaderFailoverAfterPartitionTest.test-seed#[8A464A899C1AE6CF]) [n:127.0.0.1:59077_    ] o.a.s.s.SolrDispatchFilter user.dir=C:\Users\jenkins\workspace\Lucene-Solr-6.x-Windows\solr\build\solr-core\test\J1
   [junit4]   2> 970697 INFO  (TEST-LeaderFailoverAfterPartitionTest.test-seed#[8A464A899C1AE6CF]) [n:127.0.0.1:59077_    ] o.a.s.s.SolrDispatchFilter SolrDispatchFilter.init() done
   [junit4]   2> 970698 INFO  (coreLoadExecutor-5080-thread-1-processing-n:127.0.0.1:59077_) [n:127.0.0.1:59077_ c:collection1   x:collection1] o.a.s.c.ZkController publishing state=down
   [junit4]   2> 970698 INFO  (coreLoadExecutor-5080-thread-1-processing-n:127.0.0.1:59077_) [n:127.0.0.1:59077_ c:collection1   x:collection1] o.a.s.c.ZkController numShards not found on descriptor - reading it from system property
   [junit4]   2> 970700 INFO  (coreLoadExecutor-5080-thread-1-processing-n:127.0.0.1:59077_) [n:127.0.0.1:59077_ c:collection1   x:collection1] o.a.s.c.ZkController Registering watch for collection collection1
   [junit4]   2> 970700 INFO  (OverseerStateUpdate-96576780172656644-127.0.0.1:59056_-n_0000000000) [n:127.0.0.1:59056_    ] o.a.s.c.Overseer processMessage: queueSize: 1, message = {
   [junit4]   2>   "core":"collection1",
   [junit4]   2>   "roles":null,
   [junit4]   2>   "base_url":"http://127.0.0.1:59077",
   [junit4]   2>   "node_name":"127.0.0.1:59077_",
   [junit4]   2>   "numShards":"2",
   [junit4]   2>   "state":"down",
   [junit4]   2>   "shard":null,
   [junit4]   2>   "collection":"collection1",
   [junit4]   2>   "operation":"state"} current state version: 4
   [junit4]   2> 970700 INFO  (OverseerStateUpdate-96576780172656644-127.0.0.1:59056_-n_0000000000) [n:127.0.0.1:59056_    ] o.a.s.c.o.ReplicaMutator Update state numShards=2 message={
   [junit4]   2>   "core":"collection1",
   [junit4]   2>   "roles":null,
   [junit4]   2>   "base_url":"http://127.0.0.1:59077",
   [junit4]   2>   "node_name":"127.0.0.1:59077_",
   [junit4]   2>   "numShards":"2",
   [junit4]   2>   "state":"down",
   [junit4]   2>   "shard":null,
   [junit4]   2>   "collection":"collection1",
   [junit4]   2>   "operation":"state"}
   [junit4]   2> 970700 INFO  (OverseerStateUpdate-96576780172656644-127.0.0.1:59056_-n_0000000000) [n:127.0.0.1:59056_    ] o.a.s.c.o.ReplicaMutator Collection already exists with numShards=2
   [junit4]   2> 970700 INFO  (OverseerStateUpdate-96576780172656644-127.0.0.1:59056_-n_0000000000) [n:127.0.0.1:59056_    ] o.a.s.c.o.ReplicaMutator Assigning new node to shard shard=shard2
   [junit4]   2> 970700 INFO  (coreLoadExecutor-5080-thread-1-processing-n:127.0.0.1:59077_) [n:127.0.0.1:59077_ c:collection1   x:collection1] o.a.s.c.c.ZkStateReader Add data for [collection1] ver [0]
   [junit4]   2> 970701 INFO  (coreLoadExecutor-5080-thread-1-processing-n:127.0.0.1:5907

[...truncated too long message...]

junit4]   2> 	67	/solr/overseer/collection-queue-work
   [junit4]   2> 	66	/solr/overseer/queue
   [junit4]   2> 	25	/solr/overseer/queue-work
   [junit4]   2> 	5	/solr/live_nodes
   [junit4]   2> 	5	/solr/collections
   [junit4]   2> 
   [junit4]   2> 1040568 WARN  (TEST-LeaderFailoverAfterPartitionTest.test-seed#[8A464A899C1AE6CF]) [    ] o.a.s.c.SocketProxy Closing 1 connections to: http://127.0.0.1:59056/, target: http://127.0.0.1:59057/
   [junit4]   2> 1040568 WARN  (TEST-LeaderFailoverAfterPartitionTest.test-seed#[8A464A899C1AE6CF]) [    ] o.a.s.c.SocketProxy Closing 5 connections to: http://127.0.0.1:59090/, target: http://127.0.0.1:59091/
   [junit4]   2> 1040569 WARN  (TEST-LeaderFailoverAfterPartitionTest.test-seed#[8A464A899C1AE6CF]) [    ] o.a.s.c.SocketProxy Closing 0 connections to: http://127.0.0.1:59105/, target: http://127.0.0.1:59106/
   [junit4]   2> 1040569 WARN  (TEST-LeaderFailoverAfterPartitionTest.test-seed#[8A464A899C1AE6CF]) [    ] o.a.s.c.SocketProxy Closing 6 connections to: http://127.0.0.1:59077/, target: http://127.0.0.1:59078/
   [junit4]   2> NOTE: reproduce with: ant test  -Dtestcase=LeaderFailoverAfterPartitionTest -Dtests.method=test -Dtests.seed=8A464A899C1AE6CF -Dtests.slow=true -Dtests.locale=cs-CZ -Dtests.timezone=Asia/Vientiane -Dtests.asserts=true -Dtests.file.encoding=Cp1252
   [junit4] ERROR   72.8s J1 | LeaderFailoverAfterPartitionTest.test <<<
   [junit4]    > Throwable #1: org.apache.solr.client.solrj.SolrServerException: org.apache.solr.client.solrj.SolrServerException: No live SolrServers available to handle this request:[http://127.0.0.1:59105/c8n_1x3_lf_shard1_replica1]
   [junit4]    > 	at __randomizedtesting.SeedInfo.seed([8A464A899C1AE6CF:212755332E68B37]:0)
   [junit4]    > 	at org.apache.solr.client.solrj.impl.CloudSolrClient.directUpdate(CloudSolrClient.java:769)
   [junit4]    > 	at org.apache.solr.client.solrj.impl.CloudSolrClient.sendRequest(CloudSolrClient.java:1161)
   [junit4]    > 	at org.apache.solr.client.solrj.impl.CloudSolrClient.requestWithRetryOnStaleState(CloudSolrClient.java:1050)
   [junit4]    > 	at org.apache.solr.client.solrj.impl.CloudSolrClient.request(CloudSolrClient.java:992)
   [junit4]    > 	at org.apache.solr.client.solrj.SolrClient.request(SolrClient.java:1219)
   [junit4]    > 	at org.apache.solr.cloud.HttpPartitionTest.sendDoc(HttpPartitionTest.java:592)
   [junit4]    > 	at org.apache.solr.cloud.HttpPartitionTest.sendDoc(HttpPartitionTest.java:578)
   [junit4]    > 	at org.apache.solr.cloud.LeaderFailoverAfterPartitionTest.testRf3WithLeaderFailover(LeaderFailoverAfterPartitionTest.java:174)
   [junit4]    > 	at org.apache.solr.cloud.LeaderFailoverAfterPartitionTest.test(LeaderFailoverAfterPartitionTest.java:55)
   [junit4]    > 	at org.apache.solr.BaseDistributedSearchTestCase$ShardsRepeatRule$ShardsFixedStatement.callStatement(BaseDistributedSearchTestCase.java:992)
   [junit4]    > 	at org.apache.solr.BaseDistributedSearchTestCase$ShardsRepeatRule$ShardsStatement.evaluate(BaseDistributedSearchTestCase.java:967)
   [junit4]    > 	at java.lang.Thread.run(Thread.java:745)
   [junit4]    > Caused by: org.apache.solr.client.solrj.SolrServerException: No live SolrServers available to handle this request:[http://127.0.0.1:59105/c8n_1x3_lf_shard1_replica1]
   [junit4]    > 	at org.apache.solr.client.solrj.impl.LBHttpSolrClient.request(LBHttpSolrClient.java:384)
   [junit4]    > 	at org.apache.solr.client.solrj.impl.CloudSolrClient.directUpdate(CloudSolrClient.java:763)
   [junit4]    > 	... 49 more
   [junit4]    > Caused by: org.apache.solr.client.solrj.SolrServerException: Server refused connection at: http://127.0.0.1:59105/c8n_1x3_lf_shard1_replica1
   [junit4]    > 	at org.apache.solr.client.solrj.impl.HttpSolrClient.executeMethod(HttpSolrClient.java:599)
   [junit4]    > 	at org.apache.solr.client.solrj.impl.HttpSolrClient.request(HttpSolrClient.java:261)
   [junit4]    > 	at org.apache.solr.client.solrj.impl.HttpSolrClient.request(HttpSolrClient.java:250)
   [junit4]    > 	at org.apache.solr.client.solrj.impl.LBHttpSolrClient.doRequest(LBHttpSolrClient.java:405)
   [junit4]    > 	at org.apache.solr.client.solrj.impl.LBHttpSolrClient.request(LBHttpSolrClient.java:357)
   [junit4]    > 	... 50 more
   [junit4]    > Caused by: java.net.ConnectException: Connection refused: connect
   [junit4]    > 	at java.net.DualStackPlainSocketImpl.waitForConnect(Native Method)
   [junit4]    > 	at java.net.DualStackPlainSocketImpl.socketConnect(DualStackPlainSocketImpl.java:85)
   [junit4]    > 	at java.net.AbstractPlainSocketImpl.doConnect(AbstractPlainSocketImpl.java:350)
   [junit4]    > 	at java.net.AbstractPlainSocketImpl.connectToAddress(AbstractPlainSocketImpl.java:206)
   [junit4]    > 	at java.net.AbstractPlainSocketImpl.connect(AbstractPlainSocketImpl.java:188)
   [junit4]    > 	at java.net.PlainSocketImpl.connect(PlainSocketImpl.java:172)
   [junit4]    > 	at java.net.SocksSocketImpl.connect(SocksSocketImpl.java:392)
   [junit4]    > 	at java.net.Socket.connect(Socket.java:589)
   [junit4]    > 	at org.apache.http.conn.scheme.PlainSocketFactory.connectSocket(PlainSocketFactory.java:117)
   [junit4]    > 	at org.apache.http.impl.conn.DefaultClientConnectionOperator.openConnection(DefaultClientConnectionOperator.java:177)
   [junit4]    > 	at org.apache.http.impl.conn.ManagedClientConnectionImpl.open(ManagedClientConnectionImpl.java:304)
   [junit4]    > 	at org.apache.http.impl.client.DefaultRequestDirector.tryConnect(DefaultRequestDirector.java:611)
   [junit4]    > 	at org.apache.http.impl.client.DefaultRequestDirector.execute(DefaultRequestDirector.java:446)
   [junit4]    > 	at org.apache.http.impl.client.AbstractHttpClient.doExecute(AbstractHttpClient.java:882)
   [junit4]    > 	at org.apache.http.impl.client.CloseableHttpClient.execute(CloseableHttpClient.java:82)
   [junit4]    > 	at org.apache.http.impl.client.CloseableHttpClient.execute(CloseableHttpClient.java:107)
   [junit4]    > 	at org.apache.http.impl.client.CloseableHttpClient.execute(CloseableHttpClient.java:55)
   [junit4]    > 	at org.apache.solr.client.solrj.impl.HttpSolrClient.executeMethod(HttpSolrClient.java:497)
   [junit4]    > 	... 54 more
   [junit4]   2> 1040573 INFO  (SUITE-LeaderFailoverAfterPartitionTest-seed#[8A464A899C1AE6CF]-worker) [    ] o.a.s.SolrTestCaseJ4 ###deleteCore
   [junit4]   2> NOTE: leaving temporary files on disk at: C:\Users\jenkins\workspace\Lucene-Solr-6.x-Windows\solr\build\solr-core\test\J1\temp\solr.cloud.LeaderFailoverAfterPartitionTest_8A464A899C1AE6CF-001
   [junit4]   2> Sep 12, 2016 1:46:29 AM com.carrotsearch.randomizedtesting.ThreadLeakControl checkThreadLeaks
   [junit4]   2> WARNING: Will linger awaiting termination of 2 leaked thread(s).
   [junit4]   2> NOTE: test params are: codec=CheapBastard, sim=ClassicSimilarity, locale=cs-CZ, timezone=Asia/Vientiane
   [junit4]   2> NOTE: Windows 10 10.0 x86/Oracle Corporation 1.8.0_102 (32-bit)/cpus=3,threads=1,free=205266776,total=312213504
   [junit4]   2> NOTE: All tests run in this JVM: [CoreAdminRequestStatusTest, LoggingHandlerTest, TestChildDocTransformer, TestAddFieldRealTimeGet, FieldMutatingUpdateProcessorTest, TestGeoJSONResponseWriter, TestQueryTypes, TestConfigOverlay, TestCodecSupport, TestLRUStatsCache, TestLeaderElectionZkExpiry, HdfsUnloadDistributedZkTest, NotRequiredUniqueKeyTest, FileBasedSpellCheckerTest, CustomCollectionTest, TestConfig, TestRebalanceLeaders, TestSSLRandomization, TestSubQueryTransformerCrossCore, TestRestManager, SparseHLLTest, DefaultValueUpdateProcessorTest, MBeansHandlerTest, TestRecovery, CoreSorterTest, TestRandomFlRTGCloud, CoreAdminHandlerTest, TestDistributedStatsComponentCardinality, TriLevelCompositeIdRoutingTest, SpellPossibilityIteratorTest, ExitableDirectoryReaderTest, TestCollapseQParserPlugin, SuggesterWFSTTest, TestLMJelinekMercerSimilarityFactory, TestFieldCache, TestManagedSchemaAPI, TestDynamicLoading, TestUninvertingReader, BigEndianAscendingWordSerializerTest, JavabinLoaderTest, TestConfigSetProperties, CdcrRequestHandlerTest, SpellCheckCollatorTest, TestConfigSetsAPI, PreAnalyzedFieldTest, TestOrdValues, InfoHandlerTest, RequestHandlersTest, CollectionsAPIAsyncDistributedZkTest, TestFreeTextSuggestions, TestSolrQueryResponse, TestZkChroot, TestQueryWrapperFilter, SmileWriterTest, TestMacros, PKIAuthenticationIntegrationTest, SolrCmdDistributorTest, OverriddenZkACLAndCredentialsProvidersTest, TestExclusionRuleCollectionAccess, TestJsonFacets, AtomicUpdatesTest, TestNumericTerms32, TestSlowCompositeReaderWrapper, TestMiniSolrCloudClusterSSL, PreAnalyzedUpdateProcessorTest, DistributedQueryComponentOptimizationTest, TestBlendedInfixSuggestions, NoCacheHeaderTest, DataDrivenBlockJoinTest, MultiThreadedOCPTest, TestUseDocValuesAsStored, HdfsLockFactoryTest, DistributedFacetPivotSmallAdvancedTest, BaseCdcrDistributedZkTest, UUIDFieldTest, DistributedTermsComponentTest, QueryResultKeyTest, TestUniqueKeyFieldResource, TestBadConfig, TestClassicSimilarityFactory, BooleanFieldTest, TestCustomSort, ZkSolrClientTest, SortByFunctionTest, TestFiltering, CurrencyFieldOpenExchangeTest, ScriptEngineTest, TestPHPSerializedResponseWriter, TestStressLiveNodes, TestSystemIdResolver, TestIndexingPerformance, TestDistributedMissingSort, TestRequestForwarding, TestCrossCoreJoin, URLClassifyProcessorTest, UpdateParamsTest, QueryParsingTest, TestFuzzyAnalyzedSuggestions, CacheHeaderTest, BinaryUpdateRequestHandlerTest, TestXmlQParser, SpellCheckComponentTest, SuggesterTSTTest, TestFastWriter, HLLSerializationTest, TestSolrCoreSnapshots, SolrCoreCheckLockOnStartupTest, DeleteReplicaTest, StatsComponentTest, TestRandomFaceting, CloudMLTQParserTest, TestOmitPositions, TestCoreDiscovery, TestAtomicUpdateErrorCases, StressHdfsTest, LeaderFailoverAfterPartitionTest]
   [junit4] Completed [212/630 (1!)] on J1 in 73.14s, 1 test, 1 error <<< FAILURES!

[...truncated 53932 lines...]


Mime
View raw message