lucene-dev mailing list archives

Site index · List index
Message view « Date » · « Thread »
Top « Date » · « Thread »
From Policeman Jenkins Server <jenk...@thetaphi.de>
Subject [JENKINS] Lucene-Solr-6.x-Windows (32bit/jdk1.8.0_102) - Build # 446 - Unstable!
Date Sun, 11 Sep 2016 02:18:14 GMT
Build: http://jenkins.thetaphi.de/job/Lucene-Solr-6.x-Windows/446/
Java: 32bit/jdk1.8.0_102 -client -XX:+UseG1GC

1 tests failed.
FAILED:  org.apache.solr.handler.TestReplicationHandler.doTestStressReplication

Error Message:
[index.20160910211614625, index.20160910211617076, index.properties, replication.properties, snapshot_metadata] expected:<1> but was:<2>

Stack Trace:
java.lang.AssertionError: [index.20160910211614625, index.20160910211617076, index.properties, replication.properties, snapshot_metadata] expected:<1> but was:<2>
	at __randomizedtesting.SeedInfo.seed([C7F24F7FD24F8B5A:1C594FB9D767E2E9]:0)
	at org.junit.Assert.fail(Assert.java:93)
	at org.junit.Assert.failNotEquals(Assert.java:647)
	at org.junit.Assert.assertEquals(Assert.java:128)
	at org.junit.Assert.assertEquals(Assert.java:472)
	at org.apache.solr.handler.TestReplicationHandler.checkForSingleIndex(TestReplicationHandler.java:909)
	at org.apache.solr.handler.TestReplicationHandler.doTestStressReplication(TestReplicationHandler.java:876)
	at sun.reflect.NativeMethodAccessorImpl.invoke0(Native Method)
	at sun.reflect.NativeMethodAccessorImpl.invoke(NativeMethodAccessorImpl.java:62)
	at sun.reflect.DelegatingMethodAccessorImpl.invoke(DelegatingMethodAccessorImpl.java:43)
	at java.lang.reflect.Method.invoke(Method.java:498)
	at com.carrotsearch.randomizedtesting.RandomizedRunner.invoke(RandomizedRunner.java:1764)
	at com.carrotsearch.randomizedtesting.RandomizedRunner$8.evaluate(RandomizedRunner.java:871)
	at com.carrotsearch.randomizedtesting.RandomizedRunner$9.evaluate(RandomizedRunner.java:907)
	at com.carrotsearch.randomizedtesting.RandomizedRunner$10.evaluate(RandomizedRunner.java:921)
	at com.carrotsearch.randomizedtesting.rules.SystemPropertiesRestoreRule$1.evaluate(SystemPropertiesRestoreRule.java:57)
	at org.apache.lucene.util.TestRuleSetupTeardownChained$1.evaluate(TestRuleSetupTeardownChained.java:49)
	at org.apache.lucene.util.AbstractBeforeAfterRule$1.evaluate(AbstractBeforeAfterRule.java:45)
	at org.apache.lucene.util.TestRuleThreadAndTestName$1.evaluate(TestRuleThreadAndTestName.java:48)
	at org.apache.lucene.util.TestRuleIgnoreAfterMaxFailures$1.evaluate(TestRuleIgnoreAfterMaxFailures.java:64)
	at org.apache.lucene.util.TestRuleMarkFailure$1.evaluate(TestRuleMarkFailure.java:47)
	at com.carrotsearch.randomizedtesting.rules.StatementAdapter.evaluate(StatementAdapter.java:36)
	at com.carrotsearch.randomizedtesting.ThreadLeakControl$StatementRunner.run(ThreadLeakControl.java:367)
	at com.carrotsearch.randomizedtesting.ThreadLeakControl.forkTimeoutingTask(ThreadLeakControl.java:809)
	at com.carrotsearch.randomizedtesting.ThreadLeakControl$3.evaluate(ThreadLeakControl.java:460)
	at com.carrotsearch.randomizedtesting.RandomizedRunner.runSingleTest(RandomizedRunner.java:880)
	at com.carrotsearch.randomizedtesting.RandomizedRunner$5.evaluate(RandomizedRunner.java:781)
	at com.carrotsearch.randomizedtesting.RandomizedRunner$6.evaluate(RandomizedRunner.java:816)
	at com.carrotsearch.randomizedtesting.RandomizedRunner$7.evaluate(RandomizedRunner.java:827)
	at com.carrotsearch.randomizedtesting.rules.StatementAdapter.evaluate(StatementAdapter.java:36)
	at com.carrotsearch.randomizedtesting.rules.SystemPropertiesRestoreRule$1.evaluate(SystemPropertiesRestoreRule.java:57)
	at org.apache.lucene.util.AbstractBeforeAfterRule$1.evaluate(AbstractBeforeAfterRule.java:45)
	at com.carrotsearch.randomizedtesting.rules.StatementAdapter.evaluate(StatementAdapter.java:36)
	at org.apache.lucene.util.TestRuleStoreClassName$1.evaluate(TestRuleStoreClassName.java:41)
	at com.carrotsearch.randomizedtesting.rules.NoShadowingOrOverridesOnMethodsRule$1.evaluate(NoShadowingOrOverridesOnMethodsRule.java:40)
	at com.carrotsearch.randomizedtesting.rules.NoShadowingOrOverridesOnMethodsRule$1.evaluate(NoShadowingOrOverridesOnMethodsRule.java:40)
	at com.carrotsearch.randomizedtesting.rules.StatementAdapter.evaluate(StatementAdapter.java:36)
	at com.carrotsearch.randomizedtesting.rules.StatementAdapter.evaluate(StatementAdapter.java:36)
	at com.carrotsearch.randomizedtesting.rules.StatementAdapter.evaluate(StatementAdapter.java:36)
	at org.apache.lucene.util.TestRuleAssertionsRequired$1.evaluate(TestRuleAssertionsRequired.java:53)
	at org.apache.lucene.util.TestRuleMarkFailure$1.evaluate(TestRuleMarkFailure.java:47)
	at org.apache.lucene.util.TestRuleIgnoreAfterMaxFailures$1.evaluate(TestRuleIgnoreAfterMaxFailures.java:64)
	at org.apache.lucene.util.TestRuleIgnoreTestSuites$1.evaluate(TestRuleIgnoreTestSuites.java:54)
	at com.carrotsearch.randomizedtesting.rules.StatementAdapter.evaluate(StatementAdapter.java:36)
	at com.carrotsearch.randomizedtesting.ThreadLeakControl$StatementRunner.run(ThreadLeakControl.java:367)
	at java.lang.Thread.run(Thread.java:745)




Build Log:
[...truncated 11058 lines...]
   [junit4] Suite: org.apache.solr.handler.TestReplicationHandler
   [junit4]   2> Creating dataDir: C:\Users\jenkins\workspace\Lucene-Solr-6.x-Windows\solr\build\solr-core\test\J0\temp\solr.handler.TestReplicationHandler_C7F24F7FD24F8B5A-001\init-core-data-001
   [junit4]   2> 449055 INFO  (SUITE-TestReplicationHandler-seed#[C7F24F7FD24F8B5A]-worker) [    ] o.a.s.SolrTestCaseJ4 Randomized ssl (false) and clientAuth (false) via: @org.apache.solr.SolrTestCaseJ4$SuppressSSL(bugUrl=None)
   [junit4]   2> 449056 INFO  (TEST-TestReplicationHandler.doTestRepeater-seed#[C7F24F7FD24F8B5A]) [    ] o.a.s.SolrTestCaseJ4 ###Starting doTestRepeater
   [junit4]   2> 449058 INFO  (TEST-TestReplicationHandler.doTestRepeater-seed#[C7F24F7FD24F8B5A]) [    ] o.a.s.SolrTestCaseJ4 Writing core.properties file to C:\Users\jenkins\workspace\Lucene-Solr-6.x-Windows\solr\build\solr-core\test\J0\temp\solr.handler.TestReplicationHandler_C7F24F7FD24F8B5A-001\solr-instance-001\collection1
   [junit4]   2> 449070 INFO  (TEST-TestReplicationHandler.doTestRepeater-seed#[C7F24F7FD24F8B5A]) [    ] o.e.j.s.Server jetty-9.3.8.v20160314
   [junit4]   2> 449071 INFO  (TEST-TestReplicationHandler.doTestRepeater-seed#[C7F24F7FD24F8B5A]) [    ] o.e.j.s.h.ContextHandler Started o.e.j.s.ServletContextHandler@1551c24{/solr,null,AVAILABLE}
   [junit4]   2> 449073 INFO  (TEST-TestReplicationHandler.doTestRepeater-seed#[C7F24F7FD24F8B5A]) [    ] o.e.j.s.ServerConnector Started ServerConnector@eca634{HTTP/1.1,[http/1.1]}{127.0.0.1:63857}
   [junit4]   2> 449073 INFO  (TEST-TestReplicationHandler.doTestRepeater-seed#[C7F24F7FD24F8B5A]) [    ] o.e.j.s.Server Started @453457ms
   [junit4]   2> 449073 INFO  (TEST-TestReplicationHandler.doTestRepeater-seed#[C7F24F7FD24F8B5A]) [    ] o.a.s.c.s.e.JettySolrRunner Jetty properties: {solr.data.dir=C:\Users\jenkins\workspace\Lucene-Solr-6.x-Windows\solr\build\solr-core\test\J0\temp\solr.handler.TestReplicationHandler_C7F24F7FD24F8B5A-001\solr-instance-001\collection1\data, hostContext=/solr, hostPort=63857}
   [junit4]   2> 449074 INFO  (TEST-TestReplicationHandler.doTestRepeater-seed#[C7F24F7FD24F8B5A]) [    ] o.a.s.s.SolrDispatchFilter SolrDispatchFilter.init(): sun.misc.Launcher$AppClassLoader@1d16e93
   [junit4]   2> 449074 INFO  (TEST-TestReplicationHandler.doTestRepeater-seed#[C7F24F7FD24F8B5A]) [    ] o.a.s.c.SolrResourceLoader new SolrResourceLoader for directory: 'C:\Users\jenkins\workspace\Lucene-Solr-6.x-Windows\solr\build\solr-core\test\J0\temp\solr.handler.TestReplicationHandler_C7F24F7FD24F8B5A-001\solr-instance-001'
   [junit4]   2> 449074 INFO  (TEST-TestReplicationHandler.doTestRepeater-seed#[C7F24F7FD24F8B5A]) [    ] o.a.s.c.SolrResourceLoader JNDI not configured for solr (NoInitialContextEx)
   [junit4]   2> 449074 INFO  (TEST-TestReplicationHandler.doTestRepeater-seed#[C7F24F7FD24F8B5A]) [    ] o.a.s.c.SolrResourceLoader solr home defaulted to 'solr/' (could not find system property or JNDI)
   [junit4]   2> 449076 INFO  (TEST-TestReplicationHandler.doTestRepeater-seed#[C7F24F7FD24F8B5A]) [    ] o.a.s.c.SolrXmlConfig Loading container configuration from C:\Users\jenkins\workspace\Lucene-Solr-6.x-Windows\solr\build\solr-core\test\J0\temp\solr.handler.TestReplicationHandler_C7F24F7FD24F8B5A-001\solr-instance-001\solr.xml
   [junit4]   2> 449084 INFO  (TEST-TestReplicationHandler.doTestRepeater-seed#[C7F24F7FD24F8B5A]) [    ] o.a.s.c.CorePropertiesLocator Config-defined core root directory: C:\Users\jenkins\workspace\Lucene-Solr-6.x-Windows\solr\build\solr-core\test\J0\temp\solr.handler.TestReplicationHandler_C7F24F7FD24F8B5A-001\solr-instance-001\.
   [junit4]   2> 449084 INFO  (TEST-TestReplicationHandler.doTestRepeater-seed#[C7F24F7FD24F8B5A]) [    ] o.a.s.c.CoreContainer New CoreContainer 10527613
   [junit4]   2> 449084 INFO  (TEST-TestReplicationHandler.doTestRepeater-seed#[C7F24F7FD24F8B5A]) [    ] o.a.s.c.CoreContainer Loading cores into CoreContainer [instanceDir=C:\Users\jenkins\workspace\Lucene-Solr-6.x-Windows\solr\build\solr-core\test\J0\temp\solr.handler.TestReplicationHandler_C7F24F7FD24F8B5A-001\solr-instance-001]
   [junit4]   2> 449084 WARN  (TEST-TestReplicationHandler.doTestRepeater-seed#[C7F24F7FD24F8B5A]) [    ] o.a.s.c.CoreContainer Couldn't add files from C:\Users\jenkins\workspace\Lucene-Solr-6.x-Windows\solr\build\solr-core\test\J0\temp\solr.handler.TestReplicationHandler_C7F24F7FD24F8B5A-001\solr-instance-001\lib to classpath: C:\Users\jenkins\workspace\Lucene-Solr-6.x-Windows\solr\build\solr-core\test\J0\temp\solr.handler.TestReplicationHandler_C7F24F7FD24F8B5A-001\solr-instance-001\lib
   [junit4]   2> 449084 INFO  (TEST-TestReplicationHandler.doTestRepeater-seed#[C7F24F7FD24F8B5A]) [    ] o.a.s.h.c.HttpShardHandlerFactory created with socketTimeout : 90000,urlScheme : ,connTimeout : 15000,maxConnectionsPerHost : 20,maxConnections : 10000,corePoolSize : 0,maximumPoolSize : 2147483647,maxThreadIdleTime : 5,sizeOfQueue : -1,fairnessPolicy : false,useRetries : false,connectionsEvictorSleepDelay : 5000,maxConnectionIdleTime : 40000,
   [junit4]   2> 449086 INFO  (TEST-TestReplicationHandler.doTestRepeater-seed#[C7F24F7FD24F8B5A]) [    ] o.a.s.u.UpdateShardHandler Creating UpdateShardHandler HTTP client with params: socketTimeout=340000&connTimeout=45000&retry=true
   [junit4]   2> 449086 INFO  (TEST-TestReplicationHandler.doTestRepeater-seed#[C7F24F7FD24F8B5A]) [    ] o.a.s.l.LogWatcher SLF4J impl is org.slf4j.impl.Log4jLoggerFactory
   [junit4]   2> 449086 INFO  (TEST-TestReplicationHandler.doTestRepeater-seed#[C7F24F7FD24F8B5A]) [    ] o.a.s.l.LogWatcher Registering Log Listener [Log4j (org.slf4j.impl.Log4jLoggerFactory)]
   [junit4]   2> 449086 INFO  (TEST-TestReplicationHandler.doTestRepeater-seed#[C7F24F7FD24F8B5A]) [    ] o.a.s.c.CoreContainer Security conf doesn't exist. Skipping setup for authorization module.
   [junit4]   2> 449086 INFO  (TEST-TestReplicationHandler.doTestRepeater-seed#[C7F24F7FD24F8B5A]) [    ] o.a.s.c.CoreContainer No authentication plugin used.
   [junit4]   2> 449088 INFO  (TEST-TestReplicationHandler.doTestRepeater-seed#[C7F24F7FD24F8B5A]) [    ] o.a.s.c.CorePropertiesLocator Looking for core definitions underneath C:\Users\jenkins\workspace\Lucene-Solr-6.x-Windows\solr\build\solr-core\test\J0\temp\solr.handler.TestReplicationHandler_C7F24F7FD24F8B5A-001\solr-instance-001\.
   [junit4]   2> 449091 INFO  (TEST-TestReplicationHandler.doTestRepeater-seed#[C7F24F7FD24F8B5A]) [    ] o.a.s.c.CoreDescriptor Created CoreDescriptor: {name=collection1, config=solrconfig.xml, loadOnStartup=true, schema=schema.xml, configSetProperties=configsetprops.json, transient=false, dataDir=data\}
   [junit4]   2> 449091 INFO  (TEST-TestReplicationHandler.doTestRepeater-seed#[C7F24F7FD24F8B5A]) [    ] o.a.s.c.CorePropertiesLocator Found core collection1 in C:\Users\jenkins\workspace\Lucene-Solr-6.x-Windows\solr\build\solr-core\test\J0\temp\solr.handler.TestReplicationHandler_C7F24F7FD24F8B5A-001\solr-instance-001\.\collection1
   [junit4]   2> 449092 INFO  (TEST-TestReplicationHandler.doTestRepeater-seed#[C7F24F7FD24F8B5A]) [    ] o.a.s.c.CorePropertiesLocator Found 1 core definitions
   [junit4]   2> 449092 INFO  (TEST-TestReplicationHandler.doTestRepeater-seed#[C7F24F7FD24F8B5A]) [    ] o.a.s.s.SolrDispatchFilter user.dir=C:\Users\jenkins\workspace\Lucene-Solr-6.x-Windows\solr\build\solr-core\test\J0
   [junit4]   2> 449092 INFO  (TEST-TestReplicationHandler.doTestRepeater-seed#[C7F24F7FD24F8B5A]) [    ] o.a.s.s.SolrDispatchFilter SolrDispatchFilter.init() done
   [junit4]   2> 449092 INFO  (coreLoadExecutor-1689-thread-1) [    ] o.a.s.c.SolrResourceLoader new SolrResourceLoader for directory: 'C:\Users\jenkins\workspace\Lucene-Solr-6.x-Windows\solr\build\solr-core\test\J0\temp\solr.handler.TestReplicationHandler_C7F24F7FD24F8B5A-001\solr-instance-001\collection1'
   [junit4]   2> 449093 INFO  (coreLoadExecutor-1689-thread-1) [    ] o.a.s.c.SolrResourceLoader JNDI not configured for solr (NoInitialContextEx)
   [junit4]   2> 449093 INFO  (coreLoadExecutor-1689-thread-1) [    ] o.a.s.c.SolrResourceLoader solr home defaulted to 'solr/' (could not find system property or JNDI)
   [junit4]   2> 449117 INFO  (coreLoadExecutor-1689-thread-1) [    ] o.a.s.c.SolrConfig current version of requestparams : -1
   [junit4]   2> 449120 INFO  (coreLoadExecutor-1689-thread-1) [    ] o.a.s.c.SolrConfig Using Lucene MatchVersion: 6.3.0
   [junit4]   2> 449139 INFO  (coreLoadExecutor-1689-thread-1) [    ] o.a.s.c.SolrConfig Loaded SolrConfig: solrconfig.xml
   [junit4]   2> 449145 INFO  (coreLoadExecutor-1689-thread-1) [    ] o.a.s.s.IndexSchema [collection1] Schema name=test
   [junit4]   2> 449150 INFO  (coreLoadExecutor-1689-thread-1) [    ] o.a.s.s.IndexSchema unique key field: id
   [junit4]   2> 449159 INFO  (coreLoadExecutor-1689-thread-1) [    ] o.a.s.c.ConfigSetProperties Did not find ConfigSet properties, assuming default properties: Can't find resource 'configsetprops.json' in classpath or 'C:\Users\jenkins\workspace\Lucene-Solr-6.x-Windows\solr\build\solr-core\test\J0\temp\solr.handler.TestReplicationHandler_C7F24F7FD24F8B5A-001\solr-instance-001\collection1'
   [junit4]   2> 449159 INFO  (coreLoadExecutor-1689-thread-1) [    ] o.a.s.c.CoreContainer Creating SolrCore 'collection1' using configuration from instancedir C:\Users\jenkins\workspace\Lucene-Solr-6.x-Windows\solr\build\solr-core\test\J0\temp\solr.handler.TestReplicationHandler_C7F24F7FD24F8B5A-001\solr-instance-001\.\collection1
   [junit4]   2> 449159 INFO  (coreLoadExecutor-1689-thread-1) [    x:collection1] o.a.s.c.SolrCore org.apache.solr.core.MockDirectoryFactory
   [junit4]   2> 449159 INFO  (coreLoadExecutor-1689-thread-1) [    x:collection1] o.a.s.c.SolrCore [[collection1] ] Opening new SolrCore at [C:\Users\jenkins\workspace\Lucene-Solr-6.x-Windows\solr\build\solr-core\test\J0\temp\solr.handler.TestReplicationHandler_C7F24F7FD24F8B5A-001\solr-instance-001\collection1], dataDir=[C:\Users\jenkins\workspace\Lucene-Solr-6.x-Windows\solr\build\solr-core\test\J0\temp\solr.handler.TestReplicationHandler_C7F24F7FD24F8B5A-001\solr-instance-001\.\collection1\data\]
   [junit4]   2> 449159 INFO  (coreLoadExecutor-1689-thread-1) [    x:collection1] o.a.s.c.SolrCore JMX monitoring not detected for core: collection1
   [junit4]   2> 449160 INFO  (coreLoadExecutor-1689-thread-1) [    x:collection1] o.a.s.c.CachingDirectoryFactory return new directory for C:\Users\jenkins\workspace\Lucene-Solr-6.x-Windows\solr\build\solr-core\test\J0\temp\solr.handler.TestReplicationHandler_C7F24F7FD24F8B5A-001\solr-instance-001\.\collection1\data\snapshot_metadata
   [junit4]   2> 449160 INFO  (coreLoadExecutor-1689-thread-1) [    x:collection1] o.a.s.c.s.SolrSnapshotMetaDataManager Loading from snapshot metadata file...
   [junit4]   2> 449160 INFO  (coreLoadExecutor-1689-thread-1) [    x:collection1] o.a.s.c.CachingDirectoryFactory return new directory for C:\Users\jenkins\workspace\Lucene-Solr-6.x-Windows\solr\build\solr-core\test\J0\temp\solr.handler.TestReplicationHandler_C7F24F7FD24F8B5A-001\solr-instance-001\.\collection1\data\
   [junit4]   2> 449160 INFO  (coreLoadExecutor-1689-thread-1) [    x:collection1] o.a.s.c.SolrCore New index directory detected: old=null new=C:\Users\jenkins\workspace\Lucene-Solr-6.x-Windows\solr\build\solr-core\test\J0\temp\solr.handler.TestReplicationHandler_C7F24F7FD24F8B5A-001\solr-instance-001\.\collection1\data\index/
   [junit4]   2> 449160 WARN  (coreLoadExecutor-1689-thread-1) [    x:collection1] o.a.s.c.SolrCore [collection1] Solr index directory 'C:\Users\jenkins\workspace\Lucene-Solr-6.x-Windows\solr\build\solr-core\test\J0\temp\solr.handler.TestReplicationHandler_C7F24F7FD24F8B5A-001\solr-instance-001\.\collection1\data\index' doesn't exist. Creating new index...
   [junit4]   2> 449161 INFO  (coreLoadExecutor-1689-thread-1) [    x:collection1] o.a.s.c.CachingDirectoryFactory return new directory for C:\Users\jenkins\workspace\Lucene-Solr-6.x-Windows\solr\build\solr-core\test\J0\temp\solr.handler.TestReplicationHandler_C7F24F7FD24F8B5A-001\solr-instance-001\.\collection1\data\index
   [junit4]   2> 449163 INFO  (coreLoadExecutor-1689-thread-1) [    x:collection1] o.a.s.u.RandomMergePolicy RandomMergePolicy wrapping class org.apache.lucene.index.MockRandomMergePolicy: org.apache.lucene.index.MockRandomMergePolicy@edcc7a
   [junit4]   2> 449164 INFO  (coreLoadExecutor-1689-thread-1) [    x:collection1] o.a.s.c.SolrDeletionPolicy SolrDeletionPolicy.onCommit: commits: num=1
   [junit4]   2> 	commit{dir=MockDirectoryWrapper(RAMDirectory@bab325 lockFactory=org.apache.lucene.store.SingleInstanceLockFactory@1cc38ea),segFN=segments_1,generation=1}
   [junit4]   2> 449164 INFO  (coreLoadExecutor-1689-thread-1) [    x:collection1] o.a.s.c.SolrDeletionPolicy newest commit generation = 1
   [junit4]   2> 449166 INFO  (OldIndexDirectoryCleanupThreadForCore-collection1) [    x:collection1] o.a.s.c.SolrCore Looking for old index directories to cleanup for core collection1 in C:\Users\jenkins\workspace\Lucene-Solr-6.x-Windows\solr\build\solr-core\test\J0\temp\solr.handler.TestReplicationHandler_C7F24F7FD24F8B5A-001\solr-instance-001\.\collection1\data\
   [junit4]   2> 449166 INFO  (coreLoadExecutor-1689-thread-1) [    x:collection1] o.a.s.c.SolrCore no updateRequestProcessorChain defined as default, creating implicit default
   [junit4]   2> 449173 INFO  (coreLoadExecutor-1689-thread-1) [    x:collection1] o.a.s.h.l.XMLLoader xsltCacheLifetimeSeconds=60
   [junit4]   2> 449174 INFO  (coreLoadExecutor-1689-thread-1) [    x:collection1] o.a.s.h.l.XMLLoader xsltCacheLifetimeSeconds=60
   [junit4]   2> 449176 INFO  (coreLoadExecutor-1689-thread-1) [    x:collection1] o.a.s.h.l.XMLLoader xsltCacheLifetimeSeconds=60
   [junit4]   2> 449177 INFO  (coreLoadExecutor-1689-thread-1) [    x:collection1] o.a.s.h.l.XMLLoader xsltCacheLifetimeSeconds=60
   [junit4]   2> 449180 INFO  (coreLoadExecutor-1689-thread-1) [    x:collection1] o.a.s.c.PluginBag requestHandler : 'lazy' created with startup=lazy 
   [junit4]   2> 449180 INFO  (coreLoadExecutor-1689-thread-1) [    x:collection1] o.a.s.c.RequestHandlers Registered paths: /admin/mbeans,standard,lazy,/update/json/docs,/admin/luke,/export,/get,/admin/properties,/update/json,/admin/threads,/update/csv,/sql,/graph,/admin/segments,/admin/system,/replication,defaults,/config,/stream,/schema,/admin/plugins,/admin/logging,/admin/ping,/update,/admin/file,/terms
   [junit4]   2> 449180 INFO  (coreLoadExecutor-1689-thread-1) [    x:collection1] o.a.s.c.SolrCore Using default statsCache cache: org.apache.solr.search.stats.LocalStatsCache
   [junit4]   2> 449180 INFO  (coreLoadExecutor-1689-thread-1) [    x:collection1] o.a.s.u.CommitTracker Hard AutoCommit: disabled
   [junit4]   2> 449180 INFO  (coreLoadExecutor-1689-thread-1) [    x:collection1] o.a.s.u.CommitTracker Soft AutoCommit: disabled
   [junit4]   2> 449180 INFO  (coreLoadExecutor-1689-thread-1) [    x:collection1] o.a.s.u.RandomMergePolicy RandomMergePolicy wrapping class org.apache.lucene.index.TieredMergePolicy: [TieredMergePolicy: maxMergeAtOnce=20, maxMergeAtOnceExplicit=15, maxMergedSegmentMB=72.5693359375, floorSegmentMB=1.484375, forceMergeDeletesPctAllowed=0.6529096288777358, segmentsPerTier=34.0, maxCFSSegmentSizeMB=8.796093022207999E12, noCFSRatio=0.46144161254256744
   [junit4]   2> 449181 INFO  (coreLoadExecutor-1689-thread-1) [    x:collection1] o.a.s.c.SolrDeletionPolicy SolrDeletionPolicy.onInit: commits: num=1
   [junit4]   2> 	commit{dir=MockDirectoryWrapper(RAMDirectory@bab325 lockFactory=org.apache.lucene.store.SingleInstanceLockFactory@1cc38ea),segFN=segments_1,generation=1}
   [junit4]   2> 449181 INFO  (coreLoadExecutor-1689-thread-1) [    x:collection1] o.a.s.c.SolrDeletionPolicy newest commit generation = 1
   [junit4]   2> 449181 INFO  (coreLoadExecutor-1689-thread-1) [    x:collection1] o.a.s.s.SolrIndexSearcher Opening [Searcher@e2a694[collection1] main]
   [junit4]   2> 449181 INFO  (coreLoadExecutor-1689-thread-1) [    x:collection1] o.a.s.r.ManagedResourceStorage File-based storage initialized to use dir: C:\Users\jenkins\workspace\Lucene-Solr-6.x-Windows\solr\build\solr-core\test\J0\temp\solr.handler.TestReplicationHandler_C7F24F7FD24F8B5A-001\solr-instance-001\collection1\conf
   [junit4]   2> 449181 INFO  (coreLoadExecutor-1689-thread-1) [    x:collection1] o.a.s.r.RestManager Initializing RestManager with initArgs: {storageDir=C:\Users\jenkins\workspace\Lucene-Solr-6.x-Windows\solr\build\solr-core\test\J0\temp\solr.handler.TestReplicationHandler_C7F24F7FD24F8B5A-001\solr-instance-001\collection1\conf}
   [junit4]   2> 449181 INFO  (coreLoadExecutor-1689-thread-1) [    x:collection1] o.a.s.r.ManagedResourceStorage Reading _rest_managed.json using file:dir=C:\Users\jenkins\workspace\Lucene-Solr-6.x-Windows\solr\build\solr-core\test\J0\temp\solr.handler.TestReplicationHandler_C7F24F7FD24F8B5A-001\solr-instance-001\collection1\conf
   [junit4]   2> 449182 INFO  (coreLoadExecutor-1689-thread-1) [    x:collection1] o.a.s.r.RestManager Initializing 0 registered ManagedResources
   [junit4]   2> 449182 INFO  (coreLoadExecutor-1689-thread-1) [    x:collection1] o.a.s.h.ReplicationHandler Replication enabled for following config files: schema.xml,xslt/dummy.xsl
   [junit4]   2> 449182 INFO  (coreLoadExecutor-1689-thread-1) [    x:collection1] o.a.s.h.ReplicationHandler Commits will be reserved for  10000
   [junit4]   2> 449183 INFO  (coreLoadExecutor-1689-thread-1) [    x:collection1] o.a.s.c.CoreContainer registering core: collection1
   [junit4]   2> 449183 INFO  (searcherExecutor-1690-thread-1-processing-x:collection1) [    x:collection1] o.a.s.c.SolrCore [collection1] Registered new searcher Searcher@e2a694[collection1] main{ExitableDirectoryReader(UninvertingDirectoryReader())}
   [junit4]   2> 449595 INFO  (TEST-TestReplicationHandler.doTestRepeater-seed#[C7F24F7FD24F8B5A]) [    ] o.a.s.SolrTestCaseJ4 Writing core.properties file to C:\Users\jenkins\workspace\Lucene-Solr-6.x-Windows\solr\build\solr-core\test\J0\temp\solr.handler.TestReplicationHandler_C7F24F7FD24F8B5A-001\solr-instance-002\collection1
   [junit4]   2> 449604 INFO  (TEST-TestReplicationHandler.doTestRepeater-seed#[C7F24F7FD24F8B5A]) [    ] o.e.j.s.Server jetty-9.3.8.v20160314
   [junit4]   2> 449605 INFO  (TEST-TestReplicationHandler.doTestRepeater-seed#[C7F24F7FD24F8B5A]) [    ] o.e.j.s.h.ContextHandler Started o.e.j.s.ServletContextHandler@90c492{/solr,null,AVAILABLE}
   [junit4]   2> 449606 INFO  (TEST-TestReplicationHandler.doTestRepeater-seed#[C7F24F7FD24F8B5A]) [    ] o.e.j.s.ServerConnector Started ServerConnector@91bc7d{HTTP/1.1,[http/1.1]}{127.0.0.1:63872}
   [junit4]   2> 449607 INFO  (TEST-TestReplicationHandler.doTestRepeater-seed#[C7F24F7FD24F8B5A]) [    ] o.e.j.s.Server Started @453991ms
   [junit4]   2> 449607 INFO  (TEST-TestReplicationHandler.doTestRepeater-seed#[C7F24F7FD24F8B5A]) [    ] o.a.s.c.s.e.JettySolrRunner Jetty properties: {solr.data.dir=C:\Users\jenkins\workspace\Lucene-Solr-6.x-Windows\solr\build\solr-core\test\J0\temp\solr.handler.TestReplicationHandler_C7F24F7FD24F8B5A-001\solr-instance-002\collection1\data, hostContext=/solr, hostPort=63872}
   [junit4]   2> 449607 INFO  (TEST-TestReplicationHandler.doTestRepeater-seed#[C7F24F7FD24F8B5A]) [    ] o.a.s.s.SolrDispatchFilter SolrDispatchFilter.init(): sun.misc.Launcher$AppClassLoader@1d16e93
   [junit4]   2> 449607 INFO  (TEST-TestReplicationHandler.doTestRepeater-seed#[C7F24F7FD24F8B5A]) [    ] o.a.s.c.SolrResourceLoader new SolrResourceLoader for directory: 'C:\Users\jenkins\workspace\Lucene-Solr-6.x-Windows\solr\build\solr-core\test\J0\temp\solr.handler.TestReplicationHandler_C7F24F7FD24F8B5A-001\solr-instance-002'
   [junit4]   2> 449608 INFO  (TEST-TestReplicationHandler.doTestRepeater-seed#[C7F24F7FD24F8B5A]) [    ] o.a.s.c.SolrResourceLoader JNDI not configured for solr (NoInitialContextEx)
   [junit4]   2> 449608 INFO  (TEST-TestReplicationHandler.doTestRepeater-seed#[C7F24F7FD24F8B5A]) [    ] o.a.s.c.SolrResourceLoader solr home defaulted to 'solr/' (could not find system property or JNDI)
   [junit4]   2> 449608 INFO  (TEST-TestReplicationHandler.doTestRepeater-seed#[C7F24F7FD24F8B5A]) [    ] o.a.s.c.SolrXmlConfig Loading container configuration from C:\Users\jenkins\workspace\Lucene-Solr-6.x-Windows\solr\build\solr-core\test\J0\temp\solr.handler.TestReplicationHandler_C7F24F7FD24F8B5A-001\solr-instance-002\solr.xml
   [junit4]   2> 449614 INFO  (TEST-TestReplicationHandler.doTestRepeater-seed#[C7F24F7FD24F8B5A]) [    ] o.a.s.c.CorePropertiesLocator Config-defined core root directory: C:\Users\jenkins\workspace\Lucene-Solr-6.x-Windows\solr\build\solr-core\test\J0\temp\solr.handler.TestReplicationHandler_C7F24F7FD24F8B5A-001\solr-instance-002\.
   [junit4]   2> 449614 INFO  (TEST-TestReplicationHandler.doTestRepeater-seed#[C7F24F7FD24F8B5A]) [    ] o.a.s.c.CoreContainer New CoreContainer 29717775
   [junit4]   2> 449614 INFO  (TEST-TestReplicationHandler.doTestRepeater-seed#[C7F24F7FD24F8B5A]) [    ] o.a.s.c.CoreContainer Loading cores into CoreContainer [instanceDir=C:\Users\jenkins\workspace\Lucene-Solr-6.x-Windows\solr\build\solr-core\test\J0\temp\solr.handler.TestReplicationHandler_C7F24F7FD24F8B5A-001\solr-instance-002]
   [junit4]   2> 449614 WARN  (TEST-TestReplicationHandler.doTestRepeater-seed#[C7F24F7FD24F8B5A]) [    ] o.a.s.c.CoreContainer Couldn't add files from C:\Users\jenkins\workspace\Lucene-Solr-6.x-Windows\solr\build\solr-core\test\J0\temp\solr.handler.TestReplicationHandler_C7F24F7FD24F8B5A-001\solr-instance-002\lib to classpath: C:\Users\jenkins\workspace\Lucene-Solr-6.x-Windows\solr\build\solr-core\test\J0\temp\solr.handler.TestReplicationHandler_C7F24F7FD24F8B5A-001\solr-instance-002\lib
   [junit4]   2> 449615 INFO  (TEST-TestReplicationHandler.doTestRepeater-seed#[C7F24F7FD24F8B5A]) [    ] o.a.s.h.c.HttpShardHandlerFactory created with socketTimeout : 90000,urlScheme : ,connTimeout : 15000,maxConnectionsPerHost : 20,maxConnections : 10000,corePoolSize : 0,maximumPoolSize : 2147483647,maxThreadIdleTime : 5,sizeOfQueue : -1,fairnessPolicy : false,useRetries : false,connectionsEvictorSleepDelay : 5000,maxConnectionIdleTime : 40000,
   [junit4]   2> 449619 INFO  (TEST-TestReplicationHandler.doTestRepeater-seed#[C7F24F7FD24F8B5A]) [    ] o.a.s.u.UpdateShardHandler Creating UpdateShardHandler HTTP client with params: socketTimeout=340000&connTimeout=45000&retry=true
   [junit4]   2> 449620 INFO  (TEST-TestReplicationHandler.doTestRepeater-seed#[C7F24F7FD24F8B5A]) [    ] o.a.s.l.LogWatcher SLF4J impl is org.slf4j.impl.Log4jLoggerFactory
   [junit4]   2> 449620 INFO  (TEST-TestReplicationHandler.doTestRepeater-seed#[C7F24F7FD24F8B5A]) [    ] o.a.s.l.LogWatcher Registering Log Listener [Log4j (org.slf4j.impl.Log4jLoggerFactory)]
   [junit4]   2> 449620 INFO  (TEST-TestReplicationHandler.doTestRepeater-seed#[C7F24F7FD24F8B5A]) [    ] o.a.s.c.CoreContainer Security conf doesn't exist. Skipping setup for authorization module.
   [junit4]   2> 449620 INFO  (TEST-TestReplicationHandler.doTestRepeater-seed#[C7F24F7FD24F8B5A]) [    ] o.a.s.c.CoreContainer No authentication plugin used.
   [junit4]   2> 449621 INFO  (TEST-TestReplicationHandler.doTestRepeater-seed#[C7F24F7FD24F8B5A]) [    ] o.a.s.c.CorePropertiesLocator Looking for core definitions underneath C:\Users\jenkins\workspace\Lucene-Solr-6.x-Windows\solr\build\solr-core\test\J0\temp\solr.handler.TestReplicationHandler_C7F24F7FD24F8B5A-001\solr-instance-002\.
   [junit4]   2> 449624 INFO  (TEST-TestReplicationHandler.doTestRepeater-seed#[C7F24F7FD24F8B5A]) [    ] o.a.s.c.CoreDescriptor Created CoreDescriptor: {name=collection1, config=solrconfig.xml, loadOnStartup=true, schema=schema.xml, configSetProperties=configsetprops.json, transient=false, dataDir=data\}
   [junit4]   2> 449625 INFO  (TEST-TestReplicationHandler.doTestRepeater-seed#[C7F24F7FD24F8B5A]) [    ] o.a.s.c.CorePropertiesLocator Found core collection1 in C:\Users\jenkins\workspace\Lucene-Solr-6.x-Windows\solr\build\solr-core\test\J0\temp\solr.handler.TestReplicationHandler_C7F24F7FD24F8B5A-001\solr-instance-002\.\collection1
   [junit4]   2> 449625 INFO  (TEST-TestReplicationHandler.doTestRepeater-seed#[C7F24F7FD24F8B5A]) [    ] o.a.s.c.CorePropertiesLocator Found 1 core definitions
   [junit4]   2> 449625 INFO  (TEST-TestReplicationHandler.doTestRepeater-seed#[C7F24F7FD24F8B5A]) [    ] o.a.s.s.SolrDispatchFilter user.dir=C:\Users\jenkins\workspace\Lucene-Solr-6.x-Windows\solr\build\solr-core\test\J0
   [junit4]   2> 449625 INFO  (coreLoadExecutor-1699-thread-1) [    ] o.a.s.c.SolrResourceLoader new SolrResourceLoader for directory: 'C:\Users\jenkins\workspace\Lucene-Solr-6.x-Windows\solr\build\solr-core\test\J0\temp\solr.handler.TestReplicationHandler_C7F24F7FD24F8B5A-001\solr-instance-002\collection1'
   [junit4]   2> 449625 INFO  (TEST-TestReplicationHandler.doTestRepeater-seed#[C7F24F7FD24F8B5A]) [    ] o.a.s.s.SolrDispatchFilter SolrDispatchFilter.init() done
   [junit4]   2> 449626 INFO  (coreLoadExecutor-1699-thread-1) [    ] o.a.s.c.SolrResourceLoader JNDI not configured for solr (NoInitialContextEx)
   [junit4]   2> 449626 INFO  (coreLoadExecutor-1699-thread-1) [    ] o.a.s.c.SolrResourceLoader solr home defaulted to 'solr/' (could not find system property or JNDI)
   [junit4]   2> 449640 INFO  (coreLoadExecutor-1699-thread-1) [    ] o.a.s.c.SolrConfig current version of requestparams : -1
   [junit4]   2> 449642 INFO  (coreLoadExecutor-1699-thread-1) [    ] o.a.s.c.SolrConfig Using Lucene MatchVersion: 6.3.0
   [junit4]   2> 449648 INFO  (coreLoadExecutor-1699-thread-1) [    ] o.a.s.c.SolrConfig Loaded SolrConfig: solrconfig.xml
   [junit4]   2> 449652 INFO  (coreLoadExecutor-1699-thread-1) [    ] o.a.s.s.IndexSchema [collection1] Schema name=test
   [junit4]   2> 449654 INFO  (coreLoadExecutor-1699-thread-1) [    ] o.a.s.s.IndexSchema unique key field: id
   [junit4]   2> 449657 INFO  (coreLoadExecutor-1699-thread-1) [    ] o.a.s.c.ConfigSetProperties Did not find ConfigSet properties, assuming default properties: Can't find resource 'configsetprops.json' in classpath or 'C:\Users\jenkins\workspace\Lucene-Solr-6.x-Windows\solr\build\solr-core\test\J0\temp\solr.handler.TestReplicationHandler_C7F24F7FD24F8B5A-001\solr-instance-002\collection1'
   [junit4]   2> 449657 INFO  (coreLoadExecutor-1699-thread-1) [    ] o.a.s.c.CoreContainer Creating SolrCore 'collection1' using configuration from instancedir C:\Users\jenkins\workspace\Lucene-Solr-6.x-Windows\solr\build\solr-core\test\J0\temp\solr.handler.TestReplicationHandler_C7F24F7FD24F8B5A-001\solr-instance-002\.\collection1
   [junit4]   2> 449657 INFO  (coreLoadExecutor-1699-thread-1) [    x:collection1] o.a.s.c.SolrCore org.apache.solr.core.MockDirectoryFactory
   [junit4]   2> 449657 INFO  (coreLoadExecutor-1699-thread-1) [    x:collection1] o.a.s.c.SolrCore [[collection1] ] Opening new SolrCore at [C:\Users\jenkins\workspace\Lucene-Solr-6.x-Windows\solr\build\solr-core\test\J0\temp\solr.handler.TestReplicationHandler_C7F24F7FD24F8B5A-001\solr-instance-002\collection1], dataDir=[C:\Users\jenkins\workspace\Lucene-Solr-6.x-Windows\solr\build\solr-core\test\J0\temp\solr.handler.TestReplicationHandler_C7F24F7FD24F8B5A-001\solr-instance-002\.\collection1\data\]
   [junit4]   2> 449658 INFO  (coreLoadExecutor-1699-thread-1) [    x:collection1] o.a.s.c.SolrCore JMX monitoring not detected for core: collection1
   [junit4]   2> 449658 INFO  (coreLoadExecutor-1699-thread-1) [    x:collection1] o.a.s.c.CachingDirectoryFactory return new directory for C:\Users\jenkins\workspace\Lucene-Solr-6.x-Windows\solr\build\solr-core\test\J0\temp\solr.handler.TestReplicationHandler_C7F24F7FD24F8B5A-001\solr-instance-002\.\collection1\data\snapshot_metadata
   [junit4]   2> 449658 INFO  (coreLoadExecutor-1699-thread-1) [    x:collection1] o.a.s.c.s.SolrSnapshotMetaDataManager Loading from snapshot metadata file...
   [junit4]   2> 449658 INFO  (coreLoadExecutor-1699-thread-1) [    x:collection1] o.a.s.c.CachingDirectoryFactory return new directory for C:\Users\jenkins\workspace\Lucene-Solr-6.x-Windows\solr\build\solr-core\test\J0\temp\solr.handler.TestReplicationHandler_C7F24F7FD24F8B5A-001\solr-instance-002\.\collection1\data\
   [junit4]   2> 449660 INFO  (coreLoadExecutor-1699-thread-1) [    x:collection1] o.a.s.c.SolrCore New index directory detected: old=null new=C:\Users\jenkins\workspace\Lucene-Solr-6.x-Windows\solr\build\solr-core\test\J0\temp\solr.handler.TestReplicationHandler_C7F24F7FD24F8B5A-001\solr-instance-002\.\collection1\data\index/
   [junit4]   2> 449660 WARN  (coreLoadExecutor-1699-thread-1) [    x:collection1] o.a.s.c.SolrCore [collection1] Solr index directory 'C:\Users\jenkins\workspace\Lucene-Solr-6.x-Windows\solr\build\solr-core\test\J0\temp\solr.handler.TestReplicationHandler_C7F24F7FD24F8B5A-001\solr-instance-002\.\collection1\data\index' doesn't exist. Creating new index...
   [junit4]   2> 449660 INFO  (coreLoadExecutor-1699-thread-1) [    x:collection1] o.a.s.c.CachingDirectoryFactory return new directory for C:\Users\jenkins\workspace\Lucene-Solr-6.x-Windows\solr\build\solr-core\test\J0\temp\solr.handler.TestReplicationHandler_C7F24F7FD24F8B5A-001\solr-instance-002\.\collection1\data\index
   [junit4]   2> 449660 INFO  (coreLoadExecutor-1699-thread-1) [    x:collection1] o.a.s.u.RandomMergePolicy RandomMergePolicy wrapping class org.apache.lucene.index.MockRandomMergePolicy: org.apache.lucene.index.MockRandomMergePolicy@1fd0dea
   [junit4]   2> 449662 INFO  (coreLoadExecutor-1699-thread-1) [    x:collection1] o.a.s.c.SolrDeletionPolicy SolrDeletionPolicy.onCommit: commits: num=1
   [junit4]   2> 	commit{dir=MockDirectoryWrapper(RAMDirectory@18a4153 lockFactory=org.apache.lucene.store.SingleInstanceLockFactory@1653d58),segFN=segments_1,generation=1}
   [junit4]   2> 449662 INFO  (coreLoadExecutor-1699-thread-1) [    x:collection1] o.a.s.c.SolrDeletionPolicy newest commit generation = 1
   [junit4]   2> 449663 INFO  (OldIndexDirectoryCleanupThreadForCore-collection1) [    x:collection1] o.a.s.c.SolrCore Looking for old index directories to cleanup for core collection1 in C:\Users\jenkins\workspace\Lucene-Solr-6.x-Windows\solr\build\solr-core\test\J0\temp\solr.handler.TestReplicationHandler_C7F24F7FD24F8B5A-001\solr-instance-002\.\collection1\data\
   [junit4]   2> 449665 INFO  (coreLoadExecutor-1699-thread-1) [    x:collection1] o.a.s.c.SolrCore no updateRequestProcessorChain defined as default, creating implicit default
   [junit4]   2> 449667 INFO  (coreLoadExecutor-1699-thread-1) [    x:collection1] o.a.s.h.l.XMLLoader xsltCacheLifetimeSeconds=60
   [junit4]   2> 449668 INFO  (coreLoadExecutor-1699-thread-1) [    x:collection1] o.a.s.h.l.XMLLoader xsltCacheLifetimeSeconds=60
   [junit4]   2> 449669 INFO  (coreLoadExecutor-1699-thread-1) [    x:collection1] o.a.s.h.l.XMLLoader xsltCacheLifetimeSeconds=60
   [junit4]   2> 449671 INFO  (coreLoadExecutor-1699-thread-1) [    x:collection1] o.a.s.h.l.XMLLoader xsltCacheLifetimeSeconds=60
   [junit4]   2> 449672 INFO  (coreLoadExecutor-1699-thread-1) [    x:collection1] o.a.s.c.PluginBag requestHandler : 'lazy' created with startup=lazy 
   [junit4]   2> 449672 INFO  (coreLoadExecutor-1699-thread-1) [    x:collection1] o.a.s.c.RequestHandlers Registered paths: /admin/mbeans,standard,lazy,/update/json/docs,/admin/luke,/export,/get,/admin/properties,/update/json,/admin/threads,/update/csv,/sql,/graph,/admin/segments,/admin/system,/replication,defaults,/config,/stream,/schema,/admin/plugins,/admin/logging,/admin/ping,/update,/admin/file,/terms
   [junit4]   2> 449672 INFO  (coreLoadExecutor-1699-thread-1) [    x:collection1] o.a.s.c.SolrCore Using default statsCache cache: org.apache.solr.search.stats.LocalStatsCache
   [junit4]   2> 449673 INFO  (coreLoadExecutor-1699-thread-1) [    x:collection1] o.a.s.u.CommitTracker Hard AutoCommit: disabled
   [junit4]   2> 449673 INFO  (coreLoadExecutor-1699-thread-1) [    x:collection1] o.a.s.u.CommitTracker Soft AutoCommit: disabled
   [junit4]   2> 449673 INFO  (coreLoadExecutor-1699-thread-1) [    x:collection1] o.a.s.u.RandomMergePolicy RandomMergePolicy wrapping class org.apache.lucene.index.TieredMergePolicy: [TieredMergePolicy: maxMergeAtOnce=20, maxMergeAtOnceExplicit=15, maxMergedSegmentMB=72.5693359375, floorSegmentMB=1.484375, forceMergeDeletesPctAllowed=0.6529096288777358, segmentsPerTier=34.0, maxCFSSegmentSizeMB=8.796093022207999E12, noCFSRatio=0.46144161254256744
   [junit4]   2> 449673 INFO  (coreLoadExecutor-1699-thread-1) [    x:collection1] o.a.s.c.SolrDeletionPolicy SolrDeletionPolicy.onInit: commits: num=1
   [junit4]   2> 	commit{dir=MockDirectoryWrapper(RAMDirectory@18a4153 lockFactory=org.apache.lucene.store.SingleInstanceLockFactory@1653d58),segFN=segments_1,generation=1}
   [junit4]   2> 449673 INFO  (coreLoadExecutor-1699-thread-1) [    x:collection1] o.a.s.c.SolrDeletionPolicy newest commit generation = 1
   [junit4]   2> 449673 INFO  (coreLoadExecutor-1699-thread-1) [    x:collection1] o.a.s.s.SolrIndexSearcher Opening [Searcher@8447e1[collection1] main]
   [junit4]   2> 449674 INFO  (coreLoadExecutor-1699-thread-1) [    x:collection1] o.a.s.r.ManagedResourceStorage File-based storage initialized to use dir: C:\Users\jenkins\workspace\Lucene-Solr-6.x-Windows\solr\build\solr-core\test\J0\temp\solr.handler.TestReplicationHandler_C7F24F7FD24F8B5A-001\solr-instance-002\collection1\conf
   [junit4]   2> 449674 INFO  (coreLoadExecutor-1699-thread-1) [    x:collection1] o.a.s.r.RestManager Initializing RestManager with initArgs: {storageDir=C:\Users\jenkins\workspace\Lucene-Solr-6.x-Windows\solr\build\solr-core\test\J0\temp\solr.handler.TestReplicationHandler_C7F24F7FD24F8B5A-001\solr-instance-002\collection1\conf}
   [junit4]   2> 449674 INFO  (coreLoadExecutor-1699-thread-1) [    x:collection1] o.a.s.r.ManagedResourceStorage Reading _rest_managed.json using file:dir=C:\Users\jenkins\workspace\Lucene-Solr-6.x-Windows\solr\build\solr-core\test\J0\temp\solr.handler.TestReplicationHandler_C7F24F7FD24F8B5A-001\solr-instance-002\collection1\conf
   [junit4]   2> 449674 INFO  (coreLoadExecutor-1699-thread-1) [    x:collection1] o.a.s.r.RestManager Initializing 0 registered ManagedResources
   [junit4]   2> 449676 INFO  (coreLoadExecutor-1699-thread-1) [    x:collection1] o.a.s.h.ReplicationHandler Poll scheduled at an interval of 1000ms
   [junit4]   2> 449676 INFO  (searcherExecutor-1700-thread-1-processing-x:collection1) [    x:collection1] o.a.s.c.SolrCore [collection1] Registered new searcher Searcher@8447e1[collection1] main{ExitableDirectoryReader(UninvertingDirectoryReader())}
   [junit4]   2> 449676 INFO  (coreLoadExecutor-1699-thread-1) [    x:collection1] o.a.s.c.CoreContainer registering core: collection1
   [junit4]   2> 450130 INFO  (TEST-TestReplicationHandler.doTestRepeater-seed#[C7F24F7FD24F8B5A]) [    ] o.e.j.s.ServerConnector Stopped ServerConnector@91bc7d{HTTP/1.1,[http/1.1]}{127.0.0.1:0}
   [junit4]   2> 450130 INFO  (TEST-TestReplicationHandler.doTestRepeater-seed#[C7F24F7FD24F8B5A]) [    ] o.a.s.c.CoreContainer Shutting down CoreContainer instance=29717775
   [junit4]   2> 450131 INFO  (coreCloseExecutor-1705-thread-1) [    x:collection1] o.a.s.c.SolrCore [collection1]  CLOSING SolrCore org.apache.solr.core.SolrCore@a7e5f9
   [junit4]   2> 450132 INFO  (coreCloseExecutor-1705-thread-1) [    x:collection1] o.a.s.u.DirectUpdateHandler2 closing DirectUpdateHandler2{commits=0,autocommits=0,soft autocommits=0,optimizes=0,rollbacks=0,expungeDeletes=0,docsPending=0,adds=0,deletesById=0,deletesByQuery=0,errors=0,cumulative_adds=0,cumulative_deletesById=0,cumulative_deletesByQuery=0,cumulative_errors=0}
   [junit4]   2> 450132 INFO  (coreCloseExecutor-1705-thread-1) [    x:collection1] o.a.s.u.SolrCoreState Closing SolrCoreState
   [junit4]   2> 450132 INFO  (coreCloseExecutor-1705-thread-1) [    x:collection1] o.a.s.u.DefaultSolrCoreState SolrCoreState ref count has reached 0 - closing IndexWriter
   [junit4]   2> 450132 INFO  (coreCloseExecutor-1705-thread-1) [    x:collection1] o.a.s.u.DefaultSolrCoreState closing IndexWriter with IndexWriterCloser
   [junit4]   2> 450134 INFO  (coreCloseExecutor-1705-thread-1) [    x:collection1] o.a.s.c.SolrCore [collection1] Closing main searcher on request.
   [junit4]   2> 450134 INFO  (coreCloseExecutor-1705-thread-1) [    x:collection1] o.a.s.c.CachingDirectoryFactory Closing MockDirectoryFactory - 3 directories currently being tracked
   [junit4]   2> 450134 INFO  (coreCloseExecutor-1705-thread-1) [    x:collection1] o.a.s.c.CachingDirectoryFactory looking to close C:\Users\jenkins\workspace\Lucene-Solr-6.x-Windows\solr\build\solr-core\test\J0\temp\solr.handler.TestReplicationHandler_C7F24F7FD24F8B5A-001\solr-instance-002\.\collection1\data\index [CachedDir<<refCount=0;path=C:\Users\jenkins\workspace\Lucene-Solr-6.x-Windows\solr\build\solr-core\test\J0\temp\solr.handler.TestReplicationHandler_C7F24F7FD24F8B5A-001\solr-instance-002\.\collection1\data\index;done=false>>]
   [junit4]   2> 450134 INFO  (coreCloseExecutor-1705-thread-1) [    x:collection1] o.a.s.c.CachingDirectoryFactory Closing directory, CoreContainer#isShutdown=true
   [junit4]   2> 450134 INFO  (coreCloseExecutor-1705-thread-1) [    x:collection1] o.a.s.c.CachingDirectoryFactory Closing directory: C:\Users\jenkins\workspace\Lucene-Solr-6.x-Windows\solr\build\solr-core\test\J0\temp\solr.handler.TestReplicationHandler_C7F24F7FD24F8B5A-001\solr-instance-002\.\collection1\data\index
   [junit4]   2> 450134 INFO  (coreCloseExecutor-1705-thread-1) [    x:collection1] o.a.s.c.CachingDirectoryFactory looking to close C:\Users\jenkins\workspace\Lucene-Solr-6.x-Windows\solr\build\solr-core\test\J0\temp\solr.handler.TestReplicationHandler_C7F24F7FD24F8B5A-001\solr-instance-002\.\collection1\data\ [CachedDir<<refCount=0;path=C:\Users\jenkins\workspace\Lucene-Solr-6.x-Windows\solr\build\solr-core\test\J0\temp\solr.handler.TestReplicationHandler_C7F24F7FD24F8B5A-001\solr-instance-002\.\collection1\data\;done=false>>]
   [junit4]   2> 450134 INFO  (coreCloseExecutor-1705-thread-1) [    x:collection1] o.a.s.c.CachingDirectoryFactory Closing directory, CoreContainer#isShutdown=true
   [junit4]   2> 450134 INFO  (coreCloseExecutor-1705-thread-1) [    x:collection1] o.a.s.c.CachingDirectoryFactory Closing directory: C:\Users\jenkins\workspace\Lucene-Solr-6.x-Windows\solr\build\solr-core\test\J0\temp\solr.handler.TestReplicationHandler_C7F24F7FD24F8B5A-001\solr-instance-002\.\collection1\data\
   [junit4]   2> 450134 INFO  (coreCloseExecutor-1705-thread-1) [    x:collection1] o.a.s.c.CachingDirectoryFactory looking to close C:\Users\jenkins\workspace\Lucene-Solr-6.x-Windows\solr\build\solr-core\test\J0\temp\solr.handler.TestReplicationHandler_C7F24F7FD24F8B5A-001\solr-instance-002\.\collection1\data\snapshot_metadata [CachedDir<<refCount=0;path=C:\Users\jenkins\workspace\Lucene-Solr-6.x-Windows\solr\build\solr-core\test\J0\temp\solr.handler.TestReplicationHandler_C7F24F7FD24F8B5A-001\solr-instance-002\.\collection1\data\snapshot_metadata;done=false>>]
   [junit4]   2> 450134 INFO  (coreCloseExecutor-1705-thread-1) [    x:collection1] o.a.s.c.CachingDirectoryFactory Closing directory, CoreContainer#isShutdown=true
   [junit4]   2> 450134 INFO  (coreCloseExecutor-1705-thread-1) [    x:collection1] o.a.s.c.CachingDirectoryFactory Closing directory: C:\Users\jenkins\workspace\Lucene-Solr-6.x-Windows\solr\build\solr-core\test\J0\temp\solr.handler.TestReplicationHandler_C7F24F7FD24F8B5A-001\solr-instance-002\.\collection1\data\snapshot_metadata
   [junit4]   2> 450136 INFO  (TEST-TestReplicationHandler.doTestRepeater-seed#[C7F24F7FD24F8B5A]) [    ] o.e.j.s.h.ContextHandler Stopped o.e.j.s.ServletContextHandler@90c492{/solr,null,UNAVAILABLE}
   [junit4]   2> 450138 INFO  (TEST-TestReplicationHandler.doTestRepeater-seed#[C7F24F7FD24F8B5A]) [    ] o.e.j.s.Server jetty-9.3.8.v20160314
   [junit4]   2> 450139 INFO  (TEST-TestReplicationHandler.doTestRepeater-seed#[C7F24F7FD24F8B5A]) [    ] o.e.j.s.h.ContextHandler Started o.e.j.s.ServletContextHandler@1d4f143{/solr,null,AVAILABLE}
   [junit4]   2> 450140 INFO  (TEST-TestReplicationHandler.doTestRepeater-seed#[C7F24F7FD24F8B5A]) [    ] o.e.j.s.ServerConnector Started ServerConnector@11322f8{HTTP/1.1,[http/1.1]}{127.0.0.1:63875}
   [junit4]   2> 450141 INFO  (TEST-TestReplicationHandler.doTestRepeater-seed#[C7F24F7FD24F8B5A]) [    ] o.e.j.s.Server Started @454524ms
   [junit4]   2> 450141 INFO  (TEST-TestReplicationHandler.doTestRepeater-seed#[C7F24F7FD24F8B5A]) [    ] o.a.s.c.s.e.JettySolrRunner Jetty properties: {solr.data.dir=C:\Users\jenkins\workspace\Lucene-Solr-6.x-Windows\solr\build\solr-core\test\J0\temp\solr.handler.TestReplicationHandler_C7F24F7FD24F8B5A-001\solr-instance-002\collection1\data, hostContext=/solr, hostPort=63875}
   [junit4]   2> 450141 INFO  (TEST-TestReplicationHandler.doTestRepeater-seed#[C7F24F7FD24F8B5A]) [    ] o.a.s.s.SolrDispatchFilter SolrDispatchFilter.init(): sun.misc.Launcher$AppClassLoader@1d16e93
   [junit4]   2> 450141 INFO  (TEST-TestReplicationHandler.doTestRepeater-seed#[C7F24F7FD24F8B5A]) [    ] o.a.s.c.SolrResourceLoader new SolrResourceLoader for directory: 'C:\Users\jenkins\workspace\Lucene-Solr-6.x-Windows\solr\build\solr-core\test\J0\temp\solr.handler.TestReplicationHandler_C7F24F7FD24F8B5A-001\solr-instance-002'
   [junit4]   2> 450141 INFO  (TEST-TestReplicationHandler.doTestRepeater-seed#[C7F24F7FD24F8B5A]) [    ] o.a.s.c.SolrResourceLoader JNDI not configured for solr (NoInitialContextEx)
   [junit4]   2> 450142 INFO  (TEST-TestReplicationHandler.doTestRepeater-seed#[C7F24F7FD24F8B5A]) [    ] o.a.s.c.SolrResourceLoader solr home defaulted to 'solr/' (could not find system property or JNDI)
   [junit4]   2> 450142 INFO  (TEST-TestReplicationHandler.doTestRepeater-seed#[C7F24F7FD24F8B5A]) [    ] o.a.s.c.SolrXmlConfig Loading container configuration from C:\Users\jenkins\workspace\Lucene-Solr-6.x-Windows\solr\build\solr-core\test\J0\temp\solr.handler.TestReplicationHandler_C7F24F7FD24F8B5A-001\solr-instance-002\solr.xml
   [junit4]   2> 450147 INFO  (TEST-TestReplicationHandler.doTestRepeater-seed#[C7F24F7FD24F8B5A]) [    ] o.a.s.c.CorePropertiesLocator Config-defined core root directory: C:\Users\jenkins\workspace\Lucene-Solr-6.x-Windows\solr\build\solr-core\test\J0\temp\solr.handler.TestReplicationHandler_C7F24F7FD24F8B5A-001\solr-instance-002\.
   [junit4]   2> 450147 INFO  (TEST-TestReplicationHandler.doTestRepeater-seed#[C7F24F7FD24F8B5A]) [    ] o.a.s.c.CoreContainer New CoreContainer 27508443
   [junit4]   2> 450147 INFO  (TEST-TestReplicationHandler.doTestRepeater-seed#[C7F24F7FD24F8B5A]) [    ] o.a.s.c.CoreContainer Loading cores into CoreContainer [instanceDir=C:\Users\jenkins\workspace\Lucene-Solr-6.x-Windows\solr\build\solr-core\test\J0\temp\solr.handler.TestReplicationHandler_C7F24F7FD24F8B5A-001\solr-instance-002]
   [junit4]   2> 450147 WARN  (TEST-TestReplicationHandler.doTestRepeater-seed#[C7F24F7FD24F8B5A]) [    ] o.a.s.c.CoreContainer Couldn't add files from C:\Users\jenkins\workspace\Lucene-Solr-6.x-Windows\solr\build\solr-core\test\J0\temp\solr.handler.TestReplicationHandler_C7F24F7FD24F8B5A-001\solr-instance-002\lib to classpath: C:\Users\jenkins\workspace\Lucene-Solr-6.x-Windows\solr\build\solr-core\test\J0\temp\solr.handler.TestReplicationHandler_C7F24F7FD24F8B5A-001\solr-instance-002\lib
   [junit4]   2> 450148 INFO  (TEST-TestReplicationHandler.doTestRepeater-seed#[C7F24F7FD24F8B5A]) [    ] o.a.s.h.c.HttpShardHandlerFactory created with socketTimeout : 90000,urlScheme : ,connTimeout : 15000,maxConnectionsPerHost : 20,maxConnections : 10000,corePoolSize : 0,maximumPoolSize : 2147483647,maxThreadIdleTime : 5,sizeOfQueue : -1,fairnessPolicy : false,useRetries : false,connectionsEvictorSleepDelay : 5000,maxConnectionIdleTime : 40000,
   [junit4]   2> 450149 INFO  (TEST-TestReplicationHandler.doTestRepeater-seed#[C7F24F7FD24F8B5A]) [    ] o.a.s.u.UpdateShardHandler Creating UpdateShardHandler HTTP client with params: socketTimeout=340000&connTimeout=45000&retry=true
   [junit4]   2> 450150 INFO  (TEST-TestReplicationHandler.doTestRepeater-seed#[C7F24F7FD24F8B5A]) [    ] o.a.s.l.LogWatcher SLF4J impl is org.slf4j.impl.Log4jLoggerFactory
   [junit4]   2> 450150 INFO  (TEST-TestReplicationHandler.doTestRepeater-seed#[C7F24F7FD24F8B5A]) [    ] o.a.s.l.LogWatcher Registering Log Listener [Log4j (org.slf4j.impl.Log4jLoggerFactory)]
   [junit4]   2> 450150 INFO  (TEST-TestReplicationHandler.doTestRepeater-seed#[C7F24F7FD24F8B5A]) [    ] o.a.s.c.CoreContainer Security conf doesn't exist. Skipping setup for authorization module.
   [junit4]   2> 450150 INFO  (TEST-TestReplicationHandler.doTestRepeater-seed#[C7F24F7FD24F8B5A]) [    ] o.a.s.c.CoreContainer No authentication plugin used.
   [junit4]   2> 450152 INFO  (TEST-TestReplicationHandler.doTestRepeater-seed#[C7F24F7FD24F8B5A]) [    ] o.a.s.c.CorePropertiesLocator Looking for core definitions underneath C:\Users\jenkins\workspace\Lucene-Solr-6.x-Windows\solr\build\solr-core\test\J0\temp\solr.handler.TestReplicationHandler_C7F24F7FD24F8B5A-001\solr-instance-002\.
   [junit4]   2> 450153 INFO  (TEST-TestReplicationHandler.doTestRepeater-seed#[C7F24F7FD24F8B5A]) [    ] o.a.s.c.CoreDescriptor Created CoreDescriptor: {name=collection1, config=solrconfig.xml, loadOnStartup=true, schema=schema.xml, configSetProperties=configsetprops.json, transient=false, dataDir=data\}
   [junit4]   2> 450153 INFO  (TEST-TestReplicationHandler.doTestRepeater-seed#[C7F24F7FD24F8B5A]) [    ] o.a.s.c.CorePropertiesLocator Found core collection1 in C:\Users\jenkins\workspace\Lucene-Solr-6.x-Windows\solr\build\solr-core\test\J0\temp\solr.handler.TestReplicationHandler_C7F24F7FD24F8B5A-001\solr-instance-002\.\collection1
   [junit4]   2> 450154 INFO  (TEST-TestReplicationHandler.doTestRepeater-seed#[C7F24F7FD24F8B5A]) [    ] o.a.s.c.CorePropertiesLocator Found 1 core definitions
   [junit4]   2> 450154 INFO  (TEST-TestReplicationHandler.doTestRepeater-seed#[C7F24F7FD24F8B5A]) [    ] o.a.s.s.SolrDispatchFilter user.dir=C:\Users\jenkins\workspace\Lucene-Solr-6.x-Windows\solr\build\solr-core\test\J0
   [junit4]   2> 450154 INFO  (coreLoadExecutor-1712-thread-1) [    ] o.a.s.c.SolrResourceLoader new SolrResourceLoader for directory: 'C:\Users\jenkins\workspace\Lucene-Solr-6.x-Windows\solr\build\solr-core\test\J0\temp\solr.handler.TestReplicationHandler_C7F24F7FD24F8B5A-001\solr-instance-002\collection1'
   [junit4]   2> 450154 INFO  (TEST-TestReplicationHandler.doTestRepeater-seed#[C7F24F7FD24F8B5A]) [    ] o.a.s.s.SolrDispatchFilter SolrDispatchFilter.init() done
   [junit4]   2> 450155 INFO  (coreLoadExecutor-1712-thread-1) [    ] o.a.s.c.SolrResourceLoader JNDI not configured for solr (NoInitialContextEx)
   [junit4]   2> 450156 INFO  (coreLoadExecutor-1712-thread-1) [    ] o.a.s.c.SolrResourceLoader solr home defaulted to 'solr/' (could not find system property or JNDI)
   [junit4]   2> 450164 INFO  (coreLoadExecutor-1712-thread-1) [    ] o.a.s.c.SolrConfig current version of requestparams : -1
   [junit4]   2> 450166 INFO  (coreLoadExecutor-1712-thread-1) [    ] o.a.s.c.SolrConfig Using Lucene MatchVersion: 6.3.0
   [junit4]   2> 450172 INFO  (coreLoadExecutor-1712-thread-1) [    ] o.a.s.c.SolrConfig Loaded SolrConfig: solrconfig.xml
   [junit4]   2> 450175 INFO  (coreLoadExecutor-1712-thread-1) [    ] o.a.s.s.IndexSchema [collection1] Schema name=test
   [junit4]   2> 450175 INFO  (coreLoadExecutor-1712-thread-1) [    ] o.a.s.s.IndexSchema unique key field: id
   [junit4]   2> 450180 INFO  (coreLoadExecutor-1712-thread-1) [    ] o.a.s.c.ConfigSetProperties Did not find ConfigSet properties, assuming default properties: Can't find resource 'configsetprops.json' in classpath or 'C:\Users\jenkins\workspace\Lucene-Solr-6.x-Windows\solr\build\solr-core\test\J0\temp\solr.handler.TestReplicationHandler_C7F24F7FD24F8B5A-001\solr-instance-002\collection1'
   [junit4]   2> 450180 INFO  (coreLoadExecutor-1712-thread-1) [    ] o.a.s.c.CoreContainer Creating SolrCore 'collection1' using configuration from instancedir C:\Users\jenkins\workspace\Lucene-Solr-6.x-Windows\solr\build\solr-core\test\J0\temp\solr.handler.TestReplicationHandler_C7F24F7FD24F8B5A-001\solr-instance-002\.\collection1
   [junit4]   2> 450181 INFO  (coreLoadExecutor-1712-thread-1) [    x:collection1] o.a.s.c.SolrCore org.apache.solr.core.MockDirectoryFactory
   [junit4]   2> 450181 INFO  (coreLoadExecutor-1712-thread-1) [    x:collection1] o.a.s.c.SolrCore [[collection1] ] Opening new SolrCore at [C:\Users\jenkins\workspace\Lucene-Solr-6.x-Windows\solr\build\solr-core\test\J0\temp\solr.handler.TestReplicationHandler_C7F24F7FD24F8B5A-001\solr-instance-002\collection1], dataDir=[C:\Users\jenkins\workspace\Lucene-Solr-6.x-Windows\solr\build\solr-core\test\J0\temp\solr.handler.TestReplicationHandler_C7F24F7FD24F8B5A-001\solr-instance-002\.\collection1\data\]
   [junit4]   2> 450181 INFO  (coreLoadExecutor-1712-thread-1) [    x:collection1] o.a.s.c.SolrCore JMX monitoring not detected for core: collection1
   [junit4]   2> 450182 INFO  (coreLoadExecutor-1712-thread-1) [    x:collection1] o.a.s.c.CachingDirectoryFactory return new directory for C:\Users\jenkins\workspace\Lucene-Solr-6.x-Windows\solr\build\solr-core\test\J0\temp\solr.handler.TestReplicationHandler_C7F24F7FD24F8B5A-001\solr-instance-002\.\collection1\data\snapshot_metadata
   [junit4]   2> 450182 INFO  (coreLoadExecutor-1712-thread-1) [    x:collection1] o.a.s.c.s.SolrSnapshotMetaDataManager Loading from snapshot metadata file...
   [junit4]   2> 450182 INFO  (coreLoadExecutor-1712-thread-1) [    x:collection1] o.a.s.c.CachingDirectoryFactory return new directory for C:\Users\jenkins\workspace\Lucene-Solr-6.x-Windows\solr\build\solr-core\test\J0\temp\solr.handler.TestReplicationHandler_C7F24F7FD24F8B5A-001\solr-instance-002\.\collection1\data\
   [junit4]   2> 450182 INFO  (coreLoadExecutor-1712-thread-1) [    x:collection1] o.a.s.c.SolrCore New index directory detected: old=null new=C:\Users\jenkins\workspace\Lucene-Solr-6.x-Windows\solr\build\solr-core\test\J0\temp\solr.handler.TestReplicationHandler_C7F24F7FD24F8B5A-001\solr-instance-002\.\collection1\data\index/
   [junit4]   2> 450182 WARN  (coreLoadExecutor-1712-thread-1) [    x:collection1] o.a.s.c.SolrCore [collection1] Solr index directory 'C:\Users\jenkins\workspace\Lucene-Solr-6.x-Windows\solr\build\solr-core\test\J0\temp\solr.handler.TestReplicationHandler_C7F24F7FD24F8B5A-001\solr-instance-002\.\collection1\data\index' doesn't exist. Creating new index...
   [junit4]   2> 450182 INFO  (coreLoadExecutor-1712-thread-1) [    x:collection1] o.a.s.c.CachingDirectoryFactory return new directory for C:\Users\jenkins\workspace\Lucene-Solr-6.x-Windows\solr\build\solr-core\test\J0\temp\solr.handler.TestReplicationHandler_C7F24F7FD24F8B5A-001\solr-instance-002\.\collection1\data\index
   [junit4]   2> 450182 INFO  (coreLoadExecutor-1712-thread-1) [    x:collection1] o.a.s.u.RandomMergePolicy RandomMergePolicy wrapping class org.apache.lucene.index.MockRandomMergePolicy: org.apache.lucene.index.MockRandomMergePolicy@c4debc
   [junit4]   2> 450183 INFO  (coreLoadExecutor-1712-thread-1) [    x:collection1] o.a.s.c.SolrDeletionPolicy SolrDeletionPolicy.onCommit: commits: num=1
   [junit4]   2> 	commit{dir=MockDirectoryWrapper(RAMDirectory@114c1c0 lockFactory=org.apache.lucene.store.SingleInstanceLockFactory@11c700),segFN=segments_1,generation=1}
   [junit4]   2> 450183 INFO  (coreLoadExecutor-1712-thread-1) [    x:collection1] o.a.s.c.SolrDeletionPolicy newest commit generation = 1
   [junit4]   2> 450184 INFO  (OldIndexDirectoryCleanupThreadForCore-collection1) [    x:collection1] o.a.s.c.SolrCore Looking for old index directories to cleanup for core collection1 in C:\Users\jenkins\workspace\Lucene-Solr-6.x-Windows\solr\build\solr-core\test\J0\temp\solr.handler.TestReplicationHandler_C7F24F7FD24F8B5A-001\solr-instance-002\.\collection1\data\
   [junit4]   2> 450185 INFO  (coreLoadExecutor-1712-thread-1) [    x:collection1] o.a.s.c.SolrCore no updateRequestProcessorChain defined as default, creating implicit default
   [junit4]   2> 450186 INFO  (coreLoadExecutor-1712-thread-1) [    x:collection1] o.a.s.h.l.XMLLoader xsltCacheLifetimeSeconds=60
   [junit4]   2> 450188 INFO  (coreLoadExecutor-1712-thread-1) [    x:collection1] o.a.s.h.l.XMLLoader xsltCacheLifetimeSeconds=60
   [junit4]   2> 450189 INFO  (coreLoadExecutor-1712-thread-1) [    x:collection1] o.a.s.h.l.XMLLoader xsltCacheLifetimeSeconds=60
   [junit4]   2> 450190 INFO  (coreLoadExecutor-1712-thread-1) [    x:collection1] o.a.s.h.l.XMLLoader xsltCacheLifetimeSeconds=60
   [junit4]   2> 450193 INFO  (coreLoadExecutor-1712-thread-1) [    x:collection1] o.a.s.c.PluginBag requestHandler : 'lazy' created with startup=lazy 
   [junit4]   2> 450193 INFO  (coreLoadExecutor-1712-thread-1) [    x:collection1] o.a.s.c.RequestHandlers Registered paths: /admin/mbeans,standard,lazy,/update/json/docs,/admin/luke,/export,/get,/admin/properties,/update/json,/admin/threads,/update/csv,/sql,/graph,/admin/segments,/admin/system,/replication,defaults,/config,/stream,/schema,/admin/plugins,/admin/logging,/admin/ping,/update,/admin/file,/terms
   [junit4]   2> 450193 INFO  (coreLoadExecutor-1712-thread-1) [    x:collection1] o.a.s.c.SolrCore Using default statsCache cache: org.apache.solr.search.stats.LocalStatsCache
   [junit4]   2> 450193 INFO  (coreLoadExecutor-1712-thread-1) [    x:collection1] o.a.s.u.CommitTracker Hard AutoCommit: disabled
   [junit4]   2> 450193 INFO  (coreLoadExecutor-1712-thread-1) [    x:collection1] o.a.s.u.CommitTracker Soft AutoCommit: disabled
   [junit4]   2> 450193 INFO  (coreLoadExecutor-1712-thread-1) [    x:collection1] o.a.s.u.RandomMergePolicy RandomMergePolicy wrapping class org.apache.lucene.index.TieredMergePolicy: [TieredMergePolicy: maxMergeAtOnce=20, maxMergeAtOnceExplicit=15, maxMergedSegmentMB=72.5693359375, floorSegmentMB=1.484375, forceMergeDeletesPctAllowed=0.6529096288777358, segmentsPerTier=34.0, maxCFSSegmentSizeMB=8.796093022207999E12, noCFSRatio=0.46144161254256744
   [junit4]   2> 450193 INFO  (coreLoadExecutor-1712-thread-1) [    x:collection1] o.a.s.c.SolrDeletionPolicy SolrDeletionPolicy.onInit: commits: num=1
   [junit4]   2> 	commit{dir=MockDirectoryWrapper(RAMDirectory@114c1c0 lockFactory=org.apache.lucene.store.SingleInstanceLockFactory@11c700),segFN=segments_1,generation=1}
   [junit4]   2> 450194 INFO  (coreLoadExecutor-1712-thread-1) [    x:collection1] o.a.s.c.SolrDeletionPolicy newest commit generation = 1
   [junit4]   2> 450194 INFO  (coreLoadExecutor-1712-thread-1) [    x:collection1] o.a.s.s.SolrIndexSearcher Opening [Searcher@b3d01f[collection1] main]
   [junit4]   2> 450194 INFO  (coreLoadExecutor-1712-thread-1) [    x:collection1] o.a.s.r.ManagedResourceStorage File-based storage initialized to use dir: C:\Users\jenkins\workspace\Lucene-Solr-6.x-Windows\solr\build\solr-core\test\J0\temp\solr.handler.TestReplicationHandler_C7F24F7FD24F8B5A-001\solr-instance-002\collection1\conf
   [junit4]   2> 450194 INFO  (coreLoadExecutor-1712-thread-1) [    x:collection1] o.a.s.r.RestManager Initializing RestManager with initArgs: {storageDir=C:\Users\jenkins\workspace\Lucene-Solr-6.x-Windows\solr\build\solr-core\test\J0\temp\solr.handler.TestReplicationHandler_C7F24F7FD24F8B5A-001\solr-instance-002\collection1\conf}
   [junit4]   2> 450194 INFO  (coreLoadExecutor-1712-thread-1) [    x:collection1] o.a.s.r.ManagedResourceStorage Reading _rest_managed.json using file:dir=C:\Users\jenkins\workspace\Lucene-Solr-6.x-Windows\solr\build\solr-core\test\J0\temp\solr.handler.TestReplicationHandler_C7F24F7FD24F8B5A-001\solr-instance-002\collection1\conf
   [junit4]   2> 450194 INFO  (coreLoadExecutor-1712-thread-1) [    x:collection1] o.a.s.r.RestManager Initializing 0 registered ManagedResources
   [junit4]   2> 450194 INFO  (coreLoadExecutor-1712-thread-1) [    x:collection1] o.a.s.h.ReplicationHandler Commits will be reserved for  10000
   [junit4]   2> 450195 INFO  (searcherExecutor-1713-thread-1-processing-x:collection1) [    x:collection1] o.a.s.c.SolrCore [collection1] Registered new searcher Searcher@b3d01f[collection1] main{ExitableDirectoryReader(UninvertingDirectoryReader())}
   [junit4]   2> 450195 INFO  (coreLoadExecutor-1712-thread-1) [    x:collection1] o.a.s.c.CoreContainer registering core: collection1
   [junit4]   2> 450659 INFO  (TEST-TestReplicationHandler.doTestRepeater-seed#[C7F24F7FD24F8B5A]) [    ] o.a.s.SolrTestCaseJ4 Writing core.properties file to C:\Users\jenkins\workspace\Lucene-Solr-6.x-Windows\solr\build\solr-core\test\J0\temp\solr.handler.TestReplicationHandler_C7F24F7FD24F8B5A-001\solr-instance-003\collection1
   [junit4]   2> 450669 INFO  (TEST-TestReplicationHandler.doTestRepeater-seed#[C7F24F7FD24F8B5A]) [    ] o.e.j.s.Server jetty-9.3.8.v20160314
   [junit4]   2> 450670 INFO  (TEST-TestReplicationHandler.doTestRepeater-seed#[C7F24F7FD24F8B5A]) [    ] o.e.j.s.h.ContextHandler Started o.e.j.s.ServletContextHandler@615191{/solr,null,AVAILABLE}
   [junit4]   2> 450672 INFO  (TEST-TestReplicationHandler.doTestRepeater-seed#[C7F24F7FD24F8B5A]) [    ] o.e.j.s.ServerConnector Started ServerConnector@1de76d4{HTTP/1.1,[http/1.1]}{127.0.0.1:63878}
   [junit4]   2> 450672 INFO  (TEST-TestReplicationHandler.doTestRepeater-seed#[C7F24F7FD24F8B5A]) [    ] o.e.j.s.Server Started @455056ms
   [junit4]   2> 450672 INFO  (TEST-TestReplicationHandler.doTestRepeater-seed#[C7F24F7FD24F8B5A]) [    ] o.a.s.c.s.e.JettySolrRunner Jetty properties: {solr.data.dir=C:\Users\jenkins\workspace\Lucene-Solr-6.x-Windows\solr\build\solr-core\test\J0\temp\solr.handler.TestReplicationHandler_C7F24F7FD24F8B5A-001\solr-instance-003\collection1\data, hostContext=/solr, hostPort=63878}
   [junit4]   2> 450672 INFO  (TEST-TestReplicationHandler.doTestRepeater-seed#[C7F24F7FD24F8B5A]) [    ] o.a.s.s.SolrDispatchFilter SolrDispatchFilter.init(): sun.misc.Launcher$AppClassLoader@1d16e93
   [junit4]   2> 450673 INFO  (TEST-TestReplicationHandler.doTestRepeater-seed#[C7F24F7FD24F8B5A]) [    ] o.a.s.c.SolrResourceLoader new SolrResourceLoader for directory: 'C:\Users\jenkins\workspace\Lucene-Solr-6.x-Windows\solr\build\solr-core\test\J0\temp\solr.handler.TestReplicationHandler_C7F24F7FD24F8B5A-001\solr-instance-003'
   [junit4]   2> 450673 INFO  (TEST-TestReplicationHandler.doTestRepeater-seed#[C7F24F7FD24F8B5A]) [    ] o.a.s.c.SolrResourceLoader JNDI not configured for solr (NoInitialContextEx)
   [junit4]   2> 450673 INFO  (TEST-TestReplicationHandler.doTestRepeater-seed#[C7F24F7FD24F8B5A]) [    ] o.a.s.c.SolrResourceLoader solr home defaulted to 'solr/' (could not find system property or JNDI)
   [junit4]   2> 450674 INFO  (TEST-TestReplicationHandler.doTestRepeater-seed#[C7F24F7FD24F8B5A]) [    ] o.a.s.c.SolrXmlConfig Loading container configuration from C:\Users\jenkins\workspace\Lucene-Solr-6.x-Windows\solr\build\solr-core\test\J0\temp\solr.handler.TestReplicationHandler_C7F24F7FD24F8B5A-001\solr-instance-003\solr.xml
   [junit4]   2> 450679 INFO  (TEST-TestReplicationHandler.doTestRepeater-seed#[C7F24F7FD24F8B5A]) [    ] o.a.s.c.CorePropertiesLocator Config-defined core root directory: C:\Users\jenkins\workspace\Lucene-Solr-6.x-Windows\solr\build\solr-core\test\J0\temp\solr.handler.TestReplicationHandler_C7F24F7FD24F8B5A-001\solr-instance-003\.
   [junit4]   2> 450679 INFO  (TEST-TestReplicationHandler.doTestRepeater-seed#[C7F24F7FD24F8B5A]) [    ] o.a.s.c.CoreContainer New CoreContainer 3129933
   [junit4]   2> 450680 INFO  (TEST-TestReplicationHandler.doTestRepeater-seed#[C7F24F7FD24F8B5A]) [    ] o.a.s.c.CoreContainer Loading cores into CoreContainer [instanceDir=C:\Users\jenkins\workspace\Lucene-Solr-6.x-Windows\solr\build\solr-core\test\J0\temp\solr.handler.TestReplicationHandler_C7F24F7FD24F8B5A-001\solr-instance-003]
   [junit4]   2> 450680 WARN  (TEST-TestReplicationHandler.doTestRepeater-seed#[C7F24F7FD24F8B5A]) [    ] o.a.s.c.CoreContainer Couldn't add files from C:\Users\jenkins\workspace\Lucene-Solr-6.x-Windows\solr\build\solr-core\test\J0\temp\solr.handler.TestReplicationHandler_C7F24F7FD24F8B5A-001\solr-instance-003\lib to classpath: C:\Users\jenkins\workspace\Lucene-Solr-6.x-Windows\solr\build\solr-core\test\J0\temp\solr.handler.TestReplicationHandler_C7F24F7FD24F8B5A-001\solr-instance-003\lib
   [junit4]   2> 450680 INFO  (TEST-TestReplicationHandler.doTestRepeater-seed#[C7F24F7FD24F8B5A]) [    ] o.a.s.h.c.HttpShardHandlerFactory created with socketTimeout : 90000,urlScheme : ,connTimeout : 15000,maxConnectionsPerHost : 20,maxConnections : 10000,corePoolSize : 0,maximumPoolSize : 2147483647,maxThreadIdleTime : 5,sizeOfQueue : -1,fairnessPolicy : false,useRetries : false,connectionsEvictorSleepDelay : 5000,maxConnectionIdleTime : 40000,
   [junit4]   2> 450681 INFO  (TEST-TestReplicationHandler.doTestRepeater-seed#[C7F24F7FD24F8B5A]) [    ] o.a.s.u.UpdateShardHandler Creating UpdateShardHandler HTTP client with params: socketTimeout=340000&connTimeout=45000&retry=true
   [junit4]   2> 450682 INFO  (TEST-TestReplicationHandler.doTestRepeater-seed#[C7F24F7FD24F8B5A]) [    ] o.a.s.l.LogWatcher SLF4J impl is org.slf4j.impl.Log4jLoggerFactory
   [junit4]   2> 450682 INFO  (TEST-TestReplicationHandler.doTestRepeater-seed#[C7F24F7FD24F8B5A]) [    ] o.a.s.l.LogWatcher Registering Log Listener [Log4j (org.slf4j.impl.Log4jLoggerFactory)]
   [junit4]   2> 450682 INFO  (TEST-TestReplicationHandler.doTestRepeater-seed#[C7F24F7FD24F8B5A]) [    ] o.a.s.c.CoreContainer Security conf doesn't exist. Skipping setup for authorization module.
   [junit4]   2> 450682 INFO  (TEST-TestReplicationHandler.doTestRepeater-seed#[C7F24F7FD24F8B5A]) [    ] o.a.s.c.CoreContainer No authentication plugin used.
   [junit4]   2> 450684 INFO  (TEST-TestReplicationHandler.doTestRepeater-seed#[C7F24F7FD24F8B5A]) [    ] o.a.s.c.CorePropertiesLocator Looking for core definitions underneath C:\Users\jenkins\workspace\Lucene-Solr-6.x-Windows\solr\build\solr-core\test\J0\temp\solr.handler.TestReplicationHandler_C7F24F7FD24F8B5A-001\solr-instance-003\.
   [junit4]   2> 450689 INFO  (TEST-TestReplicationHandler.doTestRepeater-seed#[C7F24F7FD24F8B5A]) [    ] o.a.s.c.CoreDescriptor Created CoreDescriptor: {name=collection1, config=solrconfig.xml, loadOnStartup=true, schema=schema.xml, configSetProperties=configsetprops.json, transient=false, dataDir=data\}
   [junit4]   2> 450689 INFO  (TEST-TestReplicationHandler.doTestRepeater-seed#[C7F24F7FD24F8B5A]) [    ] o.a.s.c.CorePropertiesLocator Found core collection1 in C:\Users\jenkins\workspace\Lucene-Solr-6.x-Windows\solr\build\solr-core\test\J0\temp\solr.handler.TestReplicationHandler_C7F24F7FD24F8B5A-001\solr-instance-003\.\collection1
   [junit4]   2> 450690 INFO  (TEST-TestReplicationHandler.doTestRepeater-seed#[C7F24F7FD24F8B5A]) [    ] o.a.s.c.CorePropertiesLocator Found 1 core definitions
   [junit4]   2> 450690 INFO  (TEST-TestReplicationHandler.doTestRepeater-seed#[C7F24F7FD24F8B5A]) [    ] o.a.s.s.SolrDispatchFilter user.dir=C:\Users\jenkins\workspace\Lucene-Solr-6.x-Windows\solr\build\solr-core\test\J0
   [junit4]   2> 450691 INFO  (TEST-TestReplicationHandler.doTestRepeater-seed#[C7F24F7FD24F8B5A]) [    ] o.a.s.s.SolrDispatchFilter SolrDispatchFilter.init() done
   [junit4]   2> 450692 INFO  (coreLoadExecutor-1722-thread-1) [    ] o.a.s.c.SolrResourceLoader new SolrResourceLoader for directory: 'C:\Users\jenkins\workspace\Lucene-Solr-6.x-Windows\solr\build\solr-core\test\J0\temp\solr.handler.TestReplicationHandler_C7F24F7FD24F8B5A-001\solr-instance-003\collection1'
   [junit4]   2> 450692 INFO  (coreLoadExecutor-1722-thread-1) [    ] o.a.s.c.SolrResourceLoader JNDI not configured for solr (NoInitialContextEx)
   [junit4]   2> 450693 INFO  (coreLoadExecutor-1722-thread-1) [    ] o.a.s.c.SolrResourceLoader solr home defaulted to 'solr/' (could not find system property or JNDI)
   [junit4]   2> 450708 INFO  (coreLoadExecutor-1722-thread-1) [    ] o.a.s.c.SolrConfig current version of requestparams : -1
   [junit4]   2> 450718 INFO  (coreLoadExecutor-1722-thread-1) [    ] o.a.s.c.SolrConfig Using Lucene MatchVersion: 6.3.0
   [junit4]   2> 450729 INFO  (coreLoadExecutor-1722-thread-1) [    ] o.a.s.c.SolrConfig Loaded SolrConfig: solrconfig.xml
   [junit4]   2> 450737 INFO  (coreLoadExecutor-1722-thread-1) [    ] o.a.s.s.IndexSchema [collection1] Schema name=test
   [junit4]   2> 450739 INFO  (coreLoadExecutor-1722-thread-1) [    ] o.a.s.s.IndexSchema unique key field: id
   [junit4]   2> 450742 INFO  (coreLoadExecutor-1722-thread-1) [    ] o.a.s.c.ConfigSetProperties Did not find ConfigSet properties, assuming default properties: Can't find resource 'configsetprops.json' in classpath or 'C:\Users\jenkins\workspace\Lucene-Solr-6.x-Windows\solr\build\solr-core\test\J0\temp\solr.handler.TestReplicationHandler_C7F24F7FD24F8B5A-001\solr-instance-003\collection1'
   [junit4]   2> 450742 INFO  (coreLoadExecutor-1722-thread-1) [    ] o.a.s.c.CoreContainer Creating SolrCore 'collection1' using configuration from instancedir C:\Users\jenkins\workspace\Lucene-Solr-6.x-Windows\solr\build\solr-core\test\J0\temp\solr.handler.TestReplicationHandler_C7F24F7FD24F8B5A-001\solr-instance-003\.\collection1
   [junit4]   2> 450742 INFO  (coreLoadExecutor-1722-thread-1) [    x:collection1] o.a.s.c.SolrCore org.apache.solr.core.MockDirectoryFactory
   [junit4]   2> 450742 INFO  (coreLoadExecutor-1722-thread-1) [    x:collection1] o.a.s.c.SolrCore [[collection1] ] Opening new SolrCore at [C:\Users\jenkins\workspace\Lucene-Solr-6.x-Windows\solr\build\solr-core\test\J0\temp\solr.handler.TestReplicationHandler_C7F24F7FD24F8B5A-001\solr-instance-003\collection1], dataDir=[C:\Users\jenkins\workspace\Lucene-Solr-6.x-Windows\solr\build\solr-core\test\J0\temp\solr.handler.TestReplicationHandler_C7F24F7FD24F8B5A-001\solr-instance-003\.\collection1\data\]
   [junit4]   2> 450742 INFO  (coreLoadExecutor-1722-thread-1) [    x:collection1] o.a.s.c.SolrCore JMX monitoring not detected for core: collection1
   [junit4]   2> 450743 INFO  (coreLoadExecutor-1722-thread-1) [    x:collection1] o.a.s.c.CachingDirectoryFactory return new directory for C:\Users\jenkins\workspace\Lucene-Solr-6.x-Windows\solr\build\solr-core\test\J0\temp\solr.handler.TestReplicationHandler_C7F24F7FD24F8B5A-001\solr-instance-003\.\collection1\data\snapshot_metadata
   [junit4]   2> 450743 INFO  (coreLoadExecutor-1722-thread-1) [    x:collection1] o.a.s.c.s.SolrSnapshotMetaDataManager Loading from snapshot metadata file...
   [junit4]   2> 450743 INFO  (coreLoadExecutor-1722-thread-1) [    x:collection1] o.a.s.c.CachingDirectoryFactory return new directory for C:\Users\jenkins\workspace\Lucene-Solr-6.x-Windows\solr\build\solr-core\test\J0\temp\solr.handler.TestReplicationHandler_C7F24F7FD24F8B5A-001\solr-instance-003\.\collection1\data\
   [junit4]   2> 450743 INFO  (coreLoadExecutor-1722-thread-1) [    x:collection1] o.a.s.c.SolrCore New index directory detected: old=null new=C:\Users\jenkins\workspace\Lucene-Solr-6.x-Windows\solr\build\solr-core\test\J0\temp\solr.handler.TestReplicationHandler_C7F24F7FD24F8B5A-001\solr-instance-003\.\collection1\data\index/
   [junit4]   2> 450743 WARN  (coreLoadExecutor-1722-thread-1) [    x:collection1] o.a.s.c.SolrCore [collection1] Solr index directory 'C:\Users\jenkins\workspace\Lucene-Solr-6.x-Windows\solr\build\solr-core\test\J0\temp\solr.handler.TestReplicationHandler_C7F24F7FD24F8B5A-001\solr-instance-003\.\collection1\data\index' doesn't exist. Creating new index...
   [junit4]   2> 450744 INFO  (coreLoadExecutor-1722-thread-1) [    x:collection1] o.a.s.c.CachingDirectoryFactory return new directory for C:\Users\jenkins\workspace\Lucene-Solr-6.x-Windows\solr\build\solr-core\test\J0\temp\solr.handler.TestReplicationHandler_C7F24F7FD24F8B5A-001\solr-instance-003\.\collection1\data\index
   [junit4]   2> 450744 INFO  (coreLoadExecutor-1722-thread-1) [    x:collection1] o.a.s.u.RandomMergePolicy RandomMergePolicy wrapping class org.apache.lucene.index.MockRandomMergePolicy: org.apache.lucene.index.MockRandomMergePolicy@181ec0a
   [junit4]   2> 450744 INFO  (coreLoadExecutor-1722-thread-1) [    x:collection1] o.a.s.c.SolrDeletionPolicy SolrDeletionPolicy.onCommit: commits: num=1
   [junit4]   2> 	commit{dir=MockDirectoryWrapper(RAMDirectory@bb9fe6 lockFactory=org.apache.lucene.store.SingleInstanceLockFactory@46876),segFN=segments_1,generation=1}
   [junit4]   2> 450744 INFO  (coreLoadExecutor-1722-thread-1) [    x:collection1] o.a.s.c.SolrDeletionPolicy newest commit generation = 1
   [junit4]   2> 450745 INFO  (OldIndexDirectoryCleanupThreadForCore-collection1) [    x:collection1] o.a.s.c.SolrCore Looking for old index directories to cleanup for core collection1 in C:\Users\jenkins\workspace\Lucene-Solr-6.x-Windows\solr\build\solr-core\test\J0\temp\solr.handler.TestReplicationHandler_C7F24F7FD24F8B5A-001\solr-instance-003\.\collection1\data\
   [junit4]   2> 450746 INFO  (coreLoadExecutor-1722-thread-1) [    x:collection1] o.a.s.c.SolrCore no updateRequestProcessorChain defined as default, creating implicit default
   [junit4]   2> 450748 INFO  (coreLoadExecutor-1722-thread-1) [    x:collection1] o.a.s.h.l.XMLLoader xsltCacheLifetimeSeconds=60
   [junit4]   2> 450749 INFO  (coreLoadExecutor-1722-thread-1) [    x:collection1] o.a.s.h.l.XMLLoader xsltCacheLifetimeSeconds=60
   [junit4]   2> 450750 INFO  (coreLoadExecutor-1722-thread-1) [    x:collection1] o.a.s.h.l.XMLLoader xsltCacheLifetimeSeconds=60
   [junit4]   2> 450751 INFO  (coreLoadExecutor-1722-thread-1) [    x:collection1] o.a.s.h.l.XMLLoader xsltCacheLifetimeSeconds=60
   [junit4]   2> 450753 INFO  (coreLoadExecutor-1722-thread-1) [    x:collection1] o.a.s.c.PluginBag requestHandler : 'lazy' created with startup=lazy 
   [junit4]   2> 450753 INFO  (coreLoadExecutor-1722-thread-1) [    x:collection1] o.a.s.c.RequestHandlers Registered paths: /admin/mbeans,standard,lazy,/update/json/docs,/admin/luke,/export,/get,/admin/properties,/update/json,/admin/threads,/update/csv,/sql,/graph,/admin/segments,/admin/system,/replication,defaults,/config,/stream,/schema,/admin/plugins,/admin/logging,/admin/ping,/update,/admin/file,/terms
   [junit4]   2> 450753 INFO  (coreLoadExecutor-1722-thread-1) [    x:collection1] o.a.s.c.SolrCore Using default statsCache cache: org.apache.solr.search.stats.LocalStatsCache
   [junit4]   2> 450754 INFO  (coreLoadExecutor-1722-thread-1) [    x:collection1] o.a.s.u.CommitTracker Hard AutoCommit: disabled
   [junit4]   2> 450754 INFO  (coreLoadExecutor-1722-thread-1) [    x:collection1] o.a.s.u.CommitTracker Soft AutoCommit: disabled
   [junit4]   2> 450754 INFO  (coreLoadExecutor-1722-thread-1) [    x:collection1] o.a.s.u.RandomMergePolicy RandomMergePolicy wrapping class org.apache.lucene.index.TieredMergePolicy: [TieredMergePolicy: maxMergeAtOnce=20, maxMergeAtOnceExplicit=15, maxMergedSegmentMB=72.5693359375, floorSegmentMB=1.484375, forceMergeDeletesPctAllowed=0.6529096288777358, segmentsPerTier=34.0, maxCFSSegmentSizeMB=8.796093022207999E12, noCFSRatio=0.46144161254256744
   [junit4]   2> 450755 INFO  (coreLoadExecutor-1722-thread-1) [    x:collection1] o.a.s.c.SolrDeletionPolicy SolrDeletionPolicy.onInit: commits: num=1
   [junit4]   2> 	commit{dir=MockDirectoryWrapper(RAMDirectory@bb9fe6 lockFactory=org.apache.lucene.store.SingleInstanceLockFactory@46876),segFN=segments_1,generation=1}
   [junit4]   2> 450755 INFO  (coreLoadExecutor-1722-thread-1) [    x:collection1] o.a.s.c.SolrDeletionPolicy newest commit generation = 1
   [junit4]   2> 450755 INFO  (coreLoadExecutor-1722-thread-1) [    x:collection1] o.a.s.s.SolrIndexSearcher Opening [Searcher@1affcf8[collection1] main]
   [junit4]   2> 450756 INFO  (coreLoadExecutor-1722-thread-1) [    x:collection1] o.a.s.r.ManagedResourceStorage File-based storage initialized to use dir: C:\Users\jenkins\workspace\Lucene-Solr-6.x-Windows\solr\build\solr-core\test\J0\temp\solr.handler.TestReplicationHandler_C7F24F7FD24F8B5A-001\solr-instance-003\collection1\conf
   [junit4]   2> 450756 INFO  (coreLoadExecutor-1722-thread-1) [    x:collection1] o.a.s.r.RestManager Initializing RestManager with initArgs: {storageDir=C:\Users\jenkins\workspace\Lucene-Solr-6.x-Windows\solr\build\solr-core\test\J0\temp\solr.handler.TestReplicationHandler_C7F24F7FD24F8B5A-001\solr-instance-003\collection1\conf}
   [junit4]   2> 450756 INFO  (coreLoadExecutor-1722-thread-1) [    x:collection1] o.a.s.r.ManagedResourceStorage Reading _rest_managed.json using file:dir=C:\Users\jenkins\workspace\Lucene-Solr-6.x-Windows\solr\build\solr-core\test\J0\temp\solr.handler.TestReplicationHandler_C7F24F7FD24F8B5A-001\solr-instance-003\collection1\conf
   [junit4]   2> 450756 INFO  (coreLoadExecutor-1722-thread-1) [    x:collection1] o.a.s.r.RestManager Initializing 0 registered ManagedResources
   [junit4]   2> 450756 WARN  (coreLoadExecutor-1722-thread-1) [    x:collection1] o.a.s.h.IndexFetcher 'masterUrl' must be specified without the /replication suffix
   [junit4]   2> 450757 INFO  (coreLoadExecutor-1722-thread-1) [    x:collection1] o.a.s.h.ReplicationHandler  No value set for 'pollInterval'. Timer Task not started.
   [junit4]   2> 450757 INFO  (coreLoadExecutor-1722-thread-1) [    x:collection1] o.a.s.h.ReplicationHandler Replication enabled for following config files: schema.xml
   [junit4]   2> 450757 INFO  (coreLoadExecutor-1722-thread-1) [    x:collection1] o.a.s.h.ReplicationHandler Commits will be reserved for  10000
   [junit4]   2> 450758 INFO  (searcherExecutor-1723-thread-1-processing-x:collection1) [    x:collection1] o.a.s.c.SolrCore [collection1] Registered new searcher Searcher@1affcf8[collection1] main{ExitableDirectoryReader(UninvertingDirectoryReader())}
   [junit4]   2> 450758 INFO  (coreLoadExecutor-1722-thread-1) [    x:collection1] o.a.s.c.CoreContainer registering core: collection1
   [junit4]   2> 451198 INFO  (qtp13190350-3552) [    x:collection1] o.a.s.u.p.LogUpdateProcessorFactory [collection1]  webapp=/solr path=/update params={wt=javabin&version=2}{add=[0]} 0 2
   [junit4]   2> 451201 INFO  (qtp13190350-3553) [    x:collection1] o.a.s.u.p.LogUpdateProcessorFactory [collection1]  webapp=/solr path=/update params={wt=javabin&version=2}{add=[1]} 0 0
   [junit4]   2> 451204 INFO  (qtp13190350-3554) [    x:collection1] o.a.s.u.p.LogUpdateProcessorFactory [collection1]  webapp=/solr path=/update params={wt=javabin&version=2}{add=[2]} 0 0
   [junit4]   2> 451205 INFO  (qtp13190350-3555) [    x:collection1] o.a.s.u.DirectUpdateHandler2 start commit{,optimize=false,openSearcher=true,waitSearcher=true,expungeDeletes=false,softCommit=false,prepareCommit=false}
   [junit4]   2> 451207 INFO  (qtp13190350-3555) [    x:collection1] o.a.s.c.SolrDeletionPolicy SolrDeletionPolicy.onCommit: commits: num=2
   [junit4]   2> 	commit{dir=MockDirectoryWrapper(RAMDirectory@bab325 lockFactory=org.apache.lucene.store.SingleInstanceLockFactory@1cc38ea),segFN=segments_1,generation=1}
   [junit4]   2> 	commit{dir=MockDirectoryWrapper(RAMDirectory@bab325 lockFactory=org.apache.lucene.store.SingleInstanceLockFactory@1cc38ea),segFN=segments_2,generation=2}
   [junit4]   2> 451208 INFO  (qtp13190350-3555) [    x:collection1] o.a.s.c.SolrDeletionPolicy newest commit generation = 2
   [junit4]   2> 451211 INFO  (qtp13190350-3555) [    x:collection1] o.a.s.s.SolrIndexSearcher Opening [Searcher@5f53f3[collection1] main]
   [junit4]   2> 451211 INFO  (qtp13190350-3555) [    x:collection1] o.a.s.u.DirectUpdateHandler2 end_commit_flush
   [junit4]   2> 451211 INFO  (searcherExecutor-1690-thread-1-processing-x:collection1) [    x:collection1] o.a.s.c.SolrCore [collection1] Registered new searcher Searcher@5f53f3[collection1] main{ExitableDirectoryReader(UninvertingDirectoryReader(Uninverting(_0(6.3.0):C3)))}
   [junit4]   2> 451212 INFO  (qtp13190350-3555) [    x:collection1] o.a.s.u.p.LogUpdateProcessorFactory [collection1]  webapp=/solr path=/update params={waitSearcher=true&commit=true&softCommit=false&wt=javabin&version=2}{commit=} 0 6
   [junit4]   2> 451237 WARN  (explicit-fetchindex-cmd) [    x:collection1] o.a.s.h.IndexFetcher 'masterUrl' must be specified without the /replication suffix
   [junit4]   2> 451242 INFO  (qtp13190350-3556) [    x:collection1] o.a.s.c.S.Request [collection1]  webapp=/solr path=/replication params={qt=/replication&wt=javabin&version=2&command=indexversion} status=0 QTime=0
   [junit4]   2> 451242 INFO  (explicit-fetchindex-cmd) [    x:collection1] o.a.s.h.IndexFetcher Master's generation: 2
   [junit4]   2> 451242 INFO  (explicit-fetchindex-cmd) [    x:collection1] o.a.s.h.IndexFetcher Master's version: 1473556503081
   [junit4]   2> 451242 INFO  (explicit-fetchindex-cmd) [    x:collection1] o.a.s.h.IndexFetcher Slave's generation: 1
   [junit4]   2> 451243 INFO  (explicit-fetchindex-cmd) [    x:collection1] o.a.s.h.IndexFetcher Starting replication process
   [junit4]   2> 451251 INFO  (qtp13190350-3550) [    x:collection1] o.a.s.c.S.Request [collection1]  webapp=/solr path=/replication params={generation=2&qt=/replication&wt=javabin&version=2&command=filelist} status=0 QTime=7
   [junit4]   2> 451252 INFO  (explicit-fetchindex-cmd) [    x:collection1] o.a.s.h.IndexFetcher Number of files in latest index in master: 10
   [junit4]   2> 451253 INFO  (explicit-fetchindex-cmd) [    x:collection1] o.a.s.c.CachingDirectoryFactory return new directory for C:\Users\jenkins\workspace\Lucene-Solr-6.x-Windows\solr\build\solr-core\test\J0\temp\solr.handler.TestReplicationHandler_C7F24F7FD24F8B5A-001\solr-instance-003\.\collection1\data\index.20160910211503128
   [junit4]   2> 451253 INFO  (explicit-fetchindex-cmd) [    x:collection1] o.a.s.u.DefaultSolrCoreState Rollback old IndexWriter... core=collection1
   [junit4]   2> 451253 INFO  (explicit-fetchindex-cmd) [    x:collection1] o.a.s.u.RandomMergePolicy RandomMergePolicy wrapping class org.apache.lucene.index.LogByteSizeMergePolicy: [LogByteSizeMergePolicy: minMergeSize=1677721, mergeFactor=29, maxMergeSize=2147483648, maxMergeSizeForForcedMerge=9223372036854775807, calibrateSizeByDeletes=false, maxMergeDocs=2147483647, maxCFSSegmentSizeMB=8.796093022207999E12, noCFSRatio=0.6081258001198929]
   [junit4]   2> 451254 INFO  (explicit-fetchindex-cmd) [    x:collection1] o.a.s.c.SolrDeletionPolicy SolrDeletionPolicy.onInit: commits: num=1
   [junit4]   2> 	commit{dir=MockDirectoryWrapper(RAMDirectory@bb9fe6 lockFactory=org.apache.lucene.store.SingleInstanceLockFactory@46876),segFN=segments_1,generation=1}
   [junit4]   2> 451254 INFO  (explicit-fetchindex-cmd) [    x:collection1] o.a.s.c.SolrDeletionPolicy newest commit generation = 1
   [junit4]   2> 451254 INFO  (explicit-fetchindex-cmd) [    x:collection1] o.a.s.u.DefaultSolrCoreState New IndexWriter is ready to be used.
   [junit4]   2> 451255 INFO  (explicit-fetchindex-cmd) [    x:collection1] o.a.s.c.SolrDeletionPolicy SolrDeletionPolicy.onCommit: commits: num=1
   [junit4]   2> 	commit{dir=MockDirectoryWrapper(RAMDirectory@bb9fe6 lockFactory=org.apache.lucene.store.SingleInstanceLockFactory@46876),segFN=segments_1,generation=1}
   [junit4]   2> 451255 INFO  (explicit-fetchindex-cmd) [    x:collection1] o.a.s.c.SolrDeletionPolicy newest commit generation = 1
   [junit4]   2> 451255 INFO  (explicit-fetchindex-cmd) [    x:collection1] o.a.s.u.DefaultSolrCoreState Rollback old IndexWriter... core=collection1
   [junit4]   2> 451255 INFO  (explicit-fetchindex-cmd) [    x:collection1] o.a.s.h.IndexFetcher Starting download (fullCopy=false) to MockDirectoryWrapper(RAMDirectory@10ed167 lockFactory=org.apache.lucene.store.SingleInstanceLockFactory@993a0d)
   [junit4]   2> 451257 INFO  (qtp13190350-3552) [    x:collection1] o.a.s.c.S.Request [collection1]  webapp=/solr path=/replication params={generation=2&qt=/replication&file=_0.si&checksum=true&wt=filestream&command=filecontent} status=0 QTime=0
   [junit4]   2> 451259 INFO  (qtp13190350-3553) [    x:collection1] o.a.s.c.S.Request [collection1]  webapp=/solr path=/replication params={generation=2&qt=/replication&file=_0.nvd&checksum=true&wt=filestream&command=filecontent} status=0 QTime=0
   [junit4]   2> 451262 INFO  (qtp13190350-3554) [    x:collection1] o.a.s.c.S.Request [collection1]  webapp=/solr path=/replication params={generation=2&qt=/replication&file=_0.fdx&checksum=true&wt=filestream&command=filecontent} status=0 QTime=0
   [junit4]   2> 451264 INFO  (qtp13190350-3555) [    x:collection1] o.a.s.c.S.Request [collection1]  webapp=/solr path=/replication params={generation=2&qt=/replication&file=_0_Asserting_0.doc&checksum=true&wt=filestream&command=filecontent} status=0 QTime=0
   [junit4]   2> 451267 INFO  (qtp13190350-3557) [    x:collection1] o.a.s.c.S.Request [collection1]  webapp=/solr path=/replication params={generation=2&qt=/replication&file=_0_Asserting_0.tim&checksum=true&wt=filestream&command=filecontent} status=0 QTime=0
   [junit4]   2> 451269 INFO  (qtp13190350-3556) [    x:collection1] o.a.s.c.S.Request [collection1]  webapp=/solr path=/replication params={generation=2&qt=/replication&file=_0.fdt&checksum=true&wt=filestream&command=filecontent} status=0 QTime=0
   [junit4]   2> 451270 INFO  (qtp13190350-3550) [    x:collection1] o.a.s.c.S.Request [collection1]  webapp=/solr path=/replication params={generation=2&qt=/replication&file=_0_Asserting_0.tip&checksum=true&wt=filestream&command=filecontent} status=0 QTime=0
   [junit4]   2> 451273 INFO  (qtp13190350-3552) [    x:collection1] o.a.s.c.S.Request [collection1]  webapp=/solr path=/replication params={generation=2&qt=/replication&file=_0.fnm&checksum=true&wt=filestream&command=filecontent} status=0 QTime=0
   [junit4]   2> 451275 INFO  (qtp13190350-3553) [    x:collection1] o.a.s.c.S.Request [collection1]  webapp=/solr path=/replication params={generation=2&qt=/replication&file=_0.nvm&checksum=true&wt=filestream&command=filecontent} status=0 QTime=0
   [junit4]   2> 451290 INFO  (qtp13190350-3554) [    x:collection1] o.a.s.c.S.Request [collection1]  webapp=/solr path=/replication params={generation=2&qt=/replication&file=segments_2&checksum=true&wt=filestream&command=filecontent} status=0 QTime=0
   [junit4]   2> 451291 INFO  (explicit-fetchindex-cmd) [    x:collection1] o.a.s.h.IndexFetcher Total time taken for download (fullCopy=false,bytesDownloaded=1692) : 0 secs (null bytes/sec) to MockDirectoryWrapper(RAMDirectory@10ed167 lockFactory=org.apache.lucene.store.SingleInstanceLockFactory@993a0d)
   [junit4]   2> 451294 INFO  (explicit-fetchindex-cmd) [    x:collection1] o.a.s.u.RandomMergePolicy RandomMergePolicy wrapping class org.apache.lucene.index.TieredMergePolicy: [TieredMergePolicy: maxMergeAtOnce=20, maxMergeAtOnceExplicit=15, maxMergedSegmentMB=72.5693359375, floorSegmentMB=1.484375, forceMergeDeletesPctAllowed=0.6529096288777358, segmentsPerTier=34.0, maxCFSSegmentSizeMB=8.796093022207999E12, noCFSRatio=0.46144161254256744
   [junit4]   2> 451295 INFO  (explicit-fetchindex-cmd) [    x:collection1] o.a.s.c.SolrDeletionPolicy SolrDeletionPolicy.onInit: commits: num=2
   [junit4]   2> 	commit{dir=MockDirectoryWrapper(RAMDirectory@bb9fe6 lockFactory=org.apache.lucene.store.SingleInstanceLockFactory@46876),segFN=segments_1,generation=1}
   [junit4]   2> 	commit{dir=MockDirectoryWrapper(RAMDirectory@bb9fe6 lockFactory=org.apache.lucene.store.SingleInstanceLockFactory@46876),segFN=segments_2,generation=2}
   [junit4]   2> 451295 INFO  (explicit-fetchindex-cmd) [    x:collection1] o.a.s.c.SolrDeletionPolicy newest commit generation = 2
   [junit4]   2> 451296 INFO  (explicit-fetchindex-cmd) [    x:collection1] o.a.s.u.DefaultSolrCoreState New IndexWriter is ready to be used.
   [junit4]   2> 451301 INFO  (explicit-fetchindex-cmd) [    x:collection1] o.a.s.s.SolrIndexSearcher Opening [Searcher@a5e08a[collection1] main]
   [junit4]   2> 451301 INFO  (searcherExecutor-1723-thread-1-processing-x:collection1) [    x:collection1] o.a.s.c.SolrCore [collection1] Registered new searcher Searcher@a5e08a[collection1] main{ExitableDirectoryReader(UninvertingDirectoryReader(Uninverting(_0(6.3.0):C3)))}
   [junit4]   2> 451302 INFO  (explicit-fetchindex-cmd) [    x:collection1] o.a.s.c.CachingDirectoryFactory looking to close C:\Users\jenkins\workspace\Lucene-Solr-6.x-Windows\solr\build\solr-core\test\J0\temp\solr.handler.TestReplicationHandler_C7F24F7FD24F8B5A-001\solr-instance-003\.\collection1\data\index.20160910211503128 [CachedDir<<refCount=0;path=C:\Users\jenkins\workspace\Lucene-Solr-6.x-Windows\solr\build\solr-core\test\J0\temp\solr.handler.TestReplicationHa

[...truncated too long message...]

\solr-core\test\J0\temp\solr.handler.TestReplicationHandler_C7F24F7FD24F8B5A-001\solr-instance-029\.\collection1\data\;done=false>>]
   [junit4]   2> 529853 INFO  (coreCloseExecutor-2337-thread-1) [    x:collection1] o.a.s.c.CachingDirectoryFactory Closing directory, CoreContainer#isShutdown=true
   [junit4]   2> 529853 INFO  (coreCloseExecutor-2337-thread-1) [    x:collection1] o.a.s.c.CachingDirectoryFactory Closing directory: C:\Users\jenkins\workspace\Lucene-Solr-6.x-Windows\solr\build\solr-core\test\J0\temp\solr.handler.TestReplicationHandler_C7F24F7FD24F8B5A-001\solr-instance-029\.\collection1\data\
   [junit4]   2> 529853 INFO  (coreCloseExecutor-2337-thread-1) [    x:collection1] o.a.s.c.CachingDirectoryFactory looking to close C:\Users\jenkins\workspace\Lucene-Solr-6.x-Windows\solr\build\solr-core\test\J0\temp\solr.handler.TestReplicationHandler_C7F24F7FD24F8B5A-001\solr-instance-029\.\collection1\data\index [CachedDir<<refCount=0;path=C:\Users\jenkins\workspace\Lucene-Solr-6.x-Windows\solr\build\solr-core\test\J0\temp\solr.handler.TestReplicationHandler_C7F24F7FD24F8B5A-001\solr-instance-029\.\collection1\data\index;done=false>>]
   [junit4]   2> 529853 INFO  (coreCloseExecutor-2337-thread-1) [    x:collection1] o.a.s.c.CachingDirectoryFactory Closing directory, CoreContainer#isShutdown=true
   [junit4]   2> 529853 INFO  (coreCloseExecutor-2337-thread-1) [    x:collection1] o.a.s.c.CachingDirectoryFactory Closing directory: C:\Users\jenkins\workspace\Lucene-Solr-6.x-Windows\solr\build\solr-core\test\J0\temp\solr.handler.TestReplicationHandler_C7F24F7FD24F8B5A-001\solr-instance-029\.\collection1\data\index
   [junit4]   2> 529853 INFO  (coreCloseExecutor-2337-thread-1) [    x:collection1] o.a.s.c.CachingDirectoryFactory looking to close C:\Users\jenkins\workspace\Lucene-Solr-6.x-Windows\solr\build\solr-core\test\J0\temp\solr.handler.TestReplicationHandler_C7F24F7FD24F8B5A-001\solr-instance-029\.\collection1\data\snapshot_metadata [CachedDir<<refCount=0;path=C:\Users\jenkins\workspace\Lucene-Solr-6.x-Windows\solr\build\solr-core\test\J0\temp\solr.handler.TestReplicationHandler_C7F24F7FD24F8B5A-001\solr-instance-029\.\collection1\data\snapshot_metadata;done=false>>]
   [junit4]   2> 529853 INFO  (coreCloseExecutor-2337-thread-1) [    x:collection1] o.a.s.c.CachingDirectoryFactory Closing directory, CoreContainer#isShutdown=true
   [junit4]   2> 529853 INFO  (coreCloseExecutor-2337-thread-1) [    x:collection1] o.a.s.c.CachingDirectoryFactory Closing directory: C:\Users\jenkins\workspace\Lucene-Solr-6.x-Windows\solr\build\solr-core\test\J0\temp\solr.handler.TestReplicationHandler_C7F24F7FD24F8B5A-001\solr-instance-029\.\collection1\data\snapshot_metadata
   [junit4]   2> 529853 INFO  (TEST-TestReplicationHandler.doTestReplicateAfterCoreReload-seed#[C7F24F7FD24F8B5A]) [    ] o.e.j.s.h.ContextHandler Stopped o.e.j.s.ServletContextHandler@9c5ffb{/solr,null,UNAVAILABLE}
   [junit4]   2> 529856 INFO  (TEST-TestReplicationHandler.doTestReplicateAfterCoreReload-seed#[C7F24F7FD24F8B5A]) [    ] o.e.j.s.ServerConnector Stopped ServerConnector@7e4a0f{HTTP/1.1,[http/1.1]}{127.0.0.1:0}
   [junit4]   2> 529856 INFO  (TEST-TestReplicationHandler.doTestReplicateAfterCoreReload-seed#[C7F24F7FD24F8B5A]) [    ] o.a.s.c.CoreContainer Shutting down CoreContainer instance=29817413
   [junit4]   2> 529857 INFO  (coreCloseExecutor-2339-thread-1) [    x:collection1] o.a.s.c.SolrCore [collection1]  CLOSING SolrCore org.apache.solr.core.SolrCore@1ef1eb4
   [junit4]   2> 529857 INFO  (coreCloseExecutor-2339-thread-1) [    x:collection1] o.a.s.u.DirectUpdateHandler2 closing DirectUpdateHandler2{commits=0,autocommits=0,soft autocommits=0,optimizes=0,rollbacks=0,expungeDeletes=0,docsPending=0,adds=0,deletesById=0,deletesByQuery=0,errors=0,cumulative_adds=0,cumulative_deletesById=0,cumulative_deletesByQuery=0,cumulative_errors=0}
   [junit4]   2> 529858 INFO  (coreCloseExecutor-2339-thread-1) [    x:collection1] o.a.s.u.SolrCoreState Closing SolrCoreState
   [junit4]   2> 529858 INFO  (coreCloseExecutor-2339-thread-1) [    x:collection1] o.a.s.u.DefaultSolrCoreState SolrCoreState ref count has reached 0 - closing IndexWriter
   [junit4]   2> 529858 INFO  (coreCloseExecutor-2339-thread-1) [    x:collection1] o.a.s.u.DefaultSolrCoreState closing IndexWriter with IndexWriterCloser
   [junit4]   2> 529858 INFO  (coreCloseExecutor-2339-thread-1) [    x:collection1] o.a.s.c.SolrCore [collection1] Closing main searcher on request.
   [junit4]   2> 529858 INFO  (coreCloseExecutor-2339-thread-1) [    x:collection1] o.a.s.c.CachingDirectoryFactory Closing MockDirectoryFactory - 3 directories currently being tracked
   [junit4]   2> 529858 INFO  (coreCloseExecutor-2339-thread-1) [    x:collection1] o.a.s.c.CachingDirectoryFactory looking to close C:\Users\jenkins\workspace\Lucene-Solr-6.x-Windows\solr\build\solr-core\test\J0\temp\solr.handler.TestReplicationHandler_C7F24F7FD24F8B5A-001\solr-instance-030\.\collection1\data\ [CachedDir<<refCount=0;path=C:\Users\jenkins\workspace\Lucene-Solr-6.x-Windows\solr\build\solr-core\test\J0\temp\solr.handler.TestReplicationHandler_C7F24F7FD24F8B5A-001\solr-instance-030\.\collection1\data\;done=false>>]
   [junit4]   2> 529858 INFO  (coreCloseExecutor-2339-thread-1) [    x:collection1] o.a.s.c.CachingDirectoryFactory Closing directory, CoreContainer#isShutdown=true
   [junit4]   2> 529858 INFO  (coreCloseExecutor-2339-thread-1) [    x:collection1] o.a.s.c.CachingDirectoryFactory Closing directory: C:\Users\jenkins\workspace\Lucene-Solr-6.x-Windows\solr\build\solr-core\test\J0\temp\solr.handler.TestReplicationHandler_C7F24F7FD24F8B5A-001\solr-instance-030\.\collection1\data\
   [junit4]   2> 529858 INFO  (coreCloseExecutor-2339-thread-1) [    x:collection1] o.a.s.c.CachingDirectoryFactory looking to close C:\Users\jenkins\workspace\Lucene-Solr-6.x-Windows\solr\build\solr-core\test\J0\temp\solr.handler.TestReplicationHandler_C7F24F7FD24F8B5A-001\solr-instance-030\.\collection1\data\snapshot_metadata [CachedDir<<refCount=0;path=C:\Users\jenkins\workspace\Lucene-Solr-6.x-Windows\solr\build\solr-core\test\J0\temp\solr.handler.TestReplicationHandler_C7F24F7FD24F8B5A-001\solr-instance-030\.\collection1\data\snapshot_metadata;done=false>>]
   [junit4]   2> 529859 INFO  (coreCloseExecutor-2339-thread-1) [    x:collection1] o.a.s.c.CachingDirectoryFactory Closing directory, CoreContainer#isShutdown=true
   [junit4]   2> 529859 INFO  (coreCloseExecutor-2339-thread-1) [    x:collection1] o.a.s.c.CachingDirectoryFactory Closing directory: C:\Users\jenkins\workspace\Lucene-Solr-6.x-Windows\solr\build\solr-core\test\J0\temp\solr.handler.TestReplicationHandler_C7F24F7FD24F8B5A-001\solr-instance-030\.\collection1\data\snapshot_metadata
   [junit4]   2> 529859 INFO  (coreCloseExecutor-2339-thread-1) [    x:collection1] o.a.s.c.CachingDirectoryFactory looking to close C:\Users\jenkins\workspace\Lucene-Solr-6.x-Windows\solr\build\solr-core\test\J0\temp\solr.handler.TestReplicationHandler_C7F24F7FD24F8B5A-001\solr-instance-030\.\collection1\data\index [CachedDir<<refCount=0;path=C:\Users\jenkins\workspace\Lucene-Solr-6.x-Windows\solr\build\solr-core\test\J0\temp\solr.handler.TestReplicationHandler_C7F24F7FD24F8B5A-001\solr-instance-030\.\collection1\data\index;done=false>>]
   [junit4]   2> 529859 INFO  (coreCloseExecutor-2339-thread-1) [    x:collection1] o.a.s.c.CachingDirectoryFactory Closing directory, CoreContainer#isShutdown=true
   [junit4]   2> 529859 INFO  (coreCloseExecutor-2339-thread-1) [    x:collection1] o.a.s.c.CachingDirectoryFactory Closing directory: C:\Users\jenkins\workspace\Lucene-Solr-6.x-Windows\solr\build\solr-core\test\J0\temp\solr.handler.TestReplicationHandler_C7F24F7FD24F8B5A-001\solr-instance-030\.\collection1\data\index
   [junit4]   2> 529860 INFO  (TEST-TestReplicationHandler.doTestReplicateAfterCoreReload-seed#[C7F24F7FD24F8B5A]) [    ] o.e.j.s.h.ContextHandler Stopped o.e.j.s.ServletContextHandler@130514{/solr,null,UNAVAILABLE}
   [junit4]   2> 529862 INFO  (SUITE-TestReplicationHandler-seed#[C7F24F7FD24F8B5A]-worker) [    ] o.a.s.SolrTestCaseJ4 ###deleteCore
   [junit4]   2> NOTE: leaving temporary files on disk at: C:\Users\jenkins\workspace\Lucene-Solr-6.x-Windows\solr\build\solr-core\test\J0\temp\solr.handler.TestReplicationHandler_C7F24F7FD24F8B5A-001
   [junit4]   2> NOTE: test params are: codec=Asserting(Lucene62), sim=RandomSimilarity(queryNorm=true,coord=no): {}, locale=ar-SY, timezone=America/Antigua
   [junit4]   2> NOTE: Windows 10 10.0 x86/Oracle Corporation 1.8.0_102 (32-bit)/cpus=3,threads=1,free=456039144,total=536870912
   [junit4]   2> NOTE: All tests run in this JVM: [DOMUtilTest, FileUtilsTest, TestHighlightDedupGrouping, TestPostingsSolrHighlighter, SpatialFilterTest, HdfsChaosMonkeySafeLeaderTest, DateFieldTest, TestXmlQParserPlugin, AssignTest, TestFaceting, TestReloadAndDeleteDocs, DeleteShardTest, TestLeaderInitiatedRecoveryThread, TestFieldSortValues, CollectionTooManyReplicasTest, TestSchemaManager, DocValuesMissingTest, TestConfigSetsAPIExclusivity, SuggesterFSTTest, XmlUpdateRequestHandlerTest, TestPerFieldSimilarity, HighlighterTest, DirectSolrConnectionTest, TestSubQueryTransformer, TestOnReconnectListenerSupport, RestartWhileUpdatingTest, StandardRequestHandlerTest, TestHighFrequencyDictionaryFactory, RequestLoggingTest, BasicDistributedZkTest, ChaosMonkeyNothingIsSafeTest, DeleteInactiveReplicaTest, XsltUpdateRequestHandlerTest, TestDocBasedVersionConstraints, TestMacroExpander, ShardRoutingTest, TestExactStatsCache, DistributedQueryComponentCustomSortTest, TestComplexPhraseQParserPlugin, DistributedSpellCheckComponentTest, TestReloadDeadlock, TestXIncludeConfig, BitVectorTest, TestSolrDeletionPolicy1, TestUseDocValuesAsStored2, DocValuesMultiTest, TestSolrQueryParserResource, TestReplicationHandler]
   [junit4] Completed [141/630 (1!)] on J0 in 80.84s, 15 tests, 1 failure, 1 skipped <<< FAILURES!

[...truncated 54151 lines...]


Mime
View raw message