lucene-dev mailing list archives

Site index · List index
Message view « Date » · « Thread »
Top « Date » · « Thread »
From Policeman Jenkins Server <jenk...@thetaphi.de>
Subject [JENKINS-EA] Lucene-Solr-6.x-Linux (32bit/jdk-9-ea+134) - Build # 1707 - Still Unstable!
Date Mon, 12 Sep 2016 07:11:02 GMT
Build: http://jenkins.thetaphi.de/job/Lucene-Solr-6.x-Linux/1707/
Java: 32bit/jdk-9-ea+134 -server -XX:+UseConcMarkSweepGC

2 tests failed.
FAILED:  org.apache.solr.cloud.ForceLeaderTest.testReplicasInLIRNoLeader

Error Message:
No live SolrServers available to handle this request:[http://127.0.0.1:36191/forceleader_test_collection_shard1_replica2]

Stack Trace:
org.apache.solr.client.solrj.impl.CloudSolrClient$RouteException: No live SolrServers available to handle this request:[http://127.0.0.1:36191/forceleader_test_collection_shard1_replica2]
	at __randomizedtesting.SeedInfo.seed([55FCF4D6D081CFA1:B36BC016E90336C0]:0)
	at org.apache.solr.client.solrj.impl.CloudSolrClient.directUpdate(CloudSolrClient.java:755)
	at org.apache.solr.client.solrj.impl.CloudSolrClient.sendRequest(CloudSolrClient.java:1161)
	at org.apache.solr.client.solrj.impl.CloudSolrClient.requestWithRetryOnStaleState(CloudSolrClient.java:1050)
	at org.apache.solr.client.solrj.impl.CloudSolrClient.request(CloudSolrClient.java:992)
	at org.apache.solr.cloud.AbstractFullDistribZkTestBase.sendDocsWithRetry(AbstractFullDistribZkTestBase.java:753)
	at org.apache.solr.cloud.AbstractFullDistribZkTestBase.sendDocsWithRetry(AbstractFullDistribZkTestBase.java:741)
	at org.apache.solr.cloud.ForceLeaderTest.sendDoc(ForceLeaderTest.java:424)
	at org.apache.solr.cloud.ForceLeaderTest.testReplicasInLIRNoLeader(ForceLeaderTest.java:131)
	at jdk.internal.reflect.NativeMethodAccessorImpl.invoke0(java.base@9-ea/Native Method)
	at jdk.internal.reflect.NativeMethodAccessorImpl.invoke(java.base@9-ea/NativeMethodAccessorImpl.java:62)
	at jdk.internal.reflect.DelegatingMethodAccessorImpl.invoke(java.base@9-ea/DelegatingMethodAccessorImpl.java:43)
	at java.lang.reflect.Method.invoke(java.base@9-ea/Method.java:535)
	at com.carrotsearch.randomizedtesting.RandomizedRunner.invoke(RandomizedRunner.java:1764)
	at com.carrotsearch.randomizedtesting.RandomizedRunner$8.evaluate(RandomizedRunner.java:871)
	at com.carrotsearch.randomizedtesting.RandomizedRunner$9.evaluate(RandomizedRunner.java:907)
	at com.carrotsearch.randomizedtesting.RandomizedRunner$10.evaluate(RandomizedRunner.java:921)
	at org.apache.solr.BaseDistributedSearchTestCase$ShardsRepeatRule$ShardsFixedStatement.callStatement(BaseDistributedSearchTestCase.java:992)
	at org.apache.solr.BaseDistributedSearchTestCase$ShardsRepeatRule$ShardsStatement.evaluate(BaseDistributedSearchTestCase.java:967)
	at com.carrotsearch.randomizedtesting.rules.SystemPropertiesRestoreRule$1.evaluate(SystemPropertiesRestoreRule.java:57)
	at org.apache.lucene.util.TestRuleSetupTeardownChained$1.evaluate(TestRuleSetupTeardownChained.java:49)
	at org.apache.lucene.util.AbstractBeforeAfterRule$1.evaluate(AbstractBeforeAfterRule.java:45)
	at org.apache.lucene.util.TestRuleThreadAndTestName$1.evaluate(TestRuleThreadAndTestName.java:48)
	at org.apache.lucene.util.TestRuleIgnoreAfterMaxFailures$1.evaluate(TestRuleIgnoreAfterMaxFailures.java:64)
	at org.apache.lucene.util.TestRuleMarkFailure$1.evaluate(TestRuleMarkFailure.java:47)
	at com.carrotsearch.randomizedtesting.rules.StatementAdapter.evaluate(StatementAdapter.java:36)
	at com.carrotsearch.randomizedtesting.ThreadLeakControl$StatementRunner.run(ThreadLeakControl.java:367)
	at com.carrotsearch.randomizedtesting.ThreadLeakControl.forkTimeoutingTask(ThreadLeakControl.java:809)
	at com.carrotsearch.randomizedtesting.ThreadLeakControl$3.evaluate(ThreadLeakControl.java:460)
	at com.carrotsearch.randomizedtesting.RandomizedRunner.runSingleTest(RandomizedRunner.java:880)
	at com.carrotsearch.randomizedtesting.RandomizedRunner$5.evaluate(RandomizedRunner.java:781)
	at com.carrotsearch.randomizedtesting.RandomizedRunner$6.evaluate(RandomizedRunner.java:816)
	at com.carrotsearch.randomizedtesting.RandomizedRunner$7.evaluate(RandomizedRunner.java:827)
	at com.carrotsearch.randomizedtesting.rules.StatementAdapter.evaluate(StatementAdapter.java:36)
	at com.carrotsearch.randomizedtesting.rules.SystemPropertiesRestoreRule$1.evaluate(SystemPropertiesRestoreRule.java:57)
	at org.apache.lucene.util.AbstractBeforeAfterRule$1.evaluate(AbstractBeforeAfterRule.java:45)
	at com.carrotsearch.randomizedtesting.rules.StatementAdapter.evaluate(StatementAdapter.java:36)
	at org.apache.lucene.util.TestRuleStoreClassName$1.evaluate(TestRuleStoreClassName.java:41)
	at com.carrotsearch.randomizedtesting.rules.NoShadowingOrOverridesOnMethodsRule$1.evaluate(NoShadowingOrOverridesOnMethodsRule.java:40)
	at com.carrotsearch.randomizedtesting.rules.NoShadowingOrOverridesOnMethodsRule$1.evaluate(NoShadowingOrOverridesOnMethodsRule.java:40)
	at com.carrotsearch.randomizedtesting.rules.StatementAdapter.evaluate(StatementAdapter.java:36)
	at com.carrotsearch.randomizedtesting.rules.StatementAdapter.evaluate(StatementAdapter.java:36)
	at com.carrotsearch.randomizedtesting.rules.StatementAdapter.evaluate(StatementAdapter.java:36)
	at org.apache.lucene.util.TestRuleAssertionsRequired$1.evaluate(TestRuleAssertionsRequired.java:53)
	at org.apache.lucene.util.TestRuleMarkFailure$1.evaluate(TestRuleMarkFailure.java:47)
	at org.apache.lucene.util.TestRuleIgnoreAfterMaxFailures$1.evaluate(TestRuleIgnoreAfterMaxFailures.java:64)
	at org.apache.lucene.util.TestRuleIgnoreTestSuites$1.evaluate(TestRuleIgnoreTestSuites.java:54)
	at com.carrotsearch.randomizedtesting.rules.StatementAdapter.evaluate(StatementAdapter.java:36)
	at com.carrotsearch.randomizedtesting.ThreadLeakControl$StatementRunner.run(ThreadLeakControl.java:367)
	at java.lang.Thread.run(java.base@9-ea/Thread.java:843)
Caused by: org.apache.solr.client.solrj.SolrServerException: No live SolrServers available to handle this request:[http://127.0.0.1:36191/forceleader_test_collection_shard1_replica2]
	at org.apache.solr.client.solrj.impl.LBHttpSolrClient.request(LBHttpSolrClient.java:384)
	at org.apache.solr.client.solrj.impl.CloudSolrClient.lambda$directUpdate$0(CloudSolrClient.java:730)
	at java.util.concurrent.FutureTask.run(java.base@9-ea/FutureTask.java:264)
	at org.apache.solr.common.util.ExecutorUtil$MDCAwareThreadPoolExecutor.lambda$execute$0(ExecutorUtil.java:229)
	at java.util.concurrent.ThreadPoolExecutor.runWorker(java.base@9-ea/ThreadPoolExecutor.java:1158)
	at java.util.concurrent.ThreadPoolExecutor$Worker.run(java.base@9-ea/ThreadPoolExecutor.java:632)
	... 1 more
Caused by: org.apache.solr.client.solrj.SolrServerException: Server refused connection at: http://127.0.0.1:36191/forceleader_test_collection_shard1_replica2
	at org.apache.solr.client.solrj.impl.HttpSolrClient.executeMethod(HttpSolrClient.java:599)
	at org.apache.solr.client.solrj.impl.HttpSolrClient.request(HttpSolrClient.java:261)
	at org.apache.solr.client.solrj.impl.HttpSolrClient.request(HttpSolrClient.java:250)
	at org.apache.solr.client.solrj.impl.LBHttpSolrClient.doRequest(LBHttpSolrClient.java:405)
	at org.apache.solr.client.solrj.impl.LBHttpSolrClient.request(LBHttpSolrClient.java:373)
	... 6 more
Caused by: java.net.ConnectException: Connection refused
	at java.net.PlainSocketImpl.socketConnect(java.base@9-ea/Native Method)
	at java.net.AbstractPlainSocketImpl.doConnect(java.base@9-ea/AbstractPlainSocketImpl.java:400)
	at java.net.AbstractPlainSocketImpl.connectToAddress(java.base@9-ea/AbstractPlainSocketImpl.java:243)
	at java.net.AbstractPlainSocketImpl.connect(java.base@9-ea/AbstractPlainSocketImpl.java:225)
	at java.net.SocksSocketImpl.connect(java.base@9-ea/SocksSocketImpl.java:402)
	at java.net.Socket.connect(java.base@9-ea/Socket.java:591)
	at org.apache.http.conn.scheme.PlainSocketFactory.connectSocket(PlainSocketFactory.java:117)
	at org.apache.http.impl.conn.DefaultClientConnectionOperator.openConnection(DefaultClientConnectionOperator.java:177)
	at org.apache.http.impl.conn.ManagedClientConnectionImpl.open(ManagedClientConnectionImpl.java:304)
	at org.apache.http.impl.client.DefaultRequestDirector.tryConnect(DefaultRequestDirector.java:611)
	at org.apache.http.impl.client.DefaultRequestDirector.execute(DefaultRequestDirector.java:446)
	at org.apache.http.impl.client.AbstractHttpClient.doExecute(AbstractHttpClient.java:882)
	at org.apache.http.impl.client.CloseableHttpClient.execute(CloseableHttpClient.java:82)
	at org.apache.http.impl.client.CloseableHttpClient.execute(CloseableHttpClient.java:107)
	at org.apache.http.impl.client.CloseableHttpClient.execute(CloseableHttpClient.java:55)
	at org.apache.solr.client.solrj.impl.HttpSolrClient.executeMethod(HttpSolrClient.java:497)
	... 10 more


FAILED:  org.apache.solr.security.BasicAuthIntegrationTest.testBasicAuth

Error Message:
IOException occured when talking to server at: https://127.0.0.1:45811/solr

Stack Trace:
org.apache.solr.client.solrj.SolrServerException: IOException occured when talking to server at: https://127.0.0.1:45811/solr
	at __randomizedtesting.SeedInfo.seed([55FCF4D6D081CFA1:E99282C474D24CDB]:0)
	at org.apache.solr.client.solrj.impl.HttpSolrClient.executeMethod(HttpSolrClient.java:606)
	at org.apache.solr.client.solrj.impl.HttpSolrClient.request(HttpSolrClient.java:261)
	at org.apache.solr.client.solrj.impl.HttpSolrClient.request(HttpSolrClient.java:250)
	at org.apache.solr.client.solrj.SolrClient.request(SolrClient.java:1219)
	at org.apache.solr.security.BasicAuthIntegrationTest.testBasicAuth(BasicAuthIntegrationTest.java:158)
	at jdk.internal.reflect.NativeMethodAccessorImpl.invoke0(java.base@9-ea/Native Method)
	at jdk.internal.reflect.NativeMethodAccessorImpl.invoke(java.base@9-ea/NativeMethodAccessorImpl.java:62)
	at jdk.internal.reflect.DelegatingMethodAccessorImpl.invoke(java.base@9-ea/DelegatingMethodAccessorImpl.java:43)
	at java.lang.reflect.Method.invoke(java.base@9-ea/Method.java:535)
	at com.carrotsearch.randomizedtesting.RandomizedRunner.invoke(RandomizedRunner.java:1764)
	at com.carrotsearch.randomizedtesting.RandomizedRunner$8.evaluate(RandomizedRunner.java:871)
	at com.carrotsearch.randomizedtesting.RandomizedRunner$9.evaluate(RandomizedRunner.java:907)
	at com.carrotsearch.randomizedtesting.RandomizedRunner$10.evaluate(RandomizedRunner.java:921)
	at com.carrotsearch.randomizedtesting.rules.SystemPropertiesRestoreRule$1.evaluate(SystemPropertiesRestoreRule.java:57)
	at org.apache.lucene.util.TestRuleSetupTeardownChained$1.evaluate(TestRuleSetupTeardownChained.java:49)
	at org.apache.lucene.util.AbstractBeforeAfterRule$1.evaluate(AbstractBeforeAfterRule.java:45)
	at org.apache.lucene.util.TestRuleThreadAndTestName$1.evaluate(TestRuleThreadAndTestName.java:48)
	at org.apache.lucene.util.TestRuleIgnoreAfterMaxFailures$1.evaluate(TestRuleIgnoreAfterMaxFailures.java:64)
	at org.apache.lucene.util.TestRuleMarkFailure$1.evaluate(TestRuleMarkFailure.java:47)
	at com.carrotsearch.randomizedtesting.rules.StatementAdapter.evaluate(StatementAdapter.java:36)
	at com.carrotsearch.randomizedtesting.ThreadLeakControl$StatementRunner.run(ThreadLeakControl.java:367)
	at com.carrotsearch.randomizedtesting.ThreadLeakControl.forkTimeoutingTask(ThreadLeakControl.java:809)
	at com.carrotsearch.randomizedtesting.ThreadLeakControl$3.evaluate(ThreadLeakControl.java:460)
	at com.carrotsearch.randomizedtesting.RandomizedRunner.runSingleTest(RandomizedRunner.java:880)
	at com.carrotsearch.randomizedtesting.RandomizedRunner$5.evaluate(RandomizedRunner.java:781)
	at com.carrotsearch.randomizedtesting.RandomizedRunner$6.evaluate(RandomizedRunner.java:816)
	at com.carrotsearch.randomizedtesting.RandomizedRunner$7.evaluate(RandomizedRunner.java:827)
	at com.carrotsearch.randomizedtesting.rules.StatementAdapter.evaluate(StatementAdapter.java:36)
	at com.carrotsearch.randomizedtesting.rules.SystemPropertiesRestoreRule$1.evaluate(SystemPropertiesRestoreRule.java:57)
	at org.apache.lucene.util.AbstractBeforeAfterRule$1.evaluate(AbstractBeforeAfterRule.java:45)
	at com.carrotsearch.randomizedtesting.rules.StatementAdapter.evaluate(StatementAdapter.java:36)
	at org.apache.lucene.util.TestRuleStoreClassName$1.evaluate(TestRuleStoreClassName.java:41)
	at com.carrotsearch.randomizedtesting.rules.NoShadowingOrOverridesOnMethodsRule$1.evaluate(NoShadowingOrOverridesOnMethodsRule.java:40)
	at com.carrotsearch.randomizedtesting.rules.NoShadowingOrOverridesOnMethodsRule$1.evaluate(NoShadowingOrOverridesOnMethodsRule.java:40)
	at com.carrotsearch.randomizedtesting.rules.StatementAdapter.evaluate(StatementAdapter.java:36)
	at com.carrotsearch.randomizedtesting.rules.StatementAdapter.evaluate(StatementAdapter.java:36)
	at com.carrotsearch.randomizedtesting.rules.StatementAdapter.evaluate(StatementAdapter.java:36)
	at org.apache.lucene.util.TestRuleAssertionsRequired$1.evaluate(TestRuleAssertionsRequired.java:53)
	at org.apache.lucene.util.TestRuleMarkFailure$1.evaluate(TestRuleMarkFailure.java:47)
	at org.apache.lucene.util.TestRuleIgnoreAfterMaxFailures$1.evaluate(TestRuleIgnoreAfterMaxFailures.java:64)
	at org.apache.lucene.util.TestRuleIgnoreTestSuites$1.evaluate(TestRuleIgnoreTestSuites.java:54)
	at com.carrotsearch.randomizedtesting.rules.StatementAdapter.evaluate(StatementAdapter.java:36)
	at com.carrotsearch.randomizedtesting.ThreadLeakControl$StatementRunner.run(ThreadLeakControl.java:367)
	at java.lang.Thread.run(java.base@9-ea/Thread.java:843)
Caused by: javax.net.ssl.SSLHandshakeException: sun.security.validator.ValidatorException: PKIX path building failed: sun.security.provider.certpath.SunCertPathBuilderException: unable to find valid certification path to requested target
	at sun.security.ssl.Alerts.getSSLException(java.base@9-ea/Alerts.java:198)
	at sun.security.ssl.SSLSocketImpl.fatal(java.base@9-ea/SSLSocketImpl.java:1962)
	at sun.security.ssl.Handshaker.fatalSE(java.base@9-ea/Handshaker.java:309)
	at sun.security.ssl.Handshaker.fatalSE(java.base@9-ea/Handshaker.java:303)
	at sun.security.ssl.ClientHandshaker.checkServerCerts(java.base@9-ea/ClientHandshaker.java:1843)
	at sun.security.ssl.ClientHandshaker.serverCertificate(java.base@9-ea/ClientHandshaker.java:1652)
	at sun.security.ssl.ClientHandshaker.processMessage(java.base@9-ea/ClientHandshaker.java:260)
	at sun.security.ssl.Handshaker.processLoop(java.base@9-ea/Handshaker.java:1061)
	at sun.security.ssl.Handshaker.processRecord(java.base@9-ea/Handshaker.java:995)
	at sun.security.ssl.SSLSocketImpl.processInputRecord(java.base@9-ea/SSLSocketImpl.java:1132)
	at sun.security.ssl.SSLSocketImpl.readRecord(java.base@9-ea/SSLSocketImpl.java:1069)
	at sun.security.ssl.SSLSocketImpl.readRecord(java.base@9-ea/SSLSocketImpl.java:968)
	at sun.security.ssl.SSLSocketImpl.performInitialHandshake(java.base@9-ea/SSLSocketImpl.java:1395)
	at sun.security.ssl.SSLSocketImpl.startHandshake(java.base@9-ea/SSLSocketImpl.java:1422)
	at sun.security.ssl.SSLSocketImpl.startHandshake(java.base@9-ea/SSLSocketImpl.java:1406)
	at org.apache.http.conn.ssl.SSLSocketFactory.connectSocket(SSLSocketFactory.java:543)
	at org.apache.http.conn.ssl.SSLSocketFactory.connectSocket(SSLSocketFactory.java:409)
	at org.apache.http.impl.conn.DefaultClientConnectionOperator.openConnection(DefaultClientConnectionOperator.java:177)
	at org.apache.http.impl.conn.ManagedClientConnectionImpl.open(ManagedClientConnectionImpl.java:304)
	at org.apache.http.impl.client.DefaultRequestDirector.tryConnect(DefaultRequestDirector.java:611)
	at org.apache.http.impl.client.DefaultRequestDirector.execute(DefaultRequestDirector.java:446)
	at org.apache.http.impl.client.AbstractHttpClient.doExecute(AbstractHttpClient.java:882)
	at org.apache.http.impl.client.CloseableHttpClient.execute(CloseableHttpClient.java:82)
	at org.apache.http.impl.client.CloseableHttpClient.execute(CloseableHttpClient.java:107)
	at org.apache.http.impl.client.CloseableHttpClient.execute(CloseableHttpClient.java:55)
	at org.apache.solr.client.solrj.impl.HttpSolrClient.executeMethod(HttpSolrClient.java:497)
	... 43 more
Caused by: sun.security.validator.ValidatorException: PKIX path building failed: sun.security.provider.certpath.SunCertPathBuilderException: unable to find valid certification path to requested target
	at sun.security.validator.PKIXValidator.doBuild(java.base@9-ea/PKIXValidator.java:386)
	at sun.security.validator.PKIXValidator.engineValidate(java.base@9-ea/PKIXValidator.java:291)
	at sun.security.validator.Validator.validate(java.base@9-ea/Validator.java:264)
	at sun.security.ssl.X509TrustManagerImpl.validate(java.base@9-ea/X509TrustManagerImpl.java:343)
	at sun.security.ssl.X509TrustManagerImpl.checkTrusted(java.base@9-ea/X509TrustManagerImpl.java:237)
	at sun.security.ssl.X509TrustManagerImpl.checkServerTrusted(java.base@9-ea/X509TrustManagerImpl.java:124)
	at sun.security.ssl.ClientHandshaker.checkServerCerts(java.base@9-ea/ClientHandshaker.java:1822)
	... 64 more
Caused by: sun.security.provider.certpath.SunCertPathBuilderException: unable to find valid certification path to requested target
	at sun.security.provider.certpath.SunCertPathBuilder.build(java.base@9-ea/SunCertPathBuilder.java:141)
	at sun.security.provider.certpath.SunCertPathBuilder.engineBuild(java.base@9-ea/SunCertPathBuilder.java:126)
	at java.security.cert.CertPathBuilder.build(java.base@9-ea/CertPathBuilder.java:288)
	at sun.security.validator.PKIXValidator.doBuild(java.base@9-ea/PKIXValidator.java:381)
	... 70 more




Build Log:
[...truncated 12149 lines...]
   [junit4] Suite: org.apache.solr.cloud.ForceLeaderTest
   [junit4]   2> Creating dataDir: /home/jenkins/workspace/Lucene-Solr-6.x-Linux/solr/build/solr-core/test/J1/temp/solr.cloud.ForceLeaderTest_55FCF4D6D081CFA1-001/init-core-data-001
   [junit4]   2> 1508910 INFO  (SUITE-ForceLeaderTest-seed#[55FCF4D6D081CFA1]-worker) [    ] o.a.s.SolrTestCaseJ4 Randomized ssl (false) and clientAuth (false) via: @org.apache.solr.SolrTestCaseJ4$SuppressSSL(bugUrl="https://issues.apache.org/jira/browse/SOLR-5776")
   [junit4]   2> 1508910 INFO  (SUITE-ForceLeaderTest-seed#[55FCF4D6D081CFA1]-worker) [    ] o.a.s.BaseDistributedSearchTestCase Setting hostContext system property: /
   [junit4]   2> 1508911 INFO  (TEST-ForceLeaderTest.testLastPublishedStateIsActive-seed#[55FCF4D6D081CFA1]) [    ] o.a.s.c.ZkTestServer STARTING ZK TEST SERVER
   [junit4]   2> 1508912 INFO  (Thread-2179) [    ] o.a.s.c.ZkTestServer client port:0.0.0.0/0.0.0.0:0
   [junit4]   2> 1508912 INFO  (Thread-2179) [    ] o.a.s.c.ZkTestServer Starting server
   [junit4]   2> 1509012 INFO  (TEST-ForceLeaderTest.testLastPublishedStateIsActive-seed#[55FCF4D6D081CFA1]) [    ] o.a.s.c.ZkTestServer start zk server on port:41242
   [junit4]   2> 1509012 INFO  (TEST-ForceLeaderTest.testLastPublishedStateIsActive-seed#[55FCF4D6D081CFA1]) [    ] o.a.s.c.c.SolrZkClient Using default ZkCredentialsProvider
   [junit4]   2> 1509012 INFO  (TEST-ForceLeaderTest.testLastPublishedStateIsActive-seed#[55FCF4D6D081CFA1]) [    ] o.a.s.c.c.ConnectionManager Waiting for client to connect to ZooKeeper
   [junit4]   2> 1509013 INFO  (zkCallback-1469-thread-1) [    ] o.a.s.c.c.ConnectionManager Watcher org.apache.solr.common.cloud.ConnectionManager@ec9344 name:ZooKeeperConnection Watcher:127.0.0.1:41242 got event WatchedEvent state:SyncConnected type:None path:null path:null type:None
   [junit4]   2> 1509013 INFO  (TEST-ForceLeaderTest.testLastPublishedStateIsActive-seed#[55FCF4D6D081CFA1]) [    ] o.a.s.c.c.ConnectionManager Client is connected to ZooKeeper
   [junit4]   2> 1509013 INFO  (TEST-ForceLeaderTest.testLastPublishedStateIsActive-seed#[55FCF4D6D081CFA1]) [    ] o.a.s.c.c.SolrZkClient Using default ZkACLProvider
   [junit4]   2> 1509013 INFO  (TEST-ForceLeaderTest.testLastPublishedStateIsActive-seed#[55FCF4D6D081CFA1]) [    ] o.a.s.c.c.SolrZkClient makePath: /solr
   [junit4]   2> 1509014 INFO  (TEST-ForceLeaderTest.testLastPublishedStateIsActive-seed#[55FCF4D6D081CFA1]) [    ] o.a.s.c.c.SolrZkClient Using default ZkCredentialsProvider
   [junit4]   2> 1509015 INFO  (TEST-ForceLeaderTest.testLastPublishedStateIsActive-seed#[55FCF4D6D081CFA1]) [    ] o.a.s.c.c.ConnectionManager Waiting for client to connect to ZooKeeper
   [junit4]   2> 1509015 INFO  (zkCallback-1470-thread-1) [    ] o.a.s.c.c.ConnectionManager Watcher org.apache.solr.common.cloud.ConnectionManager@fec914 name:ZooKeeperConnection Watcher:127.0.0.1:41242/solr got event WatchedEvent state:SyncConnected type:None path:null path:null type:None
   [junit4]   2> 1509015 INFO  (TEST-ForceLeaderTest.testLastPublishedStateIsActive-seed#[55FCF4D6D081CFA1]) [    ] o.a.s.c.c.ConnectionManager Client is connected to ZooKeeper
   [junit4]   2> 1509015 INFO  (TEST-ForceLeaderTest.testLastPublishedStateIsActive-seed#[55FCF4D6D081CFA1]) [    ] o.a.s.c.c.SolrZkClient Using default ZkACLProvider
   [junit4]   2> 1509015 INFO  (TEST-ForceLeaderTest.testLastPublishedStateIsActive-seed#[55FCF4D6D081CFA1]) [    ] o.a.s.c.c.SolrZkClient makePath: /collections/collection1
   [junit4]   2> 1509016 INFO  (TEST-ForceLeaderTest.testLastPublishedStateIsActive-seed#[55FCF4D6D081CFA1]) [    ] o.a.s.c.c.SolrZkClient makePath: /collections/collection1/shards
   [junit4]   2> 1509016 INFO  (TEST-ForceLeaderTest.testLastPublishedStateIsActive-seed#[55FCF4D6D081CFA1]) [    ] o.a.s.c.c.SolrZkClient makePath: /collections/control_collection
   [junit4]   2> 1509017 INFO  (TEST-ForceLeaderTest.testLastPublishedStateIsActive-seed#[55FCF4D6D081CFA1]) [    ] o.a.s.c.c.SolrZkClient makePath: /collections/control_collection/shards
   [junit4]   2> 1509018 INFO  (TEST-ForceLeaderTest.testLastPublishedStateIsActive-seed#[55FCF4D6D081CFA1]) [    ] o.a.s.c.AbstractZkTestCase put /home/jenkins/workspace/Lucene-Solr-6.x-Linux/solr/core/src/test-files/solr/collection1/conf/solrconfig-tlog.xml to /configs/conf1/solrconfig.xml
   [junit4]   2> 1509018 INFO  (TEST-ForceLeaderTest.testLastPublishedStateIsActive-seed#[55FCF4D6D081CFA1]) [    ] o.a.s.c.c.SolrZkClient makePath: /configs/conf1/solrconfig.xml
   [junit4]   2> 1509019 INFO  (TEST-ForceLeaderTest.testLastPublishedStateIsActive-seed#[55FCF4D6D081CFA1]) [    ] o.a.s.c.AbstractZkTestCase put /home/jenkins/workspace/Lucene-Solr-6.x-Linux/solr/core/src/test-files/solr/collection1/conf/schema.xml to /configs/conf1/schema.xml
   [junit4]   2> 1509019 INFO  (TEST-ForceLeaderTest.testLastPublishedStateIsActive-seed#[55FCF4D6D081CFA1]) [    ] o.a.s.c.c.SolrZkClient makePath: /configs/conf1/schema.xml
   [junit4]   2> 1509020 INFO  (TEST-ForceLeaderTest.testLastPublishedStateIsActive-seed#[55FCF4D6D081CFA1]) [    ] o.a.s.c.AbstractZkTestCase put /home/jenkins/workspace/Lucene-Solr-6.x-Linux/solr/core/src/test-files/solr/collection1/conf/solrconfig.snippet.randomindexconfig.xml to /configs/conf1/solrconfig.snippet.randomindexconfig.xml
   [junit4]   2> 1509020 INFO  (TEST-ForceLeaderTest.testLastPublishedStateIsActive-seed#[55FCF4D6D081CFA1]) [    ] o.a.s.c.c.SolrZkClient makePath: /configs/conf1/solrconfig.snippet.randomindexconfig.xml
   [junit4]   2> 1509020 INFO  (TEST-ForceLeaderTest.testLastPublishedStateIsActive-seed#[55FCF4D6D081CFA1]) [    ] o.a.s.c.AbstractZkTestCase put /home/jenkins/workspace/Lucene-Solr-6.x-Linux/solr/core/src/test-files/solr/collection1/conf/stopwords.txt to /configs/conf1/stopwords.txt
   [junit4]   2> 1509021 INFO  (TEST-ForceLeaderTest.testLastPublishedStateIsActive-seed#[55FCF4D6D081CFA1]) [    ] o.a.s.c.c.SolrZkClient makePath: /configs/conf1/stopwords.txt
   [junit4]   2> 1509021 INFO  (TEST-ForceLeaderTest.testLastPublishedStateIsActive-seed#[55FCF4D6D081CFA1]) [    ] o.a.s.c.AbstractZkTestCase put /home/jenkins/workspace/Lucene-Solr-6.x-Linux/solr/core/src/test-files/solr/collection1/conf/protwords.txt to /configs/conf1/protwords.txt
   [junit4]   2> 1509021 INFO  (TEST-ForceLeaderTest.testLastPublishedStateIsActive-seed#[55FCF4D6D081CFA1]) [    ] o.a.s.c.c.SolrZkClient makePath: /configs/conf1/protwords.txt
   [junit4]   2> 1509022 INFO  (TEST-ForceLeaderTest.testLastPublishedStateIsActive-seed#[55FCF4D6D081CFA1]) [    ] o.a.s.c.AbstractZkTestCase put /home/jenkins/workspace/Lucene-Solr-6.x-Linux/solr/core/src/test-files/solr/collection1/conf/currency.xml to /configs/conf1/currency.xml
   [junit4]   2> 1509022 INFO  (TEST-ForceLeaderTest.testLastPublishedStateIsActive-seed#[55FCF4D6D081CFA1]) [    ] o.a.s.c.c.SolrZkClient makePath: /configs/conf1/currency.xml
   [junit4]   2> 1509022 INFO  (TEST-ForceLeaderTest.testLastPublishedStateIsActive-seed#[55FCF4D6D081CFA1]) [    ] o.a.s.c.AbstractZkTestCase put /home/jenkins/workspace/Lucene-Solr-6.x-Linux/solr/core/src/test-files/solr/collection1/conf/enumsConfig.xml to /configs/conf1/enumsConfig.xml
   [junit4]   2> 1509022 INFO  (TEST-ForceLeaderTest.testLastPublishedStateIsActive-seed#[55FCF4D6D081CFA1]) [    ] o.a.s.c.c.SolrZkClient makePath: /configs/conf1/enumsConfig.xml
   [junit4]   2> 1509023 INFO  (TEST-ForceLeaderTest.testLastPublishedStateIsActive-seed#[55FCF4D6D081CFA1]) [    ] o.a.s.c.AbstractZkTestCase put /home/jenkins/workspace/Lucene-Solr-6.x-Linux/solr/core/src/test-files/solr/collection1/conf/open-exchange-rates.json to /configs/conf1/open-exchange-rates.json
   [junit4]   2> 1509023 INFO  (TEST-ForceLeaderTest.testLastPublishedStateIsActive-seed#[55FCF4D6D081CFA1]) [    ] o.a.s.c.c.SolrZkClient makePath: /configs/conf1/open-exchange-rates.json
   [junit4]   2> 1509023 INFO  (TEST-ForceLeaderTest.testLastPublishedStateIsActive-seed#[55FCF4D6D081CFA1]) [    ] o.a.s.c.AbstractZkTestCase put /home/jenkins/workspace/Lucene-Solr-6.x-Linux/solr/core/src/test-files/solr/collection1/conf/mapping-ISOLatin1Accent.txt to /configs/conf1/mapping-ISOLatin1Accent.txt
   [junit4]   2> 1509024 INFO  (TEST-ForceLeaderTest.testLastPublishedStateIsActive-seed#[55FCF4D6D081CFA1]) [    ] o.a.s.c.c.SolrZkClient makePath: /configs/conf1/mapping-ISOLatin1Accent.txt
   [junit4]   2> 1509024 INFO  (TEST-ForceLeaderTest.testLastPublishedStateIsActive-seed#[55FCF4D6D081CFA1]) [    ] o.a.s.c.AbstractZkTestCase put /home/jenkins/workspace/Lucene-Solr-6.x-Linux/solr/core/src/test-files/solr/collection1/conf/old_synonyms.txt to /configs/conf1/old_synonyms.txt
   [junit4]   2> 1509024 INFO  (TEST-ForceLeaderTest.testLastPublishedStateIsActive-seed#[55FCF4D6D081CFA1]) [    ] o.a.s.c.c.SolrZkClient makePath: /configs/conf1/old_synonyms.txt
   [junit4]   2> 1509025 INFO  (TEST-ForceLeaderTest.testLastPublishedStateIsActive-seed#[55FCF4D6D081CFA1]) [    ] o.a.s.c.AbstractZkTestCase put /home/jenkins/workspace/Lucene-Solr-6.x-Linux/solr/core/src/test-files/solr/collection1/conf/synonyms.txt to /configs/conf1/synonyms.txt
   [junit4]   2> 1509025 INFO  (TEST-ForceLeaderTest.testLastPublishedStateIsActive-seed#[55FCF4D6D081CFA1]) [    ] o.a.s.c.c.SolrZkClient makePath: /configs/conf1/synonyms.txt
   [junit4]   2> 1509098 INFO  (TEST-ForceLeaderTest.testLastPublishedStateIsActive-seed#[55FCF4D6D081CFA1]) [    ] o.a.s.SolrTestCaseJ4 Writing core.properties file to /home/jenkins/workspace/Lucene-Solr-6.x-Linux/solr/build/solr-core/test/J1/temp/solr.cloud.ForceLeaderTest_55FCF4D6D081CFA1-001/control-001/cores/collection1
   [junit4]   2> 1509099 INFO  (TEST-ForceLeaderTest.testLastPublishedStateIsActive-seed#[55FCF4D6D081CFA1]) [    ] o.e.j.s.Server jetty-9.3.8.v20160314
   [junit4]   2> 1509100 INFO  (TEST-ForceLeaderTest.testLastPublishedStateIsActive-seed#[55FCF4D6D081CFA1]) [    ] o.e.j.s.h.ContextHandler Started o.e.j.s.ServletContextHandler@12b7a8{/,null,AVAILABLE}
   [junit4]   2> 1509103 INFO  (TEST-ForceLeaderTest.testLastPublishedStateIsActive-seed#[55FCF4D6D081CFA1]) [    ] o.e.j.s.ServerConnector Started ServerConnector@7f5d62{HTTP/1.1,[http/1.1]}{127.0.0.1:34430}
   [junit4]   2> 1509103 INFO  (TEST-ForceLeaderTest.testLastPublishedStateIsActive-seed#[55FCF4D6D081CFA1]) [    ] o.e.j.s.Server Started @1511188ms
   [junit4]   2> 1509103 INFO  (TEST-ForceLeaderTest.testLastPublishedStateIsActive-seed#[55FCF4D6D081CFA1]) [    ] o.a.s.c.s.e.JettySolrRunner Jetty properties: {hostContext=/, solr.data.dir=/home/jenkins/workspace/Lucene-Solr-6.x-Linux/solr/build/solr-core/test/J1/temp/solr.cloud.ForceLeaderTest_55FCF4D6D081CFA1-001/tempDir-001/control/data, hostPort=40333, coreRootDirectory=/home/jenkins/workspace/Lucene-Solr-6.x-Linux/solr/build/solr-core/test/J1/temp/solr.cloud.ForceLeaderTest_55FCF4D6D081CFA1-001/control-001/cores}
   [junit4]   2> 1509104 INFO  (TEST-ForceLeaderTest.testLastPublishedStateIsActive-seed#[55FCF4D6D081CFA1]) [    ] o.a.s.s.SolrDispatchFilter SolrDispatchFilter.init(): jdk.internal.loader.ClassLoaders$AppClassLoader@17b1517
   [junit4]   2> 1509104 INFO  (TEST-ForceLeaderTest.testLastPublishedStateIsActive-seed#[55FCF4D6D081CFA1]) [    ] o.a.s.c.SolrResourceLoader new SolrResourceLoader for directory: '/home/jenkins/workspace/Lucene-Solr-6.x-Linux/solr/build/solr-core/test/J1/temp/solr.cloud.ForceLeaderTest_55FCF4D6D081CFA1-001/control-001'
   [junit4]   2> 1509104 INFO  (TEST-ForceLeaderTest.testLastPublishedStateIsActive-seed#[55FCF4D6D081CFA1]) [    ] o.a.s.c.SolrResourceLoader JNDI not configured for solr (NoInitialContextEx)
   [junit4]   2> 1509104 INFO  (TEST-ForceLeaderTest.testLastPublishedStateIsActive-seed#[55FCF4D6D081CFA1]) [    ] o.a.s.c.SolrResourceLoader solr home defaulted to 'solr/' (could not find system property or JNDI)
   [junit4]   2> 1509104 INFO  (TEST-ForceLeaderTest.testLastPublishedStateIsActive-seed#[55FCF4D6D081CFA1]) [    ] o.a.s.c.c.SolrZkClient Using default ZkCredentialsProvider
   [junit4]   2> 1509104 INFO  (TEST-ForceLeaderTest.testLastPublishedStateIsActive-seed#[55FCF4D6D081CFA1]) [    ] o.a.s.c.c.ConnectionManager Waiting for client to connect to ZooKeeper
   [junit4]   2> 1509105 INFO  (zkCallback-1471-thread-1) [    ] o.a.s.c.c.ConnectionManager Watcher org.apache.solr.common.cloud.ConnectionManager@1fbc5d0 name:ZooKeeperConnection Watcher:127.0.0.1:41242/solr got event WatchedEvent state:SyncConnected type:None path:null path:null type:None
   [junit4]   2> 1509105 INFO  (TEST-ForceLeaderTest.testLastPublishedStateIsActive-seed#[55FCF4D6D081CFA1]) [    ] o.a.s.c.c.ConnectionManager Client is connected to ZooKeeper
   [junit4]   2> 1509105 INFO  (TEST-ForceLeaderTest.testLastPublishedStateIsActive-seed#[55FCF4D6D081CFA1]) [    ] o.a.s.c.c.SolrZkClient Using default ZkACLProvider
   [junit4]   2> 1509106 INFO  (TEST-ForceLeaderTest.testLastPublishedStateIsActive-seed#[55FCF4D6D081CFA1]) [    ] o.a.s.s.SolrDispatchFilter Loading solr.xml from SolrHome (not found in ZooKeeper)
   [junit4]   2> 1509106 INFO  (TEST-ForceLeaderTest.testLastPublishedStateIsActive-seed#[55FCF4D6D081CFA1]) [    ] o.a.s.c.SolrXmlConfig Loading container configuration from /home/jenkins/workspace/Lucene-Solr-6.x-Linux/solr/build/solr-core/test/J1/temp/solr.cloud.ForceLeaderTest_55FCF4D6D081CFA1-001/control-001/solr.xml
   [junit4]   2> 1509109 INFO  (TEST-ForceLeaderTest.testLastPublishedStateIsActive-seed#[55FCF4D6D081CFA1]) [    ] o.a.s.c.CorePropertiesLocator Config-defined core root directory: /home/jenkins/workspace/Lucene-Solr-6.x-Linux/solr/build/solr-core/test/J1/temp/solr.cloud.ForceLeaderTest_55FCF4D6D081CFA1-001/control-001/cores
   [junit4]   2> 1509109 INFO  (TEST-ForceLeaderTest.testLastPublishedStateIsActive-seed#[55FCF4D6D081CFA1]) [    ] o.a.s.c.CoreContainer New CoreContainer 7720566
   [junit4]   2> 1509109 INFO  (TEST-ForceLeaderTest.testLastPublishedStateIsActive-seed#[55FCF4D6D081CFA1]) [    ] o.a.s.c.CoreContainer Loading cores into CoreContainer [instanceDir=/home/jenkins/workspace/Lucene-Solr-6.x-Linux/solr/build/solr-core/test/J1/temp/solr.cloud.ForceLeaderTest_55FCF4D6D081CFA1-001/control-001]
   [junit4]   2> 1509109 WARN  (TEST-ForceLeaderTest.testLastPublishedStateIsActive-seed#[55FCF4D6D081CFA1]) [    ] o.a.s.c.CoreContainer Couldn't add files from /home/jenkins/workspace/Lucene-Solr-6.x-Linux/solr/build/solr-core/test/J1/temp/solr.cloud.ForceLeaderTest_55FCF4D6D081CFA1-001/control-001/lib to classpath: /home/jenkins/workspace/Lucene-Solr-6.x-Linux/solr/build/solr-core/test/J1/temp/solr.cloud.ForceLeaderTest_55FCF4D6D081CFA1-001/control-001/lib
   [junit4]   2> 1509109 INFO  (TEST-ForceLeaderTest.testLastPublishedStateIsActive-seed#[55FCF4D6D081CFA1]) [    ] o.a.s.h.c.HttpShardHandlerFactory created with socketTimeout : 90000,urlScheme : ,connTimeout : 15000,maxConnectionsPerHost : 20,maxConnections : 10000,corePoolSize : 0,maximumPoolSize : 2147483647,maxThreadIdleTime : 5,sizeOfQueue : -1,fairnessPolicy : false,useRetries : false,connectionsEvictorSleepDelay : 5000,maxConnectionIdleTime : 40000,
   [junit4]   2> 1509110 INFO  (TEST-ForceLeaderTest.testLastPublishedStateIsActive-seed#[55FCF4D6D081CFA1]) [    ] o.a.s.u.UpdateShardHandler Creating UpdateShardHandler HTTP client with params: socketTimeout=340000&connTimeout=45000&retry=true
   [junit4]   2> 1509110 INFO  (TEST-ForceLeaderTest.testLastPublishedStateIsActive-seed#[55FCF4D6D081CFA1]) [    ] o.a.s.l.LogWatcher SLF4J impl is org.slf4j.impl.Log4jLoggerFactory
   [junit4]   2> 1509110 INFO  (TEST-ForceLeaderTest.testLastPublishedStateIsActive-seed#[55FCF4D6D081CFA1]) [    ] o.a.s.l.LogWatcher Registering Log Listener [Log4j (org.slf4j.impl.Log4jLoggerFactory)]
   [junit4]   2> 1509110 INFO  (TEST-ForceLeaderTest.testLastPublishedStateIsActive-seed#[55FCF4D6D081CFA1]) [    ] o.a.s.c.ZkContainer Zookeeper client=127.0.0.1:41242/solr
   [junit4]   2> 1509110 INFO  (TEST-ForceLeaderTest.testLastPublishedStateIsActive-seed#[55FCF4D6D081CFA1]) [    ] o.a.s.c.ZkController zkHost includes chroot
   [junit4]   2> 1509110 INFO  (TEST-ForceLeaderTest.testLastPublishedStateIsActive-seed#[55FCF4D6D081CFA1]) [    ] o.a.s.c.c.SolrZkClient Using default ZkCredentialsProvider
   [junit4]   2> 1509111 INFO  (TEST-ForceLeaderTest.testLastPublishedStateIsActive-seed#[55FCF4D6D081CFA1]) [    ] o.a.s.c.c.ConnectionManager Waiting for client to connect to ZooKeeper
   [junit4]   2> 1509111 INFO  (zkCallback-1474-thread-1) [    ] o.a.s.c.c.ConnectionManager Watcher org.apache.solr.common.cloud.ConnectionManager@172b461 name:ZooKeeperConnection Watcher:127.0.0.1:41242 got event WatchedEvent state:SyncConnected type:None path:null path:null type:None
   [junit4]   2> 1509111 INFO  (TEST-ForceLeaderTest.testLastPublishedStateIsActive-seed#[55FCF4D6D081CFA1]) [    ] o.a.s.c.c.ConnectionManager Client is connected to ZooKeeper
   [junit4]   2> 1509112 INFO  (TEST-ForceLeaderTest.testLastPublishedStateIsActive-seed#[55FCF4D6D081CFA1]) [    ] o.a.s.c.c.SolrZkClient Using default ZkACLProvider
   [junit4]   2> 1509112 INFO  (TEST-ForceLeaderTest.testLastPublishedStateIsActive-seed#[55FCF4D6D081CFA1]) [    ] o.a.s.c.ZkController Added new OnReconnect listener org.apache.solr.cloud.ZkController$$Lambda$153/1857100@1ceaf34
   [junit4]   2> 1509112 INFO  (TEST-ForceLeaderTest.testLastPublishedStateIsActive-seed#[55FCF4D6D081CFA1]) [    ] o.a.s.c.c.ConnectionManager Waiting for client to connect to ZooKeeper
   [junit4]   2> 1509114 INFO  (zkCallback-1475-thread-1) [    ] o.a.s.c.c.ConnectionManager Watcher org.apache.solr.common.cloud.ConnectionManager@209b94 name:ZooKeeperConnection Watcher:127.0.0.1:41242/solr got event WatchedEvent state:SyncConnected type:None path:null path:null type:None
   [junit4]   2> 1509114 INFO  (TEST-ForceLeaderTest.testLastPublishedStateIsActive-seed#[55FCF4D6D081CFA1]) [    ] o.a.s.c.c.ConnectionManager Client is connected to ZooKeeper
   [junit4]   2> 1509114 INFO  (TEST-ForceLeaderTest.testLastPublishedStateIsActive-seed#[55FCF4D6D081CFA1]) [    ] o.a.s.c.c.SolrZkClient makePath: /overseer/queue
   [junit4]   2> 1509115 INFO  (TEST-ForceLeaderTest.testLastPublishedStateIsActive-seed#[55FCF4D6D081CFA1]) [    ] o.a.s.c.c.SolrZkClient makePath: /overseer/collection-queue-work
   [junit4]   2> 1509116 INFO  (TEST-ForceLeaderTest.testLastPublishedStateIsActive-seed#[55FCF4D6D081CFA1]) [    ] o.a.s.c.c.SolrZkClient makePath: /overseer/collection-map-running
   [junit4]   2> 1509116 INFO  (TEST-ForceLeaderTest.testLastPublishedStateIsActive-seed#[55FCF4D6D081CFA1]) [    ] o.a.s.c.c.SolrZkClient makePath: /overseer/collection-map-completed
   [junit4]   2> 1509117 INFO  (TEST-ForceLeaderTest.testLastPublishedStateIsActive-seed#[55FCF4D6D081CFA1]) [    ] o.a.s.c.c.SolrZkClient makePath: /overseer/collection-map-failure
   [junit4]   2> 1509117 INFO  (TEST-ForceLeaderTest.testLastPublishedStateIsActive-seed#[55FCF4D6D081CFA1]) [    ] o.a.s.c.c.SolrZkClient makePath: /live_nodes
   [junit4]   2> 1509118 INFO  (TEST-ForceLeaderTest.testLastPublishedStateIsActive-seed#[55FCF4D6D081CFA1]) [    ] o.a.s.c.c.SolrZkClient makePath: /aliases.json
   [junit4]   2> 1509118 INFO  (TEST-ForceLeaderTest.testLastPublishedStateIsActive-seed#[55FCF4D6D081CFA1]) [    ] o.a.s.c.c.SolrZkClient makePath: /clusterstate.json
   [junit4]   2> 1509119 INFO  (TEST-ForceLeaderTest.testLastPublishedStateIsActive-seed#[55FCF4D6D081CFA1]) [    ] o.a.s.c.c.SolrZkClient makePath: /security.json
   [junit4]   2> 1509119 INFO  (TEST-ForceLeaderTest.testLastPublishedStateIsActive-seed#[55FCF4D6D081CFA1]) [    ] o.a.s.c.c.ZkStateReader Updating cluster state from ZooKeeper... 
   [junit4]   2> 1509119 INFO  (TEST-ForceLeaderTest.testLastPublishedStateIsActive-seed#[55FCF4D6D081CFA1]) [    ] o.a.s.c.c.ZkStateReader Loaded empty cluster properties
   [junit4]   2> 1509119 INFO  (TEST-ForceLeaderTest.testLastPublishedStateIsActive-seed#[55FCF4D6D081CFA1]) [    ] o.a.s.c.c.ZkStateReader Updated live nodes from ZooKeeper... (0) -> (0)
   [junit4]   2> 1509120 INFO  (TEST-ForceLeaderTest.testLastPublishedStateIsActive-seed#[55FCF4D6D081CFA1]) [    ] o.a.s.c.c.SolrZkClient makePath: /overseer_elect
   [junit4]   2> 1509121 INFO  (TEST-ForceLeaderTest.testLastPublishedStateIsActive-seed#[55FCF4D6D081CFA1]) [    ] o.a.s.c.c.SolrZkClient makePath: /overseer_elect/election
   [junit4]   2> 1509121 INFO  (TEST-ForceLeaderTest.testLastPublishedStateIsActive-seed#[55FCF4D6D081CFA1]) [    ] o.a.s.c.Overseer Overseer (id=null) closing
   [junit4]   2> 1509121 INFO  (TEST-ForceLeaderTest.testLastPublishedStateIsActive-seed#[55FCF4D6D081CFA1]) [    ] o.a.s.c.LeaderElector Joined leadership election with path: /overseer_elect/election/96577993142894596-127.0.0.1:40333_-n_0000000000
   [junit4]   2> 1509121 INFO  (TEST-ForceLeaderTest.testLastPublishedStateIsActive-seed#[55FCF4D6D081CFA1]) [    ] o.a.s.c.OverseerElectionContext I am going to be the leader 127.0.0.1:40333_
   [junit4]   2> 1509121 INFO  (TEST-ForceLeaderTest.testLastPublishedStateIsActive-seed#[55FCF4D6D081CFA1]) [    ] o.a.s.c.c.SolrZkClient makePath: /overseer_elect/leader
   [junit4]   2> 1509122 INFO  (TEST-ForceLeaderTest.testLastPublishedStateIsActive-seed#[55FCF4D6D081CFA1]) [    ] o.a.s.c.Overseer Overseer (id=96577993142894596-127.0.0.1:40333_-n_0000000000) starting
   [junit4]   2> 1509122 INFO  (TEST-ForceLeaderTest.testLastPublishedStateIsActive-seed#[55FCF4D6D081CFA1]) [    ] o.a.s.c.c.SolrZkClient makePath: /overseer/queue-work
   [junit4]   2> 1509124 INFO  (TEST-ForceLeaderTest.testLastPublishedStateIsActive-seed#[55FCF4D6D081CFA1]) [    ] o.a.s.c.OverseerAutoReplicaFailoverThread Starting OverseerAutoReplicaFailoverThread autoReplicaFailoverWorkLoopDelay=10000 autoReplicaFailoverWaitAfterExpiration=10000 autoReplicaFailoverBadNodeExpiration=60000
   [junit4]   2> 1509124 INFO  (OverseerCollectionConfigSetProcessor-96577993142894596-127.0.0.1:40333_-n_0000000000) [    ] o.a.s.c.OverseerTaskProcessor Process current queue of overseer operations
   [junit4]   2> 1509125 INFO  (TEST-ForceLeaderTest.testLastPublishedStateIsActive-seed#[55FCF4D6D081CFA1]) [    ] o.a.s.c.ZkController Register node as live in ZooKeeper:/live_nodes/127.0.0.1:40333_
   [junit4]   2> 1509125 INFO  (TEST-ForceLeaderTest.testLastPublishedStateIsActive-seed#[55FCF4D6D081CFA1]) [    ] o.a.s.c.c.SolrZkClient makePath: /live_nodes/127.0.0.1:40333_
   [junit4]   2> 1509125 INFO  (OverseerStateUpdate-96577993142894596-127.0.0.1:40333_-n_0000000000) [    ] o.a.s.c.Overseer Starting to work on the main queue
   [junit4]   2> 1509128 INFO  (zkCallback-1475-thread-1) [    ] o.a.s.c.c.ZkStateReader A live node change: [WatchedEvent state:SyncConnected type:NodeChildrenChanged path:/live_nodes], has occurred - updating... (live nodes size: [0])
   [junit4]   2> 1509128 INFO  (OverseerStateUpdate-96577993142894596-127.0.0.1:40333_-n_0000000000) [    ] o.a.s.c.c.ZkStateReader Updated live nodes from ZooKeeper... (0) -> (1)
   [junit4]   2> 1509128 INFO  (zkCallback-1475-thread-1) [    ] o.a.s.c.c.ZkStateReader Updated live nodes from ZooKeeper... (1) -> (1)
   [junit4]   2> 1509148 INFO  (TEST-ForceLeaderTest.testLastPublishedStateIsActive-seed#[55FCF4D6D081CFA1]) [    ] o.a.s.c.CoreContainer Security conf doesn't exist. Skipping setup for authorization module.
   [junit4]   2> 1509148 INFO  (TEST-ForceLeaderTest.testLastPublishedStateIsActive-seed#[55FCF4D6D081CFA1]) [    ] o.a.s.c.CoreContainer No authentication plugin used.
   [junit4]   2> 1509148 INFO  (TEST-ForceLeaderTest.testLastPublishedStateIsActive-seed#[55FCF4D6D081CFA1]) [    ] o.a.s.c.CorePropertiesLocator Looking for core definitions underneath /home/jenkins/workspace/Lucene-Solr-6.x-Linux/solr/build/solr-core/test/J1/temp/solr.cloud.ForceLeaderTest_55FCF4D6D081CFA1-001/control-001/cores
   [junit4]   2> 1509149 INFO  (TEST-ForceLeaderTest.testLastPublishedStateIsActive-seed#[55FCF4D6D081CFA1]) [    ] o.a.s.c.CoreDescriptor Created CoreDescriptor: {schema=schema.xml, dataDir=data/, collection=control_collection, loadOnStartup=true, coreNodeName=, transient=false, name=collection1, shard=, config=solrconfig.xml, configSetProperties=configsetprops.json}
   [junit4]   2> 1509150 INFO  (TEST-ForceLeaderTest.testLastPublishedStateIsActive-seed#[55FCF4D6D081CFA1]) [    ] o.a.s.c.CorePropertiesLocator Found core collection1 in /home/jenkins/workspace/Lucene-Solr-6.x-Linux/solr/build/solr-core/test/J1/temp/solr.cloud.ForceLeaderTest_55FCF4D6D081CFA1-001/control-001/cores/collection1
   [junit4]   2> 1509150 INFO  (TEST-ForceLeaderTest.testLastPublishedStateIsActive-seed#[55FCF4D6D081CFA1]) [    ] o.a.s.c.CorePropertiesLocator Found 1 core definitions
   [junit4]   2> 1509150 INFO  (TEST-ForceLeaderTest.testLastPublishedStateIsActive-seed#[55FCF4D6D081CFA1]) [    ] o.a.s.s.SolrDispatchFilter user.dir=/home/jenkins/workspace/Lucene-Solr-6.x-Linux/solr/build/solr-core/test/J1
   [junit4]   2> 1509150 INFO  (TEST-ForceLeaderTest.testLastPublishedStateIsActive-seed#[55FCF4D6D081CFA1]) [    ] o.a.s.s.SolrDispatchFilter SolrDispatchFilter.init() done
   [junit4]   2> 1509150 INFO  (coreLoadExecutor-4358-thread-1) [    ] o.a.s.c.ZkController publishing state=down
   [junit4]   2> 1509150 INFO  (coreLoadExecutor-4358-thread-1) [    ] o.a.s.c.ZkController numShards not found on descriptor - reading it from system property
   [junit4]   2> 1509151 INFO  (coreLoadExecutor-4358-thread-1) [    ] o.a.s.c.ZkController Collection control_collection not visible yet, but flagging it so a watch is registered when it becomes visible
   [junit4]   2> 1509151 INFO  (OverseerStateUpdate-96577993142894596-127.0.0.1:40333_-n_0000000000) [    ] o.a.s.c.Overseer processMessage: queueSize: 1, message = {
   [junit4]   2>   "core":"collection1",
   [junit4]   2>   "roles":null,
   [junit4]   2>   "base_url":"http://127.0.0.1:40333",
   [junit4]   2>   "node_name":"127.0.0.1:40333_",
   [junit4]   2>   "numShards":"1",
   [junit4]   2>   "state":"down",
   [junit4]   2>   "shard":null,
   [junit4]   2>   "collection":"control_collection",
   [junit4]   2>   "operation":"state"} current state version: 0
   [junit4]   2> 1509151 INFO  (OverseerStateUpdate-96577993142894596-127.0.0.1:40333_-n_0000000000) [    ] o.a.s.c.o.ReplicaMutator Update state numShards=1 message={
   [junit4]   2>   "core":"collection1",
   [junit4]   2>   "roles":null,
   [junit4]   2>   "base_url":"http://127.0.0.1:40333",
   [junit4]   2>   "node_name":"127.0.0.1:40333_",
   [junit4]   2>   "numShards":"1",
   [junit4]   2>   "state":"down",
   [junit4]   2>   "shard":null,
   [junit4]   2>   "collection":"control_collection",
   [junit4]   2>   "operation":"state"}
   [junit4]   2> 1509151 INFO  (coreLoadExecutor-4358-thread-1) [    ] o.a.s.c.c.ZkStateReader Deleting data for [control_collection]
   [junit4]   2> 1509151 INFO  (OverseerStateUpdate-96577993142894596-127.0.0.1:40333_-n_0000000000) [    ] o.a.s.c.o.ClusterStateMutator building a new cName: control_collection
   [junit4]   2> 1509151 INFO  (OverseerStateUpdate-96577993142894596-127.0.0.1:40333_-n_0000000000) [    ] o.a.s.c.o.ReplicaMutator Assigning new node to shard shard=shard1
   [junit4]   2> 1509176 INFO  (coreLoadExecutor-4358-thread-1) [    ] o.a.s.c.ZkController look for our core node name
   [junit4]   2> 1509176 INFO  (zkCallback-1475-thread-1) [    ] o.a.s.c.c.ZkStateReader A cluster state change: [WatchedEvent state:SyncConnected type:NodeDataChanged path:/clusterstate.json], has occurred - updating... (live nodes size: [1])
   [junit4]   2> 1510176 INFO  (coreLoadExecutor-4358-thread-1) [    ] o.a.s.c.ZkController waiting to find shard id in clusterstate for collection1
   [junit4]   2> 1510176 INFO  (coreLoadExecutor-4358-thread-1) [    ] o.a.s.c.ZkController Check for collection zkNode:control_collection
   [junit4]   2> 1510177 INFO  (coreLoadExecutor-4358-thread-1) [    ] o.a.s.c.ZkController Collection zkNode exists
   [junit4]   2> 1510177 INFO  (coreLoadExecutor-4358-thread-1) [    ] o.a.s.c.c.ZkStateReader Load collection config from: [/collections/control_collection]
   [junit4]   2> 1510177 INFO  (coreLoadExecutor-4358-thread-1) [    ] o.a.s.c.c.ZkStateReader path=[/collections/control_collection] [configName]=[conf1] specified config exists in ZooKeeper
   [junit4]   2> 1510177 INFO  (coreLoadExecutor-4358-thread-1) [    ] o.a.s.c.SolrResourceLoader new SolrResourceLoader for directory: '/home/jenkins/workspace/Lucene-Solr-6.x-Linux/solr/build/solr-core/test/J1/temp/solr.cloud.ForceLeaderTest_55FCF4D6D081CFA1-001/control-001/cores/collection1'
   [junit4]   2> 1510177 INFO  (coreLoadExecutor-4358-thread-1) [    ] o.a.s.c.SolrResourceLoader JNDI not configured for solr (NoInitialContextEx)
   [junit4]   2> 1510177 INFO  (coreLoadExecutor-4358-thread-1) [    ] o.a.s.c.SolrResourceLoader solr home defaulted to 'solr/' (could not find system property or JNDI)
   [junit4]   2> 1510178 INFO  (coreLoadExecutor-4358-thread-1) [    ] o.a.s.c.Config loaded config solrconfig.xml with version 0 
   [junit4]   2> 1510182 INFO  (coreLoadExecutor-4358-thread-1) [    ] o.a.s.c.SolrConfig current version of requestparams : -1
   [junit4]   2> 1510185 WARN  (coreLoadExecutor-4358-thread-1) [    ] o.a.s.c.Config Beginning with Solr 5.5, <mergePolicy> is deprecated, use <mergePolicyFactory> instead.
   [junit4]   2> 1510186 INFO  (coreLoadExecutor-4358-thread-1) [    ] o.a.s.c.SolrConfig Using Lucene MatchVersion: 6.3.0
   [junit4]   2> 1510195 INFO  (coreLoadExecutor-4358-thread-1) [    ] o.a.s.c.SolrConfig Loaded SolrConfig: solrconfig.xml
   [junit4]   2> 1510200 INFO  (coreLoadExecutor-4358-thread-1) [    ] o.a.s.s.IndexSchema [collection1] Schema name=test
   [junit4]   2> 1510273 INFO  (coreLoadExecutor-4358-thread-1) [    ] o.a.s.s.OpenExchangeRatesOrgProvider Initialized with rates=open-exchange-rates.json, refreshInterval=1440.
   [junit4]   2> 1510278 INFO  (coreLoadExecutor-4358-thread-1) [    ] o.a.s.s.IndexSchema default search field in schema is text
   [junit4]   2> 1510278 INFO  (coreLoadExecutor-4358-thread-1) [    ] o.a.s.s.IndexSchema unique key field: id
   [junit4]   2> 1510283 INFO  (coreLoadExecutor-4358-thread-1) [    ] o.a.s.s.FileExchangeRateProvider Reloading exchange rates from file currency.xml
   [junit4]   2> 1510284 INFO  (coreLoadExecutor-4358-thread-1) [    ] o.a.s.s.FileExchangeRateProvider Reloading exchange rates from file currency.xml
   [junit4]   2> 1510285 INFO  (coreLoadExecutor-4358-thread-1) [    ] o.a.s.s.OpenExchangeRatesOrgProvider Reloading exchange rates from open-exchange-rates.json
   [junit4]   2> 1510285 INFO  (coreLoadExecutor-4358-thread-1) [    ] o.a.s.s.OpenExchangeRatesOrgProvider Reloading exchange rates from open-exchange-rates.json
   [junit4]   2> 1510286 INFO  (coreLoadExecutor-4358-thread-1) [    ] o.a.s.c.ConfigSetProperties Did not find ConfigSet properties, assuming default properties: Can't find resource 'configsetprops.json' in classpath or '/configs/conf1', cwd=/home/jenkins/workspace/Lucene-Solr-6.x-Linux/solr/build/solr-core/test/J1
   [junit4]   2> 1510286 INFO  (coreLoadExecutor-4358-thread-1) [    ] o.a.s.c.CoreContainer Creating SolrCore 'collection1' using configuration from collection control_collection
   [junit4]   2> 1510286 INFO  (coreLoadExecutor-4358-thread-1) [    ] o.a.s.c.SolrCore org.apache.solr.core.MockDirectoryFactory
   [junit4]   2> 1510286 INFO  (coreLoadExecutor-4358-thread-1) [    ] o.a.s.c.SolrCore [[collection1] ] Opening new SolrCore at [/home/jenkins/workspace/Lucene-Solr-6.x-Linux/solr/build/solr-core/test/J1/temp/solr.cloud.ForceLeaderTest_55FCF4D6D081CFA1-001/control-001/cores/collection1], dataDir=[/home/jenkins/workspace/Lucene-Solr-6.x-Linux/solr/build/solr-core/test/J1/temp/solr.cloud.ForceLeaderTest_55FCF4D6D081CFA1-001/control-001/cores/collection1/data/]
   [junit4]   2> 1510286 INFO  (coreLoadExecutor-4358-thread-1) [    ] o.a.s.c.JmxMonitoredMap JMX monitoring is enabled. Adding Solr mbeans to JMX Server: com.sun.jmx.mbeanserver.JmxMBeanServer@a92fc4
   [junit4]   2> 1510287 INFO  (coreLoadExecutor-4358-thread-1) [    ] o.a.s.c.CachingDirectoryFactory return new directory for /home/jenkins/workspace/Lucene-Solr-6.x-Linux/solr/build/solr-core/test/J1/temp/solr.cloud.ForceLeaderTest_55FCF4D6D081CFA1-001/control-001/cores/collection1/data/snapshot_metadata
   [junit4]   2> 1510287 INFO  (coreLoadExecutor-4358-thread-1) [    ] o.a.s.c.s.SolrSnapshotMetaDataManager Loading from snapshot metadata file...
   [junit4]   2> 1510287 INFO  (coreLoadExecutor-4358-thread-1) [    ] o.a.s.c.CachingDirectoryFactory return new directory for /home/jenkins/workspace/Lucene-Solr-6.x-Linux/solr/build/solr-core/test/J1/temp/solr.cloud.ForceLeaderTest_55FCF4D6D081CFA1-001/control-001/cores/collection1/data
   [junit4]   2> 1510287 INFO  (coreLoadExecutor-4358-thread-1) [    ] o.a.s.c.SolrCore New index directory detected: old=null new=/home/jenkins/workspace/Lucene-Solr-6.x-Linux/solr/build/solr-core/test/J1/temp/solr.cloud.ForceLeaderTest_55FCF4D6D081CFA1-001/control-001/cores/collection1/data/index/
   [junit4]   2> 1510287 WARN  (coreLoadExecutor-4358-thread-1) [    ] o.a.s.c.SolrCore [collection1] Solr index directory '/home/jenkins/workspace/Lucene-Solr-6.x-Linux/solr/build/solr-core/test/J1/temp/solr.cloud.ForceLeaderTest_55FCF4D6D081CFA1-001/control-001/cores/collection1/data/index' doesn't exist. Creating new index...
   [junit4]   2> 1510287 INFO  (coreLoadExecutor-4358-thread-1) [    ] o.a.s.c.CachingDirectoryFactory return new directory for /home/jenkins/workspace/Lucene-Solr-6.x-Linux/solr/build/solr-core/test/J1/temp/solr.cloud.ForceLeaderTest_55FCF4D6D081CFA1-001/control-001/cores/collection1/data/index
   [junit4]   2> 1510288 INFO  (coreLoadExecutor-4358-thread-1) [    ] o.a.s.u.RandomMergePolicy RandomMergePolicy wrapping class org.apache.lucene.index.TieredMergePolicy: [TieredMergePolicy: maxMergeAtOnce=11, maxMergeAtOnceExplicit=50, maxMergedSegmentMB=99.314453125, floorSegmentMB=0.3828125, forceMergeDeletesPctAllowed=16.53165764845072, segmentsPerTier=25.0, maxCFSSegmentSizeMB=8.796093022207999E12, noCFSRatio=0.0
   [junit4]   2> 1510288 INFO  (coreLoadExecutor-4358-thread-1) [    ] o.a.s.c.SolrDeletionPolicy SolrDeletionPolicy.onCommit: commits: num=1
   [junit4]   2> 	commit{dir=MockDirectoryWrapper(RAMDirectory@19f3060 lockFactory=org.apache.lucene.store.SingleInstanceLockFactory@24e4a3),segFN=segments_1,generation=1}
   [junit4]   2> 1510288 INFO  (coreLoadExecutor-4358-thread-1) [    ] o.a.s.c.SolrDeletionPolicy newest commit generation = 1
   [junit4]   2> 1510288 INFO  (OldIndexDirectoryCleanupThreadForCore-collection1) [    ] o.a.s.c.SolrCore Looking for old index directories to cleanup for core collection1 in /home/jenkins/workspace/Lucene-Solr-6.x-Linux/solr/build/solr-core/test/J1/temp/solr.cloud.ForceLeaderTest_55FCF4D6D081CFA1-001/control-001/cores/collection1/data/
   [junit4]   2> 1510288 WARN  (OldIndexDirectoryCleanupThreadForCore-collection1) [    ] o.a.s.c.DirectoryFactory /home/jenkins/workspace/Lucene-Solr-6.x-Linux/solr/build/solr-core/test/J1/temp/solr.cloud.ForceLeaderTest_55FCF4D6D081CFA1-001/control-001/cores/collection1/data/ does not point to a valid data directory; skipping clean-up of old index directories.
   [junit4]   2> 1510291 INFO  (coreLoadExecutor-4358-thread-1) [    ] o.a.s.u.p.UpdateRequestProcessorChain creating updateRequestProcessorChain "nodistrib"
   [junit4]   2> 1510291 INFO  (coreLoadExecutor-4358-thread-1) [    ] o.a.s.u.p.UpdateRequestProcessorChain creating updateRequestProcessorChain "dedupe"
   [junit4]   2> 1510291 INFO  (coreLoadExecutor-4358-thread-1) [    ] o.a.s.u.p.UpdateRequestProcessorChain inserting DistributedUpdateProcessorFactory into updateRequestProcessorChain "dedupe"
   [junit4]   2> 1510291 INFO  (coreLoadExecutor-4358-thread-1) [    ] o.a.s.u.p.UpdateRequestProcessorChain creating updateRequestProcessorChain "stored_sig"
   [junit4]   2> 1510291 INFO  (coreLoadExecutor-4358-thread-1) [    ] o.a.s.u.p.UpdateRequestProcessorChain inserting DistributedUpdateProcessorFactory into updateRequestProcessorChain "stored_sig"
   [junit4]   2> 1510291 INFO  (coreLoadExecutor-4358-thread-1) [    ] o.a.s.u.p.UpdateRequestProcessorChain creating updateRequestProcessorChain "distrib-dup-test-chain-explicit"
   [junit4]   2> 1510292 INFO  (coreLoadExecutor-4358-thread-1) [    ] o.a.s.u.p.UpdateRequestProcessorChain creating updateRequestProcessorChain "distrib-dup-test-chain-implicit"
   [junit4]   2> 1510292 INFO  (coreLoadExecutor-4358-thread-1) [    ] o.a.s.u.p.UpdateRequestProcessorChain inserting DistributedUpdateProcessorFactory into updateRequestProcessorChain "distrib-dup-test-chain-implicit"
   [junit4]   2> 1510292 INFO  (coreLoadExecutor-4358-thread-1) [    ] o.a.s.c.SolrCore no updateRequestProcessorChain defined as default, creating implicit default
   [junit4]   2> 1510292 WARN  (coreLoadExecutor-4358-thread-1) [    ] o.a.s.c.RequestHandlers INVALID paramSet a in requestHandler {type = requestHandler,name = /dump,class = DumpRequestHandler,args = {defaults={a=A,b=B}}}
   [junit4]   2> 1510293 INFO  (coreLoadExecutor-4358-thread-1) [    ] o.a.s.h.l.XMLLoader xsltCacheLifetimeSeconds=60
   [junit4]   2> 1510294 INFO  (coreLoadExecutor-4358-thread-1) [    ] o.a.s.h.l.XMLLoader xsltCacheLifetimeSeconds=60
   [junit4]   2> 1510294 INFO  (coreLoadExecutor-4358-thread-1) [    ] o.a.s.h.l.XMLLoader xsltCacheLifetimeSeconds=60
   [junit4]   2> 1510295 INFO  (coreLoadExecutor-4358-thread-1) [    ] o.a.s.h.l.XMLLoader xsltCacheLifetimeSeconds=60
   [junit4]   2> 1510297 INFO  (coreLoadExecutor-4358-thread-1) [    ] o.a.s.c.RequestHandlers Registered paths: /admin/mbeans,standard,/update/json/docs,/admin/luke,/export,/get,/admin/properties,/update/json,/admin/threads,/dump,/update/csv,/sql,/graph,/admin/segments,/admin/system,/replication,/config,/stream,/schema,/admin/plugins,/admin/logging,/admin/ping,/update,/admin/file,/terms
   [junit4]   2> 1510297 INFO  (coreLoadExecutor-4358-thread-1) [    ] o.a.s.c.SolrCore Using default statsCache cache: org.apache.solr.search.stats.LocalStatsCache
   [junit4]   2> 1510297 INFO  (coreLoadExecutor-4358-thread-1) [    ] o.a.s.u.UpdateHandler Using UpdateLog implementation: org.apache.solr.update.UpdateLog
   [junit4]   2> 1510297 INFO  (coreLoadExecutor-4358-thread-1) [    ] o.a.s.u.UpdateLog Initializing UpdateLog: dataDir= defaultSyncLevel=FLUSH numRecordsToKeep=100 maxNumLogsToKeep=10 numVersionBuckets=65536
   [junit4]   2> 1510297 INFO  (coreLoadExecutor-4358-thread-1) [    ] o.a.s.u.CommitTracker Hard AutoCommit: disabled
   [junit4]   2> 1510297 INFO  (coreLoadExecutor-4358-thread-1) [    ] o.a.s.u.CommitTracker Soft AutoCommit: disabled
   [junit4]   2> 1510298 INFO  (coreLoadExecutor-4358-thread-1) [    ] o.a.s.u.RandomMergePolicy RandomMergePolicy wrapping class org.apache.lucene.index.TieredMergePolicy: [TieredMergePolicy: maxMergeAtOnce=15, maxMergeAtOnceExplicit=17, maxMergedSegmentMB=18.3408203125, floorSegmentMB=1.5322265625, forceMergeDeletesPctAllowed=14.947633080281983, segmentsPerTier=50.0, maxCFSSegmentSizeMB=8.796093022207999E12, noCFSRatio=1.0
   [junit4]   2> 1510298 INFO  (coreLoadExecutor-4358-thread-1) [    ] o.a.s.c.SolrDeletionPolicy SolrDeletionPolicy.onInit: commits: num=1
   [junit4]   2> 	commit{dir=MockDirectoryWrapper(RAMDirectory@19f3060 lockFactory=org.apache.lucene.store.SingleInstanceLockFactory@24e4a3),segFN=segments_1,generation=1}
   [junit4]   2> 1510298 INFO  (coreLoadExecutor-4358-thread-1) [    ] o.a.s.c.SolrDeletionPolicy newest commit generation = 1
   [junit4]   2> 1510298 INFO  (coreLoadExecutor-4358-thread-1) [    ] o.a.s.s.SolrIndexSearcher Opening [Searcher@164b6dd[collection1] main]
   [junit4]   2> 1510298 INFO  (coreLoadExecutor-4358-thread-1) [    ] o.a.s.c.c.ZkStateReader Load collection config from: [/collections/control_collection]
   [junit4]   2> 1510298 INFO  (coreLoadExecutor-4358-thread-1) [    ] o.a.s.c.c.ZkStateReader path=[/collections/control_collection] [configName]=[conf1] specified config exists in ZooKeeper
   [junit4]   2> 1510298 INFO  (coreLoadExecutor-4358-thread-1) [    ] o.a.s.r.ManagedResourceStorage Setting up ZooKeeper-based storage for the RestManager with znodeBase: /configs/conf1
   [junit4]   2> 1510299 INFO  (coreLoadExecutor-4358-thread-1) [    ] o.a.s.r.ManagedResourceStorage Configured ZooKeeperStorageIO with znodeBase: /configs/conf1
   [junit4]   2> 1510299 INFO  (coreLoadExecutor-4358-thread-1) [    ] o.a.s.r.RestManager Initializing RestManager with initArgs: {}
   [junit4]   2> 1510299 INFO  (coreLoadExecutor-4358-thread-1) [    ] o.a.s.r.ManagedResourceStorage Reading _rest_managed.json using ZooKeeperStorageIO:path=/configs/conf1
   [junit4]   2> 1510299 INFO  (coreLoadExecutor-4358-thread-1) [    ] o.a.s.r.ManagedResourceStorage No data found for znode /configs/conf1/_rest_managed.json
   [junit4]   2> 1510299 INFO  (coreLoadExecutor-4358-thread-1) [    ] o.a.s.r.ManagedResourceStorage Loaded null at path _rest_managed.json using ZooKeeperStorageIO:path=/configs/conf1
   [junit4]   2> 1510299 INFO  (coreLoadExecutor-4358-thread-1) [    ] o.a.s.r.RestManager Initializing 0 registered ManagedResources
   [junit4]   2> 1510299 INFO  (coreLoadExecutor-4358-thread-1) [    ] o.a.s.h.ReplicationHandler Commits will be reserved for  10000
   [junit4]   2> 1510301 INFO  (searcherExecutor-4359-thread-1) [    ] o.a.s.c.SolrCore [collection1] Registered new searcher Searcher@164b6dd[collection1] main{ExitableDirectoryReader(UninvertingDirectoryReader())}
   [junit4]   2> 1510301 INFO  (coreLoadExecutor-4358-thread-1) [    ] o.a.s.u.UpdateLog Looking up max value of version field to seed version buckets
   [junit4]   2> 1510301 INFO  (coreLoadExecutor-4358-thread-1) [    ] o.a.s.u.VersionInfo Refreshing highest value of _version_ for 65536 version buckets from index
   [junit4]   2> 1510301 INFO  (coreLoadExecutor-4358-thread-1) [    ] o.a.s.u.VersionInfo No terms found for _version_, cannot seed version bucket highest value from index
   [junit4]   2> 1510301 INFO  (coreLoadExecutor-4358-thread-1) [    ] o.a.s.u.UpdateLog Could not find max version in index or recent updates, using new clock 1545247891742785536
   [junit4]   2> 1510303 INFO  (coreLoadExecutor-4358-thread-1) [    ] o.a.s.u.UpdateLog Took 2.0ms to seed version buckets with highest version 1545247891742785536
   [junit4]   2> 1510303 INFO  (coreLoadExecutor-4358-thread-1) [    ] o.a.s.c.ZkController watch zkdir /configs/conf1
   [junit4]   2> 1510304 INFO  (coreLoadExecutor-4358-thread-1) [    ] o.a.s.c.CoreContainer registering core: collection1
   [junit4]   2> 1510305 INFO  (coreZkRegister-4351-thread-1) [    ] o.a.s.c.ZkController Register replica - core:collection1 address:http://127.0.0.1:40333 collection:control_collection shard:shard1
   [junit4]   2> 1510305 INFO  (coreZkRegister-4351-thread-1) [    ] o.a.s.c.c.SolrZkClient makePath: /collections/control_collection/leader_elect/shard1/election
   [junit4]   2> 1510306 INFO  (coreZkRegister-4351-thread-1) [    ] o.a.s.c.LeaderElector Joined leadership election with path: /collections/control_collection/leader_elect/shard1/election/96577993142894596-core_node1-n_0000000000
   [junit4]   2> 1510307 INFO  (coreZkRegister-4351-thread-1) [    ] o.a.s.c.ShardLeaderElectionContext Running the leader process for shard=shard1 and weAreReplacement=false and leaderVoteWait=10000
   [junit4]   2> 1510307 INFO  (coreZkRegister-4351-thread-1) [    ] o.a.s.c.ShardLeaderElectionContext Enough replicas found to continue.
   [junit4]   2> 1510307 INFO  (coreZkRegister-4351-thread-1) [    ] o.a.s.c.ShardLeaderElectionContext I may be the new leader - try and sync
   [junit4]   2> 1510307 INFO  (OverseerStateUpdate-96577993142894596-127.0.0.1:40333_-n_0000000000) [    ] o.a.s.c.Overseer processMessage: queueSize: 1, message = {
   [junit4]   2>   "operation":"leader",
   [junit4]   2>   "shard":"shard1",
   [junit4]   2>   "collection":"control_collection"} current state version: 1
   [junit4]   2> 1510307 INFO  (coreZkRegister-4351-thread-1) [    ] o.a.s.c.SyncStrategy Sync replicas to http://127.0.0.1:40333/collection1/
   [junit4]   2> 1510307 INFO  (coreZkRegister-4351-thread-1) [    ] o.a.s.c.SyncStrategy Sync Success - now sync replicas to me
   [junit4]   2> 1510307 INFO  (coreZkRegister-4351-thread-1) [    ] o.a.s.c.SyncStrategy http://127.0.0.1:40333/collection1/ has no replicas
   [junit4]   2> 1510308 INFO  (coreZkRegister-4351-thread-1) [    ] o.a.s.c.c.SolrZkClient makePath: /collections/control_collection/leaders/shard1
   [junit4]   2> 1510309 INFO  (coreZkRegister-4351-thread-1) [    ] o.a.s.c.ShardLeaderElectionContextBase Creating leader registration node /collections/control_collection/leaders/shard1/leader after winning as /collections/control_collection/leader_elect/shard1/election/96577993142894596-core_node1-n_0000000000
   [junit4]   2> 1510309 INFO  (coreZkRegister-4351-thread-1) [    ] o.a.s.c.ShardLeaderElectionContext I am the new leader: http://127.0.0.1:40333/collection1/ shard1
   [junit4]   2> 1510310 INFO  (OverseerStateUpdate-96577993142894596-127.0.0.1:40333_-n_0000000000) [    ] o.a.s.c.Overseer processMessage: queueSize: 1, message = {
   [junit4]   2>   "operation":"leader",
   [junit4]   2>   "shard":"shard1",
   [junit4]   2>   "collection":"control_collection",
   [junit4]   2>   "base_url":"http://127.0.0.1:40333",
   [junit4]   2>   "core":"collection1",
   [junit4]   2>   "state":"active"} current state version: 1
   [junit4]   2> 1510410 INFO  (zkCallback-1475-thread-2) [    ] o.a.s.c.c.ZkStateReader A cluster state change: [WatchedEvent state:SyncConnected type:NodeDataChanged path:/clusterstate.json], has occurred - updating... (live nodes size: [1])
   [junit4]   2> 1510460 INFO  (coreZkRegister-4351-thread-1) [    ] o.a.s.c.ZkController We are http://127.0.0.1:40333/collection1/ and leader is http://127.0.0.1:40333/collection1/
   [junit4]   2> 1510460 INFO  (coreZkRegister-4351-thread-1) [    ] o.a.s.c.ZkController No LogReplay needed for core=collection1 baseURL=http://127.0.0.1:40333
   [junit4]   2> 1510460 INFO  (coreZkRegister-4351-thread-1) [    ] o.a.s.c.ZkController I am the leader, no recovery necessary
   [junit4]   2> 1510460 INFO  (coreZkRegister-4351-thread-1) [    ] o.a.s.c.ZkController publishing state=active
   [junit4]   2> 1510460 INFO  (coreZkRegister-4351-thread-1) [    ] o.a.s.c.ZkController numShards not found on descriptor - reading it from system property
   [junit4]   2> 1510461 INFO  (coreZkRegister-4351-thread-1) [    ] o.a.s.c.c.ZkStateReader Checking legacy cluster state for collection control_collection
   [junit4]   2> 1510461 INFO  (OverseerStateUpdate-96577993142894596-127.0.0.1:40333_-n_0000000000) [    ] o.a.s.c.Overseer processMessage: queueSize: 1, message = {
   [junit4]   2>   "core":"collection1",
   [junit4]   2>   "core_node_name":"core_node1",
   [junit4]   2>   "roles":null,
   [junit4]   2>   "base_url":"http://127.0.0.1:40333",
   [junit4]   2>   "node_name":"127.0.0.1:40333_",
   [junit4]   2>   "numShards":"1",
   [junit4]   2>   "state":"active",
   [junit4]   2>   "shard":"shard1",
   [junit4]   2>   "collection":"control_collection",
   [junit4]   2>   "operation":"state"} current state version: 2
   [junit4]   2> 1510461 INFO  (OverseerStateUpdate-96577993142894596-127.0.0.1:40333_-n_0000000000) [    ] o.a.s.c.o.ReplicaMutator Update state numShards=1 message={
   [junit4]   2>   "core":"collection1",
   [junit4]   2>   "core_node_name":"core_node1",
   [junit4]   2>   "roles":null,
   [junit4]   2>   "base_url":"http://127.0.0.1:40333",
   [junit4]   2>   "node_name":"127.0.0.1:40333_",
   [junit4]   2>   "numShards":"1",
   [junit4]   2>   "state":"active",
   [junit4]   2>   "shard":"shard1",
   [junit4]   2>   "collection":"control_collection",
   [junit4]   2>   "operation":"state"}
   [junit4]   2> 1510562 INFO  (zkCallback-1475-thread-2) [    ] o.a.s.c.c.ZkStateReader A cluster state change: [WatchedEvent state:SyncConnected type:NodeDataChanged path:/clusterstate.json], has occurred - updating... (live nodes size: [1])
   [junit4]   2> 1510653 INFO  (TEST-ForceLeaderTest.testLastPublishedStateIsActive-seed#[55FCF4D6D081CFA1]) [    ] o.a.s.c.c.SolrZkClient Using default ZkCredentialsProvider
   [junit4]   2> 1510653 INFO  (TEST-ForceLeaderTest.testLastPublishedStateIsActive-seed#[55FCF4D6D081CFA1]) [    ] o.a.s.c.c.ConnectionManager Waiting for client to connect to ZooKeeper
   [junit4]   2> 1510654 INFO  (zkCallback-1479-thread-1) [    ] o.a.s.c.c.ConnectionManager Watcher org.apache.solr.common.cloud.ConnectionManager@13889ab name:ZooKeeperConnection Watcher:127.0.0.1:41242/solr got event WatchedEvent state:SyncConnected type:None path:null path:null type:None
   [junit4]   2> 1510654 INFO  (TEST-ForceLeaderTest.testLastPublishedStateIsActive-seed#[55FCF4D6D081CFA1]) [    ] o.a.s.c.c.ConnectionManager Client is connected to ZooKeeper
   [junit4]   2> 1510654 INFO  (TEST-ForceLeaderTest.testLastPublishedStateIsActive-seed#[55FCF4D6D081CFA1]) [    ] o.a.s.c.c.SolrZkClient Using default ZkACLProvider
   [junit4]   2> 1510654 INFO  (TEST-ForceLeaderTest.testLastPublishedStateIsActive-seed#[55FCF4D6D081CFA1]) [    ] o.a.s.c.c.ZkStateReader Updating cluster state from ZooKeeper... 
   [junit4]   2> 1510654 INFO  (TEST-ForceLeaderTest.testLastPublishedStateIsActive-seed#[55FCF4D6D081CFA1]) [    ] o.a.s.c.c.ZkStateReader Loaded empty cluster properties
   [junit4]   2> 1510655 INFO  (TEST-ForceLeaderTest.testLastPublishedStateIsActive-seed#[55FCF4D6D081CFA1]) [    ] o.a.s.c.c.ZkStateReader Updated live nodes from ZooKeeper... (0) -> (1)
   [junit4]   2> 1510655 INFO  (TEST-ForceLeaderTest.testLastPublishedStateIsActive-seed#[55FCF4D6D081CFA1]) [    ] o.a.s.c.ChaosMonkey monkey: init - expire sessions:false cause connection loss:false
   [junit4]   2> 1510738 INFO  (TEST-ForceLeaderTest.testLastPublishedStateIsActive-seed#[55FCF4D6D081CFA1]) [    ] o.a.s.SolrTestCaseJ4 Writing core.properties file to /home/jenkins/workspace/Lucene-Solr-6.x-Linux/solr/build/solr-core/test/J1/temp/solr.cloud.ForceLeaderTest_55FCF4D6D081CFA1-001/shard-1-001/cores/collection1
   [junit4]   2> 1510738 INFO  (TEST-ForceLeaderTest.testLastPublishedStateIsActive-seed#[55FCF4D6D081CFA1]) [    ] o.a.s.c.AbstractFullDistribZkTestBase create jetty 1 in directory /home/jenkins/workspace/Lucene-Solr-6.x-Linux/solr/build/solr-core/test/J1/temp/solr.cloud.ForceLeaderTest_55FCF4D6D081CFA1-001/shard-1-001
   [junit4]   2> 1510739 INFO  (TEST-ForceLeaderTest.testLastPublishedStateIsActive-seed#[55FCF4D6D081CFA1]) [    ] o.e.j.s.Server jetty-9.3.8.v20160314
   [junit4]   2> 1510740 INFO  (TEST-ForceLeaderTest.testLastPublishedStateIsActive-seed#[55FCF4D6D081CFA1]) [    ] o.e.j.s.h.ContextHandler Started o.e.j.s.ServletContextHandler@14dce5b{/,null,AVAILABLE}
   [junit4]   2> 1510740 INFO  (TEST-ForceLeaderTest.testLastPublishedStateIsActive-seed#[55FCF4D6D081CFA1]) [    ] o.e.j.s.ServerConnector Started ServerConnector@138d1f6{HTTP/1.1,[http/1.1]}{127.0.0.1:43790}
   [junit4]   2> 1510740 INFO  (TEST-ForceLeaderTest.testLastPublishedStateIsActive-seed#[55FCF4D6D081CFA1]) [    ] o.e.j.s.Server Started @1512824ms
   [junit4]   2> 1510740 INFO  (TEST-ForceLeaderTest.testLastPublishedStateIsActive-seed#[55FCF4D6D081CFA1]) [    ] o.a.s.c.s.e.JettySolrRunner Jetty properties: {hostContext=/, solrconfig=solrconfig.xml, solr.data.dir=/home/jenkins/workspace/Lucene-Solr-6.x-Linux/solr/build/solr-core/test/J1/temp/solr.cloud.ForceLeaderTest_55FCF4D6D081CFA1-001/tempDir-001/jetty1, hostPort=43768, coreRootDirectory=/home/jenkins/workspace/Lucene-Solr-6.x-Linux/solr/build/solr-core/test/J1/temp/solr.cloud.ForceLeaderTest_55FCF4D6D081CFA1-001/shard-1-001/cores}
   [junit4]   2> 1510740 INFO  (TEST-ForceLeaderTest.testLastPublishedStateIsActive-seed#[55FCF4D6D081CFA1]) [    ] o.a.s.s.SolrDispatchFilter SolrDispatchFilter.init(): jdk.internal.loader.ClassLoaders$AppClassLoader@17b1517
   [junit4]   2> 1510740 INFO  (TEST-ForceLeaderTest.testLastPublishedStateIsActive-seed#[55FCF4D6D081CFA1]) [    ] o.a.s.c.SolrResourceLoader new SolrResourceLoader for directory: '/home/jenkins/workspace/Lucene-Solr-6.x-Linux/solr/build/solr-core/test/J1/temp/solr.cloud.ForceLeaderTest_55FCF4D6D081CFA1-001/shard-1-001'
   [junit4]   2> 1510741 INFO  (TEST-ForceLeaderTest.testLastPublishedStateIsActive-seed#[55FCF4D6D081CFA1]) [    ] o.a.s.c.SolrResourceLoader JNDI not configured for solr (NoInitialContextEx)
   [junit4]   2> 1510741 INFO  (TEST-ForceLeaderTest.testLastPublishedStateIsActive-seed#[55FCF4D6D081CFA1]) [    ] o.a.s.c.SolrResourceLoader solr home defaulted to 'solr/' (could not find system property or JNDI)
   [junit4]   2> 1510741 INFO  (TEST-ForceLeaderTest.testLastPublishedStateIsActive-seed#[55FCF4D6D081CFA1]) [    ] o.a.s.c.c.SolrZkClient Using default ZkCredentialsProvider
   [junit4]   2> 1510741 INFO  (TEST-ForceLeaderTest.testLastPublishedStateIsActive-seed#[55FCF4D6D081CFA1]) [    ] o.a.s.c.c.ConnectionManager Waiting for client to connect to ZooKeeper
   [junit4]   2> 1510742 INFO  (zkCallback-1480-thread-1) [    ] o.a.s.c.c.ConnectionManager Watcher org.apache.solr.common.cloud.ConnectionManager@a0d0d0 name:ZooKeeperConnection Watcher:127.0.0.1:41242/solr got event WatchedEvent state:SyncConnected type:None path:null path:null type:None
   [junit4]   2> 1510742 INFO  (TEST-ForceLeaderTest.testLastPublishedStateIsActive-seed#[55FCF4D6D081CFA1]) [    ] o.a.s.c.c.ConnectionManager Client is connected to ZooKeeper
   [junit4]   2> 1510742 INFO  (TEST-ForceLeaderTest.testLastPublishedStateIsActive-seed#[55FCF4D6D081CFA1]) [    ] o.a.s.c.c.SolrZkClient Using default ZkACLProvider
   [junit4]   2> 1510742 INFO  (TEST-ForceLeaderTest.testLastPublishedStateIsActive-seed#[55FCF4D6D081CFA1]) [    ] o.a.s.s.SolrDispatchFilter Loading solr.xml from SolrHome (not found in ZooKeeper)
   [junit4]   2> 1510742 INFO  (TEST-ForceLeaderTest.testLastPublishedStateIsActive-seed#[55FCF4D6D081CFA1]) [    ] o.a.s.c.SolrXmlConfig Loading container configuration from /home/jenkins/workspace/Lucene-Solr-6.x-Linux/solr/build/solr-core/test/J1/temp/solr.cloud.ForceLeaderTest_55FCF4D6D081CFA1-001/shard-1-001/solr.xml
   [junit4]   2> 1510746 INFO  (TEST-ForceLeaderTest.testLastPublishedStateIsActive-seed#[55FCF4D6D081CFA1]) [    ] o.a.s.c.CorePropertiesLocator Config-defined core root directory: /home/jenkins/workspace/Lucene-Solr-6.x-Linux/solr/build/solr-core/test/J1/temp/solr.cloud.ForceLeaderTest_55FCF4D6D081CFA1-001/shard-1-001/cores
   [junit4]   2> 1510746 INFO  (TEST-ForceLeaderTest.testLastPublishedStateIsActive-seed#[55FCF4D6D081CFA1]) [    ] o.a.s.c.CoreContainer New CoreContainer 1940506
   [junit4]   2> 1510746 INFO  (TEST-ForceLeaderTest.testLastPublishedStateIsActive-seed#[55FCF4D6D081CFA1]) [    ] o.a.s.c.CoreContainer Loading cores into CoreContainer [instanceDir=/home/jenkins/workspace/Lucene-Solr-6.x-Linux/solr/build/solr-core/test/J1/temp/solr.cloud.ForceLeaderTest_55FCF4D6D081CFA1-001/shard-1-001]
   [junit4]   2> 1510747 WARN  (TEST-ForceLeaderTest.testLastPublishedStateIsActive-seed#[55FCF4D6D081CFA1]) [    ] o.a.s.c.CoreContainer Couldn't add files from /home/jenkins/workspace/Lucene-Solr-6.x-Linux/solr/build/solr-core/test/J1/temp/solr.cloud.ForceLeaderTest_55FCF4D6D081CFA1-001/shard-1-001/lib to classpath: /home/jenkins/workspace/Lucene-Solr-6.x-Linux/solr/build/solr-core/test/J1/temp/solr.cloud.ForceLeaderTest_55FCF4D6D081CFA1-001/shard-1-001/lib
   [junit4]   2> 1510747 INFO  (TEST-ForceLeaderTest.testLastPublishedStateIsActive-seed#[55FCF4D6D081CFA1]) [    ] o.a.s.h.c.HttpShardHandlerFactory created with socketTimeout : 90000,urlScheme : ,connTimeout : 15000,maxConnectionsPerHost : 20,maxConnections : 10000,corePoolSize : 0,maximumPoolSize : 2147483647,maxThreadIdleTime : 5,sizeOfQueue : -1,fairnessPolicy : false,useRetries : false,connectionsEvictorSleepDelay : 5000,maxConnectionIdleTime : 40000,
   [junit4]   2> 1510748 INFO  (TEST-ForceLeaderTest.testLastPublishedStateIsActive-seed#[55FCF4D6D081CFA1]) [    ] o.a.s.u.UpdateShardHandler Creating UpdateShardHandler HTTP client with params: socketTimeout=340000&connTimeout=45000&retry=true
   [junit4]   2> 1510748 INFO  (TEST-ForceLeaderTest.testLastPublishedStateIsActive-seed#[55FCF4D6D081CFA1]) [    ] o.a.s.l.LogWatcher SLF4J impl is org.slf4j.impl.Log4jLoggerFactory
   [junit4]   2> 1510748 INFO  (TEST-ForceLeaderTest.testLastPublishedStateIsActive-seed#[55FCF4D6D081CFA1]) [    ] o.a.s.l.LogWatcher Registering Log Listener [Log4j (org.slf4j.impl.Log4jLoggerFactory)]
   [junit4]   2> 1510748 INFO  (TEST-ForceLeaderTest.testLastPublishedStateIsActive-seed#[55FCF4D6D081CFA1]) [    ] o.a.s.c.ZkContainer Zookeeper client=127.0.0.1:41242/solr
   [junit4]   2> 1510748 INFO  (TEST-ForceLeaderTest.testLastPublishedStateIsActive-seed#[55FCF4D6D081CFA1]) [    ] o.a.s.c.ZkController zkHost includes chroot
   [junit4]   2> 1510748 INFO  (TEST-ForceLeaderTest.testLastPublishedStateIsActive-seed#[55FCF4D6D081CFA1]) [    ] o.a.s.c.c.SolrZkClient Using default ZkCredentialsProvider
   [junit4]   2> 1510749 INFO  (TEST-ForceLeaderTest.testLastPublishedStateIsActive-seed#[55FCF4D6D081CFA1]) [    ] o.a.s.c.c.ConnectionManager Waiting for client to connect to ZooKeeper
   [junit4]   2> 1510749 INFO  (zkCallback-1483-thread-1) [    ] o.a.s.c.c.ConnectionManager Watcher org.apache.solr.common.cloud.ConnectionManager@16539ae name:ZooKeeperConnection Watcher:127.0.0.1:41242 got event WatchedEvent state:SyncConnected type:None path:null path:null type:None
   [junit4]   2> 1510749 INFO  (TEST-ForceLeaderTest.testLastPublishedStateIsActive-seed#[55FCF4D6D081CFA1]) [    ] o.a.s.c.c.ConnectionManager Client is connected to ZooKeeper
   [junit4]   2> 1510750 INFO  (TEST-ForceLeaderTest.testLastPublishedStateIsActive-seed#[55FCF4D6D081CFA1]) [    ] o.a.s.c.c.SolrZkClient Using default ZkACLProvider
   [junit4]   2> 1510750 INFO  (TEST-ForceLeaderTest.testLastPublishedStateIsActive-seed#[55FCF4D6D081CFA1]) [    ] o.a.s.c.ZkController Added new OnReconnect listener org.apache.solr.cloud.ZkController$$Lambda$153/1857100@1419ac9
   [junit4]   2> 1510750 INFO  (TEST-ForceLeaderTest.testLastPublishedStateIsActive-seed#[55FCF4D6D081CFA1]) [    ] o.a.s.c.c.ConnectionManager Waiting for client to connect to ZooKeeper
   [junit4]   2> 1510751 INFO  (zkCallback-1484-thread-1) [    ] o.a.s.c.c.ConnectionManager Watcher org.apache.solr.common.cloud.ConnectionManager@137686e name:ZooKeeperConnection Watcher:127.0.0.1:41242/solr got event WatchedEvent state:SyncConnected type:None path:null path:null type:None
   [junit4]   2> 1510751 INFO  (TEST-ForceLeaderTest.testLastPublishedStateIsActive-seed#[55FCF4D6D081CFA1]) [    ] o.a.s.c.c.ConnectionManager Client is connected to ZooKeeper
   [junit4]   2> 1510753 INFO  (TEST-ForceLeaderTest.testLastPublishedStateIsActive-seed#[55FCF4D6D081CFA1]) [    ] o.a.s.c.c.ZkStateReader Updating cluster state from ZooKeeper... 
   [junit4]   2> 1510753 INFO  (TEST-ForceLeaderTest.testLastPublishedStateIsActive-seed#[55FCF4D6D081CFA1]) [    ] o.a.s.c.c.ZkStateReader Loaded empty cluster properties
   [junit4]   2> 1510754 INFO  (TEST-ForceLeaderTest.testLastPublishedStateIsActive-seed#[55FCF4D6D081CFA1]) [    ] o.a.s.c.c.ZkStateReader Updated live nodes from ZooKeeper... (0) -> (1)
   [junit4]   2> 1510755 INFO  (TEST-ForceLeaderTest.testLastPublishedStateIsActive-seed#[55FCF4D6D081CFA1]) [    ] o.a.s.c.Overseer Overseer (id=null) closing
   [junit4]   2> 1510755 INFO  (TEST-ForceLeaderTest.testLastPublishedStateIsActive-seed#[55FCF4D6D081CFA1]) [    ] o.a.s.c.LeaderElector Joined leadership election with path: /overseer_elect/election/96577993142894600-127.0.0.1:43768_-n_0000000001
   [junit4]   2> 1510755 INFO  (TEST-ForceLeaderTest.testLastPublishedStateIsActive-seed#[55FCF4D6D081CFA1]) [    ] o.a.s.c.LeaderElector Watching path /overseer_elect/election/96577993142894596-127.0.0.1:40333_-n_0000000000 to know if I could be the leader
   [junit4]   2> 1510755 INFO  (TEST-ForceLeaderTest.testLastPublishedStateIsActive-seed#[55FCF4D6D081CFA1]) [    ] o.a.s.c.ZkController Publish node=127.0.0.1:43768_ as DOWN
   [junit4]   2> 1510755 INFO  (TEST-ForceLeaderTest.testLastPublishedStateIsActive-seed#[55FCF4D6D081CFA1]) [    ] o.a.s.c.ZkController Register node as live in ZooKeeper:/live_nodes/127.0.0.1:43768_
   [junit4]   2> 1510755 INFO  (TEST-ForceLeaderTest.testLastPublishedStateIsActive-seed#[55FCF4D6D081CFA1]) [    ] o.a.s.c.c.SolrZkClient makePath: /live_nodes/127.0.0.1:43768_
   [junit4]   2> 1510756 INFO  (OverseerStateUpdate-96577993142894596-127.0.0.1:40333_-n_0000000000) [    ] o.a.s.c.Overseer processMessage: queueSize: 1, message = {
   [junit4]   2>   "operation":"downnode",
   [junit4]   2>   "node_name":"127.0.0.1:43768_"} current state version: 3
   [junit4]   2> 1510756 INFO  (OverseerStateUpdate-96577993142894596-127.0.0.1:40333_-n_0000000000) [    ] o.a.s.c.o.NodeMutator DownNode state invoked for node: 127.0.0.1:43768_
   [junit4]   2> 1510756 INFO  (zkCallback-1484-thread-1) [    ] o.a.s.c.c.ZkStateReader A live node change: [WatchedEvent state:SyncConnected type:NodeChildrenChanged path:/live_nodes], has occurred - updating... (live nodes size: [1])
   [junit4]   2> 1510756 INFO  (zkCallback-1479-thread-1) [    ] o.a.s.c.c.ZkStateReader A live node change: [WatchedEvent state:SyncConnected type:NodeChildrenChanged path:/live_nodes], has occurred - updating... (live nodes size: [1])
   [junit4]   2> 1510756 INFO  (zkCallback-1475-thread-2) [    ] o.a.s.c.c.ZkStateReader A live node change: [WatchedEvent state:SyncConnected type:NodeChildrenChanged path:/live_nodes], has occurred - updating... (live nodes size: [1])
   [junit4]   2> 1510756 INFO  (zkCallback-1484-thread-1) [    ] o.a.s.c.c.ZkStateReader Updated live nodes from ZooKeeper... (1) -> (2)
   [junit4]   2> 1510756 INFO  (zkCallback-1479-thread-1) [    ] o.a.s.c.c.ZkStateReader Updated live nodes from ZooKeeper... (1) -> (2)
   [junit4]   2> 1510756 INFO  (zkCallback-1475-thread-2) [    ] o.a.s.c.c.ZkStateReader Updated live nodes from ZooKeeper... (1) -> (2)
   [junit4]   2> 1510800 INFO  (TEST-ForceLeaderTest.testLastPublishedStateIsActive-seed#[55FCF4D6D081CFA1]) [    ] o.a.s.c.CoreContainer Security conf doesn't exist. Skipping setup for authorization module.
   [junit4]   2> 1510801 INFO  (TEST-ForceLeaderTest.testLastPublishedStateIsActive-seed#[55FCF4D6D081CFA1]) [    ] o.a.s.c.CoreContainer No authentication plugin used.
   [junit4]   2> 1510801 INFO  (TEST-ForceLeaderTest.testLastPublishedStateIsActive-seed#[55FCF4D6D081CFA1]) [    ] o.a.s.c.CorePropertiesLocator Looking for core definitions underneath /home/jenkins/workspace/Lucene-Solr-6.x-Linux/solr/build/solr-core/test/J1/temp/solr.cloud.ForceLeaderTest_55FCF4D6D081CFA1-001/shard-1-001/cores
   [junit4]   2> 1510801 INFO  (TEST-ForceLeaderTest.testLastPublishedStateIsActive-seed#[55FCF4D6D081CFA1]) [    ] o.a.s.c.CoreDescriptor Created CoreDescriptor: {schema=schema.xml, dataDir=data/, collection=collection1, loadOnStartup=true, coreNodeName=, transient=false, name=collection1, shard=, config=solrconfig.xml, configSetProperties=configsetprops.json}
   [junit4]   2> 1510801 INFO  (TEST-ForceLeaderTest.testLastPublishedStateIsActive-seed#[55FCF4D6D081CFA1]) [    ] o.a.s.c.CorePropertiesLocator Found core collection1 in /home/jenkins/workspace/Lucene-Solr-6.x-Linux/solr/build/solr-core/test/J1/temp/solr.cloud.ForceLeaderTest_55FCF4D6D081CFA1-001/shard-1-001/cores/collection1
   [junit4]   2> 1510801 INFO  (TEST-ForceLeaderTest.testLastPublishedStateIsActive-seed#[55FCF4D6D081CFA1]) [    ] o.a.s.c.CorePropertiesLocator Found 1 core definitions
   [junit4]   2> 1510802 INFO  (coreLoadExecutor-4369-thread-1) [    ] o.a.s.c.ZkController publishing state=down
   [junit4]   2> 1510802 INFO  (coreLoadExecutor-4369-thread-1) [    ] o.a.s.c.ZkController numShards not found on descriptor - reading it from system property
   [junit4]   2> 1510802 INFO  (TEST-ForceLeaderTest.testLastPublishedStateIsActive-seed#[55FCF4D6D081CFA1]) [    ] o.a.s.s.SolrDispatchFilter user.dir=/home/jenkins/workspace/Lucene-Solr-6.x-Linux/solr/build/solr-core/test/J1
   [junit4]   2> 1510802 INFO  (TEST-ForceLeaderTest.testLastPublishedStateIsActive-seed#[55FCF4D6D081CFA1]) [    ] o.a.s.s.SolrDispatchFilter SolrDispatchFilter.init() done
   [junit4]   2> 1510803 INFO  (coreLoadExecutor-4369-thread-1) [    ] o.a.s.c.ZkController Collection collection1 not visible yet, but flagging it so a watch is registered when it becomes visible
   [junit4]   2> 1510803 INFO  (OverseerStateUpdate-96577993142894596-127.0.0.1:40333_-n_0000000000) [    ] o.a.s.c.Overseer processMessage: queueSize: 1, message = {
   [junit4]   2>   "core":"collection1",
   [junit4]   2>   "roles":null,
   [junit4]   2>   "base_url":"http://127.0.0.1:43768",
   [junit4]   2>   "node_name":"127.0.0.1:43768_",
   [junit4]   2>   "numShards":"2",
   [junit4]   2>   "state":"down",
   [junit4]   2>   "shard":null,
   [junit4]   2>   "collection":"collection1",
   [junit4]   2>   "operation":"state"} current state version: 3
   [junit4]   2> 1510803 INFO  (coreLoadExecutor-4369-thread-1) [    ] o.a.s.c.c.ZkStateReader Deleting data for [collection1]
   [junit4]   2> 1510803 INFO  (OverseerStateUpdate-96577993142894596-127.0.0.1:40333_-n_0000000000) [    ] o.a.s.c.o.ReplicaMutator Update state numShards=2 message={
   [junit4]   2>   "core":"collection1",
   [junit4]   2>   "roles":null,
   [junit4]   2>   "base_url":"http://127.0.0.1:43768",
   [junit4]   2>   "node_name":"127.0.0.1:43768_",
   [junit4]   2>   "numShards":"2",
   [junit4]   2>   "state":"down",
   [junit4]   2>   "shard":null,
   [junit4]   2>   "collection":"collection1",
   [junit4]   2>   "operation":"state"}
   [junit4]   2> 1510803 INFO  (OverseerStateUpdate-96577993142894596-127.0.0.1:40333_-n_0000000000) [    ] o.a.s.c.o.ClusterStateMutator building a new cName: collection1
   [junit4]   2> 1510803 INFO  (OverseerStateUpdate-96577993142894596-127.0.0.1:40333_-n_0000000000) [    ] o.a.s.c.o.ReplicaMutator Assigning new node to shard shard=shard2
   [junit4]   2> 1510803 INFO  (coreLoadExecutor-4369-thread-1) [    ] o.a.s.c.ZkController look for our core node name
   [junit4]   2> 1510904 INFO  (zkCallback-1475-thread-2) [    ] o.a.s.c.c.ZkStateReader A cluster state change: [WatchedEvent state:SyncConnected type:NodeDataChanged path:/clusterstate.json], has occurred - updating... (live nodes size: [2])
   [junit4]   2> 1510904 INFO  (zkCallback-1479-thread-1) [    ] o.a.s.c.c.ZkStateReader A cluster state change: [WatchedEvent state:SyncConnected type:NodeDataChanged path:/clusterstate.json], has occurred - updating... (live nodes size: [2])
   [junit4]   2> 1510904 INFO  (zkCallback-1484-thread-1) [    ] o.a.s.c.c.ZkStateReader A cluster state change: [WatchedEvent state:SyncConnected type:NodeDataChanged path:/clusterstate.json], has occurred - updating... (live nodes size: [2])
   [junit4]   2> 1511804 INFO  (coreLoadExecutor-4369-thread-1) [    ] o.a.s.c.ZkController waiting to find shard id in clusterstate for collection1
   [junit4]   2> 1511804 INFO  (coreLoadExecutor-4369-thread-1) [    ] o.a.s.c.ZkController Check for collection zkNode:collection1
   [junit4]   2> 1511804 INFO  (coreLoadExecutor-4369-thread-1) [    ] o.a.s.c.ZkController Collection zkNode exists
   [junit4]   2> 1511804 INFO  (coreLoadExecutor-4369-thread-1) [    ] o.a.s.c.c.ZkStateReader Load collection config from: [/collections/collection1]
   [junit4]   2> 1511804 INFO  (coreLoadExecutor-4369-thread-1) [    ] o.a.s.c.c.ZkStateReader path=[/collections/collection1] [configName]=[conf1] specified config exists in ZooKeeper
   [junit4]   2> 1511804 INFO  (coreLoadExecutor-4369-thread-1) [    ] o.a.s.c.SolrResourceLoader new SolrResourceLoader for directory: '/home/jenkins/workspace/Lucene-Solr-6.x-Linux/solr/build/solr-core/test/J1/temp/solr.cloud.ForceLeaderTest_55FCF4D6D081CFA1-001/shard-1-001/cores/collection1'
   [junit4]   2> 1511804 INFO  (coreLoadExecutor-4369-thread-1) [    ] o.a.s.c.SolrResourceLoader JNDI not configured for solr (NoInitialContextEx)
   [junit4]   2> 1511804 INFO  (coreLoadExecutor-4369-thread-1) [    ] o.a.s.c.SolrResourceLoader solr home defaulted to 'solr/' (could not find system property or JNDI)
   [junit4]   2> 1511805 INFO  (coreLoadExecutor-4369-thread-1) [    ] o.a.s.c.Config loaded config solrconfig.xml with version 0 
   [junit4]   2> 1511808 INFO  (coreLoadExecutor-4369-thread-1) [    ] o.a.s.c.SolrConfig current version of requestparams : -1
   [junit4]   2> 1511810 WARN  (coreLoadExecutor-4369-thread-1) [    ] o.a.s.c.Config Beginning with Solr 5.5, <mergePolicy> is deprecated, use <mergePolicyFactory> instead.
   [junit4]   2> 1511811 INFO  (coreLoadExecutor-4369-thread-1) [    ] o.a.s.c.SolrConfig Using Lucene MatchVersion: 6.3.0
   [junit4]   2> 1511818 INFO  (coreLoadExecutor-4369-thread-1) [    ] o.a.s.c.SolrConfig Loaded SolrConfig: solrconfig.xml
   [junit4]   2> 1511821 INFO  (coreLoadExecutor-4369-thread-1) [    ] o.a.s.s.IndexSchema [collection1] Schema name=test
   [junit4]   2> 1511881 INFO  (coreLoadExecutor-4369-thread-1) [    ] o.a.s.s.OpenExchangeRatesOrgProvider Initialized with rates=open-exchange-rates.json, refreshInterval=1440.
   [junit4]   2> 1511885 INFO  (coreLoadExecutor-4369-thread-1) [    ] o.a.s.s.IndexSchema default search field in schema is text
   [junit4]   2> 1511886 INFO  (coreLoadExecutor-4369-thread-1) [    ] o.a.s.s.IndexSchema unique key field: id
   [junit4]   2> 1511890 INFO  (coreLoadExecutor-4369-thread-1) [    ] o.a.s.s.FileExchangeRateProvider Reloading exchange rates from file currency.xml
   [junit4]   2> 1511891 INFO  (coreLoadExecutor-4369-thread-1) [    ] o.a.s.s.FileExchangeRateProvider Reloading exchange rates from file currency.xml
   [junit4]   2> 1511892 INFO  (coreLoadExecutor-4369-thread-1) [    ] o.a.s.s.OpenExchangeRatesOrgProvider Reloading exchange rates from open-exchange-rates.json
   [junit4]   2> 1511893 INFO  (coreLoadExecutor-4369-thread-1) [    ] o.a.s.s.OpenExchangeRatesOrgProvider Reloading exchange rates from open-exchange-rates.json
   [junit4]   2> 1511894 INFO  (coreLoadExecutor-4369-thread-1) [    ] o.a.s.c.ConfigSetProperties Did not find ConfigSet properties, assuming default properties: Can't find resource 'configsetprops.json' in classpath or '/configs/conf1', cwd=/home/jenkins/workspace/Lucene-Solr-6.x-Linux/solr/build/solr-core/test/J1
   [junit4]   2> 1511894 INFO  (coreLoadExecutor-4369-thread-1) [    ] o.a.s.c.CoreContainer Creating SolrCore 'collection1' using configuration from collection collection1
   [junit4]   2> 1511894 INFO  (coreLoadExecutor-4369-thread-1) [    ] o.a.s.c.SolrCore org.apache.solr.core.MockDirectoryFactory
   [junit4]   2> 1511894 INFO  (coreLoadExecutor-4369-thread-1) [    ] o.a.s.c.SolrCore [[collection1] ] Opening new SolrCore at [/home/jenkins/workspace/Lucene-Solr-6.x-Linux/solr/build/solr-core/test/J1/temp/solr.cloud.ForceLeaderTest_55FCF4D6D081CFA1-001/shard-1-001/cores/collection1], dataDir=[/home/jenkins/workspace/Lucene-Solr-6.x-Linux/solr/build/solr-core/test/J1/temp/solr.cloud.ForceLeaderTest_55FCF4D6D081CFA1-001/shard-1-001/cores/collection1/data/]
   [junit4]   2> 1511894 INFO  (coreLoadExecutor-4369-thread-1) [    ] o.a.s.c.JmxMonitoredMap JMX monitoring is enabled. Adding Solr mbeans to JMX Server: com.sun.jmx.mbeanserver.JmxMBeanServer@a92fc4
   [junit4]   2> 1511895 INFO  (coreLoadExecutor-4369-thread-1) [    ] o.a.s.c.CachingDirectoryFactory return new directory for /home/jenkins/workspace/Lucene-Solr-6.x-Linux/solr/build/solr-core/test/J1/temp/solr.cloud.ForceLeaderTest_55FCF4D6D081CFA1-001/shard-1-001/cores/collection1/data/snapshot_metadata
   [junit4]   2> 1511895 INFO  (coreLoadExecutor-4369-thread-1) [    ] o.a.s.c.s.SolrSnapshotMetaDataManager Loading from snapshot metadata file...
   [junit4]   2> 1511895 INFO  (coreLoadExecutor-4369-thread-1) [    ] o.a.s.c.CachingDirectoryFactory return new directory for /home/jenkins/workspace/Lucene-Solr-6.x-Linux/solr/build/solr-core/test/J1/temp/solr.cloud.ForceLeaderTest_55FCF4D6D081CFA1-001/shard-1-001/cores/collection1/data
   [junit4]   2> 1511895 INFO  (coreLoadExecutor-4369-thread-1) [    ] o.a.s.c.SolrCore New index directory detected: old=null new=/home/jenkins/workspace/Lucene-Solr-6.x-Linux/solr/build/solr-core/test/J1/temp/solr.cloud.ForceLeaderTest_55FCF4D6D081CFA1-001/shard-1-001/cores/collection1/d

[...truncated too long message...]

o.a.s.c.CachingDirectoryFactory Closing directory: /home/jenkins/workspace/Lucene-Solr-6.x-Linux/solr/build/solr-core/test/J2/temp/solr.security.BasicAuthIntegrationTest_55FCF4D6D081CFA1-001/tempDir-001/node1/./authCollection_shard2_replica1/data
   [junit4]   2> 2027672 INFO  (zkCallback-3300-thread-2) [    ] o.a.s.c.OverseerAutoReplicaFailoverThread Starting OverseerAutoReplicaFailoverThread autoReplicaFailoverWorkLoopDelay=10000 autoReplicaFailoverWaitAfterExpiration=30000 autoReplicaFailoverBadNodeExpiration=60000
   [junit4]   2> 2027673 INFO  (OverseerCollectionConfigSetProcessor-96578026845700104-127.0.0.1:37339_solr-n_0000000002) [    ] o.a.s.c.OverseerTaskProcessor Process current queue of overseer operations
   [junit4]   2> 2027673 INFO  (jetty-launcher-3285-thread-1) [    ] o.a.s.c.Overseer Overseer (id=96578026845700104-127.0.0.1:37339_solr-n_0000000002) closing
   [junit4]   2> 2027673 INFO  (OverseerCollectionConfigSetProcessor-96578026845700104-127.0.0.1:37339_solr-n_0000000002) [    ] o.a.s.c.OverseerTaskProcessor According to ZK I (id=96578026845700104-127.0.0.1:37339_solr-n_0000000002) am no longer a leader.
   [junit4]   2> 2027673 ERROR (OverseerCollectionConfigSetProcessor-96578026845700104-127.0.0.1:37339_solr-n_0000000002) [    ] o.a.s.c.OverseerTaskProcessor Unable to prioritize overseer 
   [junit4]   2> java.lang.InterruptedException
   [junit4]   2> 	at org.apache.solr.common.cloud.ZkCmdExecutor.retryOperation(ZkCmdExecutor.java:67)
   [junit4]   2> 	at org.apache.solr.common.cloud.SolrZkClient.exists(SolrZkClient.java:311)
   [junit4]   2> 	at org.apache.solr.cloud.OverseerNodePrioritizer.prioritizeOverseerNodes(OverseerNodePrioritizer.java:60)
   [junit4]   2> 	at org.apache.solr.cloud.OverseerTaskProcessor.run(OverseerTaskProcessor.java:177)
   [junit4]   2> 	at java.lang.Thread.run(java.base@9-ea/Thread.java:843)
   [junit4]   2> 2027673 INFO  (OverseerStateUpdate-96578026845700104-127.0.0.1:37339_solr-n_0000000002) [    ] o.a.s.c.Overseer Starting to work on the main queue
   [junit4]   2> 2027673 INFO  (zkCallback-3300-thread-2) [    ] o.a.s.c.c.ZkStateReader A live node change: [WatchedEvent state:SyncConnected type:NodeChildrenChanged path:/live_nodes], has occurred - updating... (live nodes size: [1])
   [junit4]   2> 2027674 INFO  (OverseerStateUpdate-96578026845700104-127.0.0.1:37339_solr-n_0000000002) [    ] o.a.s.c.Overseer Overseer Loop exiting : 127.0.0.1:37339_solr
   [junit4]   2> 2027674 WARN  (zkCallback-3300-thread-2) [    ] o.a.s.c.c.ZkStateReader ZooKeeper watch triggered, but Solr cannot talk to ZK: [KeeperErrorCode = Session expired for /live_nodes]
   [junit4]   2> 2027674 INFO  (jetty-launcher-3285-thread-1) [    ] o.e.j.s.h.ContextHandler Stopped o.e.j.s.ServletContextHandler@f65b31{/solr,null,UNAVAILABLE}
   [junit4]   2> 2029166 WARN  (zkCallback-3313-thread-1) [    ] o.a.s.c.c.ZkStateReader ZooKeeper watch triggered, but Solr cannot talk to ZK: [KeeperErrorCode = Session expired for /live_nodes]
   [junit4]   2> 2029166 INFO  (jetty-launcher-3285-thread-2) [    ] o.e.j.s.h.ContextHandler Stopped o.e.j.s.ServletContextHandler@fa5da8{/solr,null,UNAVAILABLE}
   [junit4]   2> 2029167 INFO  (SUITE-BasicAuthIntegrationTest-seed#[55FCF4D6D081CFA1]-worker) [    ] o.a.s.c.ZkTestServer connecting to 127.0.0.1:33510 33510
   [junit4]   2> 2034212 INFO  (Thread-3863) [    ] o.a.s.c.ZkTestServer connecting to 127.0.0.1:33510 33510
   [junit4]   2> 2034212 WARN  (Thread-3863) [    ] o.a.s.c.ZkTestServer Watch limit violations: 
   [junit4]   2> Maximum concurrent create/delete watches above limit:
   [junit4]   2> 
   [junit4]   2> 	5	/solr/aliases.json
   [junit4]   2> 	4	/solr/security.json
   [junit4]   2> 	4	/solr/configs/conf
   [junit4]   2> 
   [junit4]   2> Maximum concurrent data watches above limit:
   [junit4]   2> 
   [junit4]   2> 	5	/solr/clusterstate.json
   [junit4]   2> 	5	/solr/clusterprops.json
   [junit4]   2> 	4	/solr/collections/authCollection/state.json
   [junit4]   2> 
   [junit4]   2> Maximum concurrent children watches above limit:
   [junit4]   2> 
   [junit4]   2> 	10	/solr/overseer/queue
   [junit4]   2> 	5	/solr/collections
   [junit4]   2> 	4	/solr/live_nodes
   [junit4]   2> 	4	/solr/overseer/collection-queue-work
   [junit4]   2> 	3	/solr/overseer/queue-work
   [junit4]   2> 
   [junit4]   2> 2034213 INFO  (SUITE-BasicAuthIntegrationTest-seed#[55FCF4D6D081CFA1]-worker) [    ] o.a.s.SolrTestCaseJ4 ###deleteCore
   [junit4]   2> NOTE: leaving temporary files on disk at: /home/jenkins/workspace/Lucene-Solr-6.x-Linux/solr/build/solr-core/test/J2/temp/solr.security.BasicAuthIntegrationTest_55FCF4D6D081CFA1-001
   [junit4]   2> NOTE: test params are: codec=Asserting(Lucene62): {}, docValues:{}, maxPointsInLeafNode=1584, maxMBSortInHeap=7.94244462542982, sim=RandomSimilarity(queryNorm=true,coord=no): {}, locale=lt, timezone=Africa/Monrovia
   [junit4]   2> NOTE: Linux 4.4.0-36-generic i386/Oracle Corporation 9-ea (32-bit)/cpus=12,threads=1,free=96204936,total=518979584
   [junit4]   2> NOTE: All tests run in this JVM: [TestSchemaResource, ExplicitHLLTest, UnloadDistributedZkTest, CircularListTest, NoCacheHeaderTest, AutoCommitTest, TestHdfsUpdateLog, TestOnReconnectListenerSupport, SolrPluginUtilsTest, UpdateParamsTest, HdfsTlogReplayBufferedWhileIndexingTest, TestStandardQParsers, ResponseHeaderTest, TermVectorComponentDistributedTest, CachingDirectoryFactoryTest, TestDFRSimilarityFactory, TestConfig, TestZkChroot, PrimUtilsTest, BJQParserTest, CoreAdminRequestStatusTest, TestConfigSetProperties, TestCryptoKeys, DistributedFacetPivotLongTailTest, LeaderInitiatedRecoveryOnCommitTest, TestConfigReload, TestImplicitCoreProperties, TestOverriddenPrefixQueryForCustomFieldType, SharedFSAutoReplicaFailoverTest, CollectionsAPIAsyncDistributedZkTest, TestDynamicFieldResource, AnalyticsQueryTest, TestHighFrequencyDictionaryFactory, TestMacroExpander, TestRebalanceLeaders, LeaderElectionTest, SecurityConfHandlerTest, TestStressReorder, WrapperMergePolicyFactoryTest, TestAuthenticationFramework, XmlUpdateRequestHandlerTest, BadComponentTest, RecoveryZkTest, HdfsChaosMonkeyNothingIsSafeTest, FullSolrCloudDistribCmdsTest, SolrCoreCheckLockOnStartupTest, JSONWriterTest, CustomCollectionTest, DistributedExpandComponentTest, PreAnalyzedUpdateProcessorTest, TestRestManager, TestCollationField, TestBackupRepositoryFactory, CdcrReplicationHandlerTest, AssignTest, HdfsRestartWhileUpdatingTest, StressHdfsTest, TestSmileRequest, PreAnalyzedFieldTest, SpellPossibilityIteratorTest, TestNonDefinedSimilarityFactory, TestReqParamsAPI, SuggesterTest, TimeZoneUtilsTest, BlockJoinFacetSimpleTest, TestSolrCoreSnapshots, OverseerTest, TestExtendedDismaxParser, TestSerializedLuceneMatchVersion, DistribJoinFromCollectionTest, TestJmxMonitoredMap, TestReversedWildcardFilterFactory, TestMinMaxOnMultiValuedField, TestCloudPivotFacet, CoreAdminHandlerTest, ZkStateWriterTest, LukeRequestHandlerTest, TestNRTOpen, TestBinaryField, DebugComponentTest, BadCopyFieldTest, RankQueryTest, TestMiniSolrCloudCluster, OpenExchangeRatesOrgProviderTest, UUIDUpdateProcessorFallbackTest, AtomicUpdatesTest, TestRawTransformer, VMParamsZkACLAndCredentialsProvidersTest, TestFieldCacheSanityChecker, JavabinLoaderTest, BufferStoreTest, ConfigSetsAPITest, TestLeaderInitiatedRecoveryThread, BasicDistributedZk2Test, TestConfigSetsAPI, TestCoreDiscovery, TestRTimerTree, SimpleFacetsTest, FieldMutatingUpdateProcessorTest, ChaosMonkeySafeLeaderTest, SyncSliceTest, LeaderElectionIntegrationTest, ShardRoutingTest, BasicZkTest, ZkSolrClientTest, ShardRoutingCustomTest, TestRecovery, DistributedSpellCheckComponentTest, ZkControllerTest, TestStressVersions, DistributedTermsComponentTest, SolrCoreTest, TestGroupingSearch, SolrCmdDistributorTest, BasicFunctionalityTest, DirectUpdateHandlerTest, HighlighterTest, ShowFileRequestHandlerTest, DistributedQueryElevationComponentTest, DocValuesTest, PrimitiveFieldTypeTest, TermsComponentTest, TestValueSourceCache, TestIndexingPerformance, MoreLikeThisHandlerTest, FastVectorHighlighterTest, IndexSchemaRuntimeFieldTest, IndexSchemaTest, MBeansHandlerTest, BinaryUpdateRequestHandlerTest, TestPartialUpdateDeduplication, PingRequestHandlerTest, HighlighterConfigTest, SOLR749Test, TestQuerySenderNoQuery, ResponseLogComponentTest, TestMergePolicyConfig, TestDocSet, NumericFieldsTest, MinimalSchemaTest, TestElisionMultitermQuery, OutputWriterTest, TestPostingsSolrHighlighter, NotRequiredUniqueKeyTest, TestLuceneMatchVersion, TestPhraseSuggestions, TestXIncludeConfig, EchoParamsTest, TestLMJelinekMercerSimilarityFactory, TestFastWriter, ResourceLoaderTest, TestFastOutputStream, ScriptEngineTest, URLClassifyProcessorTest, PluginInfoTest, TestSystemIdResolver, DateFieldTest, DOMUtilTest, TestSolrJ, TestUtils, CursorPagingTest, SolrTestCaseJ4Test, TestCursorMarkWithoutUniqueKey, TestDistributedMissingSort, TestHighlightDedupGrouping, TestSimpleTrackingShardHandler, TestTolerantSearch, TestJettySolrRunner, AliasIntegrationTest, CollectionTooManyReplicasTest, DeleteReplicaTest, MigrateRouteKeyTest, OutOfBoxZkACLAndCredentialsProvidersTest, OverseerCollectionConfigSetProcessorTest, RecoveryAfterSoftCommitTest, ReplicationFactorTest, RollingRestartTest, TestCloudInspectUtil, TestCollectionAPI, TestHdfsCloudBackupRestore, TestRandomFlRTGCloud, TestTolerantUpdateProcessorRandomCloud, HdfsCollectionsAPIDistributedZkTest, HdfsNNFailoverTest, HdfsRecoveryZkTest, HdfsThreadLeakTest, TestClusterStateMutator, RuleEngineTest, RulesTest, TestUniqueKeyFieldResource, DateRangeFieldTest, DocValuesMissingTest, SpatialRPTFieldTypeTest, TestCloudSchemaless, TestUseDocValuesAsStored2, AnalyticsMergeStrategyTest, TestInitQParser, TestMissingGroups, TestStressUserVersions, TestOrdValues, TestSortByMinMaxFunction, BlockJoinFacetDistribTest, TestScoreJoinQPNoScore, BasicAuthIntegrationTest]
   [junit4] Completed [603/630 (2!)] on J2 in 10.99s, 1 test, 1 error <<< FAILURES!

[...truncated 49919 lines...]


Mime
View raw message