lucene-dev mailing list archives

Site index · List index
Message view « Date » · « Thread »
Top « Date » · « Thread »
From Apache Jenkins Server <jenk...@builds.apache.org>
Subject [JENKINS] Lucene-Solr-Tests-master - Build # 1389 - Still Unstable
Date Mon, 12 Sep 2016 01:25:37 GMT
Build: https://builds.apache.org/job/Lucene-Solr-Tests-master/1389/

2 tests failed.
FAILED:  org.apache.solr.cloud.DistribJoinFromCollectionTest.testNoScore

Error Message:
Error from server at http://127.0.0.1:41973/solr/to_2x2_shard1_replica1: Error from server at http://127.0.0.1:52488/solr/to_2x2_shard2_replica1: SolrCloud join: Collection 'from_1x4Alias' not found!

Stack Trace:
org.apache.solr.client.solrj.impl.HttpSolrClient$RemoteSolrException: Error from server at http://127.0.0.1:41973/solr/to_2x2_shard1_replica1: Error from server at http://127.0.0.1:52488/solr/to_2x2_shard2_replica1: SolrCloud join: Collection 'from_1x4Alias' not found!
	at __randomizedtesting.SeedInfo.seed([F346093846C9D5F1:4CC9058AB885CABD]:0)
	at org.apache.solr.client.solrj.impl.HttpSolrClient.executeMethod(HttpSolrClient.java:608)
	at org.apache.solr.client.solrj.impl.HttpSolrClient.request(HttpSolrClient.java:261)
	at org.apache.solr.client.solrj.impl.HttpSolrClient.request(HttpSolrClient.java:250)
	at org.apache.solr.client.solrj.impl.LBHttpSolrClient.doRequest(LBHttpSolrClient.java:415)
	at org.apache.solr.client.solrj.impl.LBHttpSolrClient.request(LBHttpSolrClient.java:367)
	at org.apache.solr.client.solrj.impl.CloudSolrClient.sendRequest(CloudSolrClient.java:1280)
	at org.apache.solr.client.solrj.impl.CloudSolrClient.requestWithRetryOnStaleState(CloudSolrClient.java:1050)
	at org.apache.solr.client.solrj.impl.CloudSolrClient.request(CloudSolrClient.java:992)
	at org.apache.solr.client.solrj.SolrClient.request(SolrClient.java:1219)
	at org.apache.solr.cloud.DistribJoinFromCollectionTest.testJoins(DistribJoinFromCollectionTest.java:177)
	at org.apache.solr.cloud.DistribJoinFromCollectionTest.testNoScore(DistribJoinFromCollectionTest.java:124)
	at sun.reflect.NativeMethodAccessorImpl.invoke0(Native Method)
	at sun.reflect.NativeMethodAccessorImpl.invoke(NativeMethodAccessorImpl.java:62)
	at sun.reflect.DelegatingMethodAccessorImpl.invoke(DelegatingMethodAccessorImpl.java:43)
	at java.lang.reflect.Method.invoke(Method.java:498)
	at com.carrotsearch.randomizedtesting.RandomizedRunner.invoke(RandomizedRunner.java:1764)
	at com.carrotsearch.randomizedtesting.RandomizedRunner$8.evaluate(RandomizedRunner.java:871)
	at com.carrotsearch.randomizedtesting.RandomizedRunner$9.evaluate(RandomizedRunner.java:907)
	at com.carrotsearch.randomizedtesting.RandomizedRunner$10.evaluate(RandomizedRunner.java:921)
	at com.carrotsearch.randomizedtesting.rules.SystemPropertiesRestoreRule$1.evaluate(SystemPropertiesRestoreRule.java:57)
	at org.apache.lucene.util.TestRuleSetupTeardownChained$1.evaluate(TestRuleSetupTeardownChained.java:49)
	at org.apache.lucene.util.AbstractBeforeAfterRule$1.evaluate(AbstractBeforeAfterRule.java:45)
	at org.apache.lucene.util.TestRuleThreadAndTestName$1.evaluate(TestRuleThreadAndTestName.java:48)
	at org.apache.lucene.util.TestRuleIgnoreAfterMaxFailures$1.evaluate(TestRuleIgnoreAfterMaxFailures.java:64)
	at org.apache.lucene.util.TestRuleMarkFailure$1.evaluate(TestRuleMarkFailure.java:47)
	at com.carrotsearch.randomizedtesting.rules.StatementAdapter.evaluate(StatementAdapter.java:36)
	at com.carrotsearch.randomizedtesting.ThreadLeakControl$StatementRunner.run(ThreadLeakControl.java:367)
	at com.carrotsearch.randomizedtesting.ThreadLeakControl.forkTimeoutingTask(ThreadLeakControl.java:809)
	at com.carrotsearch.randomizedtesting.ThreadLeakControl$3.evaluate(ThreadLeakControl.java:460)
	at com.carrotsearch.randomizedtesting.RandomizedRunner.runSingleTest(RandomizedRunner.java:880)
	at com.carrotsearch.randomizedtesting.RandomizedRunner$5.evaluate(RandomizedRunner.java:781)
	at com.carrotsearch.randomizedtesting.RandomizedRunner$6.evaluate(RandomizedRunner.java:816)
	at com.carrotsearch.randomizedtesting.RandomizedRunner$7.evaluate(RandomizedRunner.java:827)
	at com.carrotsearch.randomizedtesting.rules.StatementAdapter.evaluate(StatementAdapter.java:36)
	at com.carrotsearch.randomizedtesting.rules.SystemPropertiesRestoreRule$1.evaluate(SystemPropertiesRestoreRule.java:57)
	at org.apache.lucene.util.AbstractBeforeAfterRule$1.evaluate(AbstractBeforeAfterRule.java:45)
	at com.carrotsearch.randomizedtesting.rules.StatementAdapter.evaluate(StatementAdapter.java:36)
	at org.apache.lucene.util.TestRuleStoreClassName$1.evaluate(TestRuleStoreClassName.java:41)
	at com.carrotsearch.randomizedtesting.rules.NoShadowingOrOverridesOnMethodsRule$1.evaluate(NoShadowingOrOverridesOnMethodsRule.java:40)
	at com.carrotsearch.randomizedtesting.rules.NoShadowingOrOverridesOnMethodsRule$1.evaluate(NoShadowingOrOverridesOnMethodsRule.java:40)
	at com.carrotsearch.randomizedtesting.rules.StatementAdapter.evaluate(StatementAdapter.java:36)
	at com.carrotsearch.randomizedtesting.rules.StatementAdapter.evaluate(StatementAdapter.java:36)
	at com.carrotsearch.randomizedtesting.rules.StatementAdapter.evaluate(StatementAdapter.java:36)
	at org.apache.lucene.util.TestRuleAssertionsRequired$1.evaluate(TestRuleAssertionsRequired.java:53)
	at org.apache.lucene.util.TestRuleMarkFailure$1.evaluate(TestRuleMarkFailure.java:47)
	at org.apache.lucene.util.TestRuleIgnoreAfterMaxFailures$1.evaluate(TestRuleIgnoreAfterMaxFailures.java:64)
	at org.apache.lucene.util.TestRuleIgnoreTestSuites$1.evaluate(TestRuleIgnoreTestSuites.java:54)
	at com.carrotsearch.randomizedtesting.rules.StatementAdapter.evaluate(StatementAdapter.java:36)
	at com.carrotsearch.randomizedtesting.ThreadLeakControl$StatementRunner.run(ThreadLeakControl.java:367)
	at java.lang.Thread.run(Thread.java:745)


FAILED:  org.apache.solr.core.TestDynamicLoading.testDynamicLoading

Error Message:
Could not find collection:.system

Stack Trace:
java.lang.AssertionError: Could not find collection:.system
	at __randomizedtesting.SeedInfo.seed([F346093846C9D5F1:2B0B246FB1147051]:0)
	at org.junit.Assert.fail(Assert.java:93)
	at org.junit.Assert.assertTrue(Assert.java:43)
	at org.junit.Assert.assertNotNull(Assert.java:526)
	at org.apache.solr.cloud.AbstractDistribZkTestBase.waitForRecoveriesToFinish(AbstractDistribZkTestBase.java:154)
	at org.apache.solr.cloud.AbstractDistribZkTestBase.waitForRecoveriesToFinish(AbstractDistribZkTestBase.java:139)
	at org.apache.solr.cloud.AbstractDistribZkTestBase.waitForRecoveriesToFinish(AbstractDistribZkTestBase.java:134)
	at org.apache.solr.cloud.AbstractFullDistribZkTestBase.waitForRecoveriesToFinish(AbstractFullDistribZkTestBase.java:856)
	at org.apache.solr.core.TestDynamicLoading.testDynamicLoading(TestDynamicLoading.java:110)
	at sun.reflect.NativeMethodAccessorImpl.invoke0(Native Method)
	at sun.reflect.NativeMethodAccessorImpl.invoke(NativeMethodAccessorImpl.java:62)
	at sun.reflect.DelegatingMethodAccessorImpl.invoke(DelegatingMethodAccessorImpl.java:43)
	at java.lang.reflect.Method.invoke(Method.java:498)
	at com.carrotsearch.randomizedtesting.RandomizedRunner.invoke(RandomizedRunner.java:1764)
	at com.carrotsearch.randomizedtesting.RandomizedRunner$8.evaluate(RandomizedRunner.java:871)
	at com.carrotsearch.randomizedtesting.RandomizedRunner$9.evaluate(RandomizedRunner.java:907)
	at com.carrotsearch.randomizedtesting.RandomizedRunner$10.evaluate(RandomizedRunner.java:921)
	at org.apache.solr.BaseDistributedSearchTestCase$ShardsRepeatRule$ShardsFixedStatement.callStatement(BaseDistributedSearchTestCase.java:985)
	at org.apache.solr.BaseDistributedSearchTestCase$ShardsRepeatRule$ShardsStatement.evaluate(BaseDistributedSearchTestCase.java:960)
	at com.carrotsearch.randomizedtesting.rules.SystemPropertiesRestoreRule$1.evaluate(SystemPropertiesRestoreRule.java:57)
	at org.apache.lucene.util.TestRuleSetupTeardownChained$1.evaluate(TestRuleSetupTeardownChained.java:49)
	at org.apache.lucene.util.AbstractBeforeAfterRule$1.evaluate(AbstractBeforeAfterRule.java:45)
	at org.apache.lucene.util.TestRuleThreadAndTestName$1.evaluate(TestRuleThreadAndTestName.java:48)
	at org.apache.lucene.util.TestRuleIgnoreAfterMaxFailures$1.evaluate(TestRuleIgnoreAfterMaxFailures.java:64)
	at org.apache.lucene.util.TestRuleMarkFailure$1.evaluate(TestRuleMarkFailure.java:47)
	at com.carrotsearch.randomizedtesting.rules.StatementAdapter.evaluate(StatementAdapter.java:36)
	at com.carrotsearch.randomizedtesting.ThreadLeakControl$StatementRunner.run(ThreadLeakControl.java:367)
	at com.carrotsearch.randomizedtesting.ThreadLeakControl.forkTimeoutingTask(ThreadLeakControl.java:809)
	at com.carrotsearch.randomizedtesting.ThreadLeakControl$3.evaluate(ThreadLeakControl.java:460)
	at com.carrotsearch.randomizedtesting.RandomizedRunner.runSingleTest(RandomizedRunner.java:880)
	at com.carrotsearch.randomizedtesting.RandomizedRunner$5.evaluate(RandomizedRunner.java:781)
	at com.carrotsearch.randomizedtesting.RandomizedRunner$6.evaluate(RandomizedRunner.java:816)
	at com.carrotsearch.randomizedtesting.RandomizedRunner$7.evaluate(RandomizedRunner.java:827)
	at com.carrotsearch.randomizedtesting.rules.StatementAdapter.evaluate(StatementAdapter.java:36)
	at com.carrotsearch.randomizedtesting.rules.SystemPropertiesRestoreRule$1.evaluate(SystemPropertiesRestoreRule.java:57)
	at org.apache.lucene.util.AbstractBeforeAfterRule$1.evaluate(AbstractBeforeAfterRule.java:45)
	at com.carrotsearch.randomizedtesting.rules.StatementAdapter.evaluate(StatementAdapter.java:36)
	at org.apache.lucene.util.TestRuleStoreClassName$1.evaluate(TestRuleStoreClassName.java:41)
	at com.carrotsearch.randomizedtesting.rules.NoShadowingOrOverridesOnMethodsRule$1.evaluate(NoShadowingOrOverridesOnMethodsRule.java:40)
	at com.carrotsearch.randomizedtesting.rules.NoShadowingOrOverridesOnMethodsRule$1.evaluate(NoShadowingOrOverridesOnMethodsRule.java:40)
	at com.carrotsearch.randomizedtesting.rules.StatementAdapter.evaluate(StatementAdapter.java:36)
	at com.carrotsearch.randomizedtesting.rules.StatementAdapter.evaluate(StatementAdapter.java:36)
	at com.carrotsearch.randomizedtesting.rules.StatementAdapter.evaluate(StatementAdapter.java:36)
	at org.apache.lucene.util.TestRuleAssertionsRequired$1.evaluate(TestRuleAssertionsRequired.java:53)
	at org.apache.lucene.util.TestRuleMarkFailure$1.evaluate(TestRuleMarkFailure.java:47)
	at org.apache.lucene.util.TestRuleIgnoreAfterMaxFailures$1.evaluate(TestRuleIgnoreAfterMaxFailures.java:64)
	at org.apache.lucene.util.TestRuleIgnoreTestSuites$1.evaluate(TestRuleIgnoreTestSuites.java:54)
	at com.carrotsearch.randomizedtesting.rules.StatementAdapter.evaluate(StatementAdapter.java:36)
	at com.carrotsearch.randomizedtesting.ThreadLeakControl$StatementRunner.run(ThreadLeakControl.java:367)
	at java.lang.Thread.run(Thread.java:745)




Build Log:
[...truncated 10935 lines...]
   [junit4] Suite: org.apache.solr.core.TestDynamicLoading
   [junit4]   2> Creating dataDir: /x1/jenkins/jenkins-slave/workspace/Lucene-Solr-Tests-master/solr/build/solr-core/test/J2/temp/solr.core.TestDynamicLoading_F346093846C9D5F1-001/init-core-data-001
   [junit4]   2> 655044 INFO  (SUITE-TestDynamicLoading-seed#[F346093846C9D5F1]-worker) [    ] o.a.s.SolrTestCaseJ4 Randomized ssl (true) and clientAuth (false) via: @org.apache.solr.util.RandomizeSSL(reason=, value=NaN, ssl=NaN, clientAuth=NaN)
   [junit4]   2> 655044 INFO  (SUITE-TestDynamicLoading-seed#[F346093846C9D5F1]-worker) [    ] o.a.s.BaseDistributedSearchTestCase Setting hostContext system property: /
   [junit4]   2> 655074 INFO  (TEST-TestDynamicLoading.testDynamicLoading-seed#[F346093846C9D5F1]) [    ] o.a.s.c.ZkTestServer STARTING ZK TEST SERVER
   [junit4]   2> 655242 INFO  (Thread-1026) [    ] o.a.s.c.ZkTestServer client port:0.0.0.0/0.0.0.0:0
   [junit4]   2> 655242 INFO  (Thread-1026) [    ] o.a.s.c.ZkTestServer Starting server
   [junit4]   2> 655346 INFO  (TEST-TestDynamicLoading.testDynamicLoading-seed#[F346093846C9D5F1]) [    ] o.a.s.c.ZkTestServer start zk server on port:44919
   [junit4]   2> 655346 INFO  (TEST-TestDynamicLoading.testDynamicLoading-seed#[F346093846C9D5F1]) [    ] o.a.s.c.c.SolrZkClient Using default ZkCredentialsProvider
   [junit4]   2> 655359 INFO  (TEST-TestDynamicLoading.testDynamicLoading-seed#[F346093846C9D5F1]) [    ] o.a.s.c.c.ConnectionManager Waiting for client to connect to ZooKeeper
   [junit4]   2> 655378 INFO  (zkCallback-882-thread-1) [    ] o.a.s.c.c.ConnectionManager Watcher org.apache.solr.common.cloud.ConnectionManager@5e4f2191 name:ZooKeeperConnection Watcher:127.0.0.1:44919 got event WatchedEvent state:SyncConnected type:None path:null path:null type:None
   [junit4]   2> 655378 INFO  (TEST-TestDynamicLoading.testDynamicLoading-seed#[F346093846C9D5F1]) [    ] o.a.s.c.c.ConnectionManager Client is connected to ZooKeeper
   [junit4]   2> 655378 INFO  (TEST-TestDynamicLoading.testDynamicLoading-seed#[F346093846C9D5F1]) [    ] o.a.s.c.c.SolrZkClient Using default ZkACLProvider
   [junit4]   2> 655378 INFO  (TEST-TestDynamicLoading.testDynamicLoading-seed#[F346093846C9D5F1]) [    ] o.a.s.c.c.SolrZkClient makePath: /solr
   [junit4]   2> 655394 INFO  (TEST-TestDynamicLoading.testDynamicLoading-seed#[F346093846C9D5F1]) [    ] o.a.s.c.c.SolrZkClient Using default ZkCredentialsProvider
   [junit4]   2> 655396 INFO  (TEST-TestDynamicLoading.testDynamicLoading-seed#[F346093846C9D5F1]) [    ] o.a.s.c.c.ConnectionManager Waiting for client to connect to ZooKeeper
   [junit4]   2> 655403 INFO  (zkCallback-883-thread-1) [    ] o.a.s.c.c.ConnectionManager Watcher org.apache.solr.common.cloud.ConnectionManager@39dbd3ed name:ZooKeeperConnection Watcher:127.0.0.1:44919/solr got event WatchedEvent state:SyncConnected type:None path:null path:null type:None
   [junit4]   2> 655404 INFO  (TEST-TestDynamicLoading.testDynamicLoading-seed#[F346093846C9D5F1]) [    ] o.a.s.c.c.ConnectionManager Client is connected to ZooKeeper
   [junit4]   2> 655404 INFO  (TEST-TestDynamicLoading.testDynamicLoading-seed#[F346093846C9D5F1]) [    ] o.a.s.c.c.SolrZkClient Using default ZkACLProvider
   [junit4]   2> 655404 INFO  (TEST-TestDynamicLoading.testDynamicLoading-seed#[F346093846C9D5F1]) [    ] o.a.s.c.c.SolrZkClient makePath: /collections/collection1
   [junit4]   2> 655406 INFO  (TEST-TestDynamicLoading.testDynamicLoading-seed#[F346093846C9D5F1]) [    ] o.a.s.c.c.SolrZkClient makePath: /collections/collection1/shards
   [junit4]   2> 655407 INFO  (TEST-TestDynamicLoading.testDynamicLoading-seed#[F346093846C9D5F1]) [    ] o.a.s.c.c.SolrZkClient makePath: /collections/control_collection
   [junit4]   2> 655408 INFO  (TEST-TestDynamicLoading.testDynamicLoading-seed#[F346093846C9D5F1]) [    ] o.a.s.c.c.SolrZkClient makePath: /collections/control_collection/shards
   [junit4]   2> 655410 INFO  (TEST-TestDynamicLoading.testDynamicLoading-seed#[F346093846C9D5F1]) [    ] o.a.s.c.AbstractZkTestCase put /x1/jenkins/jenkins-slave/workspace/Lucene-Solr-Tests-master/solr/core/src/test-files/solr/collection1/conf/solrconfig-tlog.xml to /configs/conf1/solrconfig.xml
   [junit4]   2> 655410 INFO  (TEST-TestDynamicLoading.testDynamicLoading-seed#[F346093846C9D5F1]) [    ] o.a.s.c.c.SolrZkClient makePath: /configs/conf1/solrconfig.xml
   [junit4]   2> 655412 INFO  (TEST-TestDynamicLoading.testDynamicLoading-seed#[F346093846C9D5F1]) [    ] o.a.s.c.AbstractZkTestCase put /x1/jenkins/jenkins-slave/workspace/Lucene-Solr-Tests-master/solr/core/src/test-files/solr/collection1/conf/schema.xml to /configs/conf1/schema.xml
   [junit4]   2> 655412 INFO  (TEST-TestDynamicLoading.testDynamicLoading-seed#[F346093846C9D5F1]) [    ] o.a.s.c.c.SolrZkClient makePath: /configs/conf1/schema.xml
   [junit4]   2> 655414 INFO  (TEST-TestDynamicLoading.testDynamicLoading-seed#[F346093846C9D5F1]) [    ] o.a.s.c.AbstractZkTestCase put /x1/jenkins/jenkins-slave/workspace/Lucene-Solr-Tests-master/solr/core/src/test-files/solr/collection1/conf/solrconfig.snippet.randomindexconfig.xml to /configs/conf1/solrconfig.snippet.randomindexconfig.xml
   [junit4]   2> 655414 INFO  (TEST-TestDynamicLoading.testDynamicLoading-seed#[F346093846C9D5F1]) [    ] o.a.s.c.c.SolrZkClient makePath: /configs/conf1/solrconfig.snippet.randomindexconfig.xml
   [junit4]   2> 655416 INFO  (TEST-TestDynamicLoading.testDynamicLoading-seed#[F346093846C9D5F1]) [    ] o.a.s.c.AbstractZkTestCase put /x1/jenkins/jenkins-slave/workspace/Lucene-Solr-Tests-master/solr/core/src/test-files/solr/collection1/conf/stopwords.txt to /configs/conf1/stopwords.txt
   [junit4]   2> 655416 INFO  (TEST-TestDynamicLoading.testDynamicLoading-seed#[F346093846C9D5F1]) [    ] o.a.s.c.c.SolrZkClient makePath: /configs/conf1/stopwords.txt
   [junit4]   2> 655418 INFO  (TEST-TestDynamicLoading.testDynamicLoading-seed#[F346093846C9D5F1]) [    ] o.a.s.c.AbstractZkTestCase put /x1/jenkins/jenkins-slave/workspace/Lucene-Solr-Tests-master/solr/core/src/test-files/solr/collection1/conf/protwords.txt to /configs/conf1/protwords.txt
   [junit4]   2> 655418 INFO  (TEST-TestDynamicLoading.testDynamicLoading-seed#[F346093846C9D5F1]) [    ] o.a.s.c.c.SolrZkClient makePath: /configs/conf1/protwords.txt
   [junit4]   2> 655419 INFO  (TEST-TestDynamicLoading.testDynamicLoading-seed#[F346093846C9D5F1]) [    ] o.a.s.c.AbstractZkTestCase put /x1/jenkins/jenkins-slave/workspace/Lucene-Solr-Tests-master/solr/core/src/test-files/solr/collection1/conf/currency.xml to /configs/conf1/currency.xml
   [junit4]   2> 655419 INFO  (TEST-TestDynamicLoading.testDynamicLoading-seed#[F346093846C9D5F1]) [    ] o.a.s.c.c.SolrZkClient makePath: /configs/conf1/currency.xml
   [junit4]   2> 655421 INFO  (TEST-TestDynamicLoading.testDynamicLoading-seed#[F346093846C9D5F1]) [    ] o.a.s.c.AbstractZkTestCase put /x1/jenkins/jenkins-slave/workspace/Lucene-Solr-Tests-master/solr/core/src/test-files/solr/collection1/conf/enumsConfig.xml to /configs/conf1/enumsConfig.xml
   [junit4]   2> 655421 INFO  (TEST-TestDynamicLoading.testDynamicLoading-seed#[F346093846C9D5F1]) [    ] o.a.s.c.c.SolrZkClient makePath: /configs/conf1/enumsConfig.xml
   [junit4]   2> 655423 INFO  (TEST-TestDynamicLoading.testDynamicLoading-seed#[F346093846C9D5F1]) [    ] o.a.s.c.AbstractZkTestCase put /x1/jenkins/jenkins-slave/workspace/Lucene-Solr-Tests-master/solr/core/src/test-files/solr/collection1/conf/open-exchange-rates.json to /configs/conf1/open-exchange-rates.json
   [junit4]   2> 655423 INFO  (TEST-TestDynamicLoading.testDynamicLoading-seed#[F346093846C9D5F1]) [    ] o.a.s.c.c.SolrZkClient makePath: /configs/conf1/open-exchange-rates.json
   [junit4]   2> 655424 INFO  (TEST-TestDynamicLoading.testDynamicLoading-seed#[F346093846C9D5F1]) [    ] o.a.s.c.AbstractZkTestCase put /x1/jenkins/jenkins-slave/workspace/Lucene-Solr-Tests-master/solr/core/src/test-files/solr/collection1/conf/mapping-ISOLatin1Accent.txt to /configs/conf1/mapping-ISOLatin1Accent.txt
   [junit4]   2> 655425 INFO  (TEST-TestDynamicLoading.testDynamicLoading-seed#[F346093846C9D5F1]) [    ] o.a.s.c.c.SolrZkClient makePath: /configs/conf1/mapping-ISOLatin1Accent.txt
   [junit4]   2> 655426 INFO  (TEST-TestDynamicLoading.testDynamicLoading-seed#[F346093846C9D5F1]) [    ] o.a.s.c.AbstractZkTestCase put /x1/jenkins/jenkins-slave/workspace/Lucene-Solr-Tests-master/solr/core/src/test-files/solr/collection1/conf/old_synonyms.txt to /configs/conf1/old_synonyms.txt
   [junit4]   2> 655426 INFO  (TEST-TestDynamicLoading.testDynamicLoading-seed#[F346093846C9D5F1]) [    ] o.a.s.c.c.SolrZkClient makePath: /configs/conf1/old_synonyms.txt
   [junit4]   2> 655428 INFO  (TEST-TestDynamicLoading.testDynamicLoading-seed#[F346093846C9D5F1]) [    ] o.a.s.c.AbstractZkTestCase put /x1/jenkins/jenkins-slave/workspace/Lucene-Solr-Tests-master/solr/core/src/test-files/solr/collection1/conf/synonyms.txt to /configs/conf1/synonyms.txt
   [junit4]   2> 655428 INFO  (TEST-TestDynamicLoading.testDynamicLoading-seed#[F346093846C9D5F1]) [    ] o.a.s.c.c.SolrZkClient makePath: /configs/conf1/synonyms.txt
   [junit4]   2> 655431 INFO  (TEST-TestDynamicLoading.testDynamicLoading-seed#[F346093846C9D5F1]) [    ] o.a.s.c.c.SolrZkClient Using default ZkCredentialsProvider
   [junit4]   2> 655441 INFO  (TEST-TestDynamicLoading.testDynamicLoading-seed#[F346093846C9D5F1]) [    ] o.a.s.c.c.ConnectionManager Waiting for client to connect to ZooKeeper
   [junit4]   2> 655464 INFO  (zkCallback-885-thread-1) [    ] o.a.s.c.c.ConnectionManager Watcher org.apache.solr.common.cloud.ConnectionManager@40b38a2b name:ZooKeeperConnection Watcher:127.0.0.1:44919/solr got event WatchedEvent state:SyncConnected type:None path:null path:null type:None
   [junit4]   2> 655465 INFO  (TEST-TestDynamicLoading.testDynamicLoading-seed#[F346093846C9D5F1]) [    ] o.a.s.c.c.ConnectionManager Client is connected to ZooKeeper
   [junit4]   2> 655465 INFO  (TEST-TestDynamicLoading.testDynamicLoading-seed#[F346093846C9D5F1]) [    ] o.a.s.c.c.SolrZkClient Using default ZkACLProvider
   [junit4]   2> 656207 INFO  (TEST-TestDynamicLoading.testDynamicLoading-seed#[F346093846C9D5F1]) [    ] o.a.s.SolrTestCaseJ4 Writing core.properties file to /x1/jenkins/jenkins-slave/workspace/Lucene-Solr-Tests-master/solr/build/solr-core/test/J2/temp/solr.core.TestDynamicLoading_F346093846C9D5F1-001/control-001/cores/collection1
   [junit4]   2> 656244 INFO  (TEST-TestDynamicLoading.testDynamicLoading-seed#[F346093846C9D5F1]) [    ] o.e.j.s.Server jetty-9.3.8.v20160314
   [junit4]   2> 656247 INFO  (TEST-TestDynamicLoading.testDynamicLoading-seed#[F346093846C9D5F1]) [    ] o.e.j.s.h.ContextHandler Started o.e.j.s.ServletContextHandler@367455a1{/,null,AVAILABLE}
   [junit4]   2> 656250 INFO  (TEST-TestDynamicLoading.testDynamicLoading-seed#[F346093846C9D5F1]) [    ] o.e.j.s.ServerConnector Started ServerConnector@6ef04341{SSL,[ssl, http/1.1]}{127.0.0.1:50584}
   [junit4]   2> 656250 INFO  (TEST-TestDynamicLoading.testDynamicLoading-seed#[F346093846C9D5F1]) [    ] o.e.j.s.Server Started @663690ms
   [junit4]   2> 656250 INFO  (TEST-TestDynamicLoading.testDynamicLoading-seed#[F346093846C9D5F1]) [    ] o.a.s.c.s.e.JettySolrRunner Jetty properties: {solr.data.dir=/x1/jenkins/jenkins-slave/workspace/Lucene-Solr-Tests-master/solr/build/solr-core/test/J2/temp/solr.core.TestDynamicLoading_F346093846C9D5F1-001/tempDir-001/control/data, hostContext=/, hostPort=50584, coreRootDirectory=/x1/jenkins/jenkins-slave/workspace/Lucene-Solr-Tests-master/solr/build/solr-core/test/J2/temp/solr.core.TestDynamicLoading_F346093846C9D5F1-001/control-001/cores}
   [junit4]   2> 656255 INFO  (TEST-TestDynamicLoading.testDynamicLoading-seed#[F346093846C9D5F1]) [    ] o.a.s.s.SolrDispatchFilter SolrDispatchFilter.init(): sun.misc.Launcher$AppClassLoader@73d16e93
   [junit4]   2> 656255 INFO  (TEST-TestDynamicLoading.testDynamicLoading-seed#[F346093846C9D5F1]) [    ] o.a.s.c.SolrResourceLoader new SolrResourceLoader for directory: '/x1/jenkins/jenkins-slave/workspace/Lucene-Solr-Tests-master/solr/build/solr-core/test/J2/temp/solr.core.TestDynamicLoading_F346093846C9D5F1-001/control-001'
   [junit4]   2> 656255 INFO  (TEST-TestDynamicLoading.testDynamicLoading-seed#[F346093846C9D5F1]) [    ] o.a.s.c.SolrResourceLoader JNDI not configured for solr (NoInitialContextEx)
   [junit4]   2> 656255 INFO  (TEST-TestDynamicLoading.testDynamicLoading-seed#[F346093846C9D5F1]) [    ] o.a.s.c.SolrResourceLoader solr home defaulted to 'solr/' (could not find system property or JNDI)
   [junit4]   2> 656255 INFO  (TEST-TestDynamicLoading.testDynamicLoading-seed#[F346093846C9D5F1]) [    ] o.a.s.c.c.SolrZkClient Using default ZkCredentialsProvider
   [junit4]   2> 656283 INFO  (TEST-TestDynamicLoading.testDynamicLoading-seed#[F346093846C9D5F1]) [    ] o.a.s.c.c.ConnectionManager Waiting for client to connect to ZooKeeper
   [junit4]   2> 656306 INFO  (zkCallback-886-thread-1) [    ] o.a.s.c.c.ConnectionManager Watcher org.apache.solr.common.cloud.ConnectionManager@26c5ac5d name:ZooKeeperConnection Watcher:127.0.0.1:44919/solr got event WatchedEvent state:SyncConnected type:None path:null path:null type:None
   [junit4]   2> 656306 INFO  (TEST-TestDynamicLoading.testDynamicLoading-seed#[F346093846C9D5F1]) [    ] o.a.s.c.c.ConnectionManager Client is connected to ZooKeeper
   [junit4]   2> 656307 INFO  (TEST-TestDynamicLoading.testDynamicLoading-seed#[F346093846C9D5F1]) [    ] o.a.s.c.c.SolrZkClient Using default ZkACLProvider
   [junit4]   2> 656308 INFO  (TEST-TestDynamicLoading.testDynamicLoading-seed#[F346093846C9D5F1]) [    ] o.a.s.s.SolrDispatchFilter Loading solr.xml from SolrHome (not found in ZooKeeper)
   [junit4]   2> 656309 INFO  (TEST-TestDynamicLoading.testDynamicLoading-seed#[F346093846C9D5F1]) [    ] o.a.s.c.SolrXmlConfig Loading container configuration from /x1/jenkins/jenkins-slave/workspace/Lucene-Solr-Tests-master/solr/build/solr-core/test/J2/temp/solr.core.TestDynamicLoading_F346093846C9D5F1-001/control-001/solr.xml
   [junit4]   2> 656320 INFO  (TEST-TestDynamicLoading.testDynamicLoading-seed#[F346093846C9D5F1]) [    ] o.a.s.c.CorePropertiesLocator Config-defined core root directory: /x1/jenkins/jenkins-slave/workspace/Lucene-Solr-Tests-master/solr/build/solr-core/test/J2/temp/solr.core.TestDynamicLoading_F346093846C9D5F1-001/control-001/cores
   [junit4]   2> 656320 INFO  (TEST-TestDynamicLoading.testDynamicLoading-seed#[F346093846C9D5F1]) [    ] o.a.s.c.CoreContainer New CoreContainer 1719662412
   [junit4]   2> 656320 INFO  (TEST-TestDynamicLoading.testDynamicLoading-seed#[F346093846C9D5F1]) [    ] o.a.s.c.CoreContainer Loading cores into CoreContainer [instanceDir=/x1/jenkins/jenkins-slave/workspace/Lucene-Solr-Tests-master/solr/build/solr-core/test/J2/temp/solr.core.TestDynamicLoading_F346093846C9D5F1-001/control-001]
   [junit4]   2> 656320 WARN  (TEST-TestDynamicLoading.testDynamicLoading-seed#[F346093846C9D5F1]) [    ] o.a.s.c.CoreContainer Couldn't add files from /x1/jenkins/jenkins-slave/workspace/Lucene-Solr-Tests-master/solr/build/solr-core/test/J2/temp/solr.core.TestDynamicLoading_F346093846C9D5F1-001/control-001/lib to classpath: /x1/jenkins/jenkins-slave/workspace/Lucene-Solr-Tests-master/solr/build/solr-core/test/J2/temp/solr.core.TestDynamicLoading_F346093846C9D5F1-001/control-001/lib
   [junit4]   2> 656323 INFO  (TEST-TestDynamicLoading.testDynamicLoading-seed#[F346093846C9D5F1]) [    ] o.a.s.h.c.HttpShardHandlerFactory created with socketTimeout : 90000,urlScheme : ,connTimeout : 15000,maxConnectionsPerHost : 20,maxConnections : 10000,corePoolSize : 0,maximumPoolSize : 2147483647,maxThreadIdleTime : 5,sizeOfQueue : -1,fairnessPolicy : false,
   [junit4]   2> 656379 INFO  (TEST-TestDynamicLoading.testDynamicLoading-seed#[F346093846C9D5F1]) [    ] o.a.s.u.UpdateShardHandler Created UpdateShardHandler HTTP client with params: socketTimeout=340000&connTimeout=45000&maxConnections=100000&maxConnectionsPerHost=100000
   [junit4]   2> 656379 INFO  (TEST-TestDynamicLoading.testDynamicLoading-seed#[F346093846C9D5F1]) [    ] o.a.s.l.LogWatcher SLF4J impl is org.slf4j.impl.Log4jLoggerFactory
   [junit4]   2> 656379 INFO  (TEST-TestDynamicLoading.testDynamicLoading-seed#[F346093846C9D5F1]) [    ] o.a.s.l.LogWatcher Registering Log Listener [Log4j (org.slf4j.impl.Log4jLoggerFactory)]
   [junit4]   2> 656379 INFO  (TEST-TestDynamicLoading.testDynamicLoading-seed#[F346093846C9D5F1]) [    ] o.a.s.c.ZkContainer Zookeeper client=127.0.0.1:44919/solr
   [junit4]   2> 656379 INFO  (TEST-TestDynamicLoading.testDynamicLoading-seed#[F346093846C9D5F1]) [    ] o.a.s.c.ZkController zkHost includes chroot
   [junit4]   2> 656379 INFO  (TEST-TestDynamicLoading.testDynamicLoading-seed#[F346093846C9D5F1]) [    ] o.a.s.c.c.SolrZkClient Using default ZkCredentialsProvider
   [junit4]   2> 656422 INFO  (TEST-TestDynamicLoading.testDynamicLoading-seed#[F346093846C9D5F1]) [    ] o.a.s.c.c.ConnectionManager Waiting for client to connect to ZooKeeper
   [junit4]   2> 656423 INFO  (zkCallback-889-thread-1) [    ] o.a.s.c.c.ConnectionManager Watcher org.apache.solr.common.cloud.ConnectionManager@480ab6ac name:ZooKeeperConnection Watcher:127.0.0.1:44919 got event WatchedEvent state:SyncConnected type:None path:null path:null type:None
   [junit4]   2> 656442 INFO  (TEST-TestDynamicLoading.testDynamicLoading-seed#[F346093846C9D5F1]) [    ] o.a.s.c.c.ConnectionManager Client is connected to ZooKeeper
   [junit4]   2> 656443 INFO  (TEST-TestDynamicLoading.testDynamicLoading-seed#[F346093846C9D5F1]) [    ] o.a.s.c.c.SolrZkClient Using default ZkACLProvider
   [junit4]   2> 656444 INFO  (TEST-TestDynamicLoading.testDynamicLoading-seed#[F346093846C9D5F1]) [n:127.0.0.1:50584_    ] o.a.s.c.ZkController Added new OnReconnect listener org.apache.solr.cloud.ZkController$$Lambda$12/498199007@5bab9aa3
   [junit4]   2> 656465 INFO  (TEST-TestDynamicLoading.testDynamicLoading-seed#[F346093846C9D5F1]) [n:127.0.0.1:50584_    ] o.a.s.c.c.ConnectionManager Waiting for client to connect to ZooKeeper
   [junit4]   2> 656498 INFO  (zkCallback-890-thread-1-processing-n:127.0.0.1:50584_) [n:127.0.0.1:50584_    ] o.a.s.c.c.ConnectionManager Watcher org.apache.solr.common.cloud.ConnectionManager@728dad57 name:ZooKeeperConnection Watcher:127.0.0.1:44919/solr got event WatchedEvent state:SyncConnected type:None path:null path:null type:None
   [junit4]   2> 656498 INFO  (TEST-TestDynamicLoading.testDynamicLoading-seed#[F346093846C9D5F1]) [n:127.0.0.1:50584_    ] o.a.s.c.c.ConnectionManager Client is connected to ZooKeeper
   [junit4]   2> 656502 INFO  (TEST-TestDynamicLoading.testDynamicLoading-seed#[F346093846C9D5F1]) [n:127.0.0.1:50584_    ] o.a.s.c.c.SolrZkClient makePath: /overseer/queue
   [junit4]   2> 656504 INFO  (TEST-TestDynamicLoading.testDynamicLoading-seed#[F346093846C9D5F1]) [n:127.0.0.1:50584_    ] o.a.s.c.c.SolrZkClient makePath: /overseer/collection-queue-work
   [junit4]   2> 656509 INFO  (TEST-TestDynamicLoading.testDynamicLoading-seed#[F346093846C9D5F1]) [n:127.0.0.1:50584_    ] o.a.s.c.c.SolrZkClient makePath: /overseer/collection-map-running
   [junit4]   2> 656519 INFO  (TEST-TestDynamicLoading.testDynamicLoading-seed#[F346093846C9D5F1]) [n:127.0.0.1:50584_    ] o.a.s.c.c.SolrZkClient makePath: /overseer/collection-map-completed
   [junit4]   2> 656522 INFO  (TEST-TestDynamicLoading.testDynamicLoading-seed#[F346093846C9D5F1]) [n:127.0.0.1:50584_    ] o.a.s.c.c.SolrZkClient makePath: /overseer/collection-map-failure
   [junit4]   2> 656524 INFO  (TEST-TestDynamicLoading.testDynamicLoading-seed#[F346093846C9D5F1]) [n:127.0.0.1:50584_    ] o.a.s.c.c.SolrZkClient makePath: /live_nodes
   [junit4]   2> 656526 INFO  (TEST-TestDynamicLoading.testDynamicLoading-seed#[F346093846C9D5F1]) [n:127.0.0.1:50584_    ] o.a.s.c.c.SolrZkClient makePath: /aliases.json
   [junit4]   2> 656530 INFO  (TEST-TestDynamicLoading.testDynamicLoading-seed#[F346093846C9D5F1]) [n:127.0.0.1:50584_    ] o.a.s.c.c.SolrZkClient makePath: /clusterstate.json
   [junit4]   2> 656547 INFO  (TEST-TestDynamicLoading.testDynamicLoading-seed#[F346093846C9D5F1]) [n:127.0.0.1:50584_    ] o.a.s.c.c.SolrZkClient makePath: /security.json
   [junit4]   2> 656622 INFO  (TEST-TestDynamicLoading.testDynamicLoading-seed#[F346093846C9D5F1]) [n:127.0.0.1:50584_    ] o.a.s.c.c.ZkStateReader Updating cluster state from ZooKeeper... 
   [junit4]   2> 656626 INFO  (TEST-TestDynamicLoading.testDynamicLoading-seed#[F346093846C9D5F1]) [n:127.0.0.1:50584_    ] o.a.s.c.c.ZkStateReader Loaded cluster properties: {urlScheme=https}
   [junit4]   2> 656626 INFO  (TEST-TestDynamicLoading.testDynamicLoading-seed#[F346093846C9D5F1]) [n:127.0.0.1:50584_    ] o.a.s.c.c.ZkStateReader Updated live nodes from ZooKeeper... (0) -> (0)
   [junit4]   2> 656635 INFO  (TEST-TestDynamicLoading.testDynamicLoading-seed#[F346093846C9D5F1]) [n:127.0.0.1:50584_    ] o.a.s.c.c.SolrZkClient makePath: /overseer_elect
   [junit4]   2> 656636 INFO  (TEST-TestDynamicLoading.testDynamicLoading-seed#[F346093846C9D5F1]) [n:127.0.0.1:50584_    ] o.a.s.c.c.SolrZkClient makePath: /overseer_elect/election
   [junit4]   2> 656637 INFO  (TEST-TestDynamicLoading.testDynamicLoading-seed#[F346093846C9D5F1]) [n:127.0.0.1:50584_    ] o.a.s.c.Overseer Overseer (id=null) closing
   [junit4]   2> 656637 INFO  (TEST-TestDynamicLoading.testDynamicLoading-seed#[F346093846C9D5F1]) [n:127.0.0.1:50584_    ] o.a.s.c.LeaderElector Joined leadership election with path: /overseer_elect/election/96576334255947781-127.0.0.1:50584_-n_0000000000
   [junit4]   2> 656637 INFO  (TEST-TestDynamicLoading.testDynamicLoading-seed#[F346093846C9D5F1]) [n:127.0.0.1:50584_    ] o.a.s.c.OverseerElectionContext I am going to be the leader 127.0.0.1:50584_
   [junit4]   2> 656637 INFO  (TEST-TestDynamicLoading.testDynamicLoading-seed#[F346093846C9D5F1]) [n:127.0.0.1:50584_    ] o.a.s.c.c.SolrZkClient makePath: /overseer_elect/leader
   [junit4]   2> 656638 INFO  (TEST-TestDynamicLoading.testDynamicLoading-seed#[F346093846C9D5F1]) [n:127.0.0.1:50584_    ] o.a.s.c.Overseer Overseer (id=96576334255947781-127.0.0.1:50584_-n_0000000000) starting
   [junit4]   2> 656640 INFO  (TEST-TestDynamicLoading.testDynamicLoading-seed#[F346093846C9D5F1]) [n:127.0.0.1:50584_    ] o.a.s.c.c.SolrZkClient makePath: /overseer/queue-work
   [junit4]   2> 656650 INFO  (TEST-TestDynamicLoading.testDynamicLoading-seed#[F346093846C9D5F1]) [n:127.0.0.1:50584_    ] o.a.s.c.OverseerAutoReplicaFailoverThread Starting OverseerAutoReplicaFailoverThread autoReplicaFailoverWorkLoopDelay=10000 autoReplicaFailoverWaitAfterExpiration=10000 autoReplicaFailoverBadNodeExpiration=60000
   [junit4]   2> 656674 INFO  (OverseerStateUpdate-96576334255947781-127.0.0.1:50584_-n_0000000000) [n:127.0.0.1:50584_    ] o.a.s.c.Overseer Starting to work on the main queue
   [junit4]   2> 656675 INFO  (OverseerCollectionConfigSetProcessor-96576334255947781-127.0.0.1:50584_-n_0000000000) [n:127.0.0.1:50584_    ] o.a.s.c.OverseerTaskProcessor Process current queue of overseer operations
   [junit4]   2> 656691 INFO  (TEST-TestDynamicLoading.testDynamicLoading-seed#[F346093846C9D5F1]) [n:127.0.0.1:50584_    ] o.a.s.c.ZkController Register node as live in ZooKeeper:/live_nodes/127.0.0.1:50584_
   [junit4]   2> 656691 INFO  (TEST-TestDynamicLoading.testDynamicLoading-seed#[F346093846C9D5F1]) [n:127.0.0.1:50584_    ] o.a.s.c.c.SolrZkClient makePath: /live_nodes/127.0.0.1:50584_
   [junit4]   2> 656692 INFO  (OverseerStateUpdate-96576334255947781-127.0.0.1:50584_-n_0000000000) [n:127.0.0.1:50584_    ] o.a.s.c.c.ZkStateReader Updated live nodes from ZooKeeper... (0) -> (0)
   [junit4]   2> 656693 INFO  (zkCallback-890-thread-1-processing-n:127.0.0.1:50584_) [n:127.0.0.1:50584_    ] o.a.s.c.c.ZkStateReader A live node change: [WatchedEvent state:SyncConnected type:NodeChildrenChanged path:/live_nodes], has occurred - updating... (live nodes size: [0])
   [junit4]   2> 656694 INFO  (zkCallback-890-thread-1-processing-n:127.0.0.1:50584_) [n:127.0.0.1:50584_    ] o.a.s.c.c.ZkStateReader Updated live nodes from ZooKeeper... (0) -> (1)
   [junit4]   2> 656705 INFO  (TEST-TestDynamicLoading.testDynamicLoading-seed#[F346093846C9D5F1]) [n:127.0.0.1:50584_    ] o.a.s.c.CoreContainer Security conf doesn't exist. Skipping setup for authorization module.
   [junit4]   2> 656705 INFO  (TEST-TestDynamicLoading.testDynamicLoading-seed#[F346093846C9D5F1]) [n:127.0.0.1:50584_    ] o.a.s.c.CoreContainer No authentication plugin used.
   [junit4]   2> 656718 INFO  (TEST-TestDynamicLoading.testDynamicLoading-seed#[F346093846C9D5F1]) [n:127.0.0.1:50584_    ] o.a.s.c.CorePropertiesLocator Looking for core definitions underneath /x1/jenkins/jenkins-slave/workspace/Lucene-Solr-Tests-master/solr/build/solr-core/test/J2/temp/solr.core.TestDynamicLoading_F346093846C9D5F1-001/control-001/cores
   [junit4]   2> 656719 INFO  (TEST-TestDynamicLoading.testDynamicLoading-seed#[F346093846C9D5F1]) [n:127.0.0.1:50584_    ] o.a.s.c.CoreDescriptor Created CoreDescriptor: {name=collection1, config=solrconfig.xml, transient=false, schema=schema.xml, loadOnStartup=true, configSetProperties=configsetprops.json, collection=control_collection, coreNodeName=, dataDir=data/, shard=}
   [junit4]   2> 656719 INFO  (TEST-TestDynamicLoading.testDynamicLoading-seed#[F346093846C9D5F1]) [n:127.0.0.1:50584_    ] o.a.s.c.CorePropertiesLocator Found core collection1 in /x1/jenkins/jenkins-slave/workspace/Lucene-Solr-Tests-master/solr/build/solr-core/test/J2/temp/solr.core.TestDynamicLoading_F346093846C9D5F1-001/control-001/cores/collection1
   [junit4]   2> 656719 INFO  (TEST-TestDynamicLoading.testDynamicLoading-seed#[F346093846C9D5F1]) [n:127.0.0.1:50584_    ] o.a.s.c.CorePropertiesLocator Found 1 core definitions
   [junit4]   2> 656742 INFO  (coreLoadExecutor-2019-thread-1-processing-n:127.0.0.1:50584_) [n:127.0.0.1:50584_ c:control_collection   x:collection1] o.a.s.c.ZkController publishing state=down
   [junit4]   2> 656742 INFO  (coreLoadExecutor-2019-thread-1-processing-n:127.0.0.1:50584_) [n:127.0.0.1:50584_ c:control_collection   x:collection1] o.a.s.c.ZkController numShards not found on descriptor - reading it from system property
   [junit4]   2> 656743 INFO  (coreLoadExecutor-2019-thread-1-processing-n:127.0.0.1:50584_) [n:127.0.0.1:50584_ c:control_collection   x:collection1] o.a.s.c.ZkController Collection control_collection not visible yet, but flagging it so a watch is registered when it becomes visible
   [junit4]   2> 656744 INFO  (coreLoadExecutor-2019-thread-1-processing-n:127.0.0.1:50584_) [n:127.0.0.1:50584_ c:control_collection   x:collection1] o.a.s.c.c.ZkStateReader Deleting data for [control_collection]
   [junit4]   2> 656745 INFO  (TEST-TestDynamicLoading.testDynamicLoading-seed#[F346093846C9D5F1]) [n:127.0.0.1:50584_    ] o.a.s.s.SolrDispatchFilter user.dir=/x1/jenkins/jenkins-slave/workspace/Lucene-Solr-Tests-master/solr/build/solr-core/test/J2
   [junit4]   2> 656745 INFO  (TEST-TestDynamicLoading.testDynamicLoading-seed#[F346093846C9D5F1]) [n:127.0.0.1:50584_    ] o.a.s.s.SolrDispatchFilter SolrDispatchFilter.init() done
   [junit4]   2> 656745 INFO  (OverseerStateUpdate-96576334255947781-127.0.0.1:50584_-n_0000000000) [n:127.0.0.1:50584_    ] o.a.s.c.Overseer processMessage: queueSize: 1, message = {
   [junit4]   2>   "core":"collection1",
   [junit4]   2>   "roles":null,
   [junit4]   2>   "base_url":"https://127.0.0.1:50584",
   [junit4]   2>   "node_name":"127.0.0.1:50584_",
   [junit4]   2>   "numShards":"1",
   [junit4]   2>   "state":"down",
   [junit4]   2>   "shard":null,
   [junit4]   2>   "collection":"control_collection",
   [junit4]   2>   "operation":"state"} current state version: 0
   [junit4]   2> 656745 INFO  (OverseerStateUpdate-96576334255947781-127.0.0.1:50584_-n_0000000000) [n:127.0.0.1:50584_    ] o.a.s.c.o.ReplicaMutator Update state numShards=1 message={
   [junit4]   2>   "core":"collection1",
   [junit4]   2>   "roles":null,
   [junit4]   2>   "base_url":"https://127.0.0.1:50584",
   [junit4]   2>   "node_name":"127.0.0.1:50584_",
   [junit4]   2>   "numShards":"1",
   [junit4]   2>   "state":"down",
   [junit4]   2>   "shard":null,
   [junit4]   2>   "collection":"control_collection",
   [junit4]   2>   "operation":"state"}
   [junit4]   2> 656745 INFO  (OverseerStateUpdate-96576334255947781-127.0.0.1:50584_-n_0000000000) [n:127.0.0.1:50584_    ] o.a.s.c.o.ClusterStateMutator building a new cName: control_collection
   [junit4]   2> 656746 INFO  (OverseerStateUpdate-96576334255947781-127.0.0.1:50584_-n_0000000000) [n:127.0.0.1:50584_    ] o.a.s.c.o.ReplicaMutator Assigning new node to shard shard=shard1
   [junit4]   2> 656747 INFO  (zkCallback-890-thread-1-processing-n:127.0.0.1:50584_) [n:127.0.0.1:50584_    ] o.a.s.c.c.ZkStateReader A cluster state change: [WatchedEvent state:SyncConnected type:NodeDataChanged path:/clusterstate.json], has occurred - updating... (live nodes size: [1])
   [junit4]   2> 656763 INFO  (coreLoadExecutor-2019-thread-1-processing-n:127.0.0.1:50584_) [n:127.0.0.1:50584_ c:control_collection   x:collection1] o.a.s.c.ZkController look for our core node name
   [junit4]   2> 656763 INFO  (coreLoadExecutor-2019-thread-1-processing-n:127.0.0.1:50584_) [n:127.0.0.1:50584_ c:control_collection   x:collection1] o.a.s.c.ZkController waiting to find shard id in clusterstate for collection1
   [junit4]   2> 656763 INFO  (coreLoadExecutor-2019-thread-1-processing-n:127.0.0.1:50584_) [n:127.0.0.1:50584_ c:control_collection   x:collection1] o.a.s.c.ZkController Check for collection zkNode:control_collection
   [junit4]   2> 656763 INFO  (coreLoadExecutor-2019-thread-1-processing-n:127.0.0.1:50584_) [n:127.0.0.1:50584_ c:control_collection   x:collection1] o.a.s.c.ZkController Collection zkNode exists
   [junit4]   2> 656763 INFO  (coreLoadExecutor-2019-thread-1-processing-n:127.0.0.1:50584_) [n:127.0.0.1:50584_ c:control_collection   x:collection1] o.a.s.c.c.ZkStateReader Load collection config from: [/collections/control_collection]
   [junit4]   2> 656764 INFO  (coreLoadExecutor-2019-thread-1-processing-n:127.0.0.1:50584_) [n:127.0.0.1:50584_ c:control_collection   x:collection1] o.a.s.c.c.ZkStateReader path=[/collections/control_collection] [configName]=[conf1] specified config exists in ZooKeeper
   [junit4]   2> 656764 INFO  (coreLoadExecutor-2019-thread-1-processing-n:127.0.0.1:50584_) [n:127.0.0.1:50584_ c:control_collection   x:collection1] o.a.s.c.SolrResourceLoader new SolrResourceLoader for directory: '/x1/jenkins/jenkins-slave/workspace/Lucene-Solr-Tests-master/solr/build/solr-core/test/J2/temp/solr.core.TestDynamicLoading_F346093846C9D5F1-001/control-001/cores/collection1'
   [junit4]   2> 656764 INFO  (coreLoadExecutor-2019-thread-1-processing-n:127.0.0.1:50584_) [n:127.0.0.1:50584_ c:control_collection   x:collection1] o.a.s.c.SolrResourceLoader JNDI not configured for solr (NoInitialContextEx)
   [junit4]   2> 656764 INFO  (coreLoadExecutor-2019-thread-1-processing-n:127.0.0.1:50584_) [n:127.0.0.1:50584_ c:control_collection   x:collection1] o.a.s.c.SolrResourceLoader solr home defaulted to 'solr/' (could not find system property or JNDI)
   [junit4]   2> 656765 INFO  (coreLoadExecutor-2019-thread-1-processing-n:127.0.0.1:50584_) [n:127.0.0.1:50584_ c:control_collection   x:collection1] o.a.s.c.Config loaded config solrconfig.xml with version 0 
   [junit4]   2> 656794 INFO  (coreLoadExecutor-2019-thread-1-processing-n:127.0.0.1:50584_) [n:127.0.0.1:50584_ c:control_collection   x:collection1] o.a.s.c.SolrConfig current version of requestparams : -1
   [junit4]   2> 656797 WARN  (coreLoadExecutor-2019-thread-1-processing-n:127.0.0.1:50584_) [n:127.0.0.1:50584_ c:control_collection   x:collection1] o.a.s.c.Config Beginning with Solr 5.5, <mergePolicy> is deprecated, use <mergePolicyFactory> instead.
   [junit4]   2> 656798 INFO  (coreLoadExecutor-2019-thread-1-processing-n:127.0.0.1:50584_) [n:127.0.0.1:50584_ c:control_collection   x:collection1] o.a.s.c.SolrConfig Using Lucene MatchVersion: 7.0.0
   [junit4]   2> 656819 INFO  (coreLoadExecutor-2019-thread-1-processing-n:127.0.0.1:50584_) [n:127.0.0.1:50584_ c:control_collection   x:collection1] o.a.s.c.SolrConfig Loaded SolrConfig: solrconfig.xml
   [junit4]   2> 656838 INFO  (coreLoadExecutor-2019-thread-1-processing-n:127.0.0.1:50584_) [n:127.0.0.1:50584_ c:control_collection   x:collection1] o.a.s.s.IndexSchema [collection1] Schema name=test
   [junit4]   2> 657340 INFO  (coreLoadExecutor-2019-thread-1-processing-n:127.0.0.1:50584_) [n:127.0.0.1:50584_ c:control_collection   x:collection1] o.a.s.s.OpenExchangeRatesOrgProvider Initialized with rates=open-exchange-rates.json, refreshInterval=1440.
   [junit4]   2> 657370 INFO  (coreLoadExecutor-2019-thread-1-processing-n:127.0.0.1:50584_) [n:127.0.0.1:50584_ c:control_collection   x:collection1] o.a.s.s.IndexSchema default search field in schema is text
   [junit4]   2> 657371 INFO  (coreLoadExecutor-2019-thread-1-processing-n:127.0.0.1:50584_) [n:127.0.0.1:50584_ c:control_collection   x:collection1] o.a.s.s.IndexSchema unique key field: id
   [junit4]   2> 657426 INFO  (coreLoadExecutor-2019-thread-1-processing-n:127.0.0.1:50584_) [n:127.0.0.1:50584_ c:control_collection   x:collection1] o.a.s.s.FileExchangeRateProvider Reloading exchange rates from file currency.xml
   [junit4]   2> 657430 INFO  (coreLoadExecutor-2019-thread-1-processing-n:127.0.0.1:50584_) [n:127.0.0.1:50584_ c:control_collection   x:collection1] o.a.s.s.FileExchangeRateProvider Reloading exchange rates from file currency.xml
   [junit4]   2> 657449 INFO  (coreLoadExecutor-2019-thread-1-processing-n:127.0.0.1:50584_) [n:127.0.0.1:50584_ c:control_collection   x:collection1] o.a.s.s.OpenExchangeRatesOrgProvider Reloading exchange rates from open-exchange-rates.json
   [junit4]   2> 657463 INFO  (coreLoadExecutor-2019-thread-1-processing-n:127.0.0.1:50584_) [n:127.0.0.1:50584_ c:control_collection   x:collection1] o.a.s.s.OpenExchangeRatesOrgProvider Reloading exchange rates from open-exchange-rates.json
   [junit4]   2> 657472 INFO  (coreLoadExecutor-2019-thread-1-processing-n:127.0.0.1:50584_) [n:127.0.0.1:50584_ c:control_collection   x:collection1] o.a.s.c.ConfigSetProperties Did not find ConfigSet properties, assuming default properties: Can't find resource 'configsetprops.json' in classpath or '/configs/conf1', cwd=/x1/jenkins/jenkins-slave/workspace/Lucene-Solr-Tests-master/solr/build/solr-core/test/J2
   [junit4]   2> 657472 INFO  (coreLoadExecutor-2019-thread-1-processing-n:127.0.0.1:50584_) [n:127.0.0.1:50584_ c:control_collection   x:collection1] o.a.s.c.CoreContainer Creating SolrCore 'collection1' using configuration from collection control_collection
   [junit4]   2> 657472 INFO  (coreLoadExecutor-2019-thread-1-processing-n:127.0.0.1:50584_) [n:127.0.0.1:50584_ c:control_collection s:shard1 r:core_node1 x:collection1] o.a.s.c.SolrCore org.apache.solr.core.MockDirectoryFactory
   [junit4]   2> 657472 INFO  (coreLoadExecutor-2019-thread-1-processing-n:127.0.0.1:50584_) [n:127.0.0.1:50584_ c:control_collection s:shard1 r:core_node1 x:collection1] o.a.s.c.SolrCore [[collection1] ] Opening new SolrCore at [/x1/jenkins/jenkins-slave/workspace/Lucene-Solr-Tests-master/solr/build/solr-core/test/J2/temp/solr.core.TestDynamicLoading_F346093846C9D5F1-001/control-001/cores/collection1], dataDir=[/x1/jenkins/jenkins-slave/workspace/Lucene-Solr-Tests-master/solr/build/solr-core/test/J2/temp/solr.core.TestDynamicLoading_F346093846C9D5F1-001/control-001/cores/collection1/data/]
   [junit4]   2> 657472 INFO  (coreLoadExecutor-2019-thread-1-processing-n:127.0.0.1:50584_) [n:127.0.0.1:50584_ c:control_collection s:shard1 r:core_node1 x:collection1] o.a.s.c.JmxMonitoredMap JMX monitoring is enabled. Adding Solr mbeans to JMX Server: com.sun.jmx.mbeanserver.JmxMBeanServer@3667bb0b
   [junit4]   2> 657473 INFO  (coreLoadExecutor-2019-thread-1-processing-n:127.0.0.1:50584_) [n:127.0.0.1:50584_ c:control_collection s:shard1 r:core_node1 x:collection1] o.a.s.c.CachingDirectoryFactory return new directory for /x1/jenkins/jenkins-slave/workspace/Lucene-Solr-Tests-master/solr/build/solr-core/test/J2/temp/solr.core.TestDynamicLoading_F346093846C9D5F1-001/control-001/cores/collection1/data/snapshot_metadata
   [junit4]   2> 657473 INFO  (coreLoadExecutor-2019-thread-1-processing-n:127.0.0.1:50584_) [n:127.0.0.1:50584_ c:control_collection s:shard1 r:core_node1 x:collection1] o.a.s.c.s.SolrSnapshotMetaDataManager Loading from snapshot metadata file...
   [junit4]   2> 657473 INFO  (coreLoadExecutor-2019-thread-1-processing-n:127.0.0.1:50584_) [n:127.0.0.1:50584_ c:control_collection s:shard1 r:core_node1 x:collection1] o.a.s.c.CachingDirectoryFactory return new directory for /x1/jenkins/jenkins-slave/workspace/Lucene-Solr-Tests-master/solr/build/solr-core/test/J2/temp/solr.core.TestDynamicLoading_F346093846C9D5F1-001/control-001/cores/collection1/data
   [junit4]   2> 657486 INFO  (coreLoadExecutor-2019-thread-1-processing-n:127.0.0.1:50584_) [n:127.0.0.1:50584_ c:control_collection s:shard1 r:core_node1 x:collection1] o.a.s.c.SolrCore New index directory detected: old=null new=/x1/jenkins/jenkins-slave/workspace/Lucene-Solr-Tests-master/solr/build/solr-core/test/J2/temp/solr.core.TestDynamicLoading_F346093846C9D5F1-001/control-001/cores/collection1/data/index/
   [junit4]   2> 657486 WARN  (coreLoadExecutor-2019-thread-1-processing-n:127.0.0.1:50584_) [n:127.0.0.1:50584_ c:control_collection s:shard1 r:core_node1 x:collection1] o.a.s.c.SolrCore [collection1] Solr index directory '/x1/jenkins/jenkins-slave/workspace/Lucene-Solr-Tests-master/solr/build/solr-core/test/J2/temp/solr.core.TestDynamicLoading_F346093846C9D5F1-001/control-001/cores/collection1/data/index' doesn't exist. Creating new index...
   [junit4]   2> 657486 INFO  (coreLoadExecutor-2019-thread-1-processing-n:127.0.0.1:50584_) [n:127.0.0.1:50584_ c:control_collection s:shard1 r:core_node1 x:collection1] o.a.s.c.CachingDirectoryFactory return new directory for /x1/jenkins/jenkins-slave/workspace/Lucene-Solr-Tests-master/solr/build/solr-core/test/J2/temp/solr.core.TestDynamicLoading_F346093846C9D5F1-001/control-001/cores/collection1/data/index
   [junit4]   2> 657486 INFO  (coreLoadExecutor-2019-thread-1-processing-n:127.0.0.1:50584_) [n:127.0.0.1:50584_ c:control_collection s:shard1 r:core_node1 x:collection1] o.a.s.u.RandomMergePolicy RandomMergePolicy wrapping class org.apache.lucene.index.LogDocMergePolicy: [LogDocMergePolicy: minMergeSize=1000, mergeFactor=16, maxMergeSize=9223372036854775807, maxMergeSizeForForcedMerge=9223372036854775807, calibrateSizeByDeletes=false, maxMergeDocs=2147483647, maxCFSSegmentSizeMB=8.796093022207999E12, noCFSRatio=0.8112505405975705]
   [junit4]   2> 657502 INFO  (coreLoadExecutor-2019-thread-1-processing-n:127.0.0.1:50584_) [n:127.0.0.1:50584_ c:control_collection s:shard1 r:core_node1 x:collection1] o.a.s.c.SolrDeletionPolicy SolrDeletionPolicy.onCommit: commits: num=1
   [junit4]   2> 	commit{dir=MockDirectoryWrapper(RAMDirectory@4bd183ef lockFactory=org.apache.lucene.store.SingleInstanceLockFactory@651b3fce),segFN=segments_1,generation=1}
   [junit4]   2> 657502 INFO  (coreLoadExecutor-2019-thread-1-processing-n:127.0.0.1:50584_) [n:127.0.0.1:50584_ c:control_collection s:shard1 r:core_node1 x:collection1] o.a.s.c.SolrDeletionPolicy newest commit generation = 1
   [junit4]   2> 657516 INFO  (coreLoadExecutor-2019-thread-1-processing-n:127.0.0.1:50584_) [n:127.0.0.1:50584_ c:control_collection s:shard1 r:core_node1 x:collection1] o.a.s.u.p.UpdateRequestProcessorChain creating updateRequestProcessorChain "nodistrib"
   [junit4]   2> 657517 INFO  (coreLoadExecutor-2019-thread-1-processing-n:127.0.0.1:50584_) [n:127.0.0.1:50584_ c:control_collection s:shard1 r:core_node1 x:collection1] o.a.s.u.p.UpdateRequestProcessorChain creating updateRequestProcessorChain "dedupe"
   [junit4]   2> 657517 INFO  (coreLoadExecutor-2019-thread-1-processing-n:127.0.0.1:50584_) [n:127.0.0.1:50584_ c:control_collection s:shard1 r:core_node1 x:collection1] o.a.s.u.p.UpdateRequestProcessorChain inserting DistributedUpdateProcessorFactory into updateRequestProcessorChain "dedupe"
   [junit4]   2> 657517 INFO  (coreLoadExecutor-2019-thread-1-processing-n:127.0.0.1:50584_) [n:127.0.0.1:50584_ c:control_collection s:shard1 r:core_node1 x:collection1] o.a.s.u.p.UpdateRequestProcessorChain creating updateRequestProcessorChain "stored_sig"
   [junit4]   2> 657517 INFO  (coreLoadExecutor-2019-thread-1-processing-n:127.0.0.1:50584_) [n:127.0.0.1:50584_ c:control_collection s:shard1 r:core_node1 x:collection1] o.a.s.u.p.UpdateRequestProcessorChain inserting DistributedUpdateProcessorFactory into updateRequestProcessorChain "stored_sig"
   [junit4]   2> 657517 INFO  (coreLoadExecutor-2019-thread-1-processing-n:127.0.0.1:50584_) [n:127.0.0.1:50584_ c:control_collection s:shard1 r:core_node1 x:collection1] o.a.s.u.p.UpdateRequestProcessorChain creating updateRequestProcessorChain "distrib-dup-test-chain-explicit"
   [junit4]   2> 657517 INFO  (coreLoadExecutor-2019-thread-1-processing-n:127.0.0.1:50584_) [n:127.0.0.1:50584_ c:control_collection s:shard1 r:core_node1 x:collection1] o.a.s.u.p.UpdateRequestProcessorChain creating updateRequestProcessorChain "distrib-dup-test-chain-implicit"
   [junit4]   2> 657517 INFO  (coreLoadExecutor-2019-thread-1-processing-n:127.0.0.1:50584_) [n:127.0.0.1:50584_ c:control_collection s:shard1 r:core_node1 x:collection1] o.a.s.u.p.UpdateRequestProcessorChain inserting DistributedUpdateProcessorFactory into updateRequestProcessorChain "distrib-dup-test-chain-implicit"
   [junit4]   2> 657517 INFO  (coreLoadExecutor-2019-thread-1-processing-n:127.0.0.1:50584_) [n:127.0.0.1:50584_ c:control_collection s:shard1 r:core_node1 x:collection1] o.a.s.c.SolrCore no updateRequestProcessorChain defined as default, creating implicit default
   [junit4]   2> 657517 WARN  (coreLoadExecutor-2019-thread-1-processing-n:127.0.0.1:50584_) [n:127.0.0.1:50584_ c:control_collection s:shard1 r:core_node1 x:collection1] o.a.s.c.RequestHandlers INVALID paramSet a in requestHandler {type = requestHandler,name = /dump,class = DumpRequestHandler,args = {defaults={a=A,b=B}}}
   [junit4]   2> 657519 INFO  (coreLoadExecutor-2019-thread-1-processing-n:127.0.0.1:50584_) [n:127.0.0.1:50584_ c:control_collection s:shard1 r:core_node1 x:collection1] o.a.s.h.l.XMLLoader xsltCacheLifetimeSeconds=60
   [junit4]   2> 657520 INFO  (coreLoadExecutor-2019-thread-1-processing-n:127.0.0.1:50584_) [n:127.0.0.1:50584_ c:control_collection s:shard1 r:core_node1 x:collection1] o.a.s.h.l.XMLLoader xsltCacheLifetimeSeconds=60
   [junit4]   2> 657520 INFO  (coreLoadExecutor-2019-thread-1-processing-n:127.0.0.1:50584_) [n:127.0.0.1:50584_ c:control_collection s:shard1 r:core_node1 x:collection1] o.a.s.h.l.XMLLoader xsltCacheLifetimeSeconds=60
   [junit4]   2> 657521 INFO  (coreLoadExecutor-2019-thread-1-processing-n:127.0.0.1:50584_) [n:127.0.0.1:50584_ c:control_collection s:shard1 r:core_node1 x:collection1] o.a.s.h.l.XMLLoader xsltCacheLifetimeSeconds=60
   [junit4]   2> 657522 INFO  (OldIndexDirectoryCleanupThreadForCore-collection1) [n:127.0.0.1:50584_ c:control_collection s:shard1 r:core_node1 x:collection1] o.a.s.c.SolrCore Looking for old index directories to cleanup for core collection1 in /x1/jenkins/jenkins-slave/workspace/Lucene-Solr-Tests-master/solr/build/solr-core/test/J2/temp/solr.core.TestDynamicLoading_F346093846C9D5F1-001/control-001/cores/collection1/data/
   [junit4]   2> 657525 INFO  (coreLoadExecutor-2019-thread-1-processing-n:127.0.0.1:50584_) [n:127.0.0.1:50584_ c:control_collection s:shard1 r:core_node1 x:collection1] o.a.s.c.RequestHandlers Registered paths: /admin/mbeans,standard,/update/json/docs,/admin/luke,/export,/get,/admin/properties,/update/json,/admin/threads,/dump,/update/csv,/sql,/graph,/admin/segments,/admin/system,/replication,/config,/stream,/schema,/admin/plugins,/admin/logging,/admin/ping,/update,/admin/file,/terms
   [junit4]   2> 657525 INFO  (coreLoadExecutor-2019-thread-1-processing-n:127.0.0.1:50584_) [n:127.0.0.1:50584_ c:control_collection s:shard1 r:core_node1 x:collection1] o.a.s.c.SolrCore Using default statsCache cache: org.apache.solr.search.stats.LocalStatsCache
   [junit4]   2> 657525 WARN  (OldIndexDirectoryCleanupThreadForCore-collection1) [n:127.0.0.1:50584_ c:control_collection s:shard1 r:core_node1 x:collection1] o.a.s.c.DirectoryFactory /x1/jenkins/jenkins-slave/workspace/Lucene-Solr-Tests-master/solr/build/solr-core/test/J2/temp/solr.core.TestDynamicLoading_F346093846C9D5F1-001/control-001/cores/collection1/data/ does not point to a valid data directory; skipping clean-up of old index directories.
   [junit4]   2> 657549 INFO  (coreLoadExecutor-2019-thread-1-processing-n:127.0.0.1:50584_) [n:127.0.0.1:50584_ c:control_collection s:shard1 r:core_node1 x:collection1] o.a.s.u.UpdateHandler Using UpdateLog implementation: org.apache.solr.update.UpdateLog
   [junit4]   2> 657549 INFO  (coreLoadExecutor-2019-thread-1-processing-n:127.0.0.1:50584_) [n:127.0.0.1:50584_ c:control_collection s:shard1 r:core_node1 x:collection1] o.a.s.u.UpdateLog Initializing UpdateLog: dataDir= defaultSyncLevel=FLUSH numRecordsToKeep=100 maxNumLogsToKeep=10 numVersionBuckets=65536
   [junit4]   2> 657550 INFO  (coreLoadExecutor-2019-thread-1-processing-n:127.0.0.1:50584_) [n:127.0.0.1:50584_ c:control_collection s:shard1 r:core_node1 x:collection1] o.a.s.u.CommitTracker Hard AutoCommit: disabled
   [junit4]   2> 657550 INFO  (coreLoadExecutor-2019-thread-1-processing-n:127.0.0.1:50584_) [n:127.0.0.1:50584_ c:control_collection s:shard1 r:core_node1 x:collection1] o.a.s.u.CommitTracker Soft AutoCommit: disabled
   [junit4]   2> 657550 INFO  (coreLoadExecutor-2019-thread-1-processing-n:127.0.0.1:50584_) [n:127.0.0.1:50584_ c:control_collection s:shard1 r:core_node1 x:collection1] o.a.s.u.RandomMergePolicy RandomMergePolicy wrapping class org.apache.lucene.index.TieredMergePolicy: [TieredMergePolicy: maxMergeAtOnce=13, maxMergeAtOnceExplicit=36, maxMergedSegmentMB=41.2607421875, floorSegmentMB=1.5791015625, forceMergeDeletesPctAllowed=17.88994212091842, segmentsPerTier=39.0, maxCFSSegmentSizeMB=8.796093022207999E12, noCFSRatio=0.14098872111581864
   [junit4]   2> 657551 INFO  (coreLoadExecutor-2019-thread-1-processing-n:127.0.0.1:50584_) [n:127.0.0.1:50584_ c:control_collection s:shard1 r:core_node1 x:collection1] o.a.s.c.SolrDeletionPolicy SolrDeletionPolicy.onInit: commits: num=1
   [junit4]   2> 	commit{dir=MockDirectoryWrapper(RAMDirectory@4bd183ef lockFactory=org.apache.lucene.store.SingleInstanceLockFactory@651b3fce),segFN=segments_1,generation=1}
   [junit4]   2> 657551 INFO  (coreLoadExecutor-2019-thread-1-processing-n:127.0.0.1:50584_) [n:127.0.0.1:50584_ c:control_collection s:shard1 r:core_node1 x:collection1] o.a.s.c.SolrDeletionPolicy newest commit generation = 1
   [junit4]   2> 657551 INFO  (coreLoadExecutor-2019-thread-1-processing-n:127.0.0.1:50584_) [n:127.0.0.1:50584_ c:control_collection s:shard1 r:core_node1 x:collection1] o.a.s.s.SolrIndexSearcher Opening [Searcher@32f688db[collection1] main]
   [junit4]   2> 657551 INFO  (coreLoadExecutor-2019-thread-1-processing-n:127.0.0.1:50584_) [n:127.0.0.1:50584_ c:control_collection s:shard1 r:core_node1 x:collection1] o.a.s.c.c.ZkStateReader Load collection config from: [/collections/control_collection]
   [junit4]   2> 657552 INFO  (coreLoadExecutor-2019-thread-1-processing-n:127.0.0.1:50584_) [n:127.0.0.1:50584_ c:control_collection s:shard1 r:core_node1 x:collection1] o.a.s.c.c.ZkStateReader path=[/collections/control_collection] [configName]=[conf1] specified config exists in ZooKeeper
   [junit4]   2> 657552 INFO  (coreLoadExecutor-2019-thread-1-processing-n:127.0.0.1:50584_) [n:127.0.0.1:50584_ c:control_collection s:shard1 r:core_node1 x:collection1] o.a.s.r.ManagedResourceStorage Setting up ZooKeeper-based storage for the RestManager with znodeBase: /configs/conf1
   [junit4]   2> 657552 INFO  (coreLoadExecutor-2019-thread-1-processing-n:127.0.0.1:50584_) [n:127.0.0.1:50584_ c:control_collection s:shard1 r:core_node1 x:collection1] o.a.s.r.ManagedResourceStorage Configured ZooKeeperStorageIO with znodeBase: /configs/conf1
   [junit4]   2> 657552 INFO  (coreLoadExecutor-2019-thread-1-processing-n:127.0.0.1:50584_) [n:127.0.0.1:50584_ c:control_collection s:shard1 r:core_node1 x:collection1] o.a.s.r.RestManager Initializing RestManager with initArgs: {}
   [junit4]   2> 657552 INFO  (coreLoadExecutor-2019-thread-1-processing-n:127.0.0.1:50584_) [n:127.0.0.1:50584_ c:control_collection s:shard1 r:core_node1 x:collection1] o.a.s.r.ManagedResourceStorage Reading _rest_managed.json using ZooKeeperStorageIO:path=/configs/conf1
   [junit4]   2> 657552 INFO  (coreLoadExecutor-2019-thread-1-processing-n:127.0.0.1:50584_) [n:127.0.0.1:50584_ c:control_collection s:shard1 r:core_node1 x:collection1] o.a.s.r.ManagedResourceStorage No data found for znode /configs/conf1/_rest_managed.json
   [junit4]   2> 657552 INFO  (coreLoadExecutor-2019-thread-1-processing-n:127.0.0.1:50584_) [n:127.0.0.1:50584_ c:control_collection s:shard1 r:core_node1 x:collection1] o.a.s.r.ManagedResourceStorage Loaded null at path _rest_managed.json using ZooKeeperStorageIO:path=/configs/conf1
   [junit4]   2> 657553 INFO  (coreLoadExecutor-2019-thread-1-processing-n:127.0.0.1:50584_) [n:127.0.0.1:50584_ c:control_collection s:shard1 r:core_node1 x:collection1] o.a.s.r.RestManager Initializing 0 registered ManagedResources
   [junit4]   2> 657553 INFO  (coreLoadExecutor-2019-thread-1-processing-n:127.0.0.1:50584_) [n:127.0.0.1:50584_ c:control_collection s:shard1 r:core_node1 x:collection1] o.a.s.h.ReplicationHandler Commits will be reserved for  10000
   [junit4]   2> 657553 INFO  (coreLoadExecutor-2019-thread-1-processing-n:127.0.0.1:50584_) [n:127.0.0.1:50584_ c:control_collection s:shard1 r:core_node1 x:collection1] o.a.s.u.UpdateLog Looking up max value of version field to seed version buckets
   [junit4]   2> 657553 INFO  (coreLoadExecutor-2019-thread-1-processing-n:127.0.0.1:50584_) [n:127.0.0.1:50584_ c:control_collection s:shard1 r:core_node1 x:collection1] o.a.s.u.VersionInfo Refreshing highest value of _version_ for 65536 version buckets from index
   [junit4]   2> 657553 INFO  (coreLoadExecutor-2019-thread-1-processing-n:127.0.0.1:50584_) [n:127.0.0.1:50584_ c:control_collection s:shard1 r:core_node1 x:collection1] o.a.s.u.VersionInfo No terms found for _version_, cannot seed version bucket highest value from index
   [junit4]   2> 657553 INFO  (coreLoadExecutor-2019-thread-1-processing-n:127.0.0.1:50584_) [n:127.0.0.1:50584_ c:control_collection s:shard1 r:core_node1 x:collection1] o.a.s.u.UpdateLog Could not find max version in index or recent updates, using new clock 1545221350501646336
   [junit4]   2> 657555 INFO  (coreLoadExecutor-2019-thread-1-processing-n:127.0.0.1:50584_) [n:127.0.0.1:50584_ c:control_collection s:shard1 r:core_node1 x:collection1] o.a.s.u.UpdateLog Took 1.0ms to seed version buckets with highest version 1545221350501646336
   [junit4]   2> 657555 INFO  (coreLoadExecutor-2019-thread-1-processing-n:127.0.0.1:50584_) [n:127.0.0.1:50584_ c:control_collection s:shard1 r:core_node1 x:collection1] o.a.s.c.ZkController watch zkdir /configs/conf1
   [junit4]   2> 657556 INFO  (coreLoadExecutor-2019-thread-1-processing-n:127.0.0.1:50584_) [n:127.0.0.1:50584_ c:control_collection s:shard1 r:core_node1 x:collection1] o.a.s.c.CoreContainer registering core: collection1
   [junit4]   2> 657564 INFO  (coreZkRegister-2012-thread-1-processing-n:127.0.0.1:50584_ x:collection1 s:shard1 c:control_collection r:core_node1) [n:127.0.0.1:50584_ c:control_collection s:shard1 r:core_node1 x:collection1] o.a.s.c.ZkController Register replica - core:collection1 address:https://127.0.0.1:50584 collection:control_collection shard:shard1
   [junit4]   2> 657564 INFO  (searcherExecutor-2020-thread-1-processing-n:127.0.0.1:50584_ x:collection1 s:shard1 c:control_collection r:core_node1) [n:127.0.0.1:50584_ c:control_collection s:shard1 r:core_node1 x:collection1] o.a.s.c.SolrCore [collection1] Registered new searcher Searcher@32f688db[collection1] main{ExitableDirectoryReader(UninvertingDirectoryReader())}
   [junit4]   2> 657565 INFO  (coreZkRegister-2012-thread-1-processing-n:127.0.0.1:50584_ x:collection1 s:shard1 c:control_collection r:core_node1) [n:127.0.0.1:50584_ c:control_collection s:shard1 r:core_node1 x:collection1] o.a.s.c.c.SolrZkClient makePath: /collections/control_collection/leader_elect/shard1/election
   [junit4]   2> 657568 INFO  (coreZkRegister-2012-thread-1-processing-n:127.0.0.1:50584_ x:collection1 s:shard1 c:control_collection r:core_node1) [n:127.0.0.1:50584_ c:control_collection s:shard1 r:core_node1 x:collection1] o.a.s.c.LeaderElector Joined leadership election with path: /collections/control_collection/leader_elect/shard1/election/96576334255947781-core_node1-n_0000000000
   [junit4]   2> 657569 INFO  (coreZkRegister-2012-thread-1-processing-n:127.0.0.1:50584_ x:collection1 s:shard1 c:control_collection r:core_node1) [n:127.0.0.1:50584_ c:control_collection s:shard1 r:core_node1 x:collection1] o.a.s.c.ShardLeaderElectionContext Running the leader process for shard=shard1 and weAreReplacement=false and leaderVoteWait=10000
   [junit4]   2> 657570 INFO  (OverseerStateUpdate-96576334255947781-127.0.0.1:50584_-n_0000000000) [n:127.0.0.1:50584_    ] o.a.s.c.Overseer processMessage: queueSize: 1, message = {
   [junit4]   2>   "operation":"leader",
   [junit4]   2>   "shard":"shard1",
   [junit4]   2>   "collection":"control_collection"} current state version: 1
   [junit4]   2> 657572 INFO  (coreZkRegister-2012-thread-1-processing-n:127.0.0.1:50584_ x:collection1 s:shard1 c:control_collection r:core_node1) [n:127.0.0.1:50584_ c:control_collection s:shard1 r:core_node1 x:collection1] o.a.s.c.ShardLeaderElectionContext Enough replicas found to continue.
   [junit4]   2> 657572 INFO  (coreZkRegister-2012-thread-1-processing-n:127.0.0.1:50584_ x:collection1 s:shard1 c:control_collection r:core_node1) [n:127.0.0.1:50584_ c:control_collection s:shard1 r:core_node1 x:collection1] o.a.s.c.ShardLeaderElectionContext I may be the new leader - try and sync
   [junit4]   2> 657572 INFO  (coreZkRegister-2012-thread-1-processing-n:127.0.0.1:50584_ x:collection1 s:shard1 c:control_collection r:core_node1) [n:127.0.0.1:50584_ c:control_collection s:shard1 r:core_node1 x:collection1] o.a.s.c.SyncStrategy Sync replicas to https://127.0.0.1:50584/collection1/
   [junit4]   2> 657572 INFO  (coreZkRegister-2012-thread-1-processing-n:127.0.0.1:50584_ x:collection1 s:shard1 c:control_collection r:core_node1) [n:127.0.0.1:50584_ c:control_collection s:shard1 r:core_node1 x:collection1] o.a.s.c.SyncStrategy Sync Success - now sync replicas to me
   [junit4]   2> 657572 INFO  (coreZkRegister-2012-thread-1-processing-n:127.0.0.1:50584_ x:collection1 s:shard1 c:control_collection r:core_node1) [n:127.0.0.1:50584_ c:control_collection s:shard1 r:core_node1 x:collection1] o.a.s.c.SyncStrategy https://127.0.0.1:50584/collection1/ has no replicas
   [junit4]   2> 657573 INFO  (coreZkRegister-2012-thread-1-processing-n:127.0.0.1:50584_ x:collection1 s:shard1 c:control_collection r:core_node1) [n:127.0.0.1:50584_ c:control_collection s:shard1 r:core_node1 x:collection1] o.a.s.c.c.SolrZkClient makePath: /collections/control_collection/leaders/shard1
   [junit4]   2> 657768 INFO  (TEST-TestDynamicLoading.testDynamicLoading-seed#[F346093846C9D5F1]) [    ] o.a.s.c.c.SolrZkClient Using default ZkCredentialsProvider
   [junit4]   2> 657790 INFO  (TEST-TestDynamicLoading.testDynamicLoading-seed#[F346093846C9D5F1]) [    ] o.a.s.c.c.ConnectionManager Waiting for client to connect to ZooKeeper
   [junit4]   2> 657989 INFO  (zkCallback-894-thread-1) [    ] o.a.s.c.c.ConnectionManager Watcher org.apache.solr.common.cloud.ConnectionManager@2ea2c564 name:ZooKeeperConnection Watcher:127.0.0.1:44919/solr got event WatchedEvent state:SyncConnected type:None path:null path:null type:None
   [junit4]   2> 657989 INFO  (TEST-TestDynamicLoading.testDynamicLoading-seed#[F346093846C9D5F1]) [    ] o.a.s.c.c.ConnectionManager Client is connected to ZooKeeper
   [junit4]   2> 657989 INFO  (TEST-TestDynamicLoading.testDynamicLoading-seed#[F346093846C9D5F1]) [    ] o.a.s.c.c.SolrZkClient Using default ZkACLProvider
   [junit4]   2> 657989 INFO  (TEST-TestDynamicLoading.testDynamicLoading-seed#[F346093846C9D5F1]) [    ] o.a.s.c.c.ZkStateReader Updating cluster state from ZooKeeper... 
   [junit4]   2> 657990 INFO  (TEST-TestDynamicLoading.testDynamicLoading-seed#[F346093846C9D5F1]) [    ] o.a.s.c.c.ZkStateReader Loaded cluster properties: {urlScheme=https}
   [junit4]   2> 657990 INFO  (TEST-TestDynamicLoading.testDynamicLoading-seed#[F346093846C9D5F1]) [    ] o.a.s.c.c.ZkStateReader Updated live nodes from ZooKeeper... (0) -> (1)
   [junit4]   2> 657990 INFO  (zkCallback-890-thread-3-processing-n:127.0.0.1:50584_) [n:127.0.0.1:50584_    ] o.a.s.c.c.ZkStateReader A cluster state change: [WatchedEvent state:SyncConnected type:NodeDataChanged path:/clusterstate.json], has occurred - updating... (live nodes size: [1])
   [junit4]   2> 657993 INFO  (TEST-TestDynamicLoading.testDynamicLoading-seed#[F346093846C9D5F1]) [    ] o.a.s.c.ChaosMonkey monkey: init - expire sessions:false cause connection loss:false
   [junit4]   2> 657993 INFO  (TEST-TestDynamicLoading.testDynamicLoading-seed#[F346093846C9D5F1]) [    ] o.a.s.c.AbstractFullDistribZkTestBase Creating collection1 with stateFormat=2
   [junit4]   2> 657993 INFO  (TEST-TestDynamicLoading.testDynamicLoading-seed#[F346093846C9D5F1]) [    ] o.a.s.c.c.SolrZkClient Using default ZkCredentialsProvider
   [junit4]   2> 658014 INFO  (TEST-TestDynamicLoading.testDynamicLoading-seed#[F346093846C9D5F1]) [    ] o.a.s.c.c.ConnectionManager Waiting for client to connect to ZooKeeper
   [junit4]   2> 658014 INFO  (coreZkRegister-2012-thread-1-processing-n:127.0.0.1:50584_ x:collection1 s:shard1 c:control_collection r:core_node1) [n:127.0.0.1:50584_ c:control_collection s:shard1 r:core_node1 x:collection1] o.a.s.c.ShardLeaderElectionContextBase Creating leader registration node /collections/control_collection/leaders/shard1/leader after winning as /collections/control_collection/leader_elect/shard1/election/96576334255947781-core_node1-n_0000000000
   [junit4]   2> 658030 INFO  (zkCallback-895-thread-1) [    ] o.a.s.c.c.ConnectionManager Watcher org.apache.solr.common.cloud.ConnectionManager@5c0eb0d7 name:ZooKeeperConnection Watcher:127.0.0.1:44919/solr got event WatchedEvent state:SyncConnected type:None path:null path:null type:None
   [junit4]   2> 658030 INFO  (TEST-TestDynamicLoading.testDynamicLoading-seed#[F346093846C9D5F1]) [    ] o.a.s.c.c.ConnectionManager Client is connected to ZooKeeper
   [junit4]   2> 658030 INFO  (TEST-TestDynamicLoading.testDynamicLoading-seed#[F346093846C9D5F1]) [    ] o.a.s.c.c.SolrZkClient Using default ZkACLProvider
   [junit4]   2> 658032 INFO  (coreZkRegister-2012-thread-1-processing-n:127.0.0.1:50584_ x:collection1 s:shard1 c:control_collection r:core_node1) [n:127.0.0.1:50584_ c:control_collection s:shard1 r:core_node1 x:collection1] o.a.s.c.ShardLeaderElectionContext I am the new leader: https://127.0.0.1:50584/collection1/ shard1
   [junit4]   2> 658042 INFO  (OverseerStateUpdate-96576334255947781-127.0.0.1:50584_-n_0000000000) [n:127.0.0.1:50584_    ] o.a.s.c.Overseer processMessage: queueSize: 2, message = {
   [junit4]   2>   "operation":"leader",
   [junit4]   2>   "shard":"shard1",
   [junit4]   2>   "collection":"control_collection",
   [junit4]   2>   "base_url":"https://127.0.0.1:50584",
   [junit4]   2>   "core":"collection1",
   [junit4]   2>   "state":"active"} current state version: 2
   [junit4]   2> 658138 INFO  (OverseerStateUpdate-96576334255947781-127.0.0.1:50584_-n_0000000000) [n:127.0.0.1:50584_    ] o.a.s.c.Overseer processMessage: queueSize: 1, message = {
   [junit4]   2>   "operation":"create",
   [junit4]   2>   "name":"collection1",
   [junit4]   2>   "numShards":"2",
   [junit4]   2>   "stateFormat":"2"} current state version: 2
   [junit4]   2> 658138 INFO  (OverseerStateUpdate-96576334255947781-127.0.0.1:50584_-n_0000000000) [n:127.0.0.1:50584_    ] o.a.s.c.o.ClusterStateMutator building a new cName: collection1
   [junit4]   2> 658139 INFO  (zkCallback-894-thread-1) [    ] o.a.s.c.c.ZkStateReader A cluster state change: [WatchedEvent state:SyncConnected type:NodeDataChanged path:/clusterstate.json], has occurred - updating... (live nodes size: [1])
   [junit4]   2> 658146 INFO  (zkCallback-890-thread-3-processing-n:127.0.0.1:50584_) [n:127.0.0.1:50584_    ] o.a.s.c.c.ZkStateReader A cluster state change: [WatchedEvent state:SyncConnected type:NodeDataChanged path:/clusterstate.json], has occurred - updating... (live nodes size: [1])
   [junit4]   2> 658184 INFO  (coreZkRegister-2012-thread-1-processing-n:127.0.0.1:50584_ x:collection1 s:shard1 c:control_collection r:core_node1) [n:127.0.0.1:50584_ c:control_collection s:shard1 r:core_node1 x:collection1] o.a.s.c.ZkController We are https://127.0.0.1:50584/collection1/ and leader is https://127.0.0.1:50584/collection1/
   [junit4]   2> 658184 INFO  (coreZkRegister-2012-thread-1-processing-n:127.0.0.1:50584_ x:collection1 s:shard1 c:control_collection r:core_node1) [n:127.0.0.1:50584_ c:control_collection s:shard1 r:core_node1 x:collection1] o.a.s.c.ZkController No LogReplay needed for core=collection1 baseURL=https://127.0.0.1:50584
   [junit4]   2> 658184 INFO  (coreZkRegister-2012-thread-1-processing-n:127.0.0.1:50584_ x:collection1 s:shard1 c:control_collection r:core_node1) [n:127.0.0.1:50584_ c:control_collection s:shard1 r:core_node1 x:collection1] o.a.s.c.ZkController I am the leader, no recovery necessary
   [junit4]   2> 658184 INFO  (coreZkRegister-2012-thread-1-processing-n:127.0.0.1:50584_ x:collection1 s:shard1 c:control_collection r:core_node1) [n:127.0.0.1:50584_ c:control_collection s:shard1 r:core_node1 x:collection1] o.a.s.c.ZkController publishing state=active
   [junit4]   2> 658184 INFO  (coreZkRegister-2012-thread-1-processing-n:127.0.0.1:50584_ x:collection1 s:shard1 c:control_collection r:core_node1) [n:127.0.0.1:50584_ c:control_collection s:shard1 r:core_node1 x:collection1] o.a.s.c.ZkController numShards not found on descriptor - reading it from system property
   [junit4]   2> 658185 INFO  (coreZkRegister-2012-thread-1-processing-n:127.0.0.1:50584_ x:collection1 s:shard1 c:control_collection r:core_node1) [n:127.0.0.1:50584_ c:control_collection s:shard1 r:core_node1 x:collection1] o.a.s.c.c.ZkStateReader Checking legacy cluster state for collection control_collection
   [junit4]   2> 658191 INFO  (OverseerStateUpdate-96576334255947781-127.0.0.1:50584_-n_0000000000) [n:127.0.0.1:50584_    ] o.a.s.c.Overseer processMessage: queueSize: 1, message = {
   [junit4]   2>   "core":"collection1",
   [junit4]   2>   "core_node_name":"core_node1",
   [junit4]   2>   "roles":null,
   [junit4]   2>   "base_url":"https://127.0.0.1:50584",
   [junit4]   2>   "node_name":"127.0.0.1:50584_",
   [junit4]   2>   "numShards":"2",
   [junit4]   2>   "state":"active",
   [junit4]   2>   "shard":"shard1",
   [junit4]   2>   "collection":"control_collection",
   [junit4]   2>   "operation":"state"} current state version: 3
   [junit4]   2> 658191 INFO  (OverseerStateUpdate-96576334255947781-127.0.0.1:50584_-n_0000000000) [n:127.0.0.1:50584_    ] o.a.s.c.o.ReplicaMutator Update state numShards=2 message={
   [junit4]   2>   "core":"collection1",
   [junit4]   2>   "core_node_name":"core_node1",
   [junit4]   2>   "roles":null,
   [junit4]   2>   "base_url":"https://127.0.0.1:50584",
   [junit4]   2>   "node_name":"127.0.0.1:50584_",
   [junit4]   2>   "numShards":"2",
   [junit4]   2>   "state":"active",
   [junit4]   2>   "shard":"shard1",
   [junit4]   2>   "collection":"control_collection",
   [junit4]   2>   "operation":"state"}
   [junit4]   2> 658193 INFO  (OverseerStateUpdate-96576334255947781-127.0.0.1:50584_-n_0000000000) [n:127.0.0.1:50584_    ] o.a.s.c.o.ZkStateWriter going to create_collection /collections/collection1/state.json
   [junit4]   2> 658297 INFO  (zkCallback-894-thread-1) [    ] o.a.s.c.c.ZkStateReader A cluster state change: [WatchedEvent state:SyncConnected type:NodeDataChanged path:/clusterstate.json], has occurred - updating... (live nodes size: [1])
   [junit4]   2> 658298 INFO  (zkCallback-890-thread-4-processing-n:127.0.0.1:50584_) [n:127.0.0.1:50584_    ] o.a.s.c.c.ZkStateReader A cluster state change: [WatchedEvent state:SyncConnected type:NodeDataChanged path:/clusterstate.json], has occurred - updating... (live nodes size: [1])
   [junit4]   2> 658481 INFO  (TEST-TestDynamicLoading.testDynamicLoading-seed#[F346093846C9D5F1]) [    ] o.a.s.SolrTestCaseJ4 Writing core.properties file to /x1/jenkins/jenkins-slave/workspace/Lucene-Solr-Tests-master/solr/build/solr-core/test/J2/temp/solr.core.TestDynamicLoading_F346093846C9D5F1-001/shard-1-001/cores/collection1
   [junit4]   2> 658481 INFO  (TEST-TestDynamicLoading.testDynamicLoading-seed#[F346093846C9D5F1]) [    ] o.a.s.c.AbstractFullDistribZkTestBase create jetty 1 in directory /x1/jenkins/jenkins-slave/workspace/Lucene-Solr-Tests-master/solr/build/solr-core/test/J2/temp/solr.core.TestDynamicLoading_F346093846C9D5F1-001/shard-1-001
   [junit4]   2> 658489 INFO  (TEST-TestDynamicLoading.testDynamicLoading-seed#[F346093846C9D5F1]) [    ] o.e.j.s.Server jetty-9.3.8.v20160314
   [junit4]   2> 658670 INFO  (TEST-TestDynamicLoading.testDynamicLoading-seed#[F346093846C9D5F1]) [    ] o.e.j.s.h.ContextHandler Started o.e.j.s.ServletContextHandler@64972c76{/,null,AVAILABLE}
   [junit4]   2> 658672 INFO  (TEST-TestDynamicLoading.testDynamicLoading-seed#[F346093846C9D5F1]) [    ] o.e.j.s.ServerConnector Started ServerConnector@55ef3142{SSL,[ssl, http/1.1]}{127.0.0.1:45045}
   [junit4]   2> 658672 INFO  (TEST-TestDynamicLoading.testDynamicLoading-seed#[F346093846C9D5F1]) [    ] o.e.j.s.Server Started @666112ms
   [junit4]   2> 658672 INFO  (TEST-TestDynamicLoading.testDynamicLoading-seed#[F346093846C9D5F1]) [    ] o.a.s.c.s.e.JettySolrRunner Jetty properties: {solr.data.dir=/x1/jenkins/jenkins-slave/workspace/Lucene-Solr-Tests-master/solr/build/solr-core/test/J2/temp/solr.core.TestDynamicLoading_F346093846C9D5F1-001/tempDir-001/jetty1, solrconfig=solrconfig.xml, hostContext=/, hostPort=45045, coreRootDirectory=/x1/jenkins/jenkins-slave/workspace/Lucene-Solr-Tests-master/solr/build/solr-core/test/J2/../../../../../../../../../../x1/jenkins/jenkins-slave/workspace/Lucene-Solr-Tests-master/solr/build/solr-core/test/J2/temp/solr.core.TestDynamicLoading_F346093846C9D5F1-001/shard-1-001/cores}
   [junit4]   2> 658672 INFO  (TEST-TestDynamicLoading.testDynamicLoading-seed#[F346093846C9D5F1]) [    ] o.a.s.s.SolrDispatchFilter SolrDispatchFilter.init(): sun.misc.Launcher$AppClassLoader@73d16e93
   [junit4]   2> 658672 INFO  (TEST-TestDynamicLoading.testDynamicLoading-seed#[F346093846C9D5F1]) [    ] o.a.s.c.SolrResourceLoader new SolrResourceLoader for directory: '/x1/jenkins/jenkins-slave/workspace/Lucene-Solr-Tests-master/solr/build/solr-core/test/J2/temp/solr.core.TestDynamicLoading_F346093846C9D5F1-001/shard-1-001'
   [junit4]   2> 658672 INFO  (TEST-TestDynamicLoading.testDynamicLoading-seed#[F346093846C9D5F1]) [    ] o.a.s.c.SolrResourceLoader JNDI not configured for solr (NoInitialContextEx)
   [junit4]   2> 658672 INFO  (TEST-TestDynamicLoading.testDynamicLoading-seed#[F346093846C9D5F1]) [    ] o.a.s.c.SolrResourceLoader solr home defaulted to 'solr/' (could not find system property or JNDI)
   [junit4]   2> 658678 INFO  (TEST-TestDynamicLoading.testDynamicLoading-seed#[F346093846C9D5F1]) [    ] o.a.s.c.c.SolrZkClient Using default ZkCredentialsProvider
   [junit4]   2> 658679 INFO  (TEST-TestDynamicLoading.testDynamicLoading-seed#[F346093846C9D5F1]) [    ] o.a.s.c.c.ConnectionManager Waiting for client to connect to ZooKeeper
   [junit4]   2> 658707 INFO  (zkCallback-896-thread-1) [    ] o.a.s.c.c.ConnectionManager Watcher org.apache.solr.common.cloud.ConnectionManager@35e8b3a8 name:ZooKeeperConnection Watcher:127.0.0.1:44919/solr got event WatchedEvent state:SyncConnected type:None path:null path:null type:None
   [junit4]   2> 658710 INFO  (TEST-TestDynamicLoading.testDynamicLoading-seed#[F346093846C9D5F1]) [    ] o.a.s.c.c.ConnectionManager Client is connected to ZooKeeper
   [junit4]   2> 658710 INFO  (TEST-TestDynamicLoading.testDynamicLoading-seed#[F346093846C9D5F1]) [    ] o.a.s.c.c.SolrZkClient Using default ZkACLProvider
   [junit4]   2> 658718 INFO  (TEST-TestDynamicLoading.testDynamicLoading-seed#[F346093846C9D5F1]) [    ] o.a.s.s.SolrDispatchFilter Loading solr.xml from SolrHome (not found in ZooKeeper)
   [junit4]   2> 658718 INFO  (TEST-TestDynamicLoading.testDynamicLoading-seed#[F346093846C9D5F1]) [    ] o.a.s.c.SolrXmlConfig Loading container configuration from /x1/jenkins/jenkins-slave/workspace/Lucene-Solr-Tests-master/solr/build/solr-core/test/J2/temp/solr.core.TestDynamicLoading_F346093846C9D5F1-001/shard-1-001/solr.xml
   [junit4]   2> 658727 INFO  (TEST-TestDynamicLoading.testDynamicLoading-seed#[F346093846C9D5F1]) [    ] o.a.s.c.CorePropertiesLocator Config-defined core root directory: /x1/jenkins/jenkins-slave/workspace/Lucene-Solr-Tests-master/solr/build/solr-core/test/J2/../../../../../../../../../../x1/jenkins/jenkins-slave/workspace/Lucene-Solr-Tests-master/solr/build/solr-core/test/J2/temp/solr.core.TestDynamicLoading_F346093846C9D5F1-001/shard-1-001/cores
   [junit4]   2> 658727 INFO  (TEST-TestDynamicLoading.testDynamicLoading-seed#[F346093846C9D5F1]) [    ] o.a.s.c.CoreContainer New CoreContainer 547392930
   [junit4]   2> 658727 INFO  (TEST-TestDynamicLoading.testDynamicLoading-seed#[F346093846C9D5F1]) [    ] o.a.s.c.CoreContainer Loading cores into CoreContainer [instanceDir=/x1/jenkins/jenkins-slave/workspace/Lucene-Solr-Tests-master/solr/build/solr-core/test/J2/temp/solr.core.TestDynamicLoading_F346093846C9D5F1-001/shard-1-001]
   [junit4]   2> 658727 WARN  (TEST-TestDynamicLoading.testDynamicLoading-seed#[F346093846C9D5F1]) [    ] o.a.s.c.CoreContainer Couldn't add files from /x1/jenkins/jenkins-slave/workspace/Lucene-Solr-Tests-master/solr/build/solr-core/test/J2/temp/solr.core.TestDynamicLoading_F346093846C9D5F1-001/shard-1-001/lib to classpath: /x1/jenkins/jenkins-slave/workspace/Lucene-Solr-Tests-master/solr/build/solr-core/test/J2/temp/solr.core.TestDynamicLoading_F346093846C9D5F1-001/shard-1-001/lib
   [junit4]   2> 658742 INFO  (TEST-TestDynamicLoading.testDynamicLoading-seed#[F346093846C9D5F1]) [    ] o.a.s.h.c.HttpShardHandlerFactory created with socketTimeout : 90000,urlScheme : ,connTimeout : 15000,maxConnectionsPerHost : 20,maxConnections : 10000,corePoolSize : 0,maximumPoolSize : 2147483647,maxThreadIdleTime : 5,sizeOfQueue : -1,fairnessPolicy : false,
   [junit4]   2> 658767 INFO  (TEST-TestDynamicLoading.testDynamicLoading-seed#[F346093846C9D5F1]) [    ] o.a.s.u.UpdateShardHandler Created UpdateShardHandler HTTP client with params: socketTimeout=340000&connTimeout=45000&maxConnections=100000&maxConnectionsPerHost=100000
   [junit4]   2> 658767 INFO  (TEST-TestDynamicLoading.testDynamicLoading-seed#[F346093846C9D5F1]) [    ] o.a.s.l.LogWatcher SLF4J impl is org.slf4j.impl.Log4jLoggerFactory
   [junit4]   2> 658767 INFO  (TEST-TestDynamicLoading.testDynamicLoading-seed#[F346093846C9D5F1]) [    ] o.a.s.l.LogWatcher Registering Log Listener [Log4j (org.slf4j.impl.Log4jLoggerFactory)]
   [junit4]   2> 658767 INFO  (TEST-TestDynamicLoading.testDynamicLoading-seed#[F346093846C9D5F1]) [    ] o.a.s.c.ZkContainer Zookeeper client=127.0.0.1:44919/solr
   [junit4]   2> 658767 INFO  (TEST-TestDynamicLoading.testDynamicLoading-seed#[F346093846C9D5F1]) [    ] o.a.s.c.ZkController zkHost includes chroot
   [junit4]   2> 658767 INFO  (TEST-TestDynamicLoading.testDynamicLoading-seed#[F346093846C9D5F1]) [    ] o.a.s.c.c.SolrZkClient Using default ZkCredentialsProvider
   [junit4]   2> 658769 INFO  (TEST-TestDynamicLoading.testDynamicLoading-seed#[F346093846C9D5F1]) [    ] o.a.s.c.c.ConnectionManager Waiting for client to connect to ZooKeeper
   [junit4]   2> 658769 INFO  (zkCallback-899-thread-1) [    ] o.a.s.c.c.ConnectionManager Watcher org.apache.solr.common.cloud.ConnectionManager@29a4928a name:ZooKeeperConnection Watcher:127.0.0.1:44919 got event WatchedEvent state:SyncConnected type:None path:null path:null type:None
   [junit4]   2> 658770 INFO  (TEST-TestDynamicLoading.testDynamicLoading-seed#[F346093846C9D5F1]) [    ] o.a.s.c.c.ConnectionManager Client is connected to ZooKeeper
   [junit4]   2> 658770 INFO  (TEST-TestDynamicLoading.testDynamicLoading-seed#[F346093846C9D5F1]) [    ] o.a.s.c.c.SolrZkClient Using default ZkACLProvider
   [junit4]   2> 658778 INFO  (TEST-TestDynamicLoading.testDynamicLoading-seed#[F346093846C9D5F1]) [n:127.0.0.1:45045_    ] o.a.s.c.ZkController Added new OnReconnect listener org.apache.solr.cloud.ZkController$$Lambda$12/498199007@74396cad
   [junit4]   2> 658870 INFO  (TEST-TestDynamicLoading.testDynamicLoading-seed#[F346093846C9D5F1]) [n:127.0.0.1:45045_    ] o.a.s.c.c.ConnectionManager Waiting for client to connect to ZooKeeper
   [junit4]   2> 658878 INFO  (zkCallback-900-thread-1-processing-n:127.0.0.1:45045_) [n:127.0.0.1:45045_    ] o.a.s.c.c.ConnectionManager Watcher org.apache.solr.common.cloud.ConnectionManager@7a9cafeb name:ZooKeeperConnection Watcher:127.0.0.1:44919/solr got event WatchedEvent state:SyncConnected type:None path:null path:null type:None
   [junit4]   2> 658878 INFO  (TEST-TestDynamicLoading.testDynamicLoading-seed#[F346093846C9D5F1]) [n:127.0.0.1:45045_    ] o.a.s.c.c.ConnectionManager Client is connected to ZooKeeper
   [junit4]   2> 658891 INFO  (TEST-TestDynamicLoading.testDynamicLoading-seed#[F346093846C9D5F1]) [n:127.0.0.1:45045_    ] o.a.s.c.c.ZkStateReader Updating cluster state from ZooKeeper... 
   [junit4]   2> 658891 INFO  (TEST-TestDynamicLoading.testDynamicLoading-seed#[F346093846C9D5F1]) [n:127.0.0.1:45045_    ] o.a.s.c.c.ZkStateReader Loaded cluster properties: {urlScheme=https}
   [junit4]   2> 658891 INFO  (TEST-TestDynamicLoading.testDynamicLoading-seed#[F346093846C9D5F1]) [n:127.0.0.1:45045_    ] o.a.s.c.c.ZkStateReader Updated live nodes from ZooKeeper... (0) -> (1)
   [junit4]   2> 658894 INFO  (TEST-TestDynamicLoading.testDynamicLoading-seed#[F346093846C9D5F1]) [n:127.0.0.1:45045_    ] o.a.s.c.Overseer Overseer (id=null) closing
   [junit4]   2> 658902 INFO  (TEST-TestDynamicLoading.testDynamicLoading-seed#[F346093846C9D5F1]) [n:127.0.0.1:45045_    ] o.a.s.c.LeaderElector Joined leadership election with path: /overseer_elect/election/96576334255947786-127.0.0.1:45045_-n_0000000001
   [junit4]   2> 658902 INFO  (TEST-TestDynamicLoading.testDynamicLoading-seed#[F346093846C9D5F1]) [n:127.0.0.1:45045_    ] o.a.s.c.LeaderElector Watching path /overseer_elect/election/96576334255947781-127.0.0.1:50584_-n_0000000000 to know if I could be the leader
   [junit4]   2> 658903 INFO  (TEST-TestDynamicLoading.testDynamicLoading-seed#[F346093846C9D5F1]) [n:127.0.0.1:45045_    ] o.a.s.c.ZkController Publish node=127.0.0.1:45045_ as DOWN
   [junit4]   2> 658905 INFO  (OverseerStateUpdate-96576334255947781-127.0.0.1:50584_-n_0000000000) [n:127.0.0.1:50584_    ] o.a.s.c.Overseer processMessage: queueSize: 1, message = {
   [junit4]   2>   "operation":"downnode",
   [junit4]   2>   "node_name":"127.0.0.1:45045_"} current state version: 4
   [junit4]   2> 658905 INFO  (OverseerStateUpdate-96576334255947781-127.0.0.1:50584_-n_0000000000) [n:127.0.0.1:50584_    ] o.a.s.c.o.NodeMutator DownNode state invoked for node: 127.0.0.1:45045_
   [junit4]   2> 658906 INFO  (zkCallback-894-thread-1) [    ] o.a.s.c.c.ZkStateReader A cluster state change: [WatchedEvent state:SyncConnected type:NodeDataChanged path:/clusterstate.json], has occurred - updating... (live nodes size: [1])
   [junit4]   2> 658906 INFO  (zkCallback-890-thread-3-processing-n:127.0.0.1:50584_) [n:127.0.0.1:50584_    ] o.a.s.c.c.ZkStateReader A cluster state change: [WatchedEvent state:SyncConnected type:NodeDataChanged path:/clusterstate.json], has occurred - updating... (live nodes size: [1])
   [junit4]   2> 658906 INFO  (TEST-TestDynamicLoading.testDynamicLoading-seed#[F346093846C9D5F1]) [n:127.0.0.1:45045_    ] o.a.s.c.ZkController Register node as live in ZooKeeper:/live_nodes/127.0.0.1:45045_
   [junit4]   2> 658906 INFO  (TEST-TestDynamicLoading.testDynamicLoading-seed#[F346093846C9D5F1]) [n:127.0.0.1:45045_    ] o.a.s.c.c.SolrZkClient makePath: /live_nodes/127.0.0.1:45045_
   [junit4]   2> 658906 INFO  (zkCallback-900-thread-1-processing-n:127.0.0.1:45045_) [n:127.0.0.1:45045_    ] o.a.s.c.c.ZkStateReader A cluster state change: [WatchedEvent state:SyncConnected type:NodeDataChanged path:/clusterstate.json], has occurred - updating... (live nodes size: [1])
   [junit4]   2> 658918 INFO  (zkCallback-894-thread-1) [    ] o.a.s.c.c.ZkStateReader A live node change: [WatchedEvent state:SyncConnected type:NodeChildrenChanged path:/live_nodes], has occurred - updating... (live nodes size: [1])
   [junit4]   2> 658919 INFO  (zkCallback-890-thread-3-processing-n:127.0.0.1:50584_) [n:127.0.0.1:50584_    ] o.a.s.c.c.ZkStateReader A live node change: [WatchedEvent state:SyncConnected type:NodeChildrenChanged path:/live_nodes], has occurred - updating... (live nodes size: [1])
   [junit4]   2> 658919 INFO  (zkCallback-894-thread-1) [    ] o.a.s.c.c.ZkStateReader Updated live nodes from ZooKeeper... (1) -> (2)
   [junit4]   2> 658919 INFO  (zkCallback-890-thread-3-processing-n:127.0.0.1:50584_) [n:127.0.0.1:50584_    ] o.a.s.c.c.ZkStateReader Updated live nodes from ZooKeeper... (1) -> (2)
   [junit4]   2> 658920 INFO  (zkCallback-900-thread-1-processing-n:127.0.0.1:45045_) [n:127.0.0.1:45045_    ] o.a.s.c.c.ZkStateReader A live node change: [WatchedEvent state:SyncConnected type:NodeChildrenChanged path:/live_nodes], has occurred - updating... (live nodes size: [1])
   [junit4]   2> 658921 INFO  (zkCallback-900-thread-1-processing-n:127.0.0.1:45045_) [n:127.0.0.1:45045_    ] o.a.s.c.c.ZkStateReader Updated live nodes from ZooKeeper... (1) -> (2)
   [junit4]   2> 658954 INFO  (TEST-TestDynamicLoading.testDynamicLoading-seed#[F346093846C9D5F1]) [n:127.0.0.1:45045_    ] o.a.s.c.CoreContainer Security conf doesn't exist. Skipping setup for authorization module.
   [junit4]   2> 658954 INFO  (TEST-TestDynamicLoading.testDynamicLoading-seed#[F346093846C9D5F1]) [n:127.0.0.1:45045_    ] o.a.s.c.CoreContainer No authentication plugin used.
   [junit4]   2> 658955 INFO  (TEST-TestDynamicLoading.testDynamicLoading-seed#[F346093846C9D5F1]) [n:127.0.0.1:45045_    ] o.a.s.c.CorePropertiesLocator Looking for core definitions underneath /x1/jenkins/jenkins-slave/workspace/Lucene-Solr-Tests-master/solr/build/solr-core/test/J2/../../../../../../../../../../x1/jenkins/jenkins-slave/workspace/Lucene-Solr-Tests-master/solr/build/solr-core/test/J2/temp/solr.core.TestDynamicLoading_F346093846C9D5F1-001/shard-1-001/cores
   [junit4]   2> 658955 INFO  (TEST-TestDynamicLoading.testDynamicLoading-seed#[F346093

[...truncated too long message...]

cessMessage: queueSize: 1, message = {
   [junit4]   2>   "operation":"downnode",
   [junit4]   2>   "node_name":"127.0.0.1:41973_solr"} current state version: 0
   [junit4]   2> 843710 INFO  (OverseerStateUpdate-96576344321163273-127.0.0.1:41973_solr-n_0000000000) [n:127.0.0.1:41973_solr    ] o.a.s.c.o.NodeMutator DownNode state invoked for node: 127.0.0.1:41973_solr
   [junit4]   2> 843714 INFO  (zkCallback-1032-thread-2-processing-n:127.0.0.1:52940_solr) [n:127.0.0.1:52940_solr    ] o.a.s.c.c.ZkStateReader A live node change: [WatchedEvent state:SyncConnected type:NodeChildrenChanged path:/live_nodes], has occurred - updating... (live nodes size: [5])
   [junit4]   2> 843714 WARN  (zkCallback-1032-thread-2-processing-n:127.0.0.1:52940_solr) [n:127.0.0.1:52940_solr    ] o.a.s.c.c.ZkStateReader ZooKeeper watch triggered, but Solr cannot talk to ZK: [KeeperErrorCode = Session expired for /live_nodes]
   [junit4]   2> 843718 INFO  (jetty-launcher-1002-thread-2) [    ] o.a.s.c.Overseer Overseer (id=96576344321163273-127.0.0.1:41973_solr-n_0000000000) closing
   [junit4]   2> 843718 INFO  (OverseerStateUpdate-96576344321163273-127.0.0.1:41973_solr-n_0000000000) [n:127.0.0.1:41973_solr    ] o.a.s.c.Overseer Overseer Loop exiting : 127.0.0.1:41973_solr
   [junit4]   2> 843743 INFO  (zkCallback-1015-thread-5-processing-n:127.0.0.1:41973_solr) [n:127.0.0.1:41973_solr    ] o.a.s.c.c.ZkStateReader A live node change: [WatchedEvent state:SyncConnected type:NodeChildrenChanged path:/live_nodes], has occurred - updating... (live nodes size: [1])
   [junit4]   2> 845158 WARN  (zkCallback-1030-thread-2-processing-n:127.0.0.1:53859_solr) [n:127.0.0.1:53859_solr    ] o.a.s.c.c.ZkStateReader ZooKeeper watch triggered, but Solr cannot talk to ZK: [KeeperErrorCode = Session expired for /live_nodes]
   [junit4]   2> 845158 INFO  (jetty-launcher-1002-thread-5) [    ] o.e.j.s.h.ContextHandler Stopped o.e.j.s.ServletContextHandler@53f9dccc{/solr,null,UNAVAILABLE}
   [junit4]   2> 845186 WARN  (zkCallback-1032-thread-1-processing-n:127.0.0.1:52940_solr) [n:127.0.0.1:52940_solr    ] o.a.s.c.LeaderElector 
   [junit4]   2> org.apache.zookeeper.KeeperException$SessionExpiredException: KeeperErrorCode = Session expired for /overseer_elect/election
   [junit4]   2> 	at org.apache.zookeeper.KeeperException.create(KeeperException.java:127)
   [junit4]   2> 	at org.apache.zookeeper.KeeperException.create(KeeperException.java:51)
   [junit4]   2> 	at org.apache.zookeeper.ZooKeeper.getChildren(ZooKeeper.java:1472)
   [junit4]   2> 	at org.apache.solr.common.cloud.SolrZkClient$6.execute(SolrZkClient.java:331)
   [junit4]   2> 	at org.apache.solr.common.cloud.SolrZkClient$6.execute(SolrZkClient.java:328)
   [junit4]   2> 	at org.apache.solr.common.cloud.ZkCmdExecutor.retryOperation(ZkCmdExecutor.java:60)
   [junit4]   2> 	at org.apache.solr.common.cloud.SolrZkClient.getChildren(SolrZkClient.java:328)
   [junit4]   2> 	at org.apache.solr.cloud.LeaderElector.checkIfIamLeader(LeaderElector.java:105)
   [junit4]   2> 	at org.apache.solr.cloud.LeaderElector.access$200(LeaderElector.java:56)
   [junit4]   2> 	at org.apache.solr.cloud.LeaderElector$ElectionWatcher.process(LeaderElector.java:348)
   [junit4]   2> 	at org.apache.solr.common.cloud.SolrZkClient$3.lambda$process$0(SolrZkClient.java:266)
   [junit4]   2> 	at java.util.concurrent.Executors$RunnableAdapter.call(Executors.java:511)
   [junit4]   2> 	at java.util.concurrent.FutureTask.run(FutureTask.java:266)
   [junit4]   2> 	at org.apache.solr.common.util.ExecutorUtil$MDCAwareThreadPoolExecutor.lambda$execute$0(ExecutorUtil.java:229)
   [junit4]   2> 	at java.util.concurrent.ThreadPoolExecutor.runWorker(ThreadPoolExecutor.java:1142)
   [junit4]   2> 	at java.util.concurrent.ThreadPoolExecutor$Worker.run(ThreadPoolExecutor.java:617)
   [junit4]   2> 	at java.lang.Thread.run(Thread.java:745)
   [junit4]   2> 845187 INFO  (jetty-launcher-1002-thread-1) [    ] o.e.j.s.h.ContextHandler Stopped o.e.j.s.ServletContextHandler@1a304b86{/solr,null,UNAVAILABLE}
   [junit4]   2> 845187 WARN  (zkCallback-1025-thread-1-processing-n:127.0.0.1:52488_solr) [n:127.0.0.1:52488_solr    ] o.a.s.c.c.ZkStateReader ZooKeeper watch triggered, but Solr cannot talk to ZK: [KeeperErrorCode = Session expired for /live_nodes]
   [junit4]   2> 845188 INFO  (jetty-launcher-1002-thread-4) [    ] o.e.j.s.h.ContextHandler Stopped o.e.j.s.ServletContextHandler@5a9f1a4f{/solr,null,UNAVAILABLE}
   [junit4]   2> 845188 WARN  (zkCallback-1019-thread-1-processing-n:127.0.0.1:33984_solr) [n:127.0.0.1:33984_solr    ] o.a.s.c.c.ZkStateReader ZooKeeper watch triggered, but Solr cannot talk to ZK: [KeeperErrorCode = Session expired for /live_nodes]
   [junit4]   2> 845194 INFO  (jetty-launcher-1002-thread-3) [    ] o.e.j.s.h.ContextHandler Stopped o.e.j.s.ServletContextHandler@79a6cfac{/solr,null,UNAVAILABLE}
   [junit4]   2> 845243 WARN  (zkCallback-1015-thread-5-processing-n:127.0.0.1:41973_solr) [n:127.0.0.1:41973_solr    ] o.a.s.c.c.ZkStateReader ZooKeeper watch triggered, but Solr cannot talk to ZK: [KeeperErrorCode = Session expired for /live_nodes]
   [junit4]   2> 845250 INFO  (jetty-launcher-1002-thread-2) [    ] o.e.j.s.h.ContextHandler Stopped o.e.j.s.ServletContextHandler@3a4ef7ee{/solr,null,UNAVAILABLE}
   [junit4]   2> 845263 INFO  (SUITE-DistribJoinFromCollectionTest-seed#[F346093846C9D5F1]-worker) [    ] o.a.s.c.ZkTestServer connecting to 127.0.0.1:42297 42297
   [junit4]   2> 845382 INFO  (Thread-1156) [    ] o.a.s.c.ZkTestServer connecting to 127.0.0.1:42297 42297
   [junit4]   2> 845390 WARN  (Thread-1156) [    ] o.a.s.c.ZkTestServer Watch limit violations: 
   [junit4]   2> Maximum concurrent create/delete watches above limit:
   [junit4]   2> 
   [junit4]   2> 	6	/solr/aliases.json
   [junit4]   2> 	6	/solr/clusterprops.json
   [junit4]   2> 	5	/solr/security.json
   [junit4]   2> 	4	/solr/configs/solrCloudCollectionConfig
   [junit4]   2> 
   [junit4]   2> Maximum concurrent data watches above limit:
   [junit4]   2> 
   [junit4]   2> 	6	/solr/clusterstate.json
   [junit4]   2> 	4	/solr/collections/from_1x4/state.json
   [junit4]   2> 	4	/solr/collections/to_2x2/state.json
   [junit4]   2> 
   [junit4]   2> Maximum concurrent children watches above limit:
   [junit4]   2> 
   [junit4]   2> 	30	/solr/overseer/queue
   [junit4]   2> 	21	/solr/overseer/collection-queue-work
   [junit4]   2> 	9	/solr/overseer/queue-work
   [junit4]   2> 	6	/solr/live_nodes
   [junit4]   2> 	6	/solr/collections
   [junit4]   2> 
   [junit4]   2> 845394 INFO  (SUITE-DistribJoinFromCollectionTest-seed#[F346093846C9D5F1]-worker) [    ] o.a.s.SolrTestCaseJ4 ###deleteCore
   [junit4]   2> NOTE: leaving temporary files on disk at: /x1/jenkins/jenkins-slave/workspace/Lucene-Solr-Tests-master/solr/build/solr-core/test/J2/temp/solr.cloud.DistribJoinFromCollectionTest_F346093846C9D5F1-001
   [junit4]   2> Sep 11, 2016 11:55:02 PM com.carrotsearch.randomizedtesting.ThreadLeakControl checkThreadLeaks
   [junit4]   2> WARNING: Will linger awaiting termination of 1 leaked thread(s).
   [junit4]   2> NOTE: test params are: codec=Asserting(Lucene62): {get_s=TestBloomFilteredLucenePostings(BloomFilteringPostingsFormat(Lucene50(blocksize=128))), join_s=Lucene50(blocksize=128), range_facet_l_dv=PostingsFormat(name=Direct), _version_=Lucene50(blocksize=128), multiDefault=TestBloomFilteredLucenePostings(BloomFilteringPostingsFormat(Lucene50(blocksize=128))), match_s=PostingsFormat(name=Memory doPackFST= true), intDefault=Lucene50(blocksize=128), id=PostingsFormat(name=Direct), range_facet_i_dv=TestBloomFilteredLucenePostings(BloomFilteringPostingsFormat(Lucene50(blocksize=128))), range_facet_l=TestBloomFilteredLucenePostings(BloomFilteringPostingsFormat(Lucene50(blocksize=128))), timestamp=TestBloomFilteredLucenePostings(BloomFilteringPostingsFormat(Lucene50(blocksize=128)))}, docValues:{range_facet_l_dv=DocValuesFormat(name=Asserting), range_facet_i_dv=DocValuesFormat(name=Lucene54), timestamp=DocValuesFormat(name=Lucene54)}, maxPointsInLeafNode=179, maxMBSortInHeap=7.521959041632813, sim=ClassicSimilarity, locale=ar-OM, timezone=Asia/Ust-Nera
   [junit4]   2> NOTE: Linux 3.13.0-85-generic amd64/Oracle Corporation 1.8.0_102 (64-bit)/cpus=4,threads=1,free=62789672,total=524812288
   [junit4]   2> NOTE: All tests run in this JVM: [TestConfigSetsAPI, TestJettySolrRunner, TestIndexSearcher, TestWriterPerf, BaseCdcrDistributedZkTest, TestSearcherReuse, FieldMutatingUpdateProcessorTest, AutoCommitTest, TestSolrJ, TestLMJelinekMercerSimilarityFactory, StatelessScriptUpdateProcessorFactoryTest, JSONWriterTest, TestJsonRequest, TestAnalyzeInfixSuggestions, BadIndexSchemaTest, TestSlowCompositeReaderWrapper, TestInitQParser, PreAnalyzedFieldTest, TestAnalyzedSuggestions, TestAuthenticationFramework, TestShardHandlerFactory, TestDistribIDF, TestLRUStatsCache, TestSolrQueryParserResource, ZkStateReaderTest, SOLR749Test, TestSort, HdfsBasicDistributedZkTest, EnumFieldTest, TestSolrDeletionPolicy1, TestSolrQueryParser, TestDistributedMissingSort, TestSubQueryTransformerCrossCore, TestTestInjection, TestFreeTextSuggestions, TestPerFieldSimilarityWithDefaultOverride, HdfsLockFactoryTest, TestQueryWrapperFilter, TestCryptoKeys, DirectUpdateHandlerTest, TestExclusionRuleCollectionAccess, TestRecovery, ConfigSetsAPITest, HdfsThreadLeakTest, TestComplexPhraseQParserPlugin, HdfsWriteToMultipleCollectionsTest, AssignTest, TestAuthorizationFramework, TestConfig, OverseerStatusTest, TestClassicSimilarityFactory, BitVectorTest, QueryParsingTest, CustomCollectionTest, DirectUpdateHandlerOptimizeTest, TestStressReorder, TestExtendedDismaxParser, TestDynamicLoading, TestUtils, GraphQueryTest, OpenExchangeRatesOrgProviderTest, TestReload, CollectionsAPIAsyncDistributedZkTest, SharedFSAutoReplicaFailoverTest, TestOnReconnectListenerSupport, DistribJoinFromCollectionTest]
   [junit4] Completed [170/631 (2!)] on J2 in 37.03s, 2 tests, 1 error <<< FAILURES!

[...truncated 61710 lines...]



Mime
View raw message