lucene-dev mailing list archives

Site index · List index
Message view « Date » · « Thread »
Top « Date » · « Thread »
From Policeman Jenkins Server <jenk...@thetaphi.de>
Subject [JENKINS] Lucene-Solr-master-Solaris (64bit/jdk1.8.0) - Build # 825 - Still Unstable!
Date Fri, 02 Sep 2016 22:40:25 GMT
Build: http://jenkins.thetaphi.de/job/Lucene-Solr-master-Solaris/825/
Java: 64bit/jdk1.8.0 -XX:-UseCompressedOops -XX:+UseSerialGC

2 tests failed.
FAILED:  org.apache.solr.handler.TestSolrConfigHandlerConcurrent.test

Error Message:


Stack Trace:
java.lang.NullPointerException
	at __randomizedtesting.SeedInfo.seed([5FCB0D442252EFE3:D79F329E8CAE821B]:0)
	at org.apache.solr.handler.TestSolrConfigHandlerConcurrent.test(TestSolrConfigHandlerConcurrent.java:109)
	at sun.reflect.NativeMethodAccessorImpl.invoke0(Native Method)
	at sun.reflect.NativeMethodAccessorImpl.invoke(NativeMethodAccessorImpl.java:62)
	at sun.reflect.DelegatingMethodAccessorImpl.invoke(DelegatingMethodAccessorImpl.java:43)
	at java.lang.reflect.Method.invoke(Method.java:498)
	at com.carrotsearch.randomizedtesting.RandomizedRunner.invoke(RandomizedRunner.java:1764)
	at com.carrotsearch.randomizedtesting.RandomizedRunner$8.evaluate(RandomizedRunner.java:871)
	at com.carrotsearch.randomizedtesting.RandomizedRunner$9.evaluate(RandomizedRunner.java:907)
	at com.carrotsearch.randomizedtesting.RandomizedRunner$10.evaluate(RandomizedRunner.java:921)
	at org.apache.solr.BaseDistributedSearchTestCase$ShardsRepeatRule$ShardsFixedStatement.callStatement(BaseDistributedSearchTestCase.java:985)
	at org.apache.solr.BaseDistributedSearchTestCase$ShardsRepeatRule$ShardsStatement.evaluate(BaseDistributedSearchTestCase.java:960)
	at com.carrotsearch.randomizedtesting.rules.SystemPropertiesRestoreRule$1.evaluate(SystemPropertiesRestoreRule.java:57)
	at org.apache.lucene.util.TestRuleSetupTeardownChained$1.evaluate(TestRuleSetupTeardownChained.java:49)
	at org.apache.lucene.util.AbstractBeforeAfterRule$1.evaluate(AbstractBeforeAfterRule.java:45)
	at org.apache.lucene.util.TestRuleThreadAndTestName$1.evaluate(TestRuleThreadAndTestName.java:48)
	at org.apache.lucene.util.TestRuleIgnoreAfterMaxFailures$1.evaluate(TestRuleIgnoreAfterMaxFailures.java:64)
	at org.apache.lucene.util.TestRuleMarkFailure$1.evaluate(TestRuleMarkFailure.java:47)
	at com.carrotsearch.randomizedtesting.rules.StatementAdapter.evaluate(StatementAdapter.java:36)
	at com.carrotsearch.randomizedtesting.ThreadLeakControl$StatementRunner.run(ThreadLeakControl.java:367)
	at com.carrotsearch.randomizedtesting.ThreadLeakControl.forkTimeoutingTask(ThreadLeakControl.java:809)
	at com.carrotsearch.randomizedtesting.ThreadLeakControl$3.evaluate(ThreadLeakControl.java:460)
	at com.carrotsearch.randomizedtesting.RandomizedRunner.runSingleTest(RandomizedRunner.java:880)
	at com.carrotsearch.randomizedtesting.RandomizedRunner$5.evaluate(RandomizedRunner.java:781)
	at com.carrotsearch.randomizedtesting.RandomizedRunner$6.evaluate(RandomizedRunner.java:816)
	at com.carrotsearch.randomizedtesting.RandomizedRunner$7.evaluate(RandomizedRunner.java:827)
	at com.carrotsearch.randomizedtesting.rules.StatementAdapter.evaluate(StatementAdapter.java:36)
	at com.carrotsearch.randomizedtesting.rules.SystemPropertiesRestoreRule$1.evaluate(SystemPropertiesRestoreRule.java:57)
	at org.apache.lucene.util.AbstractBeforeAfterRule$1.evaluate(AbstractBeforeAfterRule.java:45)
	at com.carrotsearch.randomizedtesting.rules.StatementAdapter.evaluate(StatementAdapter.java:36)
	at org.apache.lucene.util.TestRuleStoreClassName$1.evaluate(TestRuleStoreClassName.java:41)
	at com.carrotsearch.randomizedtesting.rules.NoShadowingOrOverridesOnMethodsRule$1.evaluate(NoShadowingOrOverridesOnMethodsRule.java:40)
	at com.carrotsearch.randomizedtesting.rules.NoShadowingOrOverridesOnMethodsRule$1.evaluate(NoShadowingOrOverridesOnMethodsRule.java:40)
	at com.carrotsearch.randomizedtesting.rules.StatementAdapter.evaluate(StatementAdapter.java:36)
	at com.carrotsearch.randomizedtesting.rules.StatementAdapter.evaluate(StatementAdapter.java:36)
	at com.carrotsearch.randomizedtesting.rules.StatementAdapter.evaluate(StatementAdapter.java:36)
	at org.apache.lucene.util.TestRuleAssertionsRequired$1.evaluate(TestRuleAssertionsRequired.java:53)
	at org.apache.lucene.util.TestRuleMarkFailure$1.evaluate(TestRuleMarkFailure.java:47)
	at org.apache.lucene.util.TestRuleIgnoreAfterMaxFailures$1.evaluate(TestRuleIgnoreAfterMaxFailures.java:64)
	at org.apache.lucene.util.TestRuleIgnoreTestSuites$1.evaluate(TestRuleIgnoreTestSuites.java:54)
	at com.carrotsearch.randomizedtesting.rules.StatementAdapter.evaluate(StatementAdapter.java:36)
	at com.carrotsearch.randomizedtesting.ThreadLeakControl$StatementRunner.run(ThreadLeakControl.java:367)
	at java.lang.Thread.run(Thread.java:745)


FAILED:  org.apache.solr.update.HardAutoCommitTest.testCommitWithin

Error Message:
Exception during query

Stack Trace:
java.lang.RuntimeException: Exception during query
	at __randomizedtesting.SeedInfo.seed([5FCB0D442252EFE3:E519623CA17C01F6]:0)
	at org.apache.solr.SolrTestCaseJ4.assertQ(SolrTestCaseJ4.java:782)
	at org.apache.solr.update.HardAutoCommitTest.testCommitWithin(HardAutoCommitTest.java:99)
	at sun.reflect.NativeMethodAccessorImpl.invoke0(Native Method)
	at sun.reflect.NativeMethodAccessorImpl.invoke(NativeMethodAccessorImpl.java:62)
	at sun.reflect.DelegatingMethodAccessorImpl.invoke(DelegatingMethodAccessorImpl.java:43)
	at java.lang.reflect.Method.invoke(Method.java:498)
	at com.carrotsearch.randomizedtesting.RandomizedRunner.invoke(RandomizedRunner.java:1764)
	at com.carrotsearch.randomizedtesting.RandomizedRunner$8.evaluate(RandomizedRunner.java:871)
	at com.carrotsearch.randomizedtesting.RandomizedRunner$9.evaluate(RandomizedRunner.java:907)
	at com.carrotsearch.randomizedtesting.RandomizedRunner$10.evaluate(RandomizedRunner.java:921)
	at com.carrotsearch.randomizedtesting.rules.SystemPropertiesRestoreRule$1.evaluate(SystemPropertiesRestoreRule.java:57)
	at org.apache.lucene.util.TestRuleSetupTeardownChained$1.evaluate(TestRuleSetupTeardownChained.java:49)
	at org.apache.lucene.util.AbstractBeforeAfterRule$1.evaluate(AbstractBeforeAfterRule.java:45)
	at org.apache.lucene.util.TestRuleThreadAndTestName$1.evaluate(TestRuleThreadAndTestName.java:48)
	at org.apache.lucene.util.TestRuleIgnoreAfterMaxFailures$1.evaluate(TestRuleIgnoreAfterMaxFailures.java:64)
	at org.apache.lucene.util.TestRuleMarkFailure$1.evaluate(TestRuleMarkFailure.java:47)
	at com.carrotsearch.randomizedtesting.rules.StatementAdapter.evaluate(StatementAdapter.java:36)
	at com.carrotsearch.randomizedtesting.ThreadLeakControl$StatementRunner.run(ThreadLeakControl.java:367)
	at com.carrotsearch.randomizedtesting.ThreadLeakControl.forkTimeoutingTask(ThreadLeakControl.java:809)
	at com.carrotsearch.randomizedtesting.ThreadLeakControl$3.evaluate(ThreadLeakControl.java:460)
	at com.carrotsearch.randomizedtesting.RandomizedRunner.runSingleTest(RandomizedRunner.java:880)
	at com.carrotsearch.randomizedtesting.RandomizedRunner$5.evaluate(RandomizedRunner.java:781)
	at com.carrotsearch.randomizedtesting.RandomizedRunner$6.evaluate(RandomizedRunner.java:816)
	at com.carrotsearch.randomizedtesting.RandomizedRunner$7.evaluate(RandomizedRunner.java:827)
	at com.carrotsearch.randomizedtesting.rules.StatementAdapter.evaluate(StatementAdapter.java:36)
	at com.carrotsearch.randomizedtesting.rules.SystemPropertiesRestoreRule$1.evaluate(SystemPropertiesRestoreRule.java:57)
	at org.apache.lucene.util.AbstractBeforeAfterRule$1.evaluate(AbstractBeforeAfterRule.java:45)
	at com.carrotsearch.randomizedtesting.rules.StatementAdapter.evaluate(StatementAdapter.java:36)
	at org.apache.lucene.util.TestRuleStoreClassName$1.evaluate(TestRuleStoreClassName.java:41)
	at com.carrotsearch.randomizedtesting.rules.NoShadowingOrOverridesOnMethodsRule$1.evaluate(NoShadowingOrOverridesOnMethodsRule.java:40)
	at com.carrotsearch.randomizedtesting.rules.NoShadowingOrOverridesOnMethodsRule$1.evaluate(NoShadowingOrOverridesOnMethodsRule.java:40)
	at com.carrotsearch.randomizedtesting.rules.StatementAdapter.evaluate(StatementAdapter.java:36)
	at com.carrotsearch.randomizedtesting.rules.StatementAdapter.evaluate(StatementAdapter.java:36)
	at com.carrotsearch.randomizedtesting.rules.StatementAdapter.evaluate(StatementAdapter.java:36)
	at org.apache.lucene.util.TestRuleAssertionsRequired$1.evaluate(TestRuleAssertionsRequired.java:53)
	at org.apache.lucene.util.TestRuleMarkFailure$1.evaluate(TestRuleMarkFailure.java:47)
	at org.apache.lucene.util.TestRuleIgnoreAfterMaxFailures$1.evaluate(TestRuleIgnoreAfterMaxFailures.java:64)
	at org.apache.lucene.util.TestRuleIgnoreTestSuites$1.evaluate(TestRuleIgnoreTestSuites.java:54)
	at com.carrotsearch.randomizedtesting.rules.StatementAdapter.evaluate(StatementAdapter.java:36)
	at com.carrotsearch.randomizedtesting.ThreadLeakControl$StatementRunner.run(ThreadLeakControl.java:367)
	at java.lang.Thread.run(Thread.java:745)
Caused by: java.lang.RuntimeException: REQUEST FAILED: xpath=//result[@numFound=1]
	xml response was: <?xml version="1.0" encoding="UTF-8"?>
<response>
<lst name="responseHeader"><int name="status">0</int><int name="QTime">0</int></lst><result name="response" numFound="0" start="0"></result>
</response>

	request was:q=id:529&qt=standard&start=0&rows=20&version=2.2
	at org.apache.solr.SolrTestCaseJ4.assertQ(SolrTestCaseJ4.java:775)
	... 40 more




Build Log:
[...truncated 10508 lines...]
   [junit4] Suite: org.apache.solr.handler.TestSolrConfigHandlerConcurrent
   [junit4]   2> Creating dataDir: /export/home/jenkins/workspace/Lucene-Solr-master-Solaris/solr/build/solr-core/test/J1/temp/solr.handler.TestSolrConfigHandlerConcurrent_5FCB0D442252EFE3-001/init-core-data-001
   [junit4]   2> 14745 INFO  (SUITE-TestSolrConfigHandlerConcurrent-seed#[5FCB0D442252EFE3]-worker) [    ] o.a.s.SolrTestCaseJ4 Randomized ssl (false) and clientAuth (false) via: @org.apache.solr.util.RandomizeSSL(reason=, value=NaN, ssl=NaN, clientAuth=NaN)
   [junit4]   2> 14746 INFO  (SUITE-TestSolrConfigHandlerConcurrent-seed#[5FCB0D442252EFE3]-worker) [    ] o.a.s.BaseDistributedSearchTestCase Setting hostContext system property: /rcsq/k
   [junit4]   2> 14766 INFO  (TEST-TestSolrConfigHandlerConcurrent.test-seed#[5FCB0D442252EFE3]) [    ] o.a.s.c.ZkTestServer STARTING ZK TEST SERVER
   [junit4]   2> 14766 INFO  (Thread-27) [    ] o.a.s.c.ZkTestServer client port:0.0.0.0/0.0.0.0:0
   [junit4]   2> 14766 INFO  (Thread-27) [    ] o.a.s.c.ZkTestServer Starting server
   [junit4]   2> 14867 INFO  (TEST-TestSolrConfigHandlerConcurrent.test-seed#[5FCB0D442252EFE3]) [    ] o.a.s.c.ZkTestServer start zk server on port:57233
   [junit4]   2> 14869 INFO  (TEST-TestSolrConfigHandlerConcurrent.test-seed#[5FCB0D442252EFE3]) [    ] o.a.s.c.c.SolrZkClient Using default ZkCredentialsProvider
   [junit4]   2> 14869 INFO  (TEST-TestSolrConfigHandlerConcurrent.test-seed#[5FCB0D442252EFE3]) [    ] o.a.s.c.c.ConnectionManager Waiting for client to connect to ZooKeeper
   [junit4]   2> 14873 INFO  (zkCallback-27-thread-1) [    ] o.a.s.c.c.ConnectionManager Watcher org.apache.solr.common.cloud.ConnectionManager@18c6daed name:ZooKeeperConnection Watcher:127.0.0.1:57233 got event WatchedEvent state:SyncConnected type:None path:null path:null type:None
   [junit4]   2> 14873 INFO  (TEST-TestSolrConfigHandlerConcurrent.test-seed#[5FCB0D442252EFE3]) [    ] o.a.s.c.c.ConnectionManager Client is connected to ZooKeeper
   [junit4]   2> 14873 INFO  (TEST-TestSolrConfigHandlerConcurrent.test-seed#[5FCB0D442252EFE3]) [    ] o.a.s.c.c.SolrZkClient Using default ZkACLProvider
   [junit4]   2> 14873 INFO  (TEST-TestSolrConfigHandlerConcurrent.test-seed#[5FCB0D442252EFE3]) [    ] o.a.s.c.c.SolrZkClient makePath: /solr
   [junit4]   2> 14880 INFO  (TEST-TestSolrConfigHandlerConcurrent.test-seed#[5FCB0D442252EFE3]) [    ] o.a.s.c.c.SolrZkClient Using default ZkCredentialsProvider
   [junit4]   2> 14880 INFO  (TEST-TestSolrConfigHandlerConcurrent.test-seed#[5FCB0D442252EFE3]) [    ] o.a.s.c.c.ConnectionManager Waiting for client to connect to ZooKeeper
   [junit4]   2> 14882 INFO  (zkCallback-28-thread-1) [    ] o.a.s.c.c.ConnectionManager Watcher org.apache.solr.common.cloud.ConnectionManager@347c0f6f name:ZooKeeperConnection Watcher:127.0.0.1:57233/solr got event WatchedEvent state:SyncConnected type:None path:null path:null type:None
   [junit4]   2> 14882 INFO  (TEST-TestSolrConfigHandlerConcurrent.test-seed#[5FCB0D442252EFE3]) [    ] o.a.s.c.c.ConnectionManager Client is connected to ZooKeeper
   [junit4]   2> 14882 INFO  (TEST-TestSolrConfigHandlerConcurrent.test-seed#[5FCB0D442252EFE3]) [    ] o.a.s.c.c.SolrZkClient Using default ZkACLProvider
   [junit4]   2> 14883 INFO  (TEST-TestSolrConfigHandlerConcurrent.test-seed#[5FCB0D442252EFE3]) [    ] o.a.s.c.c.SolrZkClient makePath: /collections/collection1
   [junit4]   2> 14887 INFO  (TEST-TestSolrConfigHandlerConcurrent.test-seed#[5FCB0D442252EFE3]) [    ] o.a.s.c.c.SolrZkClient makePath: /collections/collection1/shards
   [junit4]   2> 14892 INFO  (TEST-TestSolrConfigHandlerConcurrent.test-seed#[5FCB0D442252EFE3]) [    ] o.a.s.c.c.SolrZkClient makePath: /collections/control_collection
   [junit4]   2> 14894 INFO  (TEST-TestSolrConfigHandlerConcurrent.test-seed#[5FCB0D442252EFE3]) [    ] o.a.s.c.c.SolrZkClient makePath: /collections/control_collection/shards
   [junit4]   2> 14897 INFO  (TEST-TestSolrConfigHandlerConcurrent.test-seed#[5FCB0D442252EFE3]) [    ] o.a.s.c.AbstractZkTestCase put /export/home/jenkins/workspace/Lucene-Solr-master-Solaris/solr/core/src/test-files/solr/collection1/conf/solrconfig-tlog.xml to /configs/conf1/solrconfig.xml
   [junit4]   2> 14897 INFO  (TEST-TestSolrConfigHandlerConcurrent.test-seed#[5FCB0D442252EFE3]) [    ] o.a.s.c.c.SolrZkClient makePath: /configs/conf1/solrconfig.xml
   [junit4]   2> 14902 INFO  (TEST-TestSolrConfigHandlerConcurrent.test-seed#[5FCB0D442252EFE3]) [    ] o.a.s.c.AbstractZkTestCase put /export/home/jenkins/workspace/Lucene-Solr-master-Solaris/solr/core/src/test-files/solr/collection1/conf/schema.xml to /configs/conf1/schema.xml
   [junit4]   2> 14902 INFO  (TEST-TestSolrConfigHandlerConcurrent.test-seed#[5FCB0D442252EFE3]) [    ] o.a.s.c.c.SolrZkClient makePath: /configs/conf1/schema.xml
   [junit4]   2> 14906 INFO  (TEST-TestSolrConfigHandlerConcurrent.test-seed#[5FCB0D442252EFE3]) [    ] o.a.s.c.AbstractZkTestCase put /export/home/jenkins/workspace/Lucene-Solr-master-Solaris/solr/core/src/test-files/solr/collection1/conf/solrconfig.snippet.randomindexconfig.xml to /configs/conf1/solrconfig.snippet.randomindexconfig.xml
   [junit4]   2> 14906 INFO  (TEST-TestSolrConfigHandlerConcurrent.test-seed#[5FCB0D442252EFE3]) [    ] o.a.s.c.c.SolrZkClient makePath: /configs/conf1/solrconfig.snippet.randomindexconfig.xml
   [junit4]   2> 14908 INFO  (TEST-TestSolrConfigHandlerConcurrent.test-seed#[5FCB0D442252EFE3]) [    ] o.a.s.c.AbstractZkTestCase put /export/home/jenkins/workspace/Lucene-Solr-master-Solaris/solr/core/src/test-files/solr/collection1/conf/stopwords.txt to /configs/conf1/stopwords.txt
   [junit4]   2> 14908 INFO  (TEST-TestSolrConfigHandlerConcurrent.test-seed#[5FCB0D442252EFE3]) [    ] o.a.s.c.c.SolrZkClient makePath: /configs/conf1/stopwords.txt
   [junit4]   2> 14911 INFO  (TEST-TestSolrConfigHandlerConcurrent.test-seed#[5FCB0D442252EFE3]) [    ] o.a.s.c.AbstractZkTestCase put /export/home/jenkins/workspace/Lucene-Solr-master-Solaris/solr/core/src/test-files/solr/collection1/conf/protwords.txt to /configs/conf1/protwords.txt
   [junit4]   2> 14911 INFO  (TEST-TestSolrConfigHandlerConcurrent.test-seed#[5FCB0D442252EFE3]) [    ] o.a.s.c.c.SolrZkClient makePath: /configs/conf1/protwords.txt
   [junit4]   2> 14914 INFO  (TEST-TestSolrConfigHandlerConcurrent.test-seed#[5FCB0D442252EFE3]) [    ] o.a.s.c.AbstractZkTestCase put /export/home/jenkins/workspace/Lucene-Solr-master-Solaris/solr/core/src/test-files/solr/collection1/conf/currency.xml to /configs/conf1/currency.xml
   [junit4]   2> 14914 INFO  (TEST-TestSolrConfigHandlerConcurrent.test-seed#[5FCB0D442252EFE3]) [    ] o.a.s.c.c.SolrZkClient makePath: /configs/conf1/currency.xml
   [junit4]   2> 14918 INFO  (TEST-TestSolrConfigHandlerConcurrent.test-seed#[5FCB0D442252EFE3]) [    ] o.a.s.c.AbstractZkTestCase put /export/home/jenkins/workspace/Lucene-Solr-master-Solaris/solr/core/src/test-files/solr/collection1/conf/enumsConfig.xml to /configs/conf1/enumsConfig.xml
   [junit4]   2> 14918 INFO  (TEST-TestSolrConfigHandlerConcurrent.test-seed#[5FCB0D442252EFE3]) [    ] o.a.s.c.c.SolrZkClient makePath: /configs/conf1/enumsConfig.xml
   [junit4]   2> 14920 INFO  (TEST-TestSolrConfigHandlerConcurrent.test-seed#[5FCB0D442252EFE3]) [    ] o.a.s.c.AbstractZkTestCase put /export/home/jenkins/workspace/Lucene-Solr-master-Solaris/solr/core/src/test-files/solr/collection1/conf/open-exchange-rates.json to /configs/conf1/open-exchange-rates.json
   [junit4]   2> 14921 INFO  (TEST-TestSolrConfigHandlerConcurrent.test-seed#[5FCB0D442252EFE3]) [    ] o.a.s.c.c.SolrZkClient makePath: /configs/conf1/open-exchange-rates.json
   [junit4]   2> 14924 INFO  (TEST-TestSolrConfigHandlerConcurrent.test-seed#[5FCB0D442252EFE3]) [    ] o.a.s.c.AbstractZkTestCase put /export/home/jenkins/workspace/Lucene-Solr-master-Solaris/solr/core/src/test-files/solr/collection1/conf/mapping-ISOLatin1Accent.txt to /configs/conf1/mapping-ISOLatin1Accent.txt
   [junit4]   2> 14924 INFO  (TEST-TestSolrConfigHandlerConcurrent.test-seed#[5FCB0D442252EFE3]) [    ] o.a.s.c.c.SolrZkClient makePath: /configs/conf1/mapping-ISOLatin1Accent.txt
   [junit4]   2> 14928 INFO  (TEST-TestSolrConfigHandlerConcurrent.test-seed#[5FCB0D442252EFE3]) [    ] o.a.s.c.AbstractZkTestCase put /export/home/jenkins/workspace/Lucene-Solr-master-Solaris/solr/core/src/test-files/solr/collection1/conf/old_synonyms.txt to /configs/conf1/old_synonyms.txt
   [junit4]   2> 14928 INFO  (TEST-TestSolrConfigHandlerConcurrent.test-seed#[5FCB0D442252EFE3]) [    ] o.a.s.c.c.SolrZkClient makePath: /configs/conf1/old_synonyms.txt
   [junit4]   2> 14931 INFO  (TEST-TestSolrConfigHandlerConcurrent.test-seed#[5FCB0D442252EFE3]) [    ] o.a.s.c.AbstractZkTestCase put /export/home/jenkins/workspace/Lucene-Solr-master-Solaris/solr/core/src/test-files/solr/collection1/conf/synonyms.txt to /configs/conf1/synonyms.txt
   [junit4]   2> 14931 INFO  (TEST-TestSolrConfigHandlerConcurrent.test-seed#[5FCB0D442252EFE3]) [    ] o.a.s.c.c.SolrZkClient makePath: /configs/conf1/synonyms.txt
   [junit4]   2> 15097 INFO  (TEST-TestSolrConfigHandlerConcurrent.test-seed#[5FCB0D442252EFE3]) [    ] o.a.s.SolrTestCaseJ4 Writing core.properties file to /export/home/jenkins/workspace/Lucene-Solr-master-Solaris/solr/build/solr-core/test/J1/temp/solr.handler.TestSolrConfigHandlerConcurrent_5FCB0D442252EFE3-001/control-001/cores/collection1
   [junit4]   2> 15099 INFO  (TEST-TestSolrConfigHandlerConcurrent.test-seed#[5FCB0D442252EFE3]) [    ] o.e.j.s.Server jetty-9.3.8.v20160314
   [junit4]   2> 15100 INFO  (TEST-TestSolrConfigHandlerConcurrent.test-seed#[5FCB0D442252EFE3]) [    ] o.e.j.s.h.ContextHandler Started o.e.j.s.ServletContextHandler@aa5db9c{/rcsq/k,null,AVAILABLE}
   [junit4]   2> 15100 INFO  (TEST-TestSolrConfigHandlerConcurrent.test-seed#[5FCB0D442252EFE3]) [    ] o.e.j.s.ServerConnector Started ServerConnector@3ace5cb7{HTTP/1.1,[http/1.1]}{127.0.0.1:34366}
   [junit4]   2> 15101 INFO  (TEST-TestSolrConfigHandlerConcurrent.test-seed#[5FCB0D442252EFE3]) [    ] o.e.j.s.Server Started @17350ms
   [junit4]   2> 15101 INFO  (TEST-TestSolrConfigHandlerConcurrent.test-seed#[5FCB0D442252EFE3]) [    ] o.a.s.c.s.e.JettySolrRunner Jetty properties: {solr.data.dir=/export/home/jenkins/workspace/Lucene-Solr-master-Solaris/solr/build/solr-core/test/J1/temp/solr.handler.TestSolrConfigHandlerConcurrent_5FCB0D442252EFE3-001/tempDir-001/control/data, hostContext=/rcsq/k, hostPort=34366, coreRootDirectory=/export/home/jenkins/workspace/Lucene-Solr-master-Solaris/solr/build/solr-core/test/J1/temp/solr.handler.TestSolrConfigHandlerConcurrent_5FCB0D442252EFE3-001/control-001/cores}
   [junit4]   2> 15102 INFO  (TEST-TestSolrConfigHandlerConcurrent.test-seed#[5FCB0D442252EFE3]) [    ] o.a.s.s.SolrDispatchFilter SolrDispatchFilter.init(): sun.misc.Launcher$AppClassLoader@6d06d69c
   [junit4]   2> 15102 INFO  (TEST-TestSolrConfigHandlerConcurrent.test-seed#[5FCB0D442252EFE3]) [    ] o.a.s.c.SolrResourceLoader new SolrResourceLoader for directory: '/export/home/jenkins/workspace/Lucene-Solr-master-Solaris/solr/build/solr-core/test/J1/temp/solr.handler.TestSolrConfigHandlerConcurrent_5FCB0D442252EFE3-001/control-001'
   [junit4]   2> 15102 INFO  (TEST-TestSolrConfigHandlerConcurrent.test-seed#[5FCB0D442252EFE3]) [    ] o.a.s.c.SolrResourceLoader JNDI not configured for solr (NoInitialContextEx)
   [junit4]   2> 15102 INFO  (TEST-TestSolrConfigHandlerConcurrent.test-seed#[5FCB0D442252EFE3]) [    ] o.a.s.c.SolrResourceLoader solr home defaulted to 'solr/' (could not find system property or JNDI)
   [junit4]   2> 15102 INFO  (TEST-TestSolrConfigHandlerConcurrent.test-seed#[5FCB0D442252EFE3]) [    ] o.a.s.c.c.SolrZkClient Using default ZkCredentialsProvider
   [junit4]   2> 15103 INFO  (TEST-TestSolrConfigHandlerConcurrent.test-seed#[5FCB0D442252EFE3]) [    ] o.a.s.c.c.ConnectionManager Waiting for client to connect to ZooKeeper
   [junit4]   2> 15106 INFO  (zkCallback-29-thread-1) [    ] o.a.s.c.c.ConnectionManager Watcher org.apache.solr.common.cloud.ConnectionManager@4c166559 name:ZooKeeperConnection Watcher:127.0.0.1:57233/solr got event WatchedEvent state:SyncConnected type:None path:null path:null type:None
   [junit4]   2> 15106 INFO  (TEST-TestSolrConfigHandlerConcurrent.test-seed#[5FCB0D442252EFE3]) [    ] o.a.s.c.c.ConnectionManager Client is connected to ZooKeeper
   [junit4]   2> 15107 INFO  (TEST-TestSolrConfigHandlerConcurrent.test-seed#[5FCB0D442252EFE3]) [    ] o.a.s.c.c.SolrZkClient Using default ZkACLProvider
   [junit4]   2> 15109 INFO  (TEST-TestSolrConfigHandlerConcurrent.test-seed#[5FCB0D442252EFE3]) [    ] o.a.s.s.SolrDispatchFilter Loading solr.xml from SolrHome (not found in ZooKeeper)
   [junit4]   2> 15110 INFO  (TEST-TestSolrConfigHandlerConcurrent.test-seed#[5FCB0D442252EFE3]) [    ] o.a.s.c.SolrXmlConfig Loading container configuration from /export/home/jenkins/workspace/Lucene-Solr-master-Solaris/solr/build/solr-core/test/J1/temp/solr.handler.TestSolrConfigHandlerConcurrent_5FCB0D442252EFE3-001/control-001/solr.xml
   [junit4]   2> 15123 INFO  (TEST-TestSolrConfigHandlerConcurrent.test-seed#[5FCB0D442252EFE3]) [    ] o.a.s.c.CorePropertiesLocator Config-defined core root directory: /export/home/jenkins/workspace/Lucene-Solr-master-Solaris/solr/build/solr-core/test/J1/temp/solr.handler.TestSolrConfigHandlerConcurrent_5FCB0D442252EFE3-001/control-001/cores
   [junit4]   2> 15123 INFO  (TEST-TestSolrConfigHandlerConcurrent.test-seed#[5FCB0D442252EFE3]) [    ] o.a.s.c.CoreContainer New CoreContainer 1743698775
   [junit4]   2> 15123 INFO  (TEST-TestSolrConfigHandlerConcurrent.test-seed#[5FCB0D442252EFE3]) [    ] o.a.s.c.CoreContainer Loading cores into CoreContainer [instanceDir=/export/home/jenkins/workspace/Lucene-Solr-master-Solaris/solr/build/solr-core/test/J1/temp/solr.handler.TestSolrConfigHandlerConcurrent_5FCB0D442252EFE3-001/control-001]
   [junit4]   2> 15123 WARN  (TEST-TestSolrConfigHandlerConcurrent.test-seed#[5FCB0D442252EFE3]) [    ] o.a.s.c.CoreContainer Couldn't add files from /export/home/jenkins/workspace/Lucene-Solr-master-Solaris/solr/build/solr-core/test/J1/temp/solr.handler.TestSolrConfigHandlerConcurrent_5FCB0D442252EFE3-001/control-001/lib to classpath: /export/home/jenkins/workspace/Lucene-Solr-master-Solaris/solr/build/solr-core/test/J1/temp/solr.handler.TestSolrConfigHandlerConcurrent_5FCB0D442252EFE3-001/control-001/lib
   [junit4]   2> 15124 INFO  (TEST-TestSolrConfigHandlerConcurrent.test-seed#[5FCB0D442252EFE3]) [    ] o.a.s.h.c.HttpShardHandlerFactory created with socketTimeout : 90000,urlScheme : ,connTimeout : 15000,maxConnectionsPerHost : 20,maxConnections : 10000,corePoolSize : 0,maximumPoolSize : 2147483647,maxThreadIdleTime : 5,sizeOfQueue : -1,fairnessPolicy : false,
   [junit4]   2> 15127 INFO  (TEST-TestSolrConfigHandlerConcurrent.test-seed#[5FCB0D442252EFE3]) [    ] o.a.s.u.UpdateShardHandler Created UpdateShardHandler HTTP client with params: socketTimeout=340000&connTimeout=45000&maxConnections=100000&maxConnectionsPerHost=100000
   [junit4]   2> 15127 INFO  (TEST-TestSolrConfigHandlerConcurrent.test-seed#[5FCB0D442252EFE3]) [    ] o.a.s.l.LogWatcher SLF4J impl is org.slf4j.impl.Log4jLoggerFactory
   [junit4]   2> 15127 INFO  (TEST-TestSolrConfigHandlerConcurrent.test-seed#[5FCB0D442252EFE3]) [    ] o.a.s.l.LogWatcher Registering Log Listener [Log4j (org.slf4j.impl.Log4jLoggerFactory)]
   [junit4]   2> 15127 INFO  (TEST-TestSolrConfigHandlerConcurrent.test-seed#[5FCB0D442252EFE3]) [    ] o.a.s.c.ZkContainer Zookeeper client=127.0.0.1:57233/solr
   [junit4]   2> 15127 INFO  (TEST-TestSolrConfigHandlerConcurrent.test-seed#[5FCB0D442252EFE3]) [    ] o.a.s.c.ZkController zkHost includes chroot
   [junit4]   2> 15127 INFO  (TEST-TestSolrConfigHandlerConcurrent.test-seed#[5FCB0D442252EFE3]) [    ] o.a.s.c.c.SolrZkClient Using default ZkCredentialsProvider
   [junit4]   2> 15127 INFO  (TEST-TestSolrConfigHandlerConcurrent.test-seed#[5FCB0D442252EFE3]) [    ] o.a.s.c.c.ConnectionManager Waiting for client to connect to ZooKeeper
   [junit4]   2> 15131 INFO  (zkCallback-32-thread-1) [    ] o.a.s.c.c.ConnectionManager Watcher org.apache.solr.common.cloud.ConnectionManager@5b54973d name:ZooKeeperConnection Watcher:127.0.0.1:57233 got event WatchedEvent state:SyncConnected type:None path:null path:null type:None
   [junit4]   2> 15132 INFO  (TEST-TestSolrConfigHandlerConcurrent.test-seed#[5FCB0D442252EFE3]) [    ] o.a.s.c.c.ConnectionManager Client is connected to ZooKeeper
   [junit4]   2> 15132 INFO  (TEST-TestSolrConfigHandlerConcurrent.test-seed#[5FCB0D442252EFE3]) [    ] o.a.s.c.c.SolrZkClient Using default ZkACLProvider
   [junit4]   2> 15135 INFO  (TEST-TestSolrConfigHandlerConcurrent.test-seed#[5FCB0D442252EFE3]) [n:127.0.0.1:34366_rcsq%2Fk    ] o.a.s.c.ZkController Added new OnReconnect listener org.apache.solr.cloud.ZkController$$Lambda$82/1918400991@2e3de456
   [junit4]   2> 15135 INFO  (TEST-TestSolrConfigHandlerConcurrent.test-seed#[5FCB0D442252EFE3]) [n:127.0.0.1:34366_rcsq%2Fk    ] o.a.s.c.c.ConnectionManager Waiting for client to connect to ZooKeeper
   [junit4]   2> 15137 INFO  (zkCallback-33-thread-1-processing-n:127.0.0.1:34366_rcsq%2Fk) [n:127.0.0.1:34366_rcsq%2Fk    ] o.a.s.c.c.ConnectionManager Watcher org.apache.solr.common.cloud.ConnectionManager@7b02740 name:ZooKeeperConnection Watcher:127.0.0.1:57233/solr got event WatchedEvent state:SyncConnected type:None path:null path:null type:None
   [junit4]   2> 15137 INFO  (TEST-TestSolrConfigHandlerConcurrent.test-seed#[5FCB0D442252EFE3]) [n:127.0.0.1:34366_rcsq%2Fk    ] o.a.s.c.c.ConnectionManager Client is connected to ZooKeeper
   [junit4]   2> 15139 INFO  (TEST-TestSolrConfigHandlerConcurrent.test-seed#[5FCB0D442252EFE3]) [n:127.0.0.1:34366_rcsq%2Fk    ] o.a.s.c.c.SolrZkClient makePath: /overseer/queue
   [junit4]   2> 15144 INFO  (TEST-TestSolrConfigHandlerConcurrent.test-seed#[5FCB0D442252EFE3]) [n:127.0.0.1:34366_rcsq%2Fk    ] o.a.s.c.c.SolrZkClient makePath: /overseer/collection-queue-work
   [junit4]   2> 15149 INFO  (TEST-TestSolrConfigHandlerConcurrent.test-seed#[5FCB0D442252EFE3]) [n:127.0.0.1:34366_rcsq%2Fk    ] o.a.s.c.c.SolrZkClient makePath: /overseer/collection-map-running
   [junit4]   2> 15153 INFO  (TEST-TestSolrConfigHandlerConcurrent.test-seed#[5FCB0D442252EFE3]) [n:127.0.0.1:34366_rcsq%2Fk    ] o.a.s.c.c.SolrZkClient makePath: /overseer/collection-map-completed
   [junit4]   2> 15156 INFO  (TEST-TestSolrConfigHandlerConcurrent.test-seed#[5FCB0D442252EFE3]) [n:127.0.0.1:34366_rcsq%2Fk    ] o.a.s.c.c.SolrZkClient makePath: /overseer/collection-map-failure
   [junit4]   2> 15159 INFO  (TEST-TestSolrConfigHandlerConcurrent.test-seed#[5FCB0D442252EFE3]) [n:127.0.0.1:34366_rcsq%2Fk    ] o.a.s.c.c.SolrZkClient makePath: /live_nodes
   [junit4]   2> 15161 INFO  (TEST-TestSolrConfigHandlerConcurrent.test-seed#[5FCB0D442252EFE3]) [n:127.0.0.1:34366_rcsq%2Fk    ] o.a.s.c.c.SolrZkClient makePath: /aliases.json
   [junit4]   2> 15163 INFO  (TEST-TestSolrConfigHandlerConcurrent.test-seed#[5FCB0D442252EFE3]) [n:127.0.0.1:34366_rcsq%2Fk    ] o.a.s.c.c.SolrZkClient makePath: /clusterstate.json
   [junit4]   2> 15165 INFO  (TEST-TestSolrConfigHandlerConcurrent.test-seed#[5FCB0D442252EFE3]) [n:127.0.0.1:34366_rcsq%2Fk    ] o.a.s.c.c.SolrZkClient makePath: /security.json
   [junit4]   2> 15166 INFO  (TEST-TestSolrConfigHandlerConcurrent.test-seed#[5FCB0D442252EFE3]) [n:127.0.0.1:34366_rcsq%2Fk    ] o.a.s.c.c.ZkStateReader Updating cluster state from ZooKeeper... 
   [junit4]   2> 15167 INFO  (TEST-TestSolrConfigHandlerConcurrent.test-seed#[5FCB0D442252EFE3]) [n:127.0.0.1:34366_rcsq%2Fk    ] o.a.s.c.c.ZkStateReader Loaded empty cluster properties
   [junit4]   2> 15168 INFO  (TEST-TestSolrConfigHandlerConcurrent.test-seed#[5FCB0D442252EFE3]) [n:127.0.0.1:34366_rcsq%2Fk    ] o.a.s.c.c.ZkStateReader Updated live nodes from ZooKeeper... (0) -> (0)
   [junit4]   2> 15174 INFO  (TEST-TestSolrConfigHandlerConcurrent.test-seed#[5FCB0D442252EFE3]) [n:127.0.0.1:34366_rcsq%2Fk    ] o.a.s.c.c.SolrZkClient makePath: /overseer_elect
   [junit4]   2> 15176 INFO  (TEST-TestSolrConfigHandlerConcurrent.test-seed#[5FCB0D442252EFE3]) [n:127.0.0.1:34366_rcsq%2Fk    ] o.a.s.c.c.SolrZkClient makePath: /overseer_elect/election
   [junit4]   2> 15178 INFO  (TEST-TestSolrConfigHandlerConcurrent.test-seed#[5FCB0D442252EFE3]) [n:127.0.0.1:34366_rcsq%2Fk    ] o.a.s.c.Overseer Overseer (id=null) closing
   [junit4]   2> 15180 INFO  (TEST-TestSolrConfigHandlerConcurrent.test-seed#[5FCB0D442252EFE3]) [n:127.0.0.1:34366_rcsq%2Fk    ] o.a.s.c.LeaderElector Joined leadership election with path: /overseer_elect/election/96524837608947716-127.0.0.1:34366_rcsq%2Fk-n_0000000000
   [junit4]   2> 15181 INFO  (TEST-TestSolrConfigHandlerConcurrent.test-seed#[5FCB0D442252EFE3]) [n:127.0.0.1:34366_rcsq%2Fk    ] o.a.s.c.OverseerElectionContext I am going to be the leader 127.0.0.1:34366_rcsq%2Fk
   [junit4]   2> 15181 INFO  (TEST-TestSolrConfigHandlerConcurrent.test-seed#[5FCB0D442252EFE3]) [n:127.0.0.1:34366_rcsq%2Fk    ] o.a.s.c.c.SolrZkClient makePath: /overseer_elect/leader
   [junit4]   2> 15183 INFO  (TEST-TestSolrConfigHandlerConcurrent.test-seed#[5FCB0D442252EFE3]) [n:127.0.0.1:34366_rcsq%2Fk    ] o.a.s.c.Overseer Overseer (id=96524837608947716-127.0.0.1:34366_rcsq%2Fk-n_0000000000) starting
   [junit4]   2> 15187 INFO  (TEST-TestSolrConfigHandlerConcurrent.test-seed#[5FCB0D442252EFE3]) [n:127.0.0.1:34366_rcsq%2Fk    ] o.a.s.c.c.SolrZkClient makePath: /overseer/queue-work
   [junit4]   2> 15197 INFO  (TEST-TestSolrConfigHandlerConcurrent.test-seed#[5FCB0D442252EFE3]) [n:127.0.0.1:34366_rcsq%2Fk    ] o.a.s.c.OverseerAutoReplicaFailoverThread Starting OverseerAutoReplicaFailoverThread autoReplicaFailoverWorkLoopDelay=10000 autoReplicaFailoverWaitAfterExpiration=10000 autoReplicaFailoverBadNodeExpiration=60000
   [junit4]   2> 15198 INFO  (TEST-TestSolrConfigHandlerConcurrent.test-seed#[5FCB0D442252EFE3]) [n:127.0.0.1:34366_rcsq%2Fk    ] o.a.s.c.ZkController Register node as live in ZooKeeper:/live_nodes/127.0.0.1:34366_rcsq%2Fk
   [junit4]   2> 15198 INFO  (TEST-TestSolrConfigHandlerConcurrent.test-seed#[5FCB0D442252EFE3]) [n:127.0.0.1:34366_rcsq%2Fk    ] o.a.s.c.c.SolrZkClient makePath: /live_nodes/127.0.0.1:34366_rcsq%2Fk
   [junit4]   2> 15200 INFO  (OverseerCollectionConfigSetProcessor-96524837608947716-127.0.0.1:34366_rcsq%2Fk-n_0000000000) [n:127.0.0.1:34366_rcsq%2Fk    ] o.a.s.c.OverseerTaskProcessor Process current queue of overseer operations
   [junit4]   2> 15203 INFO  (zkCallback-33-thread-1-processing-n:127.0.0.1:34366_rcsq%2Fk) [n:127.0.0.1:34366_rcsq%2Fk    ] o.a.s.c.c.ZkStateReader A live node change: [WatchedEvent state:SyncConnected type:NodeChildrenChanged path:/live_nodes], has occurred - updating... (live nodes size: [0])
   [junit4]   2> 15203 INFO  (OverseerStateUpdate-96524837608947716-127.0.0.1:34366_rcsq%2Fk-n_0000000000) [n:127.0.0.1:34366_rcsq%2Fk    ] o.a.s.c.Overseer Starting to work on the main queue
   [junit4]   2> 15204 INFO  (zkCallback-33-thread-1-processing-n:127.0.0.1:34366_rcsq%2Fk) [n:127.0.0.1:34366_rcsq%2Fk    ] o.a.s.c.c.ZkStateReader Updated live nodes from ZooKeeper... (0) -> (1)
   [junit4]   2> 15207 INFO  (OverseerStateUpdate-96524837608947716-127.0.0.1:34366_rcsq%2Fk-n_0000000000) [n:127.0.0.1:34366_rcsq%2Fk    ] o.a.s.c.c.ZkStateReader Updated live nodes from ZooKeeper... (1) -> (1)
   [junit4]   2> 15227 INFO  (TEST-TestSolrConfigHandlerConcurrent.test-seed#[5FCB0D442252EFE3]) [n:127.0.0.1:34366_rcsq%2Fk    ] o.a.s.c.CoreContainer Security conf doesn't exist. Skipping setup for authorization module.
   [junit4]   2> 15227 INFO  (TEST-TestSolrConfigHandlerConcurrent.test-seed#[5FCB0D442252EFE3]) [n:127.0.0.1:34366_rcsq%2Fk    ] o.a.s.c.CoreContainer No authentication plugin used.
   [junit4]   2> 15228 INFO  (TEST-TestSolrConfigHandlerConcurrent.test-seed#[5FCB0D442252EFE3]) [n:127.0.0.1:34366_rcsq%2Fk    ] o.a.s.c.CorePropertiesLocator Looking for core definitions underneath /export/home/jenkins/workspace/Lucene-Solr-master-Solaris/solr/build/solr-core/test/J1/temp/solr.handler.TestSolrConfigHandlerConcurrent_5FCB0D442252EFE3-001/control-001/cores
   [junit4]   2> 15229 INFO  (TEST-TestSolrConfigHandlerConcurrent.test-seed#[5FCB0D442252EFE3]) [n:127.0.0.1:34366_rcsq%2Fk    ] o.a.s.c.CoreDescriptor Created CoreDescriptor: {name=collection1, config=solrconfig.xml, transient=false, schema=schema.xml, loadOnStartup=true, configSetProperties=configsetprops.json, collection=control_collection, coreNodeName=, dataDir=data/, shard=}
   [junit4]   2> 15229 INFO  (TEST-TestSolrConfigHandlerConcurrent.test-seed#[5FCB0D442252EFE3]) [n:127.0.0.1:34366_rcsq%2Fk    ] o.a.s.c.CorePropertiesLocator Found core collection1 in /export/home/jenkins/workspace/Lucene-Solr-master-Solaris/solr/build/solr-core/test/J1/temp/solr.handler.TestSolrConfigHandlerConcurrent_5FCB0D442252EFE3-001/control-001/cores/collection1
   [junit4]   2> 15229 INFO  (TEST-TestSolrConfigHandlerConcurrent.test-seed#[5FCB0D442252EFE3]) [n:127.0.0.1:34366_rcsq%2Fk    ] o.a.s.c.CorePropertiesLocator Found 1 core definitions
   [junit4]   2> 15232 INFO  (coreLoadExecutor-114-thread-1-processing-n:127.0.0.1:34366_rcsq%2Fk) [n:127.0.0.1:34366_rcsq%2Fk c:control_collection   x:collection1] o.a.s.c.ZkController publishing state=down
   [junit4]   2> 15232 INFO  (coreLoadExecutor-114-thread-1-processing-n:127.0.0.1:34366_rcsq%2Fk) [n:127.0.0.1:34366_rcsq%2Fk c:control_collection   x:collection1] o.a.s.c.ZkController numShards not found on descriptor - reading it from system property
   [junit4]   2> 15232 INFO  (TEST-TestSolrConfigHandlerConcurrent.test-seed#[5FCB0D442252EFE3]) [n:127.0.0.1:34366_rcsq%2Fk    ] o.a.s.s.SolrDispatchFilter user.dir=/export/home/jenkins/workspace/Lucene-Solr-master-Solaris/solr/build/solr-core/test/J1
   [junit4]   2> 15232 INFO  (TEST-TestSolrConfigHandlerConcurrent.test-seed#[5FCB0D442252EFE3]) [n:127.0.0.1:34366_rcsq%2Fk    ] o.a.s.s.SolrDispatchFilter SolrDispatchFilter.init() done
   [junit4]   2> 15234 INFO  (coreLoadExecutor-114-thread-1-processing-n:127.0.0.1:34366_rcsq%2Fk) [n:127.0.0.1:34366_rcsq%2Fk c:control_collection   x:collection1] o.a.s.c.ZkController Collection control_collection not visible yet, but flagging it so a watch is registered when it becomes visible
   [junit4]   2> 15236 INFO  (OverseerStateUpdate-96524837608947716-127.0.0.1:34366_rcsq%2Fk-n_0000000000) [n:127.0.0.1:34366_rcsq%2Fk    ] o.a.s.c.Overseer processMessage: queueSize: 1, message = {
   [junit4]   2>   "core":"collection1",
   [junit4]   2>   "roles":null,
   [junit4]   2>   "base_url":"http://127.0.0.1:34366/rcsq/k",
   [junit4]   2>   "node_name":"127.0.0.1:34366_rcsq%2Fk",
   [junit4]   2>   "numShards":"1",
   [junit4]   2>   "state":"down",
   [junit4]   2>   "shard":null,
   [junit4]   2>   "collection":"control_collection",
   [junit4]   2>   "operation":"state"} current state version: 0
   [junit4]   2> 15240 INFO  (coreLoadExecutor-114-thread-1-processing-n:127.0.0.1:34366_rcsq%2Fk) [n:127.0.0.1:34366_rcsq%2Fk c:control_collection   x:collection1] o.a.s.c.c.ZkStateReader Deleting data for [control_collection]
   [junit4]   2> 15243 INFO  (coreLoadExecutor-114-thread-1-processing-n:127.0.0.1:34366_rcsq%2Fk) [n:127.0.0.1:34366_rcsq%2Fk c:control_collection   x:collection1] o.a.s.c.ZkController look for our core node name
   [junit4]   2> 15248 INFO  (OverseerStateUpdate-96524837608947716-127.0.0.1:34366_rcsq%2Fk-n_0000000000) [n:127.0.0.1:34366_rcsq%2Fk    ] o.a.s.c.o.ReplicaMutator Update state numShards=1 message={
   [junit4]   2>   "core":"collection1",
   [junit4]   2>   "roles":null,
   [junit4]   2>   "base_url":"http://127.0.0.1:34366/rcsq/k",
   [junit4]   2>   "node_name":"127.0.0.1:34366_rcsq%2Fk",
   [junit4]   2>   "numShards":"1",
   [junit4]   2>   "state":"down",
   [junit4]   2>   "shard":null,
   [junit4]   2>   "collection":"control_collection",
   [junit4]   2>   "operation":"state"}
   [junit4]   2> 15250 INFO  (OverseerStateUpdate-96524837608947716-127.0.0.1:34366_rcsq%2Fk-n_0000000000) [n:127.0.0.1:34366_rcsq%2Fk    ] o.a.s.c.o.ClusterStateMutator building a new cName: control_collection
   [junit4]   2> 15262 INFO  (OverseerStateUpdate-96524837608947716-127.0.0.1:34366_rcsq%2Fk-n_0000000000) [n:127.0.0.1:34366_rcsq%2Fk    ] o.a.s.c.o.ReplicaMutator Assigning new node to shard shard=shard1
   [junit4]   2> 15266 INFO  (zkCallback-33-thread-1-processing-n:127.0.0.1:34366_rcsq%2Fk) [n:127.0.0.1:34366_rcsq%2Fk    ] o.a.s.c.c.ZkStateReader A cluster state change: [WatchedEvent state:SyncConnected type:NodeDataChanged path:/clusterstate.json], has occurred - updating... (live nodes size: [1])
   [junit4]   2> 16249 INFO  (coreLoadExecutor-114-thread-1-processing-n:127.0.0.1:34366_rcsq%2Fk) [n:127.0.0.1:34366_rcsq%2Fk c:control_collection   x:collection1] o.a.s.c.ZkController waiting to find shard id in clusterstate for collection1
   [junit4]   2> 16249 INFO  (coreLoadExecutor-114-thread-1-processing-n:127.0.0.1:34366_rcsq%2Fk) [n:127.0.0.1:34366_rcsq%2Fk c:control_collection   x:collection1] o.a.s.c.ZkController Check for collection zkNode:control_collection
   [junit4]   2> 16250 INFO  (coreLoadExecutor-114-thread-1-processing-n:127.0.0.1:34366_rcsq%2Fk) [n:127.0.0.1:34366_rcsq%2Fk c:control_collection   x:collection1] o.a.s.c.ZkController Collection zkNode exists
   [junit4]   2> 16250 INFO  (coreLoadExecutor-114-thread-1-processing-n:127.0.0.1:34366_rcsq%2Fk) [n:127.0.0.1:34366_rcsq%2Fk c:control_collection   x:collection1] o.a.s.c.c.ZkStateReader Load collection config from: [/collections/control_collection]
   [junit4]   2> 16252 INFO  (coreLoadExecutor-114-thread-1-processing-n:127.0.0.1:34366_rcsq%2Fk) [n:127.0.0.1:34366_rcsq%2Fk c:control_collection   x:collection1] o.a.s.c.c.ZkStateReader path=[/collections/control_collection] [configName]=[conf1] specified config exists in ZooKeeper
   [junit4]   2> 16252 INFO  (coreLoadExecutor-114-thread-1-processing-n:127.0.0.1:34366_rcsq%2Fk) [n:127.0.0.1:34366_rcsq%2Fk c:control_collection   x:collection1] o.a.s.c.SolrResourceLoader new SolrResourceLoader for directory: '/export/home/jenkins/workspace/Lucene-Solr-master-Solaris/solr/build/solr-core/test/J1/temp/solr.handler.TestSolrConfigHandlerConcurrent_5FCB0D442252EFE3-001/control-001/cores/collection1'
   [junit4]   2> 16252 INFO  (coreLoadExecutor-114-thread-1-processing-n:127.0.0.1:34366_rcsq%2Fk) [n:127.0.0.1:34366_rcsq%2Fk c:control_collection   x:collection1] o.a.s.c.SolrResourceLoader JNDI not configured for solr (NoInitialContextEx)
   [junit4]   2> 16252 INFO  (coreLoadExecutor-114-thread-1-processing-n:127.0.0.1:34366_rcsq%2Fk) [n:127.0.0.1:34366_rcsq%2Fk c:control_collection   x:collection1] o.a.s.c.SolrResourceLoader solr home defaulted to 'solr/' (could not find system property or JNDI)
   [junit4]   2> 16254 INFO  (coreLoadExecutor-114-thread-1-processing-n:127.0.0.1:34366_rcsq%2Fk) [n:127.0.0.1:34366_rcsq%2Fk c:control_collection   x:collection1] o.a.s.c.Config loaded config solrconfig.xml with version 0 
   [junit4]   2> 16263 INFO  (coreLoadExecutor-114-thread-1-processing-n:127.0.0.1:34366_rcsq%2Fk) [n:127.0.0.1:34366_rcsq%2Fk c:control_collection   x:collection1] o.a.s.c.SolrConfig current version of requestparams : -1
   [junit4]   2> 16266 WARN  (coreLoadExecutor-114-thread-1-processing-n:127.0.0.1:34366_rcsq%2Fk) [n:127.0.0.1:34366_rcsq%2Fk c:control_collection   x:collection1] o.a.s.c.Config Beginning with Solr 5.5, <mergePolicy> is deprecated, use <mergePolicyFactory> instead.
   [junit4]   2> 16266 INFO  (coreLoadExecutor-114-thread-1-processing-n:127.0.0.1:34366_rcsq%2Fk) [n:127.0.0.1:34366_rcsq%2Fk c:control_collection   x:collection1] o.a.s.c.SolrConfig Using Lucene MatchVersion: 7.0.0
   [junit4]   2> 16287 INFO  (coreLoadExecutor-114-thread-1-processing-n:127.0.0.1:34366_rcsq%2Fk) [n:127.0.0.1:34366_rcsq%2Fk c:control_collection   x:collection1] o.a.s.c.SolrConfig Loaded SolrConfig: solrconfig.xml
   [junit4]   2> 16295 INFO  (coreLoadExecutor-114-thread-1-processing-n:127.0.0.1:34366_rcsq%2Fk) [n:127.0.0.1:34366_rcsq%2Fk c:control_collection   x:collection1] o.a.s.s.IndexSchema [collection1] Schema name=test
   [junit4]   2> 16397 INFO  (coreLoadExecutor-114-thread-1-processing-n:127.0.0.1:34366_rcsq%2Fk) [n:127.0.0.1:34366_rcsq%2Fk c:control_collection   x:collection1] o.a.s.s.OpenExchangeRatesOrgProvider Initialized with rates=open-exchange-rates.json, refreshInterval=1440.
   [junit4]   2> 16408 INFO  (coreLoadExecutor-114-thread-1-processing-n:127.0.0.1:34366_rcsq%2Fk) [n:127.0.0.1:34366_rcsq%2Fk c:control_collection   x:collection1] o.a.s.s.IndexSchema default search field in schema is text
   [junit4]   2> 16409 INFO  (coreLoadExecutor-114-thread-1-processing-n:127.0.0.1:34366_rcsq%2Fk) [n:127.0.0.1:34366_rcsq%2Fk c:control_collection   x:collection1] o.a.s.s.IndexSchema unique key field: id
   [junit4]   2> 16424 INFO  (coreLoadExecutor-114-thread-1-processing-n:127.0.0.1:34366_rcsq%2Fk) [n:127.0.0.1:34366_rcsq%2Fk c:control_collection   x:collection1] o.a.s.s.FileExchangeRateProvider Reloading exchange rates from file currency.xml
   [junit4]   2> 16427 INFO  (coreLoadExecutor-114-thread-1-processing-n:127.0.0.1:34366_rcsq%2Fk) [n:127.0.0.1:34366_rcsq%2Fk c:control_collection   x:collection1] o.a.s.s.FileExchangeRateProvider Reloading exchange rates from file currency.xml
   [junit4]   2> 16430 INFO  (coreLoadExecutor-114-thread-1-processing-n:127.0.0.1:34366_rcsq%2Fk) [n:127.0.0.1:34366_rcsq%2Fk c:control_collection   x:collection1] o.a.s.s.OpenExchangeRatesOrgProvider Reloading exchange rates from open-exchange-rates.json
   [junit4]   2> 16431 INFO  (coreLoadExecutor-114-thread-1-processing-n:127.0.0.1:34366_rcsq%2Fk) [n:127.0.0.1:34366_rcsq%2Fk c:control_collection   x:collection1] o.a.s.s.OpenExchangeRatesOrgProvider Reloading exchange rates from open-exchange-rates.json
   [junit4]   2> 16433 INFO  (coreLoadExecutor-114-thread-1-processing-n:127.0.0.1:34366_rcsq%2Fk) [n:127.0.0.1:34366_rcsq%2Fk c:control_collection   x:collection1] o.a.s.c.ConfigSetProperties Did not find ConfigSet properties, assuming default properties: Can't find resource 'configsetprops.json' in classpath or '/configs/conf1', cwd=/export/home/jenkins/workspace/Lucene-Solr-master-Solaris/solr/build/solr-core/test/J1
   [junit4]   2> 16433 INFO  (coreLoadExecutor-114-thread-1-processing-n:127.0.0.1:34366_rcsq%2Fk) [n:127.0.0.1:34366_rcsq%2Fk c:control_collection   x:collection1] o.a.s.c.CoreContainer Creating SolrCore 'collection1' using configuration from collection control_collection
   [junit4]   2> 16433 INFO  (coreLoadExecutor-114-thread-1-processing-n:127.0.0.1:34366_rcsq%2Fk) [n:127.0.0.1:34366_rcsq%2Fk c:control_collection s:shard1 r:core_node1 x:collection1] o.a.s.c.SolrCore org.apache.solr.core.MockDirectoryFactory
   [junit4]   2> 16433 INFO  (coreLoadExecutor-114-thread-1-processing-n:127.0.0.1:34366_rcsq%2Fk) [n:127.0.0.1:34366_rcsq%2Fk c:control_collection s:shard1 r:core_node1 x:collection1] o.a.s.c.SolrCore [[collection1] ] Opening new SolrCore at [/export/home/jenkins/workspace/Lucene-Solr-master-Solaris/solr/build/solr-core/test/J1/temp/solr.handler.TestSolrConfigHandlerConcurrent_5FCB0D442252EFE3-001/control-001/cores/collection1], dataDir=[/export/home/jenkins/workspace/Lucene-Solr-master-Solaris/solr/build/solr-core/test/J1/temp/solr.handler.TestSolrConfigHandlerConcurrent_5FCB0D442252EFE3-001/control-001/cores/collection1/data/]
   [junit4]   2> 16434 INFO  (coreLoadExecutor-114-thread-1-processing-n:127.0.0.1:34366_rcsq%2Fk) [n:127.0.0.1:34366_rcsq%2Fk c:control_collection s:shard1 r:core_node1 x:collection1] o.a.s.c.JmxMonitoredMap JMX monitoring is enabled. Adding Solr mbeans to JMX Server: com.sun.jmx.mbeanserver.JmxMBeanServer@4c474e0
   [junit4]   2> 16434 INFO  (coreLoadExecutor-114-thread-1-processing-n:127.0.0.1:34366_rcsq%2Fk) [n:127.0.0.1:34366_rcsq%2Fk c:control_collection s:shard1 r:core_node1 x:collection1] o.a.s.c.CachingDirectoryFactory return new directory for /export/home/jenkins/workspace/Lucene-Solr-master-Solaris/solr/build/solr-core/test/J1/temp/solr.handler.TestSolrConfigHandlerConcurrent_5FCB0D442252EFE3-001/control-001/cores/collection1/data/snapshot_metadata
   [junit4]   2> 16434 INFO  (coreLoadExecutor-114-thread-1-processing-n:127.0.0.1:34366_rcsq%2Fk) [n:127.0.0.1:34366_rcsq%2Fk c:control_collection s:shard1 r:core_node1 x:collection1] o.a.s.c.s.SolrSnapshotMetaDataManager Loading from snapshot metadata file...
   [junit4]   2> 16434 INFO  (coreLoadExecutor-114-thread-1-processing-n:127.0.0.1:34366_rcsq%2Fk) [n:127.0.0.1:34366_rcsq%2Fk c:control_collection s:shard1 r:core_node1 x:collection1] o.a.s.c.CachingDirectoryFactory return new directory for /export/home/jenkins/workspace/Lucene-Solr-master-Solaris/solr/build/solr-core/test/J1/temp/solr.handler.TestSolrConfigHandlerConcurrent_5FCB0D442252EFE3-001/control-001/cores/collection1/data
   [junit4]   2> 16434 INFO  (coreLoadExecutor-114-thread-1-processing-n:127.0.0.1:34366_rcsq%2Fk) [n:127.0.0.1:34366_rcsq%2Fk c:control_collection s:shard1 r:core_node1 x:collection1] o.a.s.c.SolrCore New index directory detected: old=null new=/export/home/jenkins/workspace/Lucene-Solr-master-Solaris/solr/build/solr-core/test/J1/temp/solr.handler.TestSolrConfigHandlerConcurrent_5FCB0D442252EFE3-001/control-001/cores/collection1/data/index/
   [junit4]   2> 16435 WARN  (coreLoadExecutor-114-thread-1-processing-n:127.0.0.1:34366_rcsq%2Fk) [n:127.0.0.1:34366_rcsq%2Fk c:control_collection s:shard1 r:core_node1 x:collection1] o.a.s.c.SolrCore [collection1] Solr index directory '/export/home/jenkins/workspace/Lucene-Solr-master-Solaris/solr/build/solr-core/test/J1/temp/solr.handler.TestSolrConfigHandlerConcurrent_5FCB0D442252EFE3-001/control-001/cores/collection1/data/index' doesn't exist. Creating new index...
   [junit4]   2> 16435 INFO  (coreLoadExecutor-114-thread-1-processing-n:127.0.0.1:34366_rcsq%2Fk) [n:127.0.0.1:34366_rcsq%2Fk c:control_collection s:shard1 r:core_node1 x:collection1] o.a.s.c.CachingDirectoryFactory return new directory for /export/home/jenkins/workspace/Lucene-Solr-master-Solaris/solr/build/solr-core/test/J1/temp/solr.handler.TestSolrConfigHandlerConcurrent_5FCB0D442252EFE3-001/control-001/cores/collection1/data/index
   [junit4]   2> 16435 INFO  (coreLoadExecutor-114-thread-1-processing-n:127.0.0.1:34366_rcsq%2Fk) [n:127.0.0.1:34366_rcsq%2Fk c:control_collection s:shard1 r:core_node1 x:collection1] o.a.s.u.RandomMergePolicy RandomMergePolicy wrapping class org.apache.lucene.index.TieredMergePolicy: [TieredMergePolicy: maxMergeAtOnce=14, maxMergeAtOnceExplicit=21, maxMergedSegmentMB=8.70703125, floorSegmentMB=0.5009765625, forceMergeDeletesPctAllowed=14.957609734867258, segmentsPerTier=42.0, maxCFSSegmentSizeMB=8.796093022207999E12, noCFSRatio=1.0
   [junit4]   2> 16436 INFO  (coreLoadExecutor-114-thread-1-processing-n:127.0.0.1:34366_rcsq%2Fk) [n:127.0.0.1:34366_rcsq%2Fk c:control_collection s:shard1 r:core_node1 x:collection1] o.a.s.c.SolrDeletionPolicy SolrDeletionPolicy.onCommit: commits: num=1
   [junit4]   2> 	commit{dir=MockDirectoryWrapper(RAMDirectory@62bc0411 lockFactory=org.apache.lucene.store.SingleInstanceLockFactory@7d56b750),segFN=segments_1,generation=1}
   [junit4]   2> 16436 INFO  (coreLoadExecutor-114-thread-1-processing-n:127.0.0.1:34366_rcsq%2Fk) [n:127.0.0.1:34366_rcsq%2Fk c:control_collection s:shard1 r:core_node1 x:collection1] o.a.s.c.SolrDeletionPolicy newest commit generation = 1
   [junit4]   2> 16436 INFO  (OldIndexDirectoryCleanupThreadForCore-collection1) [n:127.0.0.1:34366_rcsq%2Fk c:control_collection s:shard1 r:core_node1 x:collection1] o.a.s.c.SolrCore Looking for old index directories to cleanup for core collection1 in /export/home/jenkins/workspace/Lucene-Solr-master-Solaris/solr/build/solr-core/test/J1/temp/solr.handler.TestSolrConfigHandlerConcurrent_5FCB0D442252EFE3-001/control-001/cores/collection1/data/
   [junit4]   2> 16437 WARN  (OldIndexDirectoryCleanupThreadForCore-collection1) [n:127.0.0.1:34366_rcsq%2Fk c:control_collection s:shard1 r:core_node1 x:collection1] o.a.s.c.DirectoryFactory /export/home/jenkins/workspace/Lucene-Solr-master-Solaris/solr/build/solr-core/test/J1/temp/solr.handler.TestSolrConfigHandlerConcurrent_5FCB0D442252EFE3-001/control-001/cores/collection1/data/ does not point to a valid data directory; skipping clean-up of old index directories.
   [junit4]   2> 16441 INFO  (coreLoadExecutor-114-thread-1-processing-n:127.0.0.1:34366_rcsq%2Fk) [n:127.0.0.1:34366_rcsq%2Fk c:control_collection s:shard1 r:core_node1 x:collection1] o.a.s.u.p.UpdateRequestProcessorChain creating updateRequestProcessorChain "nodistrib"
   [junit4]   2> 16450 INFO  (coreLoadExecutor-114-thread-1-processing-n:127.0.0.1:34366_rcsq%2Fk) [n:127.0.0.1:34366_rcsq%2Fk c:control_collection s:shard1 r:core_node1 x:collection1] o.a.s.u.p.UpdateRequestProcessorChain creating updateRequestProcessorChain "dedupe"
   [junit4]   2> 16451 INFO  (coreLoadExecutor-114-thread-1-processing-n:127.0.0.1:34366_rcsq%2Fk) [n:127.0.0.1:34366_rcsq%2Fk c:control_collection s:shard1 r:core_node1 x:collection1] o.a.s.u.p.UpdateRequestProcessorChain inserting DistributedUpdateProcessorFactory into updateRequestProcessorChain "dedupe"
   [junit4]   2> 16451 INFO  (coreLoadExecutor-114-thread-1-processing-n:127.0.0.1:34366_rcsq%2Fk) [n:127.0.0.1:34366_rcsq%2Fk c:control_collection s:shard1 r:core_node1 x:collection1] o.a.s.u.p.UpdateRequestProcessorChain creating updateRequestProcessorChain "stored_sig"
   [junit4]   2> 16451 INFO  (coreLoadExecutor-114-thread-1-processing-n:127.0.0.1:34366_rcsq%2Fk) [n:127.0.0.1:34366_rcsq%2Fk c:control_collection s:shard1 r:core_node1 x:collection1] o.a.s.u.p.UpdateRequestProcessorChain inserting DistributedUpdateProcessorFactory into updateRequestProcessorChain "stored_sig"
   [junit4]   2> 16451 INFO  (coreLoadExecutor-114-thread-1-processing-n:127.0.0.1:34366_rcsq%2Fk) [n:127.0.0.1:34366_rcsq%2Fk c:control_collection s:shard1 r:core_node1 x:collection1] o.a.s.u.p.UpdateRequestProcessorChain creating updateRequestProcessorChain "distrib-dup-test-chain-explicit"
   [junit4]   2> 16451 INFO  (coreLoadExecutor-114-thread-1-processing-n:127.0.0.1:34366_rcsq%2Fk) [n:127.0.0.1:34366_rcsq%2Fk c:control_collection s:shard1 r:core_node1 x:collection1] o.a.s.u.p.UpdateRequestProcessorChain creating updateRequestProcessorChain "distrib-dup-test-chain-implicit"
   [junit4]   2> 16451 INFO  (coreLoadExecutor-114-thread-1-processing-n:127.0.0.1:34366_rcsq%2Fk) [n:127.0.0.1:34366_rcsq%2Fk c:control_collection s:shard1 r:core_node1 x:collection1] o.a.s.u.p.UpdateRequestProcessorChain inserting DistributedUpdateProcessorFactory into updateRequestProcessorChain "distrib-dup-test-chain-implicit"
   [junit4]   2> 16451 INFO  (coreLoadExecutor-114-thread-1-processing-n:127.0.0.1:34366_rcsq%2Fk) [n:127.0.0.1:34366_rcsq%2Fk c:control_collection s:shard1 r:core_node1 x:collection1] o.a.s.c.SolrCore no updateRequestProcessorChain defined as default, creating implicit default
   [junit4]   2> 16451 WARN  (coreLoadExecutor-114-thread-1-processing-n:127.0.0.1:34366_rcsq%2Fk) [n:127.0.0.1:34366_rcsq%2Fk c:control_collection s:shard1 r:core_node1 x:collection1] o.a.s.c.RequestHandlers INVALID paramSet a in requestHandler {type = requestHandler,name = /dump,class = DumpRequestHandler,args = {defaults={a=A,b=B}}}
   [junit4]   2> 16453 INFO  (coreLoadExecutor-114-thread-1-processing-n:127.0.0.1:34366_rcsq%2Fk) [n:127.0.0.1:34366_rcsq%2Fk c:control_collection s:shard1 r:core_node1 x:collection1] o.a.s.h.l.XMLLoader xsltCacheLifetimeSeconds=60
   [junit4]   2> 16454 INFO  (coreLoadExecutor-114-thread-1-processing-n:127.0.0.1:34366_rcsq%2Fk) [n:127.0.0.1:34366_rcsq%2Fk c:control_collection s:shard1 r:core_node1 x:collection1] o.a.s.h.l.XMLLoader xsltCacheLifetimeSeconds=60
   [junit4]   2> 16455 INFO  (coreLoadExecutor-114-thread-1-processing-n:127.0.0.1:34366_rcsq%2Fk) [n:127.0.0.1:34366_rcsq%2Fk c:control_collection s:shard1 r:core_node1 x:collection1] o.a.s.h.l.XMLLoader xsltCacheLifetimeSeconds=60
   [junit4]   2> 16456 INFO  (coreLoadExecutor-114-thread-1-processing-n:127.0.0.1:34366_rcsq%2Fk) [n:127.0.0.1:34366_rcsq%2Fk c:control_collection s:shard1 r:core_node1 x:collection1] o.a.s.h.l.XMLLoader xsltCacheLifetimeSeconds=60
   [junit4]   2> 16466 INFO  (coreLoadExecutor-114-thread-1-processing-n:127.0.0.1:34366_rcsq%2Fk) [n:127.0.0.1:34366_rcsq%2Fk c:control_collection s:shard1 r:core_node1 x:collection1] o.a.s.c.RequestHandlers Registered paths: /admin/mbeans,standard,/update/json/docs,/admin/luke,/export,/get,/admin/properties,/update/json,/admin/threads,/dump,/update/csv,/sql,/graph,/admin/segments,/admin/system,/replication,/config,/stream,/schema,/admin/plugins,/admin/logging,/admin/ping,/update,/admin/file,/terms
   [junit4]   2> 16466 INFO  (coreLoadExecutor-114-thread-1-processing-n:127.0.0.1:34366_rcsq%2Fk) [n:127.0.0.1:34366_rcsq%2Fk c:control_collection s:shard1 r:core_node1 x:collection1] o.a.s.c.SolrCore Using default statsCache cache: org.apache.solr.search.stats.LocalStatsCache
   [junit4]   2> 16466 INFO  (coreLoadExecutor-114-thread-1-processing-n:127.0.0.1:34366_rcsq%2Fk) [n:127.0.0.1:34366_rcsq%2Fk c:control_collection s:shard1 r:core_node1 x:collection1] o.a.s.u.UpdateHandler Using UpdateLog implementation: org.apache.solr.update.UpdateLog
   [junit4]   2> 16466 INFO  (coreLoadExecutor-114-thread-1-processing-n:127.0.0.1:34366_rcsq%2Fk) [n:127.0.0.1:34366_rcsq%2Fk c:control_collection s:shard1 r:core_node1 x:collection1] o.a.s.u.UpdateLog Initializing UpdateLog: dataDir= defaultSyncLevel=FLUSH numRecordsToKeep=100 maxNumLogsToKeep=10 numVersionBuckets=65536
   [junit4]   2> 16467 INFO  (coreLoadExecutor-114-thread-1-processing-n:127.0.0.1:34366_rcsq%2Fk) [n:127.0.0.1:34366_rcsq%2Fk c:control_collection s:shard1 r:core_node1 x:collection1] o.a.s.u.CommitTracker Hard AutoCommit: disabled
   [junit4]   2> 16467 INFO  (coreLoadExecutor-114-thread-1-processing-n:127.0.0.1:34366_rcsq%2Fk) [n:127.0.0.1:34366_rcsq%2Fk c:control_collection s:shard1 r:core_node1 x:collection1] o.a.s.u.CommitTracker Soft AutoCommit: disabled
   [junit4]   2> 16468 INFO  (coreLoadExecutor-114-thread-1-processing-n:127.0.0.1:34366_rcsq%2Fk) [n:127.0.0.1:34366_rcsq%2Fk c:control_collection s:shard1 r:core_node1 x:collection1] o.a.s.u.RandomMergePolicy RandomMergePolicy wrapping class org.apache.lucene.index.TieredMergePolicy: [TieredMergePolicy: maxMergeAtOnce=45, maxMergeAtOnceExplicit=24, maxMergedSegmentMB=81.6787109375, floorSegmentMB=1.71484375, forceMergeDeletesPctAllowed=22.406529270262816, segmentsPerTier=44.0, maxCFSSegmentSizeMB=8.796093022207999E12, noCFSRatio=0.0
   [junit4]   2> 16468 INFO  (coreLoadExecutor-114-thread-1-processing-n:127.0.0.1:34366_rcsq%2Fk) [n:127.0.0.1:34366_rcsq%2Fk c:control_collection s:shard1 r:core_node1 x:collection1] o.a.s.c.SolrDeletionPolicy SolrDeletionPolicy.onInit: commits: num=1
   [junit4]   2> 	commit{dir=MockDirectoryWrapper(RAMDirectory@62bc0411 lockFactory=org.apache.lucene.store.SingleInstanceLockFactory@7d56b750),segFN=segments_1,generation=1}
   [junit4]   2> 16468 INFO  (coreLoadExecutor-114-thread-1-processing-n:127.0.0.1:34366_rcsq%2Fk) [n:127.0.0.1:34366_rcsq%2Fk c:control_collection s:shard1 r:core_node1 x:collection1] o.a.s.c.SolrDeletionPolicy newest commit generation = 1
   [junit4]   2> 16468 INFO  (coreLoadExecutor-114-thread-1-processing-n:127.0.0.1:34366_rcsq%2Fk) [n:127.0.0.1:34366_rcsq%2Fk c:control_collection s:shard1 r:core_node1 x:collection1] o.a.s.s.SolrIndexSearcher Opening [Searcher@131a4dfd[collection1] main]
   [junit4]   2> 16468 INFO  (coreLoadExecutor-114-thread-1-processing-n:127.0.0.1:34366_rcsq%2Fk) [n:127.0.0.1:34366_rcsq%2Fk c:control_collection s:shard1 r:core_node1 x:collection1] o.a.s.c.c.ZkStateReader Load collection config from: [/collections/control_collection]
   [junit4]   2> 16470 INFO  (coreLoadExecutor-114-thread-1-processing-n:127.0.0.1:34366_rcsq%2Fk) [n:127.0.0.1:34366_rcsq%2Fk c:control_collection s:shard1 r:core_node1 x:collection1] o.a.s.c.c.ZkStateReader path=[/collections/control_collection] [configName]=[conf1] specified config exists in ZooKeeper
   [junit4]   2> 16470 INFO  (coreLoadExecutor-114-thread-1-processing-n:127.0.0.1:34366_rcsq%2Fk) [n:127.0.0.1:34366_rcsq%2Fk c:control_collection s:shard1 r:core_node1 x:collection1] o.a.s.r.ManagedResourceStorage Setting up ZooKeeper-based storage for the RestManager with znodeBase: /configs/conf1
   [junit4]   2> 16474 INFO  (coreLoadExecutor-114-thread-1-processing-n:127.0.0.1:34366_rcsq%2Fk) [n:127.0.0.1:34366_rcsq%2Fk c:control_collection s:shard1 r:core_node1 x:collection1] o.a.s.r.ManagedResourceStorage Configured ZooKeeperStorageIO with znodeBase: /configs/conf1
   [junit4]   2> 16474 INFO  (coreLoadExecutor-114-thread-1-processing-n:127.0.0.1:34366_rcsq%2Fk) [n:127.0.0.1:34366_rcsq%2Fk c:control_collection s:shard1 r:core_node1 x:collection1] o.a.s.r.RestManager Initializing RestManager with initArgs: {}
   [junit4]   2> 16474 INFO  (coreLoadExecutor-114-thread-1-processing-n:127.0.0.1:34366_rcsq%2Fk) [n:127.0.0.1:34366_rcsq%2Fk c:control_collection s:shard1 r:core_node1 x:collection1] o.a.s.r.ManagedResourceStorage Reading _rest_managed.json using ZooKeeperStorageIO:path=/configs/conf1
   [junit4]   2> 16476 INFO  (coreLoadExecutor-114-thread-1-processing-n:127.0.0.1:34366_rcsq%2Fk) [n:127.0.0.1:34366_rcsq%2Fk c:control_collection s:shard1 r:core_node1 x:collection1] o.a.s.r.ManagedResourceStorage No data found for znode /configs/conf1/_rest_managed.json
   [junit4]   2> 16476 INFO  (coreLoadExecutor-114-thread-1-processing-n:127.0.0.1:34366_rcsq%2Fk) [n:127.0.0.1:34366_rcsq%2Fk c:control_collection s:shard1 r:core_node1 x:collection1] o.a.s.r.ManagedResourceStorage Loaded null at path _rest_managed.json using ZooKeeperStorageIO:path=/configs/conf1
   [junit4]   2> 16476 INFO  (coreLoadExecutor-114-thread-1-processing-n:127.0.0.1:34366_rcsq%2Fk) [n:127.0.0.1:34366_rcsq%2Fk c:control_collection s:shard1 r:core_node1 x:collection1] o.a.s.r.RestManager Initializing 0 registered ManagedResources
   [junit4]   2> 16476 INFO  (coreLoadExecutor-114-thread-1-processing-n:127.0.0.1:34366_rcsq%2Fk) [n:127.0.0.1:34366_rcsq%2Fk c:control_collection s:shard1 r:core_node1 x:collection1] o.a.s.h.ReplicationHandler Commits will be reserved for  10000
   [junit4]   2> 16477 INFO  (searcherExecutor-115-thread-1-processing-n:127.0.0.1:34366_rcsq%2Fk x:collection1 s:shard1 c:control_collection r:core_node1) [n:127.0.0.1:34366_rcsq%2Fk c:control_collection s:shard1 r:core_node1 x:collection1] o.a.s.c.SolrCore [collection1] Registered new searcher Searcher@131a4dfd[collection1] main{ExitableDirectoryReader(UninvertingDirectoryReader())}
   [junit4]   2> 16477 INFO  (coreLoadExecutor-114-thread-1-processing-n:127.0.0.1:34366_rcsq%2Fk) [n:127.0.0.1:34366_rcsq%2Fk c:control_collection s:shard1 r:core_node1 x:collection1] o.a.s.u.UpdateLog Looking up max value of version field to seed version buckets
   [junit4]   2> 16477 INFO  (coreLoadExecutor-114-thread-1-processing-n:127.0.0.1:34366_rcsq%2Fk) [n:127.0.0.1:34366_rcsq%2Fk c:control_collection s:shard1 r:core_node1 x:collection1] o.a.s.u.VersionInfo Refreshing highest value of _version_ for 65536 version buckets from index
   [junit4]   2> 16478 INFO  (coreLoadExecutor-114-thread-1-processing-n:127.0.0.1:34366_rcsq%2Fk) [n:127.0.0.1:34366_rcsq%2Fk c:control_collection s:shard1 r:core_node1 x:collection1] o.a.s.u.VersionInfo No terms found for _version_, cannot seed version bucket highest value from index
   [junit4]   2> 16478 INFO  (coreLoadExecutor-114-thread-1-processing-n:127.0.0.1:34366_rcsq%2Fk) [n:127.0.0.1:34366_rcsq%2Fk c:control_collection s:shard1 r:core_node1 x:collection1] o.a.s.u.UpdateLog Could not find max version in index or recent updates, using new clock 1544397403536228352
   [junit4]   2> 16479 INFO  (coreLoadExecutor-114-thread-1-processing-n:127.0.0.1:34366_rcsq%2Fk) [n:127.0.0.1:34366_rcsq%2Fk c:control_collection s:shard1 r:core_node1 x:collection1] o.a.s.u.UpdateLog Took 1.0ms to seed version buckets with highest version 1544397403536228352
   [junit4]   2> 16480 INFO  (coreLoadExecutor-114-thread-1-processing-n:127.0.0.1:34366_rcsq%2Fk) [n:127.0.0.1:34366_rcsq%2Fk c:control_collection s:shard1 r:core_node1 x:collection1] o.a.s.c.ZkController watch zkdir /configs/conf1
   [junit4]   2> 16482 INFO  (coreLoadExecutor-114-thread-1-processing-n:127.0.0.1:34366_rcsq%2Fk) [n:127.0.0.1:34366_rcsq%2Fk c:control_collection s:shard1 r:core_node1 x:collection1] o.a.s.c.CoreContainer registering core: collection1
   [junit4]   2> 16484 INFO  (coreZkRegister-107-thread-1-processing-n:127.0.0.1:34366_rcsq%2Fk x:collection1 s:shard1 c:control_collection r:core_node1) [n:127.0.0.1:34366_rcsq%2Fk c:control_collection s:shard1 r:core_node1 x:collection1] o.a.s.c.ZkController Register replica - core:collection1 address:http://127.0.0.1:34366/rcsq/k collection:control_collection shard:shard1
   [junit4]   2> 16493 INFO  (coreZkRegister-107-thread-1-processing-n:127.0.0.1:34366_rcsq%2Fk x:collection1 s:shard1 c:control_collection r:core_node1) [n:127.0.0.1:34366_rcsq%2Fk c:control_collection s:shard1 r:core_node1 x:collection1] o.a.s.c.c.SolrZkClient makePath: /collections/control_collection/leader_elect/shard1/election
   [junit4]   2> 16502 INFO  (coreZkRegister-107-thread-1-processing-n:127.0.0.1:34366_rcsq%2Fk x:collection1 s:shard1 c:control_collection r:core_node1) [n:127.0.0.1:34366_rcsq%2Fk c:control_collection s:shard1 r:core_node1 x:collection1] o.a.s.c.LeaderElector Joined leadership election with path: /collections/control_collection/leader_elect/shard1/election/96524837608947716-core_node1-n_0000000000
   [junit4]   2> 16503 INFO  (coreZkRegister-107-thread-1-processing-n:127.0.0.1:34366_rcsq%2Fk x:collection1 s:shard1 c:control_collection r:core_node1) [n:127.0.0.1:34366_rcsq%2Fk c:control_collection s:shard1 r:core_node1 x:collection1] o.a.s.c.ShardLeaderElectionContext Running the leader process for shard=shard1 and weAreReplacement=false and leaderVoteWait=10000
   [junit4]   2> 16506 INFO  (OverseerStateUpdate-96524837608947716-127.0.0.1:34366_rcsq%2Fk-n_0000000000) [n:127.0.0.1:34366_rcsq%2Fk    ] o.a.s.c.Overseer processMessage: queueSize: 1, message = {
   [junit4]   2>   "operation":"leader",
   [junit4]   2>   "shard":"shard1",
   [junit4]   2>   "collection":"control_collection"} current state version: 1
   [junit4]   2> 16507 INFO  (coreZkRegister-107-thread-1-processing-n:127.0.0.1:34366_rcsq%2Fk x:collection1 s:shard1 c:control_collection r:core_node1) [n:127.0.0.1:34366_rcsq%2Fk c:control_collection s:shard1 r:core_node1 x:collection1] o.a.s.c.ShardLeaderElectionContext Enough replicas found to continue.
   [junit4]   2> 16507 INFO  (coreZkRegister-107-thread-1-processing-n:127.0.0.1:34366_rcsq%2Fk x:collection1 s:shard1 c:control_collection r:core_node1) [n:127.0.0.1:34366_rcsq%2Fk c:control_collection s:shard1 r:core_node1 x:collection1] o.a.s.c.ShardLeaderElectionContext I may be the new leader - try and sync
   [junit4]   2> 16509 INFO  (coreZkRegister-107-thread-1-processing-n:127.0.0.1:34366_rcsq%2Fk x:collection1 s:shard1 c:control_collection r:core_node1) [n:127.0.0.1:34366_rcsq%2Fk c:control_collection s:shard1 r:core_node1 x:collection1] o.a.s.c.SyncStrategy Sync replicas to http://127.0.0.1:34366/rcsq/k/collection1/
   [junit4]   2> 16509 INFO  (coreZkRegister-107-thread-1-processing-n:127.0.0.1:34366_rcsq%2Fk x:collection1 s:shard1 c:control_collection r:core_node1) [n:127.0.0.1:34366_rcsq%2Fk c:control_collection s:shard1 r:core_node1 x:collection1] o.a.s.c.SyncStrategy Sync Success - now sync replicas to me
   [junit4]   2> 16509 INFO  (coreZkRegister-107-thread-1-processing-n:127.0.0.1:34366_rcsq%2Fk x:collection1 s:shard1 c:control_collection r:core_node1) [n:127.0.0.1:34366_rcsq%2Fk c:control_collection s:shard1 r:core_node1 x:collection1] o.a.s.c.SyncStrategy http://127.0.0.1:34366/rcsq/k/collection1/ has no replicas
   [junit4]   2> 16519 INFO  (coreZkRegister-107-thread-1-processing-n:127.0.0.1:34366_rcsq%2Fk x:collection1 s:shard1 c:control_collection r:core_node1) [n:127.0.0.1:34366_rcsq%2Fk c:control_collection s:shard1 r:core_node1 x:collection1] o.a.s.c.c.SolrZkClient makePath: /collections/control_collection/leaders/shard1
   [junit4]   2> 16525 INFO  (coreZkRegister-107-thread-1-processing-n:127.0.0.1:34366_rcsq%2Fk x:collection1 s:shard1 c:control_collection r:core_node1) [n:127.0.0.1:34366_rcsq%2Fk c:control_collection s:shard1 r:core_node1 x:collection1] o.a.s.c.ShardLeaderElectionContextBase Creating leader registration node /collections/control_collection/leaders/shard1/leader after winning as /collections/control_collection/leader_elect/shard1/election/96524837608947716-core_node1-n_0000000000
   [junit4]   2> 16549 INFO  (coreZkRegister-107-thread-1-processing-n:127.0.0.1:34366_rcsq%2Fk x:collection1 s:shard1 c:control_collection r:core_node1) [n:127.0.0.1:34366_rcsq%2Fk c:control_collection s:shard1 r:core_node1 x:collection1] o.a.s.c.ShardLeaderElectionContext I am the new leader: http://127.0.0.1:34366/rcsq/k/collection1/ shard1
   [junit4]   2> 16551 INFO  (OverseerStateUpdate-96524837608947716-127.0.0.1:34366_rcsq%2Fk-n_0000000000) [n:127.0.0.1:34366_rcsq%2Fk    ] o.a.s.c.Overseer processMessage: queueSize: 1, message = {
   [junit4]   2>   "operation":"leader",
   [junit4]   2>   "shard":"shard1",
   [junit4]   2>   "collection":"control_collection",
   [junit4]   2>   "base_url":"http://127.0.0.1:34366/rcsq/k",
   [junit4]   2>   "core":"collection1",
   [junit4]   2>   "state":"active"} current state version: 1
   [junit4]   2> 16656 INFO  (zkCallback-33-thread-1-processing-n:127.0.0.1:34366_rcsq%2Fk) [n:127.0.0.1:34366_rcsq%2Fk    ] o.a.s.c.c.ZkStateReader A cluster state change: [WatchedEvent state:SyncConnected type:NodeDataChanged path:/clusterstate.json], has occurred - updating... (live nodes size: [1])
   [junit4]   2> 16702 INFO  (coreZkRegister-107-thread-1-processing-n:127.0.0.1:34366_rcsq%2Fk x:collection1 s:shard1 c:control_collection r:core_node1) [n:127.0.0.1:34366_rcsq%2Fk c:control_collection s:shard1 r:core_node1 x:collection1] o.a.s.c.ZkController We are http://127.0.0.1:34366/rcsq/k/collection1/ and leader is http://127.0.0.1:34366/rcsq/k/collection1/
   [junit4]   2> 16702 INFO  (coreZkRegister-107-thread-1-processing-n:127.0.0.1:34366_rcsq%2Fk x:collection1 s:shard1 c:control_collection r:core_node1) [n:127.0.0.1:34366_rcsq%2Fk c:control_collection s:shard1 r:core_node1 x:collection1] o.a.s.c.ZkController No LogReplay needed for core=collection1 baseURL=http://127.0.0.1:34366/rcsq/k
   [junit4]   2> 16702 INFO  (coreZkRegister-107-thread-1-processing-n:127.0.0.1:34366_rcsq%2Fk x:collection1 s:shard1 c:control_collection r:core_node1) [n:127.0.0.1:34366_rcsq%2Fk c:control_collection s:shard1 r:core_node1 x:collection1] o.a.s.c.ZkController I am the leader, no recovery necessary
   [junit4]   2> 16702 INFO  (coreZkRegister-107-thread-1-processing-n:127.0.0.1:34366_rcsq%2Fk x:collection1 s:shard1 c:control_collection r:core_node1) [n:127.0.0.1:34366_rcsq%2Fk c:control_collection s:shard1 r:core_node1 x:collection1] o.a.s.c.ZkController publishing state=active
   [junit4]   2> 16703 INFO  (coreZkRegister-107-thread-1-processing-n:127.0.0.1:34366_rcsq%2Fk x:collection1 s:shard1 c:control_collection r:core_node1) [n:127.0.0.1:34366_rcsq%2Fk c:control_collection s:shard1 r:core_node1 x:collection1] o.a.s.c.ZkController numShards not found on descriptor - reading it from system property
   [junit4]   2> 16705 INFO  (coreZkRegister-107-thread-1-processing-n:127.0.0.1:34366_rcsq%2Fk x:collection1 s:shard1 c:control_collection r:core_node1) [n:127.0.0.1:34366_rcsq%2Fk c:control_collection s:shard1 r:core_node1 x:collection1] o.a.s.c.c.ZkStateReader Checking legacy cluster state for collection control_collection
   [junit4]   2> 16706 INFO  (OverseerStateUpdate-96524837608947716-127.0.0.1:34366_rcsq%2Fk-n_0000000000) [n:127.0.0.1:34366_rcsq%2Fk    ] o.a.s.c.Overseer processMessage: queueSize: 1, message = {
   [junit4]   2>   "core":"collection1",
   [junit4]   2>   "core_node_name":"core_node1",
   [junit4]   2>   "roles":null,
   [junit4]   2>   "base_url":"http://127.0.0.1:34366/rcsq/k",
   [junit4]   2>   "node_name":"127.0.0.1:34366_rcsq%2Fk",
   [junit4]   2>   "numShards":"1",
   [junit4]   2>   "state":"active",
   [junit4]   2>   "shard":"shard1",
   [junit4]   2>   "collection":"control_collection",
   [junit4]   2>   "operation":"state"} current state version: 2
   [junit4]   2> 16707 INFO  (OverseerStateUpdate-96524837608947716-127.0.0.1:34366_rcsq%2Fk-n_0000000000) [n:127.0.0.1:34366_rcsq%2Fk    ] o.a.s.c.o.ReplicaMutator Update state numShards=1 message={
   [junit4]   2>   "core":"collection1",
   [junit4]   2>   "core_node_name":"core_node1",
   [junit4]   2>   "roles":null,
   [junit4]   2>   "base_url":"http://127.0.0.1:34366/rcsq/k",
   [junit4]   2>   "node_name":"127.0.0.1:34366_rcsq%2Fk",
   [junit4]   2>   "numShards":"1",
   [junit4]   2>   "state":"active",
   [junit4]   2>   "shard":"shard1",
   [junit4]   2>   "collection":"control_collection",
   [junit4]   2>   "operation":"state"}
   [junit4]   2> 16747 INFO  (TEST-TestSolrConfigHandlerConcurrent.test-seed#[5FCB0D442252EFE3]) [    ] o.a.s.c.c.SolrZkClient Using default ZkCredentialsProvider
   [junit4]   2> 16748 INFO  (TEST-TestSolrConfigHandlerConcurrent.test-seed#[5FCB0D442252EFE3]) [    ] o.a.s.c.c.ConnectionManager Waiting for client to connect to ZooKeeper
   [junit4]   2> 16752 INFO  (zkCallback-37-thread-1) [    ] o.a.s.c.c.ConnectionManager Watcher org.apache.solr.common.cloud.ConnectionManager@6a3b6ff name:ZooKeeperConnection Watcher:127.0.0.1:57233/solr got event WatchedEvent state:SyncConnected type:None path:null path:null type:None
   [junit4]   2> 16752 INFO  (TEST-TestSolrConfigHandlerConcurrent.test-seed#[5FCB0D442252EFE3]) [    ] o.a.s.c.c.ConnectionManager Client is connected to ZooKeeper
   [junit4]   2> 16752 INFO  (TEST-TestSolrConfigHandlerConcurrent.test-seed#[5FCB0D442252EFE3]) [    ] o.a.s.c.c.SolrZkClient Using default ZkACLProvider
   [junit4]   2> 16752 INFO  (TEST-TestSolrConfigHandlerConcurrent.test-seed#[5FCB0D442252EFE3]) [    ] o.a.s.c.c.ZkStateReader Updating cluster state from ZooKeeper... 
   [junit4]   2> 16754 INFO  (TEST-TestSolrConfigHandlerConcurrent.test-seed#[5FCB0D442252EFE3]) [    ] o.a.s.c.c.ZkStateReader Loaded empty cluster properties
   [junit4]   2> 16755 INFO  (TEST-TestSolrConfigHandlerConcurrent.test-seed#[5FCB0D442252EFE3]) [    ] o.a.s.c.c.ZkStateReader Updated live nodes from ZooKeeper... (0) -> (1)
   [junit4]   2> 16759 INFO  (TEST-TestSolrConfigHandlerConcurrent.test-seed#[5FCB0D442252EFE3]) [    ] o.a.s.c.ChaosMonkey monkey: init - expire sessions:false cause connection loss:false
   [junit4]   2> 16812 INFO  (zkCallback-37-thread-1) [    ] o.a.s.c.c.ZkStateReader A cluster state change: [WatchedEvent state:SyncConnected type:NodeDataChanged path:/clusterstate.json], has occurred - updating... (live nodes size: [1])
   [junit4]   2> 16812 INFO  (zkCallback-33-thread-3-processing-n:127.0.0.1:34366_rcsq%2Fk) [n:127.0.0.1:34366_rcsq%2Fk    ] o.a.s.c.c.ZkStateReader A cluster state change: [WatchedEvent state:SyncConnected type:NodeDataChanged path:/clusterstate.json], has occurred - updating... (live nodes size: [1])
   [junit4]   2> 16916 INFO  (TEST-TestSolrConfigHandlerConcurrent.test-seed#[5FCB0D442252EFE3]) [    ] o.a.s.SolrTestCaseJ4 Writing core.properties file to /export/home/jenkins/workspace/Lucene-Solr-master-Solaris/solr/build/solr-core/test/J1/temp/solr.handler.TestSolrConfigHandlerConcurrent_5FCB0D442252EFE3-001/shard-1-001/cores/collection1
   [junit4]   2> 16917 INFO  (TEST-TestSolrConfigHandlerConcurrent.test-seed#[5FCB0D442252EFE3]) [    ] o.a.s.c.AbstractFullDistribZkTestBase create jetty 1 in directory /export/home/jenkins/workspace/Lucene-Solr-master-Solaris/solr/build/solr-core/test/J1/temp/solr.handler.TestSolrConfigHandlerConcurrent_5FCB0D442252EFE3-001/shard-1-001
   [junit4]   2> 16920 INFO  (TEST-TestSolrConfigHandlerConcurrent.test-seed#[5FCB0D442252EFE3]) [    ] o.e.j.s.Server jetty-9.3.8.v20160314
   [junit4]   2> 16930 INFO  (TEST-TestSolrConfigHandlerConcurrent.test-seed#[5FCB0D442252EFE3]) [    ] o.e.j.s.h.ContextHandler Started o.e.j.s.ServletContextHandler@78227447{/rcsq/k,null,AVAILABLE}
   [junit4]   2> 16931 INFO  (TEST-TestSolrConfigHandlerConcurrent.test-seed#[5FCB0D442252EFE3]) [    ] o.e.j.s.ServerConnector Started ServerConnector@3fcaac2b{HTTP/1.1,[http/1.1]}{127.0.0.1:33368}
   [junit4]   2> 16931 INFO  (TEST-TestSolrConfigHandlerConcurrent.test-seed#[5FCB0D442252EFE3]) [    ] o.e.j.s.Server Started @19181ms
   [junit4]   2> 16931 INFO  (TEST-TestSolrConfigHandlerConcurrent.test-seed#[5FCB0D442252EFE3]) [    ] o.a.s.c.s.e.JettySolrRunner Jetty properties: {solr.data.dir=/export/home/jenkins/workspace/Lucene-Solr-master-Solaris/solr/build/solr-core/test/J1/temp/solr.handler.TestSolrConfigHandlerConcurrent_5FCB0D442252EFE3-001/tempDir-001/jetty1, solrconfig=solrconfig.xml, hostContext=/rcsq/k, hostPort=33368, coreRootDirectory=/export/home/jenkins/workspace/Lucene-Solr-master-Solaris/solr/build/solr-core/test/J1/../../../../../../../../../../export/home/jenkins/workspace/Lucene-Solr-master-Solaris/solr/build/solr-core/test/J1/temp/solr.handler.TestSolrConfigHandlerConcurrent_5FCB0D442252EFE3-001/shard-1-001/cores}
   [junit4]   2> 16932 INFO  (TEST-TestSolrConfigHandlerConcurrent.test-seed#[5FCB0D442252EFE3]) [    ] o.a.s.s.SolrDispatchFilter SolrDispatchFilter.init(): sun.misc.Launcher$AppClassLoader@6d06d69c
   [junit4]   2> 16932 INFO  (TEST-TestSolrConfigHandlerConcurrent.test-seed#[5FCB0D442252EFE3]) [    ] o.a.s.c.SolrResourceLoader new SolrResourceLoader for directory: '/export/home/jenkins/workspace/Lucene-Solr-master-Solaris/solr/build/solr-core/test/J1/temp/solr.handler.TestSolrConfigHandlerConcurrent_5FCB0D442252EFE3-001/shard-1-001'
   [junit4]   2> 16932 INFO  (TEST-TestSolrConfigHandlerConcurrent.test-seed#[5FCB0D442252EFE3]) [    ] o.a.s.c.SolrResourceLoader JNDI not configured for solr (NoInitialContextEx)
   [junit4]   2> 16933 INFO  (TEST-TestSolrConfigHandlerConcurrent.test-seed#[5FCB0D442252EFE3]) [    ] o.a.s.c.SolrResourceLoader solr home defaulted to 'solr/' (could not find system property or JNDI)
   [junit4]   2> 16933 INFO  (TEST-TestSolrConfigHandlerConcurrent.test-seed#[5FCB0D442252EFE3]) [    ] o.a.s.c.c.SolrZkClient Using default ZkCredentialsProvider
   [junit4]   2> 16934 INFO  (TEST-TestSolrConfigHandlerConcurrent.test-seed#[5FCB0D442252EFE3]) [    ] o.a.s.c.c.ConnectionManager Waiting for client to connect to ZooKeeper
   [junit4]   2> 16939 INFO  (zkCallback-38-thread-1) [    ] o.a.s.c.c.ConnectionManager Watcher org.apache.solr.common.cloud.ConnectionManager@5d5c6d7e name:ZooKeeperConnection Watcher:127.0.0.1:57233/solr got event WatchedEvent state:SyncConnected type:None path:null path:null type:None
   [junit4]   2> 16940 INFO  (TEST-TestSolrConfigHandlerConcurrent.test-seed#[5FCB0D442252EFE3]) [    ] o.a.s.c.c.ConnectionManager Client is connected to ZooKeeper
   [junit4]   2> 16940 INFO  (TEST-TestSolrConfigHandlerConcurrent.test-seed#[5FCB0D442252EFE3]) [    ] o.a.s.c.c.SolrZkClient Using default ZkACLProvider
   [junit4]   2> 16944 INFO  (TEST-TestSolrConfigHandlerConcurrent.test-seed#[5FCB0D442252EFE3]) [    ] o.a.s.s.SolrDispatchFilter Loading solr.xml from SolrHome (not found in ZooKeeper)
   [junit4]   2> 16944 INFO  (TEST-TestSolrConfigHandlerConcurrent.test-seed#[5FCB0D442252EFE3]) [    ] o.a.s.c.SolrXmlConfig Loading container configuration from /export/home/jenkins/workspace/Lucene-Solr-master-Solaris/solr/build/solr-core/test/J1/temp/solr.handler.TestSolrConfigHandlerConcurrent_5FCB0D442252EFE3-001/shard-1-001/solr.xml
   [junit4]   2> 16953 INFO  (TEST-TestSolrConfigHandlerConcurrent.test-seed#[5FCB0D442252EFE3]) [    ] o.a.s.c.CorePropertiesLocator Config-defined core root directory: /export/home/jenkins/workspace/Lucene-Solr-master-Solaris/solr/build/solr-core/test/J1/../../../../../../../../../../export/home/jenkins/workspace/Lucene-Solr-master-Solaris/solr/build/solr-core/test/J1/temp/solr.handler.TestSolrConfigHandlerConcurrent_5FCB0D442252EFE3-001/shard-1-001/cores
   [junit4]   2> 16953 INFO  (TEST-TestSolrConfigHandlerConcurrent.test-seed#[5FCB0D442252EFE3]) [    ] o.a.s.c.CoreContainer New CoreContainer 2049416123
   [junit4]   2> 16953 INFO  (TEST-TestSolrConfigHandlerConcurrent.test-seed#[5FCB0D442252EFE3]) [    ] o.a.s.c.CoreContainer Loading cores into CoreContainer [instanceDir=/export/home/jenkins/workspace/Lucene-Solr-master-Solaris/solr/build/solr-core/test/J1/temp/solr.handler.TestSolrConfigHandlerConcurrent_5FCB0D442252EFE3-001/shard-1-001]
   [junit4]   2> 16953 WARN  (TEST-TestSolrConfigHandlerConcurrent.test-seed#[5FCB0D442252EFE3]) [    ] o.a.s.c.CoreContainer Couldn't add files from /export/home/jenkins/workspace/Lucene-Solr-master-Solaris/solr/build/solr-core/test/J1/temp/solr.handler.TestSolrConfigHandlerConcurrent_5FCB0D442252EFE3-001/shard-1-001/lib to classpath: /export/home/jenkins/workspace/Lucene-Solr-master-Solaris/solr/build/solr-core/test/J1/temp/solr.handler.TestSolrConfigHandlerConcurrent_5FCB0D442252EFE3-001/shard-1-001/lib
   [junit4]   2> 16953 INFO  (TEST-TestSolrConfigHandlerConcurrent.test-seed#[5FCB0D442252EFE3]) [    ] o.a.s.h.c.HttpShardHandlerFactory created with socketTimeout : 90000,urlScheme : ,connTimeout : 15000,maxConnectionsPerHost : 20,maxConnections : 10000,corePoolSize : 0,maximumPoolSize : 2147483647,maxThreadIdleTime : 5,sizeOfQueue : -1,fairnessPolicy : false,
   [junit4]   2> 16962 INFO  (TEST-TestSolrConfigHandlerConcurrent.test-seed#[5FCB0D442252EFE3]) [    ] o.a.s.u.UpdateShardHandler Created UpdateShardHandler HTTP client with params: socketTimeout=340000&connTimeout=45000&maxConnections=100000&maxConnectionsPerHost=100000
   [junit4]   2> 16962 INFO  (TEST-TestSolrConfigHandlerConcurrent.test-seed#[5FCB0D442252EFE3]) [    ] o.a.s.l.LogWatcher SLF4J impl is org.slf4j.impl.Log4jLoggerFactory
   [junit4]   2> 16962 INFO  (TEST-TestSolrConfigHandlerConcurrent.test-seed#[5FCB0D442252EFE3]) [    ] o.a.s.l.LogWatcher Registering Log Listener [Log4j (org.slf4j.impl.Log4jLoggerFactory)]
   [junit4]   2> 16962 INFO  (TEST-TestSolrConfigHandlerConcurrent.test-seed#[5FCB0D442252EFE3]) [    ] o.a.s.c.ZkContainer Zookeeper client=127.0.0.1:57233/solr
   [junit4]   2> 16962 INFO  (TEST-TestSolrConfigHandlerConcurrent.test-seed#[5FCB0D442252EFE3]) [    ] o.a.s.c.ZkController zkHost includes chroot
   [junit4]   2> 16962 INFO  (TEST-TestSolrConfigHandlerConcurrent.test-seed#[5FCB0D442252EFE3]) [    ] o.a.s.c.c.SolrZkClient Using default ZkCredentialsProvider
   [junit4]   2> 16963 INFO  (TEST-TestSolrConfigHandlerConcurrent.test-seed#[5FCB0D442252EFE3]) [    ] o.a.s.c.c.ConnectionManager Waiting for client to connect to ZooKeeper
   [junit4]   2> 16973 INFO  (zkCallback-41-thread-1) [    ] o.a.s.c.c.ConnectionManager Watcher org.apache.solr.common.cloud.ConnectionManager@3671060d name:ZooKeeperConnection Watcher:127.0.0.1:57233 got event WatchedEvent state:SyncConnected type:None path:null path:null type:None
   [junit4]   2> 16975 INFO  (TEST-TestSolrConfigHandlerConcurrent.test-seed#[5FCB0D442252EFE3]) [    ] o.a.s.c.c.ConnectionManager Client is connected to ZooKeeper
   [junit4]   2> 16975 INFO  (TEST-TestSolrConfigHandlerConcurrent.test-seed#[5FCB0D442252EFE3]) [    ] o.a.s.c.c.SolrZkClient Using default ZkACLProvider
   [junit4]   2> 16978 INFO  (TEST-TestSolrConfigHandlerConcurrent.test-seed#[5FCB0D442252EFE3]) [n:127.0.0.1:33368_rcsq%2Fk    ] o.a.s.c.ZkController Added new OnReconnect listener org.apache.solr.cloud.ZkController$$Lambda$82/1918400991@56a1ba65
   [junit4]   2> 16980 INFO  (TEST-TestSolrConfigHandlerConcurrent.test-seed#[5FCB0D442252EFE3]) [n:127.0.0.1:33368_rcsq%2Fk    ] o.a.s.c.c.ConnectionManager Waiting for client to connect to ZooKeeper
   [junit4]   2> 16983 INFO  (zkCallback-42-thread-1-processing-n:127.0.0.1:33368_rcsq%2Fk) [n:127.0.0.1:33368_rcsq%2Fk    ] o.a.s.c.c.ConnectionManager Watcher org.apache.solr.common.cloud.ConnectionManager@7b2912f8 name:ZooKeeperConnection Watcher:127.0.0.1:57233/solr got event WatchedEvent state:SyncConnected type:None path:null path:null type:None
   [junit4]   2> 16983 INFO  (TEST-TestSolrConfigHandlerConcurrent.test-seed#[5FCB0D442252EFE3]) [n:127.0.0.1:33368_rcsq%2Fk    ] o.a.s.c.c.ConnectionManager Client is connected to ZooKeeper
   [junit4]   2> 16994 INFO  (TEST-TestSolrConfigHandlerConcurrent.test-seed#[5FCB0D442252EFE3]) [n:127.0.0.1:33368_rcsq%2Fk    ] o.a.s.c.c.ZkStateReader Updating cluster state from ZooKeeper... 
   [junit4]   2> 16995 INFO  (TEST-TestSolrConfigHandlerConcurrent.test-seed#[5FCB0D442252EFE3]) [n:127.0.0.1:33368_rcsq%2Fk    ] o.a.s.c.c.ZkStateReader Loaded empty cluster properties
   [junit4]   2> 16997 INFO  (TEST-TestSolrConfigHandlerConcurrent.test-seed#[5FCB0D442252EFE3]) [n:127.0.0.1:33368_rcsq%2Fk    ] o.a.s.c.c.ZkStateReader Updated live nodes from ZooKeeper... (0) -> (1)
   [junit4]   2> 17002 INFO  (TEST-TestSolrConfigHandlerConcurrent.test-seed#[5FCB0D442252EFE3]) [n:127.0.0.1:33368_rcsq%2Fk    ] o.a.s.c.Overseer Overseer (id=null) closing
   [junit4]   2> 17010 INFO  (TEST-TestSolrConfigHandlerConcurrent.test-seed#[5FCB0D442252EFE3]) [n:127.0.0.1:33368_rcsq%2Fk    ] o.a.s.c.LeaderElector Joined leadership election with path: /overseer_elect/election/96524837608947720-127.0.0.1:33368_rcsq%2Fk-n_0000000001
   [junit4]   2> 17013 INFO  (TEST-TestSolrConfigHandlerConcurrent.test-seed#[5FCB0D442252EFE3]) [n:127.0.0.1:33368_rcsq%2Fk    ] o.a.s.c.LeaderElector Watching path /overseer_elect/election/96524837608947716-127.0.0.1:34366_rcsq%2Fk-n_0000000000 to know if I could be the leader
   [junit4]   2> 17014 INFO  (TEST-TestSolrConfigHandlerConcurrent.test-seed#[5FCB0D442252EFE3]) [n:127.0.0.1:33368_rcsq%2Fk    ] o.a.s.c.ZkController Publish node=127.0.0.1:33368_rcsq%2Fk as DOWN
   [junit4]   2> 17018 INFO  (TEST-TestSolrConfigHandlerConcurrent.test-seed#[5FCB0D442252EFE3]) [n:127.0.0.1:33368_rcsq%2Fk    ] o.a.s.c.ZkController Register node as live in ZooKeeper:/live_nodes/127.0.0.1:33368_rcsq%2Fk
   [junit4]   2> 17018 INFO  (TEST-TestSolrConfigHandlerConcurrent.test-seed#[5FCB0D442252EFE3]) [n:127.0.0.1:33368_rcsq%2Fk    ] o.a.s.c.c.SolrZkClient makePath: /live_nodes/127.0.0.1:33368_rcsq%2Fk
   [junit4]   2> 17018 INFO  (OverseerStateUpdate-96524837608947716-127.0.0.1:34366_rcsq%2Fk-n_0000000000) [n:127.0.0.1:34366_rcsq%2Fk    ] o.a.s.c.Overseer processMessage: queueSize: 1, message = {
   [junit4]   2>   "operation":"downnode",
   [junit4]   2>   "node_name":"127.0.0.1:33368_rcsq%2Fk"} current state version: 3
   [junit4]   2> 17020 INFO  (OverseerStateUpdate-96524837608947716-127.0.0.1:34366_rcsq%2Fk-n_0000000000) [n:127.0.0.1:34366_rcsq%2Fk    ] o.a.s.c.o.NodeMutator DownNode state invoked for node: 127.0.0.1:33368_rcsq%2Fk
   [junit4]   2> 17022 INFO  (zkCallback-37-thread-1) [    ] o.a.s.c.c.ZkStateReader A live node change: [WatchedEvent state:SyncConnected type:NodeChildrenChanged path:/live_nodes], has occurred - updating... (live nodes size: [1])
   [junit4]   2> 17022 INFO  (zkCallback-42-thread-1-processing-n:127.0.0.1:33368_rcsq%2Fk) [n:127.0.0.1:33368_rcsq%2Fk    ] o.a.s.c.c.ZkStateReader A live node change: [WatchedEvent state:SyncConnected type:NodeChildrenChanged path:/live_nodes], has occurred - updating... (live nodes size: [1])
   [junit4]   2> 17023 INFO  (zkCallback-33-thread-2-processing-n:127.0.0.1:34366_rcsq%2Fk) [n:127.0.0.1:34366_rcsq%2Fk    ] o.a.s.c.c.ZkStateReader A live node change: [WatchedEvent state:SyncConnected type:NodeChildrenChanged path:/live_nodes], has occurred - updating... (live nodes size: [1])
   [junit4]   2> 17024 INFO  (zkCallback-37-thread-1) [    ] o.a.s.c.c.ZkStateReader Updated live nodes from ZooKeeper... (1) -> (2)
   [junit4]   2> 17024 INFO  (zkCallback-33-thread-2-processing-n:127.0.0.1:34366_rcsq%2Fk) [n:127.0.0.1:34366_rcsq%2Fk    ] o.a.s.c.c.ZkStateReader Updated live nodes from ZooKeeper... (1) -> (2)
   [junit4]   2> 17025 INFO  (zkCallback-42-thread-1-processing-n:127.0.0.1:33368_rcsq%2Fk) [n:127.0.0.1:33368_rcsq%2Fk    ] o.a.s.c.c.ZkStateReader Updated live nodes from ZooKeeper... (1) -> (2)
   [junit4]   2> 17045 INFO  (TEST-TestSolrConfigHandlerConcurrent.test-seed#[5FCB0D442252EFE3]) [n:127.0.0.1:33368_rcsq%2Fk    ] o.a.s.c.CoreContainer Security conf doesn't exist. Skipping setup for authorization module.
   [junit4]   2> 17045 INFO  (TEST-TestSolrConfigHandlerConcurrent.test-seed#[5FCB0D442252EFE3]) [n:127.0.0.1:33368_rcsq%2Fk    ] o.a.s.c.CoreContainer No authentication plugin used.
   [junit4]   2> 17046 INFO  (TEST-TestSolrConfigHandlerConcurrent.test-seed#[5FCB0D442252EFE3]) [n:127.0.0.1:33368_rcsq%2Fk    ] o.a.s.c.CorePropertiesLocator Looking for core definitions underneath /export/home/jenkins/workspace/Lucene-Solr-master-Solaris/solr/build/solr-core/test/J1/../../../../../../../../../../export/home/jenkins/workspace/Lucene-Solr-master-Solaris/solr/build/solr-core/test/J1/temp/solr.handler.TestSolrConfigHandlerConcurrent_5FCB0D442252EFE3-001/shard-1-001/cores
   [junit4]   2> 17047 INFO  (TEST-TestSolrConfigHandlerConcurrent.test-seed#[5FCB0D442252EFE3]) [n:127.0.0.1:33368_rcsq%2Fk    ] o.a.s.c.CoreDescriptor Created CoreDescriptor: {name=collection1, config=solrconfig.xml, transient=false, schema=schema.xml, loadOnStartup=true, configSetProperties=configsetprops.json, collection=collection1, coreNodeName=, dataDir=data/, shard=}
   [junit4]   2> 17047 INFO  (TEST-TestSolrConfigHandlerConcurrent.test-seed#[5FCB0D442252EFE3]) [n:127.0.0.1:33368_rcsq%2Fk    ] o.a.s.c.CorePropertiesLocator Found core collection1 in /export/home/jenkins/workspace/Lucene-Solr-master-Solaris/solr/build/solr-core/test/J1/../../../../../../../../../../export/home/jenkins/workspace/Lucene-Solr-master-Solaris/solr/build/solr-core/test/J1/temp/solr.handler.TestSolrConfigHandlerConcurrent_5FCB0D442252EFE3-001/shard-1-001/cores/collection1
   [junit4]   2> 17048 INFO  (TEST-TestSolrConfigHandlerConcurrent.test-seed#[5FCB0D442252EFE3]) [n:127.0.0.1:33368_rcsq%2Fk    ] o.a.s.c.CorePropertiesLocator Found 1 core definitions
   [junit4]   2> 17049 INFO  (TEST-TestSolrConfigHandlerConcurrent.test-seed#[5FCB0D442252EFE3]) [n:127.0.0.1:33368_rcsq%2Fk    ] o.a.s.s.SolrDispatchFilter user.dir=/export/home/jenkins/workspace/Lucene-Solr-master-Solaris/solr/build/solr-core/test/J1
   [junit4]   2> 17049 INFO  (TEST-TestSolrConfigHandlerConcurrent.test-seed#[5FCB0D442252EFE3]) [n:127.0.0.1:33368_rcsq%2Fk    ] o.a.s.s.SolrDispatchFilter SolrDispatchFilter.init() done
   [junit4]   2> 17050 INFO  (coreLoadExecutor-125-thread-1-processing-n:127.0.0.1:33368_rcsq%2Fk) [n:127.0.0.1:33368_rcsq%2Fk c:collection1   x:collection1] o.a.s.c.ZkController publishing state=down
   [junit4]   2> 17050 INFO  (coreLoadExecutor-125-thread-1-processing-n:127.0.0.1:33368_rcsq%2Fk) [n:127.0.0.1:33368_rcsq%2Fk c:collection1   x:collection1] o.a.s.c.ZkController numShards not found on descriptor - reading it from system property
   [junit4]   2> 17053 INFO  (OverseerStateUpdate-96524837608947716-127.0.0.1:34366_rcsq%2Fk-n_0000000000) [n:127.0.0.1:34366_rcsq%2Fk    ] o.a.s.c.Overseer processMessage: queueSize: 1, message = {
   [junit4]   2>   "core":"collection1",
   [junit4]   2>   "roles":null,
   [junit4]   2>   "base_url":"http://127.0.0.1:33368/rcsq/k",
   [junit4]   2>   "node_name":"127.0.0.1:33368_rcsq%2Fk",
   [junit4]   2>   "numShards":"2",
   [junit4]   2>   "state":"down",
   [junit4]   2>   "shard":null,
   [junit4]   2>   "collection":"collection1",
   [junit4]   2>   "operation":"state"} current state version: 3
   [junit4]   2> 17053 INFO  (OverseerStateUpdate-96524837608947716-127.0.0.1:34366_rcsq%2Fk-n_0000000000) [n:127.0.0.1:34366_rcsq%2Fk    ] o.a.s.c.o.ReplicaMutator Update state numShards=2 message={
   [junit4]   2>   "core":"collection1",
   [junit4]   2>   "roles":null,
   [junit4]   2>   "base_url":"http://127.0.0.1:33368/rcsq/k",
   [junit4]   2>   "node_name":"127.0.0.1:33368_rcsq%2Fk",
   [junit4]   2>   "numShards":"2",
   [junit4]   2>   "state":"down",
   [junit4]   2>   "shard":null,
   [junit4]   2>   "collection":"collection1",
   [junit4]   2>   "operation":"state"}
   [junit4]   2> 17053 INFO  (OverseerStateUpdate-96524837608947716-127.0.0.1:34366_rcsq%2Fk-n_0000000000) [n:127.0.0.1:34366_rcsq%2Fk    ] o.a.s.c.o.ClusterStateMutat

[...truncated too long message...]

lrCoreState
   [junit4]   2> 1694860 INFO  (coreCloseExecutor-6606-thread-1-processing-x:collection1) [    x:collection1] o.a.s.u.DefaultSolrCoreState SolrCoreState ref count has reached 0 - closing IndexWriter
   [junit4]   2> 1694860 INFO  (coreCloseExecutor-6606-thread-1-processing-x:collection1) [    x:collection1] o.a.s.u.DefaultSolrCoreState closing IndexWriter with IndexWriterCloser
   [junit4]   2> 1694860 INFO  (coreCloseExecutor-6606-thread-1-processing-x:collection1) [    x:collection1] o.a.s.u.DirectUpdateHandler2 Committing on IndexWriter close.
   [junit4]   2> 1694864 INFO  (coreCloseExecutor-6606-thread-1-processing-x:collection1) [    x:collection1] o.a.s.c.SolrDeletionPolicy SolrDeletionPolicy.onCommit: commits: num=2
   [junit4]   2> 	commit{dir=MockDirectoryWrapper(RAMDirectory@17dbae6e lockFactory=org.apache.lucene.store.SingleInstanceLockFactory@2ec86a18),segFN=segments_1,generation=1}
   [junit4]   2> 	commit{dir=MockDirectoryWrapper(RAMDirectory@17dbae6e lockFactory=org.apache.lucene.store.SingleInstanceLockFactory@2ec86a18),segFN=segments_2,generation=2}
   [junit4]   2> 1694864 INFO  (coreCloseExecutor-6606-thread-1-processing-x:collection1) [    x:collection1] o.a.s.c.SolrDeletionPolicy newest commit generation = 2
   [junit4]   2> 1694865 INFO  (coreCloseExecutor-6606-thread-1-processing-x:collection1) [    x:collection1] o.a.s.c.SolrCore [collection1] Closing main searcher on request.
   [junit4]   2> 1694876 INFO  (coreCloseExecutor-6606-thread-1-processing-x:collection1) [    x:collection1] o.a.s.c.CachingDirectoryFactory Closing MockDirectoryFactory - 3 directories currently being tracked
   [junit4]   2> 1694876 INFO  (coreCloseExecutor-6606-thread-1-processing-x:collection1) [    x:collection1] o.a.s.c.CachingDirectoryFactory looking to close /export/home/jenkins/workspace/Lucene-Solr-master-Solaris/solr/build/solr-core/test/J1/temp/solr.update.HardAutoCommitTest_5FCB0D442252EFE3-001/init-core-data-001/index [CachedDir<<refCount=0;path=/export/home/jenkins/workspace/Lucene-Solr-master-Solaris/solr/build/solr-core/test/J1/temp/solr.update.HardAutoCommitTest_5FCB0D442252EFE3-001/init-core-data-001/index;done=false>>]
   [junit4]   2> 1694876 INFO  (coreCloseExecutor-6606-thread-1-processing-x:collection1) [    x:collection1] o.a.s.c.CachingDirectoryFactory Closing directory, CoreContainer#isShutdown=true
   [junit4]   2> 1694876 INFO  (coreCloseExecutor-6606-thread-1-processing-x:collection1) [    x:collection1] o.a.s.c.CachingDirectoryFactory Closing directory: /export/home/jenkins/workspace/Lucene-Solr-master-Solaris/solr/build/solr-core/test/J1/temp/solr.update.HardAutoCommitTest_5FCB0D442252EFE3-001/init-core-data-001/index
   [junit4]   2> 1694876 INFO  (coreCloseExecutor-6606-thread-1-processing-x:collection1) [    x:collection1] o.a.s.c.CachingDirectoryFactory looking to close /export/home/jenkins/workspace/Lucene-Solr-master-Solaris/solr/build/solr-core/test/J1/temp/solr.update.HardAutoCommitTest_5FCB0D442252EFE3-001/init-core-data-001/snapshot_metadata [CachedDir<<refCount=0;path=/export/home/jenkins/workspace/Lucene-Solr-master-Solaris/solr/build/solr-core/test/J1/temp/solr.update.HardAutoCommitTest_5FCB0D442252EFE3-001/init-core-data-001/snapshot_metadata;done=false>>]
   [junit4]   2> 1694876 INFO  (coreCloseExecutor-6606-thread-1-processing-x:collection1) [    x:collection1] o.a.s.c.CachingDirectoryFactory Closing directory, CoreContainer#isShutdown=true
   [junit4]   2> 1694876 INFO  (coreCloseExecutor-6606-thread-1-processing-x:collection1) [    x:collection1] o.a.s.c.CachingDirectoryFactory Closing directory: /export/home/jenkins/workspace/Lucene-Solr-master-Solaris/solr/build/solr-core/test/J1/temp/solr.update.HardAutoCommitTest_5FCB0D442252EFE3-001/init-core-data-001/snapshot_metadata
   [junit4]   2> 1694876 INFO  (coreCloseExecutor-6606-thread-1-processing-x:collection1) [    x:collection1] o.a.s.c.CachingDirectoryFactory looking to close /export/home/jenkins/workspace/Lucene-Solr-master-Solaris/solr/build/solr-core/test/J1/temp/solr.update.HardAutoCommitTest_5FCB0D442252EFE3-001/init-core-data-001 [CachedDir<<refCount=0;path=/export/home/jenkins/workspace/Lucene-Solr-master-Solaris/solr/build/solr-core/test/J1/temp/solr.update.HardAutoCommitTest_5FCB0D442252EFE3-001/init-core-data-001;done=false>>]
   [junit4]   2> 1694877 INFO  (coreCloseExecutor-6606-thread-1-processing-x:collection1) [    x:collection1] o.a.s.c.CachingDirectoryFactory Closing directory, CoreContainer#isShutdown=true
   [junit4]   2> 1694877 INFO  (coreCloseExecutor-6606-thread-1-processing-x:collection1) [    x:collection1] o.a.s.c.CachingDirectoryFactory Closing directory: /export/home/jenkins/workspace/Lucene-Solr-master-Solaris/solr/build/solr-core/test/J1/temp/solr.update.HardAutoCommitTest_5FCB0D442252EFE3-001/init-core-data-001
   [junit4]   2> NOTE: leaving temporary files on disk at: /export/home/jenkins/workspace/Lucene-Solr-master-Solaris/solr/build/solr-core/test/J1/temp/solr.update.HardAutoCommitTest_5FCB0D442252EFE3-001
   [junit4]   2> NOTE: test params are: codec=Asserting(Lucene62): {range_facet_l_dv=FST50, _version_=PostingsFormat(name=Direct), field_t=PostingsFormat(name=Memory doPackFST= true), multiDefault=PostingsFormat(name=LuceneVarGapFixedInterval), subject=PostingsFormat(name=LuceneVarGapFixedInterval), intDefault=PostingsFormat(name=Direct), id=FST50, range_facet_i_dv=PostingsFormat(name=Direct), text=PostingsFormat(name=Memory doPackFST= true), range_facet_l=PostingsFormat(name=Direct), timestamp=PostingsFormat(name=Direct)}, docValues:{range_facet_l_dv=DocValuesFormat(name=Memory), range_facet_i_dv=DocValuesFormat(name=Direct), timestamp=DocValuesFormat(name=Direct)}, maxPointsInLeafNode=920, maxMBSortInHeap=7.267077016623888, sim=ClassicSimilarity, locale=ar-EG, timezone=America/St_Vincent
   [junit4]   2> NOTE: SunOS 5.11 amd64/Oracle Corporation 1.8.0_102 (64-bit)/cpus=3,threads=1,free=306383296,total=518979584
   [junit4]   2> NOTE: All tests run in this JVM: [TestSolrQueryParser, CdcrReplicationDistributedZkTest, CoreAdminRequestStatusTest, ShowFileRequestHandlerTest, TestConfigSetsAPIZkFailure, SolrInfoMBeanTest, SuggesterTest, TestSolrConfigHandlerConcurrent, SignatureUpdateProcessorFactoryTest, TestSolrCoreProperties, UniqFieldsUpdateProcessorFactoryTest, TestFastWriter, TestQueryUtils, TestSimpleTrackingShardHandler, OverseerModifyCollectionTest, BlockDirectoryTest, TermVectorComponentTest, BigEndianAscendingWordDeserializerTest, FieldAnalysisRequestHandlerTest, SolrCoreCheckLockOnStartupTest, SpellingQueryConverterTest, TestAnalyzeInfixSuggestions, ZkSolrClientTest, DistributedTermsComponentTest, TestNamedUpdateProcessors, HLLUtilTest, TestSolrCoreSnapshots, TestBadConfig, TestFastOutputStream, TestNumericTerms64, TestSchemaSimilarityResource, TestBinaryResponseWriter, TestDistribIDF, IndexSchemaRuntimeFieldTest, ConnectionReuseTest, TestZkChroot, TestReplicaProperties, TestStressUserVersions, TestAuthorizationFramework, AnalyticsQueryTest, TestClassicSimilarityFactory, TestConfigSetsAPI, SuggestComponentTest, TestTolerantUpdateProcessorRandomCloud, TestSQLHandler, TestQueryWrapperFilter, TestCrossCoreJoin, TestBulkSchemaAPI, TestXmlQParser, TestLegacyFieldCache, BadIndexSchemaTest, TestSuggestSpellingConverter, TestFiltering, HdfsDirectoryTest, SaslZkACLProviderTest, DateMathParserTest, SimpleCollectionCreateDeleteTest, TestReload, TestOnReconnectListenerSupport, LeaderFailoverAfterPartitionTest, TestSolrIndexConfig, SuggesterTSTTest, DistributedExpandComponentTest, CacheHeaderTest, TestCloudPseudoReturnFields, CopyFieldTest, CoreAdminHandlerTest, CollectionStateFormat2Test, TestCopyFieldCollectionResource, TestOrdValues, TestHdfsBackupRestoreCore, SegmentsInfoRequestHandlerTest, TestInitQParser, TestJsonFacets, TestSolrFieldCacheMBean, ParsingFieldUpdateProcessorsTest, TestNRTOpen, BinaryUpdateRequestHandlerTest, ChangedSchemaMergeTest, TestFieldCacheSort, ConvertedLegacyTest, DateFieldTest, PeerSyncReplicationTest, TestSubQueryTransformer, TestFieldTypeCollectionResource, RulesTest, FileUtilsTest, ZkNodePropsTest, TestManagedStopFilterFactory, SolrPluginUtilsTest, SpellCheckCollatorTest, TestFieldSortValues, CollectionsAPIAsyncDistributedZkTest, TestShortCircuitedRequests, NumericFieldsTest, InfoHandlerTest, LeaderElectionIntegrationTest, DeleteReplicaTest, MultiTermTest, RollingRestartTest, ResponseHeaderTest, SortSpecParsingTest, TestExclusionRuleCollectionAccess, TestTrackingShardHandlerFactory, TestSolrJ, TestPHPSerializedResponseWriter, TestRTGBase, HdfsBasicDistributedZk2Test, DebugComponentTest, NotRequiredUniqueKeyTest, TestValueSourceCache, TestConfigSetProperties, BJQParserTest, HdfsRecoverLeaseTest, TestMaxScoreQueryParser, UpdateRequestProcessorFactoryTest, DefaultValueUpdateProcessorTest, DistributedFacetPivotSmallTest, CustomCollectionTest, DistributedIntervalFacetingTest, TestSolrQueryParserResource, TestFieldCollectionResource, WrapperMergePolicyFactoryTest, TestDistributedMissingSort, DistributedSuggestComponentTest, TestReqParamsAPI, TestHighFrequencyDictionaryFactory, BitVectorTest, TestUtils, CollectionsAPIDistributedZkTest, AddSchemaFieldsUpdateProcessorFactoryTest, TestLocalFSCloudBackupRestore, SpellPossibilityIteratorTest, TestDistribDocBasedVersion, ConcurrentDeleteAndCreateCollectionTest, TestGraphTermsQParserPlugin, SuggesterWFSTTest, TestCSVResponseWriter, HdfsUnloadDistributedZkTest, ConnectionManagerTest, StatsComponentTest, TestCloudSchemaless, TestSolr4Spatial, ShardRoutingCustomTest, TestScoreJoinQPScore, TestSchemaManager, OpenCloseCoreStressTest, ResponseLogComponentTest, AutoCommitTest, OpenExchangeRatesOrgProviderTest, DeleteLastCustomShardedReplicaTest, ClusterStateUpdateTest, TestRandomFaceting, LeaderElectionTest, TestDistributedGrouping, TestHashPartitioner, TestRealTimeGet, HardAutoCommitTest]
   [junit4] Completed [338/632 (2!)] on J1 in 1.01s, 1 test, 1 error <<< FAILURES!

[...truncated 61084 lines...]


Mime
View raw message