lucene-dev mailing list archives

Site index · List index
Message view « Date » · « Thread »
Top « Date » · « Thread »
From Apache Jenkins Server <jenk...@builds.apache.org>
Subject [JENKINS] Lucene-Solr-Tests-6.x - Build # 453 - Unstable
Date Mon, 19 Sep 2016 08:24:09 GMT
Build: https://builds.apache.org/job/Lucene-Solr-Tests-6.x/453/

1 tests failed.
FAILED:  org.apache.solr.cloud.LeaderFailoverAfterPartitionTest.test

Error Message:
org.apache.solr.client.solrj.SolrServerException: No live SolrServers available to handle this request:[http://127.0.0.1:34292/c8n_1x3_lf_shard1_replica3]

Stack Trace:
org.apache.solr.client.solrj.SolrServerException: org.apache.solr.client.solrj.SolrServerException: No live SolrServers available to handle this request:[http://127.0.0.1:34292/c8n_1x3_lf_shard1_replica3]
	at __randomizedtesting.SeedInfo.seed([272CC8FD1EF4722F:AF78F727B0081FD7]:0)
	at org.apache.solr.client.solrj.impl.CloudSolrClient.directUpdate(CloudSolrClient.java:769)
	at org.apache.solr.client.solrj.impl.CloudSolrClient.sendRequest(CloudSolrClient.java:1161)
	at org.apache.solr.client.solrj.impl.CloudSolrClient.requestWithRetryOnStaleState(CloudSolrClient.java:1050)
	at org.apache.solr.client.solrj.impl.CloudSolrClient.request(CloudSolrClient.java:992)
	at org.apache.solr.client.solrj.SolrClient.request(SolrClient.java:1219)
	at org.apache.solr.cloud.HttpPartitionTest.sendDoc(HttpPartitionTest.java:592)
	at org.apache.solr.cloud.HttpPartitionTest.sendDoc(HttpPartitionTest.java:578)
	at org.apache.solr.cloud.LeaderFailoverAfterPartitionTest.testRf3WithLeaderFailover(LeaderFailoverAfterPartitionTest.java:174)
	at org.apache.solr.cloud.LeaderFailoverAfterPartitionTest.test(LeaderFailoverAfterPartitionTest.java:55)
	at sun.reflect.NativeMethodAccessorImpl.invoke0(Native Method)
	at sun.reflect.NativeMethodAccessorImpl.invoke(NativeMethodAccessorImpl.java:62)
	at sun.reflect.DelegatingMethodAccessorImpl.invoke(DelegatingMethodAccessorImpl.java:43)
	at java.lang.reflect.Method.invoke(Method.java:498)
	at com.carrotsearch.randomizedtesting.RandomizedRunner.invoke(RandomizedRunner.java:1764)
	at com.carrotsearch.randomizedtesting.RandomizedRunner$8.evaluate(RandomizedRunner.java:871)
	at com.carrotsearch.randomizedtesting.RandomizedRunner$9.evaluate(RandomizedRunner.java:907)
	at com.carrotsearch.randomizedtesting.RandomizedRunner$10.evaluate(RandomizedRunner.java:921)
	at org.apache.solr.BaseDistributedSearchTestCase$ShardsRepeatRule$ShardsFixedStatement.callStatement(BaseDistributedSearchTestCase.java:992)
	at org.apache.solr.BaseDistributedSearchTestCase$ShardsRepeatRule$ShardsStatement.evaluate(BaseDistributedSearchTestCase.java:967)
	at com.carrotsearch.randomizedtesting.rules.SystemPropertiesRestoreRule$1.evaluate(SystemPropertiesRestoreRule.java:57)
	at org.apache.lucene.util.TestRuleSetupTeardownChained$1.evaluate(TestRuleSetupTeardownChained.java:49)
	at org.apache.lucene.util.AbstractBeforeAfterRule$1.evaluate(AbstractBeforeAfterRule.java:45)
	at org.apache.lucene.util.TestRuleThreadAndTestName$1.evaluate(TestRuleThreadAndTestName.java:48)
	at org.apache.lucene.util.TestRuleIgnoreAfterMaxFailures$1.evaluate(TestRuleIgnoreAfterMaxFailures.java:64)
	at org.apache.lucene.util.TestRuleMarkFailure$1.evaluate(TestRuleMarkFailure.java:47)
	at com.carrotsearch.randomizedtesting.rules.StatementAdapter.evaluate(StatementAdapter.java:36)
	at com.carrotsearch.randomizedtesting.ThreadLeakControl$StatementRunner.run(ThreadLeakControl.java:367)
	at com.carrotsearch.randomizedtesting.ThreadLeakControl.forkTimeoutingTask(ThreadLeakControl.java:809)
	at com.carrotsearch.randomizedtesting.ThreadLeakControl$3.evaluate(ThreadLeakControl.java:460)
	at com.carrotsearch.randomizedtesting.RandomizedRunner.runSingleTest(RandomizedRunner.java:880)
	at com.carrotsearch.randomizedtesting.RandomizedRunner$5.evaluate(RandomizedRunner.java:781)
	at com.carrotsearch.randomizedtesting.RandomizedRunner$6.evaluate(RandomizedRunner.java:816)
	at com.carrotsearch.randomizedtesting.RandomizedRunner$7.evaluate(RandomizedRunner.java:827)
	at com.carrotsearch.randomizedtesting.rules.StatementAdapter.evaluate(StatementAdapter.java:36)
	at com.carrotsearch.randomizedtesting.rules.SystemPropertiesRestoreRule$1.evaluate(SystemPropertiesRestoreRule.java:57)
	at org.apache.lucene.util.AbstractBeforeAfterRule$1.evaluate(AbstractBeforeAfterRule.java:45)
	at com.carrotsearch.randomizedtesting.rules.StatementAdapter.evaluate(StatementAdapter.java:36)
	at org.apache.lucene.util.TestRuleStoreClassName$1.evaluate(TestRuleStoreClassName.java:41)
	at com.carrotsearch.randomizedtesting.rules.NoShadowingOrOverridesOnMethodsRule$1.evaluate(NoShadowingOrOverridesOnMethodsRule.java:40)
	at com.carrotsearch.randomizedtesting.rules.NoShadowingOrOverridesOnMethodsRule$1.evaluate(NoShadowingOrOverridesOnMethodsRule.java:40)
	at com.carrotsearch.randomizedtesting.rules.StatementAdapter.evaluate(StatementAdapter.java:36)
	at com.carrotsearch.randomizedtesting.rules.StatementAdapter.evaluate(StatementAdapter.java:36)
	at com.carrotsearch.randomizedtesting.rules.StatementAdapter.evaluate(StatementAdapter.java:36)
	at org.apache.lucene.util.TestRuleAssertionsRequired$1.evaluate(TestRuleAssertionsRequired.java:53)
	at org.apache.lucene.util.TestRuleMarkFailure$1.evaluate(TestRuleMarkFailure.java:47)
	at org.apache.lucene.util.TestRuleIgnoreAfterMaxFailures$1.evaluate(TestRuleIgnoreAfterMaxFailures.java:64)
	at org.apache.lucene.util.TestRuleIgnoreTestSuites$1.evaluate(TestRuleIgnoreTestSuites.java:54)
	at com.carrotsearch.randomizedtesting.rules.StatementAdapter.evaluate(StatementAdapter.java:36)
	at com.carrotsearch.randomizedtesting.ThreadLeakControl$StatementRunner.run(ThreadLeakControl.java:367)
	at java.lang.Thread.run(Thread.java:745)
Caused by: org.apache.solr.client.solrj.SolrServerException: No live SolrServers available to handle this request:[http://127.0.0.1:34292/c8n_1x3_lf_shard1_replica3]
	at org.apache.solr.client.solrj.impl.LBHttpSolrClient.request(LBHttpSolrClient.java:384)
	at org.apache.solr.client.solrj.impl.CloudSolrClient.directUpdate(CloudSolrClient.java:763)
	... 49 more
Caused by: org.apache.solr.client.solrj.SolrServerException: Server refused connection at: http://127.0.0.1:34292/c8n_1x3_lf_shard1_replica3
	at org.apache.solr.client.solrj.impl.HttpSolrClient.executeMethod(HttpSolrClient.java:599)
	at org.apache.solr.client.solrj.impl.HttpSolrClient.request(HttpSolrClient.java:261)
	at org.apache.solr.client.solrj.impl.HttpSolrClient.request(HttpSolrClient.java:250)
	at org.apache.solr.client.solrj.impl.LBHttpSolrClient.doRequest(LBHttpSolrClient.java:405)
	at org.apache.solr.client.solrj.impl.LBHttpSolrClient.request(LBHttpSolrClient.java:357)
	... 50 more
Caused by: java.net.ConnectException: Connection refused
	at java.net.PlainSocketImpl.socketConnect(Native Method)
	at java.net.AbstractPlainSocketImpl.doConnect(AbstractPlainSocketImpl.java:350)
	at java.net.AbstractPlainSocketImpl.connectToAddress(AbstractPlainSocketImpl.java:206)
	at java.net.AbstractPlainSocketImpl.connect(AbstractPlainSocketImpl.java:188)
	at java.net.SocksSocketImpl.connect(SocksSocketImpl.java:392)
	at java.net.Socket.connect(Socket.java:589)
	at org.apache.http.conn.scheme.PlainSocketFactory.connectSocket(PlainSocketFactory.java:117)
	at org.apache.http.impl.conn.DefaultClientConnectionOperator.openConnection(DefaultClientConnectionOperator.java:177)
	at org.apache.http.impl.conn.ManagedClientConnectionImpl.open(ManagedClientConnectionImpl.java:304)
	at org.apache.http.impl.client.DefaultRequestDirector.tryConnect(DefaultRequestDirector.java:611)
	at org.apache.http.impl.client.DefaultRequestDirector.execute(DefaultRequestDirector.java:446)
	at org.apache.http.impl.client.AbstractHttpClient.doExecute(AbstractHttpClient.java:882)
	at org.apache.http.impl.client.CloseableHttpClient.execute(CloseableHttpClient.java:82)
	at org.apache.http.impl.client.CloseableHttpClient.execute(CloseableHttpClient.java:107)
	at org.apache.http.impl.client.CloseableHttpClient.execute(CloseableHttpClient.java:55)
	at org.apache.solr.client.solrj.impl.HttpSolrClient.executeMethod(HttpSolrClient.java:497)
	... 54 more




Build Log:
[...truncated 11265 lines...]
   [junit4] Suite: org.apache.solr.cloud.LeaderFailoverAfterPartitionTest
   [junit4]   2> Creating dataDir: /x1/jenkins/jenkins-slave/workspace/Lucene-Solr-Tests-6.x/solr/build/solr-core/test/J1/temp/solr.cloud.LeaderFailoverAfterPartitionTest_272CC8FD1EF4722F-001/init-core-data-001
   [junit4]   2> 1022241 INFO  (SUITE-LeaderFailoverAfterPartitionTest-seed#[272CC8FD1EF4722F]-worker) [    ] o.a.s.SolrTestCaseJ4 Randomized ssl (false) and clientAuth (false) via: @org.apache.solr.SolrTestCaseJ4$SuppressSSL(bugUrl=https://issues.apache.org/jira/browse/SOLR-5776)
   [junit4]   2> 1022241 INFO  (SUITE-LeaderFailoverAfterPartitionTest-seed#[272CC8FD1EF4722F]-worker) [    ] o.a.s.BaseDistributedSearchTestCase Setting hostContext system property: /
   [junit4]   2> 1022242 INFO  (TEST-LeaderFailoverAfterPartitionTest.test-seed#[272CC8FD1EF4722F]) [    ] o.a.s.c.ZkTestServer STARTING ZK TEST SERVER
   [junit4]   2> 1022243 INFO  (Thread-1009) [    ] o.a.s.c.ZkTestServer client port:0.0.0.0/0.0.0.0:0
   [junit4]   2> 1022243 INFO  (Thread-1009) [    ] o.a.s.c.ZkTestServer Starting server
   [junit4]   2> 1022344 INFO  (TEST-LeaderFailoverAfterPartitionTest.test-seed#[272CC8FD1EF4722F]) [    ] o.a.s.c.ZkTestServer start zk server on port:60817
   [junit4]   2> 1022344 INFO  (TEST-LeaderFailoverAfterPartitionTest.test-seed#[272CC8FD1EF4722F]) [    ] o.a.s.c.c.SolrZkClient Using default ZkCredentialsProvider
   [junit4]   2> 1022348 INFO  (TEST-LeaderFailoverAfterPartitionTest.test-seed#[272CC8FD1EF4722F]) [    ] o.a.s.c.c.ConnectionManager Waiting for client to connect to ZooKeeper
   [junit4]   2> 1022350 INFO  (zkCallback-824-thread-1) [    ] o.a.s.c.c.ConnectionManager Watcher org.apache.solr.common.cloud.ConnectionManager@6d0d1597 name:ZooKeeperConnection Watcher:127.0.0.1:60817 got event WatchedEvent state:SyncConnected type:None path:null path:null type:None
   [junit4]   2> 1022351 INFO  (TEST-LeaderFailoverAfterPartitionTest.test-seed#[272CC8FD1EF4722F]) [    ] o.a.s.c.c.ConnectionManager Client is connected to ZooKeeper
   [junit4]   2> 1022351 INFO  (TEST-LeaderFailoverAfterPartitionTest.test-seed#[272CC8FD1EF4722F]) [    ] o.a.s.c.c.SolrZkClient Using default ZkACLProvider
   [junit4]   2> 1022351 INFO  (TEST-LeaderFailoverAfterPartitionTest.test-seed#[272CC8FD1EF4722F]) [    ] o.a.s.c.c.SolrZkClient makePath: /solr
   [junit4]   2> 1022362 INFO  (TEST-LeaderFailoverAfterPartitionTest.test-seed#[272CC8FD1EF4722F]) [    ] o.a.s.c.c.SolrZkClient Using default ZkCredentialsProvider
   [junit4]   2> 1022364 INFO  (TEST-LeaderFailoverAfterPartitionTest.test-seed#[272CC8FD1EF4722F]) [    ] o.a.s.c.c.ConnectionManager Waiting for client to connect to ZooKeeper
   [junit4]   2> 1022364 INFO  (zkCallback-825-thread-1) [    ] o.a.s.c.c.ConnectionManager Watcher org.apache.solr.common.cloud.ConnectionManager@3be55f9e name:ZooKeeperConnection Watcher:127.0.0.1:60817/solr got event WatchedEvent state:SyncConnected type:None path:null path:null type:None
   [junit4]   2> 1022364 INFO  (TEST-LeaderFailoverAfterPartitionTest.test-seed#[272CC8FD1EF4722F]) [    ] o.a.s.c.c.ConnectionManager Client is connected to ZooKeeper
   [junit4]   2> 1022364 INFO  (TEST-LeaderFailoverAfterPartitionTest.test-seed#[272CC8FD1EF4722F]) [    ] o.a.s.c.c.SolrZkClient Using default ZkACLProvider
   [junit4]   2> 1022364 INFO  (TEST-LeaderFailoverAfterPartitionTest.test-seed#[272CC8FD1EF4722F]) [    ] o.a.s.c.c.SolrZkClient makePath: /collections/collection1
   [junit4]   2> 1022366 INFO  (TEST-LeaderFailoverAfterPartitionTest.test-seed#[272CC8FD1EF4722F]) [    ] o.a.s.c.c.SolrZkClient makePath: /collections/collection1/shards
   [junit4]   2> 1022367 INFO  (TEST-LeaderFailoverAfterPartitionTest.test-seed#[272CC8FD1EF4722F]) [    ] o.a.s.c.c.SolrZkClient makePath: /collections/control_collection
   [junit4]   2> 1022372 INFO  (TEST-LeaderFailoverAfterPartitionTest.test-seed#[272CC8FD1EF4722F]) [    ] o.a.s.c.c.SolrZkClient makePath: /collections/control_collection/shards
   [junit4]   2> 1022373 INFO  (TEST-LeaderFailoverAfterPartitionTest.test-seed#[272CC8FD1EF4722F]) [    ] o.a.s.c.AbstractZkTestCase put /x1/jenkins/jenkins-slave/workspace/Lucene-Solr-Tests-6.x/solr/core/src/test-files/solr/collection1/conf/solrconfig-tlog.xml to /configs/conf1/solrconfig.xml
   [junit4]   2> 1022373 INFO  (TEST-LeaderFailoverAfterPartitionTest.test-seed#[272CC8FD1EF4722F]) [    ] o.a.s.c.c.SolrZkClient makePath: /configs/conf1/solrconfig.xml
   [junit4]   2> 1022375 INFO  (TEST-LeaderFailoverAfterPartitionTest.test-seed#[272CC8FD1EF4722F]) [    ] o.a.s.c.AbstractZkTestCase put /x1/jenkins/jenkins-slave/workspace/Lucene-Solr-Tests-6.x/solr/core/src/test-files/solr/collection1/conf/schema.xml to /configs/conf1/schema.xml
   [junit4]   2> 1022375 INFO  (TEST-LeaderFailoverAfterPartitionTest.test-seed#[272CC8FD1EF4722F]) [    ] o.a.s.c.c.SolrZkClient makePath: /configs/conf1/schema.xml
   [junit4]   2> 1022376 INFO  (TEST-LeaderFailoverAfterPartitionTest.test-seed#[272CC8FD1EF4722F]) [    ] o.a.s.c.AbstractZkTestCase put /x1/jenkins/jenkins-slave/workspace/Lucene-Solr-Tests-6.x/solr/core/src/test-files/solr/collection1/conf/solrconfig.snippet.randomindexconfig.xml to /configs/conf1/solrconfig.snippet.randomindexconfig.xml
   [junit4]   2> 1022377 INFO  (TEST-LeaderFailoverAfterPartitionTest.test-seed#[272CC8FD1EF4722F]) [    ] o.a.s.c.c.SolrZkClient makePath: /configs/conf1/solrconfig.snippet.randomindexconfig.xml
   [junit4]   2> 1022378 INFO  (TEST-LeaderFailoverAfterPartitionTest.test-seed#[272CC8FD1EF4722F]) [    ] o.a.s.c.AbstractZkTestCase put /x1/jenkins/jenkins-slave/workspace/Lucene-Solr-Tests-6.x/solr/core/src/test-files/solr/collection1/conf/stopwords.txt to /configs/conf1/stopwords.txt
   [junit4]   2> 1022378 INFO  (TEST-LeaderFailoverAfterPartitionTest.test-seed#[272CC8FD1EF4722F]) [    ] o.a.s.c.c.SolrZkClient makePath: /configs/conf1/stopwords.txt
   [junit4]   2> 1022379 INFO  (TEST-LeaderFailoverAfterPartitionTest.test-seed#[272CC8FD1EF4722F]) [    ] o.a.s.c.AbstractZkTestCase put /x1/jenkins/jenkins-slave/workspace/Lucene-Solr-Tests-6.x/solr/core/src/test-files/solr/collection1/conf/protwords.txt to /configs/conf1/protwords.txt
   [junit4]   2> 1022379 INFO  (TEST-LeaderFailoverAfterPartitionTest.test-seed#[272CC8FD1EF4722F]) [    ] o.a.s.c.c.SolrZkClient makePath: /configs/conf1/protwords.txt
   [junit4]   2> 1022380 INFO  (TEST-LeaderFailoverAfterPartitionTest.test-seed#[272CC8FD1EF4722F]) [    ] o.a.s.c.AbstractZkTestCase put /x1/jenkins/jenkins-slave/workspace/Lucene-Solr-Tests-6.x/solr/core/src/test-files/solr/collection1/conf/currency.xml to /configs/conf1/currency.xml
   [junit4]   2> 1022380 INFO  (TEST-LeaderFailoverAfterPartitionTest.test-seed#[272CC8FD1EF4722F]) [    ] o.a.s.c.c.SolrZkClient makePath: /configs/conf1/currency.xml
   [junit4]   2> 1022381 INFO  (TEST-LeaderFailoverAfterPartitionTest.test-seed#[272CC8FD1EF4722F]) [    ] o.a.s.c.AbstractZkTestCase put /x1/jenkins/jenkins-slave/workspace/Lucene-Solr-Tests-6.x/solr/core/src/test-files/solr/collection1/conf/enumsConfig.xml to /configs/conf1/enumsConfig.xml
   [junit4]   2> 1022381 INFO  (TEST-LeaderFailoverAfterPartitionTest.test-seed#[272CC8FD1EF4722F]) [    ] o.a.s.c.c.SolrZkClient makePath: /configs/conf1/enumsConfig.xml
   [junit4]   2> 1022382 INFO  (TEST-LeaderFailoverAfterPartitionTest.test-seed#[272CC8FD1EF4722F]) [    ] o.a.s.c.AbstractZkTestCase put /x1/jenkins/jenkins-slave/workspace/Lucene-Solr-Tests-6.x/solr/core/src/test-files/solr/collection1/conf/open-exchange-rates.json to /configs/conf1/open-exchange-rates.json
   [junit4]   2> 1022382 INFO  (TEST-LeaderFailoverAfterPartitionTest.test-seed#[272CC8FD1EF4722F]) [    ] o.a.s.c.c.SolrZkClient makePath: /configs/conf1/open-exchange-rates.json
   [junit4]   2> 1022435 INFO  (TEST-LeaderFailoverAfterPartitionTest.test-seed#[272CC8FD1EF4722F]) [    ] o.a.s.c.AbstractZkTestCase put /x1/jenkins/jenkins-slave/workspace/Lucene-Solr-Tests-6.x/solr/core/src/test-files/solr/collection1/conf/mapping-ISOLatin1Accent.txt to /configs/conf1/mapping-ISOLatin1Accent.txt
   [junit4]   2> 1022435 INFO  (TEST-LeaderFailoverAfterPartitionTest.test-seed#[272CC8FD1EF4722F]) [    ] o.a.s.c.c.SolrZkClient makePath: /configs/conf1/mapping-ISOLatin1Accent.txt
   [junit4]   2> 1022559 INFO  (TEST-LeaderFailoverAfterPartitionTest.test-seed#[272CC8FD1EF4722F]) [    ] o.a.s.c.AbstractZkTestCase put /x1/jenkins/jenkins-slave/workspace/Lucene-Solr-Tests-6.x/solr/core/src/test-files/solr/collection1/conf/old_synonyms.txt to /configs/conf1/old_synonyms.txt
   [junit4]   2> 1022559 INFO  (TEST-LeaderFailoverAfterPartitionTest.test-seed#[272CC8FD1EF4722F]) [    ] o.a.s.c.c.SolrZkClient makePath: /configs/conf1/old_synonyms.txt
   [junit4]   2> 1022588 INFO  (TEST-LeaderFailoverAfterPartitionTest.test-seed#[272CC8FD1EF4722F]) [    ] o.a.s.c.AbstractZkTestCase put /x1/jenkins/jenkins-slave/workspace/Lucene-Solr-Tests-6.x/solr/core/src/test-files/solr/collection1/conf/synonyms.txt to /configs/conf1/synonyms.txt
   [junit4]   2> 1022588 INFO  (TEST-LeaderFailoverAfterPartitionTest.test-seed#[272CC8FD1EF4722F]) [    ] o.a.s.c.c.SolrZkClient makePath: /configs/conf1/synonyms.txt
   [junit4]   2> 1022701 INFO  (TEST-LeaderFailoverAfterPartitionTest.test-seed#[272CC8FD1EF4722F]) [    ] o.a.s.SolrTestCaseJ4 Writing core.properties file to /x1/jenkins/jenkins-slave/workspace/Lucene-Solr-Tests-6.x/solr/build/solr-core/test/J1/temp/solr.cloud.LeaderFailoverAfterPartitionTest_272CC8FD1EF4722F-001/control-001/cores/collection1
   [junit4]   2> 1022704 INFO  (TEST-LeaderFailoverAfterPartitionTest.test-seed#[272CC8FD1EF4722F]) [    ] o.e.j.s.Server jetty-9.3.8.v20160314
   [junit4]   2> 1022720 INFO  (TEST-LeaderFailoverAfterPartitionTest.test-seed#[272CC8FD1EF4722F]) [    ] o.e.j.s.h.ContextHandler Started o.e.j.s.ServletContextHandler@371cc3{/,null,AVAILABLE}
   [junit4]   2> 1022721 INFO  (TEST-LeaderFailoverAfterPartitionTest.test-seed#[272CC8FD1EF4722F]) [    ] o.e.j.s.ServerConnector Started ServerConnector@c7dd9e9{HTTP/1.1,[http/1.1]}{127.0.0.1:45497}
   [junit4]   2> 1022721 INFO  (TEST-LeaderFailoverAfterPartitionTest.test-seed#[272CC8FD1EF4722F]) [    ] o.e.j.s.Server Started @1028455ms
   [junit4]   2> 1022721 INFO  (TEST-LeaderFailoverAfterPartitionTest.test-seed#[272CC8FD1EF4722F]) [    ] o.a.s.c.s.e.JettySolrRunner Jetty properties: {solr.data.dir=/x1/jenkins/jenkins-slave/workspace/Lucene-Solr-Tests-6.x/solr/build/solr-core/test/J1/temp/solr.cloud.LeaderFailoverAfterPartitionTest_272CC8FD1EF4722F-001/tempDir-001/control/data, hostContext=/, hostPort=56720, coreRootDirectory=/x1/jenkins/jenkins-slave/workspace/Lucene-Solr-Tests-6.x/solr/build/solr-core/test/J1/temp/solr.cloud.LeaderFailoverAfterPartitionTest_272CC8FD1EF4722F-001/control-001/cores}
   [junit4]   2> 1022721 INFO  (TEST-LeaderFailoverAfterPartitionTest.test-seed#[272CC8FD1EF4722F]) [    ] o.a.s.s.SolrDispatchFilter SolrDispatchFilter.init(): sun.misc.Launcher$AppClassLoader@73d16e93
   [junit4]   2> 1022721 INFO  (TEST-LeaderFailoverAfterPartitionTest.test-seed#[272CC8FD1EF4722F]) [    ] o.a.s.c.SolrResourceLoader new SolrResourceLoader for directory: '/x1/jenkins/jenkins-slave/workspace/Lucene-Solr-Tests-6.x/solr/build/solr-core/test/J1/temp/solr.cloud.LeaderFailoverAfterPartitionTest_272CC8FD1EF4722F-001/control-001'
   [junit4]   2> 1022722 INFO  (TEST-LeaderFailoverAfterPartitionTest.test-seed#[272CC8FD1EF4722F]) [    ] o.a.s.c.SolrResourceLoader JNDI not configured for solr (NoInitialContextEx)
   [junit4]   2> 1022722 INFO  (TEST-LeaderFailoverAfterPartitionTest.test-seed#[272CC8FD1EF4722F]) [    ] o.a.s.c.SolrResourceLoader solr home defaulted to 'solr/' (could not find system property or JNDI)
   [junit4]   2> 1022722 INFO  (TEST-LeaderFailoverAfterPartitionTest.test-seed#[272CC8FD1EF4722F]) [    ] o.a.s.c.c.SolrZkClient Using default ZkCredentialsProvider
   [junit4]   2> 1022723 INFO  (TEST-LeaderFailoverAfterPartitionTest.test-seed#[272CC8FD1EF4722F]) [    ] o.a.s.c.c.ConnectionManager Waiting for client to connect to ZooKeeper
   [junit4]   2> 1022731 INFO  (zkCallback-826-thread-1) [    ] o.a.s.c.c.ConnectionManager Watcher org.apache.solr.common.cloud.ConnectionManager@40a42978 name:ZooKeeperConnection Watcher:127.0.0.1:60817/solr got event WatchedEvent state:SyncConnected type:None path:null path:null type:None
   [junit4]   2> 1022731 INFO  (TEST-LeaderFailoverAfterPartitionTest.test-seed#[272CC8FD1EF4722F]) [    ] o.a.s.c.c.ConnectionManager Client is connected to ZooKeeper
   [junit4]   2> 1022731 INFO  (TEST-LeaderFailoverAfterPartitionTest.test-seed#[272CC8FD1EF4722F]) [    ] o.a.s.c.c.SolrZkClient Using default ZkACLProvider
   [junit4]   2> 1022783 INFO  (TEST-LeaderFailoverAfterPartitionTest.test-seed#[272CC8FD1EF4722F]) [    ] o.a.s.s.SolrDispatchFilter Loading solr.xml from SolrHome (not found in ZooKeeper)
   [junit4]   2> 1022783 INFO  (TEST-LeaderFailoverAfterPartitionTest.test-seed#[272CC8FD1EF4722F]) [    ] o.a.s.c.SolrXmlConfig Loading container configuration from /x1/jenkins/jenkins-slave/workspace/Lucene-Solr-Tests-6.x/solr/build/solr-core/test/J1/temp/solr.cloud.LeaderFailoverAfterPartitionTest_272CC8FD1EF4722F-001/control-001/solr.xml
   [junit4]   2> 1022788 INFO  (TEST-LeaderFailoverAfterPartitionTest.test-seed#[272CC8FD1EF4722F]) [    ] o.a.s.c.CorePropertiesLocator Config-defined core root directory: /x1/jenkins/jenkins-slave/workspace/Lucene-Solr-Tests-6.x/solr/build/solr-core/test/J1/temp/solr.cloud.LeaderFailoverAfterPartitionTest_272CC8FD1EF4722F-001/control-001/cores
   [junit4]   2> 1022788 INFO  (TEST-LeaderFailoverAfterPartitionTest.test-seed#[272CC8FD1EF4722F]) [    ] o.a.s.c.CoreContainer New CoreContainer 1178822948
   [junit4]   2> 1022788 INFO  (TEST-LeaderFailoverAfterPartitionTest.test-seed#[272CC8FD1EF4722F]) [    ] o.a.s.c.CoreContainer Loading cores into CoreContainer [instanceDir=/x1/jenkins/jenkins-slave/workspace/Lucene-Solr-Tests-6.x/solr/build/solr-core/test/J1/temp/solr.cloud.LeaderFailoverAfterPartitionTest_272CC8FD1EF4722F-001/control-001]
   [junit4]   2> 1022789 WARN  (TEST-LeaderFailoverAfterPartitionTest.test-seed#[272CC8FD1EF4722F]) [    ] o.a.s.c.CoreContainer Couldn't add files from /x1/jenkins/jenkins-slave/workspace/Lucene-Solr-Tests-6.x/solr/build/solr-core/test/J1/temp/solr.cloud.LeaderFailoverAfterPartitionTest_272CC8FD1EF4722F-001/control-001/lib to classpath: /x1/jenkins/jenkins-slave/workspace/Lucene-Solr-Tests-6.x/solr/build/solr-core/test/J1/temp/solr.cloud.LeaderFailoverAfterPartitionTest_272CC8FD1EF4722F-001/control-001/lib
   [junit4]   2> 1022789 INFO  (TEST-LeaderFailoverAfterPartitionTest.test-seed#[272CC8FD1EF4722F]) [    ] o.a.s.h.c.HttpShardHandlerFactory created with socketTimeout : 90000,urlScheme : ,connTimeout : 15000,maxConnectionsPerHost : 20,maxConnections : 10000,corePoolSize : 0,maximumPoolSize : 2147483647,maxThreadIdleTime : 5,sizeOfQueue : -1,fairnessPolicy : false,useRetries : false,connectionsEvictorSleepDelay : 5000,maxConnectionIdleTime : 40000,
   [junit4]   2> 1022791 INFO  (TEST-LeaderFailoverAfterPartitionTest.test-seed#[272CC8FD1EF4722F]) [    ] o.a.s.u.UpdateShardHandler Creating UpdateShardHandler HTTP client with params: socketTimeout=340000&connTimeout=45000&retry=true
   [junit4]   2> 1022792 INFO  (TEST-LeaderFailoverAfterPartitionTest.test-seed#[272CC8FD1EF4722F]) [    ] o.a.s.l.LogWatcher SLF4J impl is org.slf4j.impl.Log4jLoggerFactory
   [junit4]   2> 1022792 INFO  (TEST-LeaderFailoverAfterPartitionTest.test-seed#[272CC8FD1EF4722F]) [    ] o.a.s.l.LogWatcher Registering Log Listener [Log4j (org.slf4j.impl.Log4jLoggerFactory)]
   [junit4]   2> 1022792 INFO  (TEST-LeaderFailoverAfterPartitionTest.test-seed#[272CC8FD1EF4722F]) [    ] o.a.s.c.ZkContainer Zookeeper client=127.0.0.1:60817/solr
   [junit4]   2> 1022792 INFO  (TEST-LeaderFailoverAfterPartitionTest.test-seed#[272CC8FD1EF4722F]) [    ] o.a.s.c.ZkController zkHost includes chroot
   [junit4]   2> 1022793 INFO  (TEST-LeaderFailoverAfterPartitionTest.test-seed#[272CC8FD1EF4722F]) [    ] o.a.s.c.c.SolrZkClient Using default ZkCredentialsProvider
   [junit4]   2> 1022794 INFO  (TEST-LeaderFailoverAfterPartitionTest.test-seed#[272CC8FD1EF4722F]) [    ] o.a.s.c.c.ConnectionManager Waiting for client to connect to ZooKeeper
   [junit4]   2> 1022794 INFO  (zkCallback-829-thread-1) [    ] o.a.s.c.c.ConnectionManager Watcher org.apache.solr.common.cloud.ConnectionManager@19d8347b name:ZooKeeperConnection Watcher:127.0.0.1:60817 got event WatchedEvent state:SyncConnected type:None path:null path:null type:None
   [junit4]   2> 1022799 INFO  (TEST-LeaderFailoverAfterPartitionTest.test-seed#[272CC8FD1EF4722F]) [    ] o.a.s.c.c.ConnectionManager Client is connected to ZooKeeper
   [junit4]   2> 1022799 INFO  (TEST-LeaderFailoverAfterPartitionTest.test-seed#[272CC8FD1EF4722F]) [    ] o.a.s.c.c.SolrZkClient Using default ZkACLProvider
   [junit4]   2> 1022802 INFO  (TEST-LeaderFailoverAfterPartitionTest.test-seed#[272CC8FD1EF4722F]) [n:127.0.0.1:56720_    ] o.a.s.c.ZkController Added new OnReconnect listener org.apache.solr.cloud.ZkController$$Lambda$23/101308563@5cf9d86e
   [junit4]   2> 1022807 INFO  (TEST-LeaderFailoverAfterPartitionTest.test-seed#[272CC8FD1EF4722F]) [n:127.0.0.1:56720_    ] o.a.s.c.c.ConnectionManager Waiting for client to connect to ZooKeeper
   [junit4]   2> 1022817 INFO  (zkCallback-830-thread-1-processing-n:127.0.0.1:56720_) [n:127.0.0.1:56720_    ] o.a.s.c.c.ConnectionManager Watcher org.apache.solr.common.cloud.ConnectionManager@7861a429 name:ZooKeeperConnection Watcher:127.0.0.1:60817/solr got event WatchedEvent state:SyncConnected type:None path:null path:null type:None
   [junit4]   2> 1022817 INFO  (TEST-LeaderFailoverAfterPartitionTest.test-seed#[272CC8FD1EF4722F]) [n:127.0.0.1:56720_    ] o.a.s.c.c.ConnectionManager Client is connected to ZooKeeper
   [junit4]   2> 1022819 INFO  (TEST-LeaderFailoverAfterPartitionTest.test-seed#[272CC8FD1EF4722F]) [n:127.0.0.1:56720_    ] o.a.s.c.c.SolrZkClient makePath: /overseer/queue
   [junit4]   2> 1022821 INFO  (TEST-LeaderFailoverAfterPartitionTest.test-seed#[272CC8FD1EF4722F]) [n:127.0.0.1:56720_    ] o.a.s.c.c.SolrZkClient makePath: /overseer/collection-queue-work
   [junit4]   2> 1022823 INFO  (TEST-LeaderFailoverAfterPartitionTest.test-seed#[272CC8FD1EF4722F]) [n:127.0.0.1:56720_    ] o.a.s.c.c.SolrZkClient makePath: /overseer/collection-map-running
   [junit4]   2> 1022827 INFO  (TEST-LeaderFailoverAfterPartitionTest.test-seed#[272CC8FD1EF4722F]) [n:127.0.0.1:56720_    ] o.a.s.c.c.SolrZkClient makePath: /overseer/collection-map-completed
   [junit4]   2> 1022829 INFO  (TEST-LeaderFailoverAfterPartitionTest.test-seed#[272CC8FD1EF4722F]) [n:127.0.0.1:56720_    ] o.a.s.c.c.SolrZkClient makePath: /overseer/collection-map-failure
   [junit4]   2> 1022830 INFO  (TEST-LeaderFailoverAfterPartitionTest.test-seed#[272CC8FD1EF4722F]) [n:127.0.0.1:56720_    ] o.a.s.c.c.SolrZkClient makePath: /live_nodes
   [junit4]   2> 1022831 INFO  (TEST-LeaderFailoverAfterPartitionTest.test-seed#[272CC8FD1EF4722F]) [n:127.0.0.1:56720_    ] o.a.s.c.c.SolrZkClient makePath: /aliases.json
   [junit4]   2> 1022840 INFO  (TEST-LeaderFailoverAfterPartitionTest.test-seed#[272CC8FD1EF4722F]) [n:127.0.0.1:56720_    ] o.a.s.c.c.SolrZkClient makePath: /clusterstate.json
   [junit4]   2> 1022841 INFO  (TEST-LeaderFailoverAfterPartitionTest.test-seed#[272CC8FD1EF4722F]) [n:127.0.0.1:56720_    ] o.a.s.c.c.SolrZkClient makePath: /security.json
   [junit4]   2> 1022841 INFO  (TEST-LeaderFailoverAfterPartitionTest.test-seed#[272CC8FD1EF4722F]) [n:127.0.0.1:56720_    ] o.a.s.c.c.ZkStateReader Updating cluster state from ZooKeeper... 
   [junit4]   2> 1022842 INFO  (TEST-LeaderFailoverAfterPartitionTest.test-seed#[272CC8FD1EF4722F]) [n:127.0.0.1:56720_    ] o.a.s.c.c.ZkStateReader Loaded empty cluster properties
   [junit4]   2> 1022843 INFO  (TEST-LeaderFailoverAfterPartitionTest.test-seed#[272CC8FD1EF4722F]) [n:127.0.0.1:56720_    ] o.a.s.c.c.ZkStateReader Updated live nodes from ZooKeeper... (0) -> (0)
   [junit4]   2> 1022844 INFO  (TEST-LeaderFailoverAfterPartitionTest.test-seed#[272CC8FD1EF4722F]) [n:127.0.0.1:56720_    ] o.a.s.c.c.SolrZkClient makePath: /overseer_elect
   [junit4]   2> 1022845 INFO  (TEST-LeaderFailoverAfterPartitionTest.test-seed#[272CC8FD1EF4722F]) [n:127.0.0.1:56720_    ] o.a.s.c.c.SolrZkClient makePath: /overseer_elect/election
   [junit4]   2> 1022846 INFO  (TEST-LeaderFailoverAfterPartitionTest.test-seed#[272CC8FD1EF4722F]) [n:127.0.0.1:56720_    ] o.a.s.c.Overseer Overseer (id=null) closing
   [junit4]   2> 1022846 INFO  (TEST-LeaderFailoverAfterPartitionTest.test-seed#[272CC8FD1EF4722F]) [n:127.0.0.1:56720_    ] o.a.s.c.LeaderElector Joined leadership election with path: /overseer_elect/election/96617683825786884-127.0.0.1:56720_-n_0000000000
   [junit4]   2> 1022847 INFO  (TEST-LeaderFailoverAfterPartitionTest.test-seed#[272CC8FD1EF4722F]) [n:127.0.0.1:56720_    ] o.a.s.c.OverseerElectionContext I am going to be the leader 127.0.0.1:56720_
   [junit4]   2> 1022847 INFO  (TEST-LeaderFailoverAfterPartitionTest.test-seed#[272CC8FD1EF4722F]) [n:127.0.0.1:56720_    ] o.a.s.c.c.SolrZkClient makePath: /overseer_elect/leader
   [junit4]   2> 1022848 INFO  (TEST-LeaderFailoverAfterPartitionTest.test-seed#[272CC8FD1EF4722F]) [n:127.0.0.1:56720_    ] o.a.s.c.Overseer Overseer (id=96617683825786884-127.0.0.1:56720_-n_0000000000) starting
   [junit4]   2> 1022849 INFO  (TEST-LeaderFailoverAfterPartitionTest.test-seed#[272CC8FD1EF4722F]) [n:127.0.0.1:56720_    ] o.a.s.c.c.SolrZkClient makePath: /overseer/queue-work
   [junit4]   2> 1022955 INFO  (TEST-LeaderFailoverAfterPartitionTest.test-seed#[272CC8FD1EF4722F]) [n:127.0.0.1:56720_    ] o.a.s.c.OverseerAutoReplicaFailoverThread Starting OverseerAutoReplicaFailoverThread autoReplicaFailoverWorkLoopDelay=10000 autoReplicaFailoverWaitAfterExpiration=10000 autoReplicaFailoverBadNodeExpiration=60000
   [junit4]   2> 1022956 INFO  (OverseerCollectionConfigSetProcessor-96617683825786884-127.0.0.1:56720_-n_0000000000) [n:127.0.0.1:56720_    ] o.a.s.c.OverseerTaskProcessor Process current queue of overseer operations
   [junit4]   2> 1022959 INFO  (OverseerStateUpdate-96617683825786884-127.0.0.1:56720_-n_0000000000) [n:127.0.0.1:56720_    ] o.a.s.c.Overseer Starting to work on the main queue
   [junit4]   2> 1022960 INFO  (TEST-LeaderFailoverAfterPartitionTest.test-seed#[272CC8FD1EF4722F]) [n:127.0.0.1:56720_    ] o.a.s.c.ZkController Register node as live in ZooKeeper:/live_nodes/127.0.0.1:56720_
   [junit4]   2> 1022960 INFO  (TEST-LeaderFailoverAfterPartitionTest.test-seed#[272CC8FD1EF4722F]) [n:127.0.0.1:56720_    ] o.a.s.c.c.SolrZkClient makePath: /live_nodes/127.0.0.1:56720_
   [junit4]   2> 1022972 INFO  (zkCallback-830-thread-1-processing-n:127.0.0.1:56720_) [n:127.0.0.1:56720_    ] o.a.s.c.c.ZkStateReader A live node change: [WatchedEvent state:SyncConnected type:NodeChildrenChanged path:/live_nodes], has occurred - updating... (live nodes size: [0])
   [junit4]   2> 1022982 INFO  (OverseerStateUpdate-96617683825786884-127.0.0.1:56720_-n_0000000000) [n:127.0.0.1:56720_    ] o.a.s.c.c.ZkStateReader Updated live nodes from ZooKeeper... (0) -> (1)
   [junit4]   2> 1023035 INFO  (TEST-LeaderFailoverAfterPartitionTest.test-seed#[272CC8FD1EF4722F]) [n:127.0.0.1:56720_    ] o.a.s.c.CoreContainer Security conf doesn't exist. Skipping setup for authorization module.
   [junit4]   2> 1023035 INFO  (TEST-LeaderFailoverAfterPartitionTest.test-seed#[272CC8FD1EF4722F]) [n:127.0.0.1:56720_    ] o.a.s.c.CoreContainer No authentication plugin used.
   [junit4]   2> 1023036 INFO  (TEST-LeaderFailoverAfterPartitionTest.test-seed#[272CC8FD1EF4722F]) [n:127.0.0.1:56720_    ] o.a.s.c.CorePropertiesLocator Looking for core definitions underneath /x1/jenkins/jenkins-slave/workspace/Lucene-Solr-Tests-6.x/solr/build/solr-core/test/J1/temp/solr.cloud.LeaderFailoverAfterPartitionTest_272CC8FD1EF4722F-001/control-001/cores
   [junit4]   2> 1023037 INFO  (TEST-LeaderFailoverAfterPartitionTest.test-seed#[272CC8FD1EF4722F]) [n:127.0.0.1:56720_    ] o.a.s.c.CoreDescriptor Created CoreDescriptor: {name=collection1, config=solrconfig.xml, transient=false, schema=schema.xml, loadOnStartup=true, configSetProperties=configsetprops.json, collection=control_collection, coreNodeName=, dataDir=data/, shard=}
   [junit4]   2> 1023037 INFO  (TEST-LeaderFailoverAfterPartitionTest.test-seed#[272CC8FD1EF4722F]) [n:127.0.0.1:56720_    ] o.a.s.c.CorePropertiesLocator Found core collection1 in /x1/jenkins/jenkins-slave/workspace/Lucene-Solr-Tests-6.x/solr/build/solr-core/test/J1/temp/solr.cloud.LeaderFailoverAfterPartitionTest_272CC8FD1EF4722F-001/control-001/cores/collection1
   [junit4]   2> 1023037 INFO  (TEST-LeaderFailoverAfterPartitionTest.test-seed#[272CC8FD1EF4722F]) [n:127.0.0.1:56720_    ] o.a.s.c.CorePropertiesLocator Found 1 core definitions
   [junit4]   2> 1023059 INFO  (TEST-LeaderFailoverAfterPartitionTest.test-seed#[272CC8FD1EF4722F]) [n:127.0.0.1:56720_    ] o.a.s.s.SolrDispatchFilter user.dir=/x1/jenkins/jenkins-slave/workspace/Lucene-Solr-Tests-6.x/solr/build/solr-core/test/J1
   [junit4]   2> 1023059 INFO  (coreLoadExecutor-2089-thread-1-processing-n:127.0.0.1:56720_) [n:127.0.0.1:56720_ c:control_collection   x:collection1] o.a.s.c.ZkController publishing state=down
   [junit4]   2> 1023059 INFO  (TEST-LeaderFailoverAfterPartitionTest.test-seed#[272CC8FD1EF4722F]) [n:127.0.0.1:56720_    ] o.a.s.s.SolrDispatchFilter SolrDispatchFilter.init() done
   [junit4]   2> 1023059 INFO  (coreLoadExecutor-2089-thread-1-processing-n:127.0.0.1:56720_) [n:127.0.0.1:56720_ c:control_collection   x:collection1] o.a.s.c.ZkController numShards not found on descriptor - reading it from system property
   [junit4]   2> 1023080 INFO  (coreLoadExecutor-2089-thread-1-processing-n:127.0.0.1:56720_) [n:127.0.0.1:56720_ c:control_collection   x:collection1] o.a.s.c.ZkController Collection control_collection not visible yet, but flagging it so a watch is registered when it becomes visible
   [junit4]   2> 1023093 INFO  (OverseerStateUpdate-96617683825786884-127.0.0.1:56720_-n_0000000000) [n:127.0.0.1:56720_    ] o.a.s.c.Overseer processMessage: queueSize: 1, message = {
   [junit4]   2>   "core":"collection1",
   [junit4]   2>   "roles":null,
   [junit4]   2>   "base_url":"http://127.0.0.1:56720",
   [junit4]   2>   "node_name":"127.0.0.1:56720_",
   [junit4]   2>   "numShards":"1",
   [junit4]   2>   "state":"down",
   [junit4]   2>   "shard":null,
   [junit4]   2>   "collection":"control_collection",
   [junit4]   2>   "operation":"state"} current state version: 0
   [junit4]   2> 1023093 INFO  (OverseerStateUpdate-96617683825786884-127.0.0.1:56720_-n_0000000000) [n:127.0.0.1:56720_    ] o.a.s.c.o.ReplicaMutator Update state numShards=1 message={
   [junit4]   2>   "core":"collection1",
   [junit4]   2>   "roles":null,
   [junit4]   2>   "base_url":"http://127.0.0.1:56720",
   [junit4]   2>   "node_name":"127.0.0.1:56720_",
   [junit4]   2>   "numShards":"1",
   [junit4]   2>   "state":"down",
   [junit4]   2>   "shard":null,
   [junit4]   2>   "collection":"control_collection",
   [junit4]   2>   "operation":"state"}
   [junit4]   2> 1023099 INFO  (OverseerStateUpdate-96617683825786884-127.0.0.1:56720_-n_0000000000) [n:127.0.0.1:56720_    ] o.a.s.c.o.ClusterStateMutator building a new cName: control_collection
   [junit4]   2> 1023100 INFO  (coreLoadExecutor-2089-thread-1-processing-n:127.0.0.1:56720_) [n:127.0.0.1:56720_ c:control_collection   x:collection1] o.a.s.c.c.ZkStateReader Deleting data for [control_collection]
   [junit4]   2> 1023103 INFO  (OverseerStateUpdate-96617683825786884-127.0.0.1:56720_-n_0000000000) [n:127.0.0.1:56720_    ] o.a.s.c.o.ReplicaMutator Assigning new node to shard shard=shard1
   [junit4]   2> 1023127 INFO  (zkCallback-830-thread-1-processing-n:127.0.0.1:56720_) [n:127.0.0.1:56720_    ] o.a.s.c.c.ZkStateReader A cluster state change: [WatchedEvent state:SyncConnected type:NodeDataChanged path:/clusterstate.json], has occurred - updating... (live nodes size: [1])
   [junit4]   2> 1023134 INFO  (coreLoadExecutor-2089-thread-1-processing-n:127.0.0.1:56720_) [n:127.0.0.1:56720_ c:control_collection   x:collection1] o.a.s.c.ZkController look for our core node name
   [junit4]   2> 1023134 INFO  (coreLoadExecutor-2089-thread-1-processing-n:127.0.0.1:56720_) [n:127.0.0.1:56720_ c:control_collection   x:collection1] o.a.s.c.ZkController waiting to find shard id in clusterstate for collection1
   [junit4]   2> 1023134 INFO  (coreLoadExecutor-2089-thread-1-processing-n:127.0.0.1:56720_) [n:127.0.0.1:56720_ c:control_collection   x:collection1] o.a.s.c.ZkController Check for collection zkNode:control_collection
   [junit4]   2> 1023135 INFO  (coreLoadExecutor-2089-thread-1-processing-n:127.0.0.1:56720_) [n:127.0.0.1:56720_ c:control_collection   x:collection1] o.a.s.c.ZkController Collection zkNode exists
   [junit4]   2> 1023151 INFO  (coreLoadExecutor-2089-thread-1-processing-n:127.0.0.1:56720_) [n:127.0.0.1:56720_ c:control_collection   x:collection1] o.a.s.c.SolrResourceLoader new SolrResourceLoader for directory: '/x1/jenkins/jenkins-slave/workspace/Lucene-Solr-Tests-6.x/solr/build/solr-core/test/J1/temp/solr.cloud.LeaderFailoverAfterPartitionTest_272CC8FD1EF4722F-001/control-001/cores/collection1'
   [junit4]   2> 1023152 INFO  (coreLoadExecutor-2089-thread-1-processing-n:127.0.0.1:56720_) [n:127.0.0.1:56720_ c:control_collection   x:collection1] o.a.s.c.SolrResourceLoader JNDI not configured for solr (NoInitialContextEx)
   [junit4]   2> 1023152 INFO  (coreLoadExecutor-2089-thread-1-processing-n:127.0.0.1:56720_) [n:127.0.0.1:56720_ c:control_collection   x:collection1] o.a.s.c.SolrResourceLoader solr home defaulted to 'solr/' (could not find system property or JNDI)
   [junit4]   2> 1023155 INFO  (coreLoadExecutor-2089-thread-1-processing-n:127.0.0.1:56720_) [n:127.0.0.1:56720_ c:control_collection   x:collection1] o.a.s.c.Config loaded config solrconfig.xml with version 0 
   [junit4]   2> 1023166 INFO  (coreLoadExecutor-2089-thread-1-processing-n:127.0.0.1:56720_) [n:127.0.0.1:56720_ c:control_collection   x:collection1] o.a.s.c.SolrConfig current version of requestparams : -1
   [junit4]   2> 1023173 WARN  (coreLoadExecutor-2089-thread-1-processing-n:127.0.0.1:56720_) [n:127.0.0.1:56720_ c:control_collection   x:collection1] o.a.s.c.Config Beginning with Solr 5.5, <mergePolicy> is deprecated, use <mergePolicyFactory> instead.
   [junit4]   2> 1023174 INFO  (coreLoadExecutor-2089-thread-1-processing-n:127.0.0.1:56720_) [n:127.0.0.1:56720_ c:control_collection   x:collection1] o.a.s.c.SolrConfig Using Lucene MatchVersion: 6.3.0
   [junit4]   2> 1023183 INFO  (coreLoadExecutor-2089-thread-1-processing-n:127.0.0.1:56720_) [n:127.0.0.1:56720_ c:control_collection   x:collection1] o.a.s.c.SolrConfig Loaded SolrConfig: solrconfig.xml
   [junit4]   2> 1023199 INFO  (coreLoadExecutor-2089-thread-1-processing-n:127.0.0.1:56720_) [n:127.0.0.1:56720_ c:control_collection   x:collection1] o.a.s.s.IndexSchema [collection1] Schema name=test
   [junit4]   2> 1023387 INFO  (coreLoadExecutor-2089-thread-1-processing-n:127.0.0.1:56720_) [n:127.0.0.1:56720_ c:control_collection   x:collection1] o.a.s.s.OpenExchangeRatesOrgProvider Initialized with rates=open-exchange-rates.json, refreshInterval=1440.
   [junit4]   2> 1023401 INFO  (coreLoadExecutor-2089-thread-1-processing-n:127.0.0.1:56720_) [n:127.0.0.1:56720_ c:control_collection   x:collection1] o.a.s.s.IndexSchema default search field in schema is text
   [junit4]   2> 1023402 INFO  (coreLoadExecutor-2089-thread-1-processing-n:127.0.0.1:56720_) [n:127.0.0.1:56720_ c:control_collection   x:collection1] o.a.s.s.IndexSchema unique key field: id
   [junit4]   2> 1023410 INFO  (coreLoadExecutor-2089-thread-1-processing-n:127.0.0.1:56720_) [n:127.0.0.1:56720_ c:control_collection   x:collection1] o.a.s.s.FileExchangeRateProvider Reloading exchange rates from file currency.xml
   [junit4]   2> 1023422 INFO  (coreLoadExecutor-2089-thread-1-processing-n:127.0.0.1:56720_) [n:127.0.0.1:56720_ c:control_collection   x:collection1] o.a.s.s.FileExchangeRateProvider Reloading exchange rates from file currency.xml
   [junit4]   2> 1023428 INFO  (coreLoadExecutor-2089-thread-1-processing-n:127.0.0.1:56720_) [n:127.0.0.1:56720_ c:control_collection   x:collection1] o.a.s.s.OpenExchangeRatesOrgProvider Reloading exchange rates from open-exchange-rates.json
   [junit4]   2> 1023429 INFO  (coreLoadExecutor-2089-thread-1-processing-n:127.0.0.1:56720_) [n:127.0.0.1:56720_ c:control_collection   x:collection1] o.a.s.s.OpenExchangeRatesOrgProvider Reloading exchange rates from open-exchange-rates.json
   [junit4]   2> 1023430 INFO  (coreLoadExecutor-2089-thread-1-processing-n:127.0.0.1:56720_) [n:127.0.0.1:56720_ c:control_collection   x:collection1] o.a.s.c.ConfigSetProperties Did not find ConfigSet properties, assuming default properties: Can't find resource 'configsetprops.json' in classpath or '/configs/conf1', cwd=/x1/jenkins/jenkins-slave/workspace/Lucene-Solr-Tests-6.x/solr/build/solr-core/test/J1
   [junit4]   2> 1023430 INFO  (coreLoadExecutor-2089-thread-1-processing-n:127.0.0.1:56720_) [n:127.0.0.1:56720_ c:control_collection   x:collection1] o.a.s.c.CoreContainer Creating SolrCore 'collection1' using configuration from collection control_collection
   [junit4]   2> 1023430 INFO  (coreLoadExecutor-2089-thread-1-processing-n:127.0.0.1:56720_) [n:127.0.0.1:56720_ c:control_collection s:shard1 r:core_node1 x:collection1] o.a.s.c.SolrCore org.apache.solr.core.MockDirectoryFactory
   [junit4]   2> 1023431 INFO  (coreLoadExecutor-2089-thread-1-processing-n:127.0.0.1:56720_) [n:127.0.0.1:56720_ c:control_collection s:shard1 r:core_node1 x:collection1] o.a.s.c.SolrCore [[collection1] ] Opening new SolrCore at [/x1/jenkins/jenkins-slave/workspace/Lucene-Solr-Tests-6.x/solr/build/solr-core/test/J1/temp/solr.cloud.LeaderFailoverAfterPartitionTest_272CC8FD1EF4722F-001/control-001/cores/collection1], dataDir=[/x1/jenkins/jenkins-slave/workspace/Lucene-Solr-Tests-6.x/solr/build/solr-core/test/J1/temp/solr.cloud.LeaderFailoverAfterPartitionTest_272CC8FD1EF4722F-001/control-001/cores/collection1/data/]
   [junit4]   2> 1023431 INFO  (coreLoadExecutor-2089-thread-1-processing-n:127.0.0.1:56720_) [n:127.0.0.1:56720_ c:control_collection s:shard1 r:core_node1 x:collection1] o.a.s.c.JmxMonitoredMap JMX monitoring is enabled. Adding Solr mbeans to JMX Server: com.sun.jmx.mbeanserver.JmxMBeanServer@56920ecb
   [junit4]   2> 1023431 INFO  (coreLoadExecutor-2089-thread-1-processing-n:127.0.0.1:56720_) [n:127.0.0.1:56720_ c:control_collection s:shard1 r:core_node1 x:collection1] o.a.s.c.CachingDirectoryFactory return new directory for /x1/jenkins/jenkins-slave/workspace/Lucene-Solr-Tests-6.x/solr/build/solr-core/test/J1/temp/solr.cloud.LeaderFailoverAfterPartitionTest_272CC8FD1EF4722F-001/control-001/cores/collection1/data/snapshot_metadata
   [junit4]   2> 1023431 INFO  (coreLoadExecutor-2089-thread-1-processing-n:127.0.0.1:56720_) [n:127.0.0.1:56720_ c:control_collection s:shard1 r:core_node1 x:collection1] o.a.s.c.s.SolrSnapshotMetaDataManager Loading from snapshot metadata file...
   [junit4]   2> 1023431 INFO  (coreLoadExecutor-2089-thread-1-processing-n:127.0.0.1:56720_) [n:127.0.0.1:56720_ c:control_collection s:shard1 r:core_node1 x:collection1] o.a.s.c.CachingDirectoryFactory return new directory for /x1/jenkins/jenkins-slave/workspace/Lucene-Solr-Tests-6.x/solr/build/solr-core/test/J1/temp/solr.cloud.LeaderFailoverAfterPartitionTest_272CC8FD1EF4722F-001/control-001/cores/collection1/data
   [junit4]   2> 1023431 INFO  (coreLoadExecutor-2089-thread-1-processing-n:127.0.0.1:56720_) [n:127.0.0.1:56720_ c:control_collection s:shard1 r:core_node1 x:collection1] o.a.s.c.SolrCore New index directory detected: old=null new=/x1/jenkins/jenkins-slave/workspace/Lucene-Solr-Tests-6.x/solr/build/solr-core/test/J1/temp/solr.cloud.LeaderFailoverAfterPartitionTest_272CC8FD1EF4722F-001/control-001/cores/collection1/data/index/
   [junit4]   2> 1023431 WARN  (coreLoadExecutor-2089-thread-1-processing-n:127.0.0.1:56720_) [n:127.0.0.1:56720_ c:control_collection s:shard1 r:core_node1 x:collection1] o.a.s.c.SolrCore [collection1] Solr index directory '/x1/jenkins/jenkins-slave/workspace/Lucene-Solr-Tests-6.x/solr/build/solr-core/test/J1/temp/solr.cloud.LeaderFailoverAfterPartitionTest_272CC8FD1EF4722F-001/control-001/cores/collection1/data/index' doesn't exist. Creating new index...
   [junit4]   2> 1023432 INFO  (coreLoadExecutor-2089-thread-1-processing-n:127.0.0.1:56720_) [n:127.0.0.1:56720_ c:control_collection s:shard1 r:core_node1 x:collection1] o.a.s.c.CachingDirectoryFactory return new directory for /x1/jenkins/jenkins-slave/workspace/Lucene-Solr-Tests-6.x/solr/build/solr-core/test/J1/temp/solr.cloud.LeaderFailoverAfterPartitionTest_272CC8FD1EF4722F-001/control-001/cores/collection1/data/index
   [junit4]   2> 1023432 INFO  (coreLoadExecutor-2089-thread-1-processing-n:127.0.0.1:56720_) [n:127.0.0.1:56720_ c:control_collection s:shard1 r:core_node1 x:collection1] o.a.s.u.RandomMergePolicy RandomMergePolicy wrapping class org.apache.lucene.index.TieredMergePolicy: [TieredMergePolicy: maxMergeAtOnce=23, maxMergeAtOnceExplicit=35, maxMergedSegmentMB=59.4990234375, floorSegmentMB=0.8837890625, forceMergeDeletesPctAllowed=12.588537490389468, segmentsPerTier=24.0, maxCFSSegmentSizeMB=8.796093022207999E12, noCFSRatio=0.6407551818436906
   [junit4]   2> 1023439 INFO  (coreLoadExecutor-2089-thread-1-processing-n:127.0.0.1:56720_) [n:127.0.0.1:56720_ c:control_collection s:shard1 r:core_node1 x:collection1] o.a.s.c.SolrDeletionPolicy SolrDeletionPolicy.onCommit: commits: num=1
   [junit4]   2> 	commit{dir=MockDirectoryWrapper(RAMDirectory@77ce88b0 lockFactory=org.apache.lucene.store.SingleInstanceLockFactory@b396e56),segFN=segments_1,generation=1}
   [junit4]   2> 1023439 INFO  (coreLoadExecutor-2089-thread-1-processing-n:127.0.0.1:56720_) [n:127.0.0.1:56720_ c:control_collection s:shard1 r:core_node1 x:collection1] o.a.s.c.SolrDeletionPolicy newest commit generation = 1
   [junit4]   2> 1023446 INFO  (coreLoadExecutor-2089-thread-1-processing-n:127.0.0.1:56720_) [n:127.0.0.1:56720_ c:control_collection s:shard1 r:core_node1 x:collection1] o.a.s.u.p.UpdateRequestProcessorChain creating updateRequestProcessorChain "nodistrib"
   [junit4]   2> 1023446 INFO  (coreLoadExecutor-2089-thread-1-processing-n:127.0.0.1:56720_) [n:127.0.0.1:56720_ c:control_collection s:shard1 r:core_node1 x:collection1] o.a.s.u.p.UpdateRequestProcessorChain creating updateRequestProcessorChain "dedupe"
   [junit4]   2> 1023446 INFO  (coreLoadExecutor-2089-thread-1-processing-n:127.0.0.1:56720_) [n:127.0.0.1:56720_ c:control_collection s:shard1 r:core_node1 x:collection1] o.a.s.u.p.UpdateRequestProcessorChain inserting DistributedUpdateProcessorFactory into updateRequestProcessorChain "dedupe"
   [junit4]   2> 1023446 INFO  (coreLoadExecutor-2089-thread-1-processing-n:127.0.0.1:56720_) [n:127.0.0.1:56720_ c:control_collection s:shard1 r:core_node1 x:collection1] o.a.s.u.p.UpdateRequestProcessorChain creating updateRequestProcessorChain "stored_sig"
   [junit4]   2> 1023446 INFO  (coreLoadExecutor-2089-thread-1-processing-n:127.0.0.1:56720_) [n:127.0.0.1:56720_ c:control_collection s:shard1 r:core_node1 x:collection1] o.a.s.u.p.UpdateRequestProcessorChain inserting DistributedUpdateProcessorFactory into updateRequestProcessorChain "stored_sig"
   [junit4]   2> 1023446 INFO  (coreLoadExecutor-2089-thread-1-processing-n:127.0.0.1:56720_) [n:127.0.0.1:56720_ c:control_collection s:shard1 r:core_node1 x:collection1] o.a.s.u.p.UpdateRequestProcessorChain creating updateRequestProcessorChain "distrib-dup-test-chain-explicit"
   [junit4]   2> 1023446 INFO  (coreLoadExecutor-2089-thread-1-processing-n:127.0.0.1:56720_) [n:127.0.0.1:56720_ c:control_collection s:shard1 r:core_node1 x:collection1] o.a.s.u.p.UpdateRequestProcessorChain creating updateRequestProcessorChain "distrib-dup-test-chain-implicit"
   [junit4]   2> 1023446 INFO  (coreLoadExecutor-2089-thread-1-processing-n:127.0.0.1:56720_) [n:127.0.0.1:56720_ c:control_collection s:shard1 r:core_node1 x:collection1] o.a.s.u.p.UpdateRequestProcessorChain inserting DistributedUpdateProcessorFactory into updateRequestProcessorChain "distrib-dup-test-chain-implicit"
   [junit4]   2> 1023446 INFO  (coreLoadExecutor-2089-thread-1-processing-n:127.0.0.1:56720_) [n:127.0.0.1:56720_ c:control_collection s:shard1 r:core_node1 x:collection1] o.a.s.c.SolrCore no updateRequestProcessorChain defined as default, creating implicit default
   [junit4]   2> 1023447 WARN  (coreLoadExecutor-2089-thread-1-processing-n:127.0.0.1:56720_) [n:127.0.0.1:56720_ c:control_collection s:shard1 r:core_node1 x:collection1] o.a.s.c.RequestHandlers INVALID paramSet a in requestHandler {type = requestHandler,name = /dump,class = DumpRequestHandler,args = {defaults={a=A,b=B}}}
   [junit4]   2> 1023448 INFO  (coreLoadExecutor-2089-thread-1-processing-n:127.0.0.1:56720_) [n:127.0.0.1:56720_ c:control_collection s:shard1 r:core_node1 x:collection1] o.a.s.h.l.XMLLoader xsltCacheLifetimeSeconds=60
   [junit4]   2> 1023449 INFO  (coreLoadExecutor-2089-thread-1-processing-n:127.0.0.1:56720_) [n:127.0.0.1:56720_ c:control_collection s:shard1 r:core_node1 x:collection1] o.a.s.h.l.XMLLoader xsltCacheLifetimeSeconds=60
   [junit4]   2> 1023450 INFO  (coreLoadExecutor-2089-thread-1-processing-n:127.0.0.1:56720_) [n:127.0.0.1:56720_ c:control_collection s:shard1 r:core_node1 x:collection1] o.a.s.h.l.XMLLoader xsltCacheLifetimeSeconds=60
   [junit4]   2> 1023451 INFO  (coreLoadExecutor-2089-thread-1-processing-n:127.0.0.1:56720_) [n:127.0.0.1:56720_ c:control_collection s:shard1 r:core_node1 x:collection1] o.a.s.h.l.XMLLoader xsltCacheLifetimeSeconds=60
   [junit4]   2> 1023455 INFO  (OldIndexDirectoryCleanupThreadForCore-collection1) [n:127.0.0.1:56720_ c:control_collection s:shard1 r:core_node1 x:collection1] o.a.s.c.SolrCore Looking for old index directories to cleanup for core collection1 in /x1/jenkins/jenkins-slave/workspace/Lucene-Solr-Tests-6.x/solr/build/solr-core/test/J1/temp/solr.cloud.LeaderFailoverAfterPartitionTest_272CC8FD1EF4722F-001/control-001/cores/collection1/data/
   [junit4]   2> 1023455 WARN  (OldIndexDirectoryCleanupThreadForCore-collection1) [n:127.0.0.1:56720_ c:control_collection s:shard1 r:core_node1 x:collection1] o.a.s.c.DirectoryFactory /x1/jenkins/jenkins-slave/workspace/Lucene-Solr-Tests-6.x/solr/build/solr-core/test/J1/temp/solr.cloud.LeaderFailoverAfterPartitionTest_272CC8FD1EF4722F-001/control-001/cores/collection1/data/ does not point to a valid data directory; skipping clean-up of old index directories.
   [junit4]   2> 1023457 INFO  (coreLoadExecutor-2089-thread-1-processing-n:127.0.0.1:56720_) [n:127.0.0.1:56720_ c:control_collection s:shard1 r:core_node1 x:collection1] o.a.s.c.RequestHandlers Registered paths: /admin/mbeans,standard,/update/json/docs,/admin/luke,/export,/get,/admin/properties,/update/json,/admin/threads,/dump,/update/csv,/sql,/graph,/admin/segments,/admin/system,/replication,/config,/stream,/schema,/admin/plugins,/admin/logging,/admin/ping,/update,/admin/file,/terms
   [junit4]   2> 1023459 INFO  (coreLoadExecutor-2089-thread-1-processing-n:127.0.0.1:56720_) [n:127.0.0.1:56720_ c:control_collection s:shard1 r:core_node1 x:collection1] o.a.s.c.SolrCore Using default statsCache cache: org.apache.solr.search.stats.LocalStatsCache
   [junit4]   2> 1023460 INFO  (coreLoadExecutor-2089-thread-1-processing-n:127.0.0.1:56720_) [n:127.0.0.1:56720_ c:control_collection s:shard1 r:core_node1 x:collection1] o.a.s.u.UpdateHandler Using UpdateLog implementation: org.apache.solr.update.UpdateLog
   [junit4]   2> 1023460 INFO  (coreLoadExecutor-2089-thread-1-processing-n:127.0.0.1:56720_) [n:127.0.0.1:56720_ c:control_collection s:shard1 r:core_node1 x:collection1] o.a.s.u.UpdateLog Initializing UpdateLog: dataDir= defaultSyncLevel=FLUSH numRecordsToKeep=100 maxNumLogsToKeep=10 numVersionBuckets=65536
   [junit4]   2> 1023460 INFO  (coreLoadExecutor-2089-thread-1-processing-n:127.0.0.1:56720_) [n:127.0.0.1:56720_ c:control_collection s:shard1 r:core_node1 x:collection1] o.a.s.u.CommitTracker Hard AutoCommit: disabled
   [junit4]   2> 1023460 INFO  (coreLoadExecutor-2089-thread-1-processing-n:127.0.0.1:56720_) [n:127.0.0.1:56720_ c:control_collection s:shard1 r:core_node1 x:collection1] o.a.s.u.CommitTracker Soft AutoCommit: disabled
   [junit4]   2> 1023461 INFO  (coreLoadExecutor-2089-thread-1-processing-n:127.0.0.1:56720_) [n:127.0.0.1:56720_ c:control_collection s:shard1 r:core_node1 x:collection1] o.a.s.u.RandomMergePolicy RandomMergePolicy wrapping class org.apache.lucene.index.TieredMergePolicy: [TieredMergePolicy: maxMergeAtOnce=39, maxMergeAtOnceExplicit=30, maxMergedSegmentMB=72.814453125, floorSegmentMB=1.638671875, forceMergeDeletesPctAllowed=7.783332526596141, segmentsPerTier=16.0, maxCFSSegmentSizeMB=8.796093022207999E12, noCFSRatio=0.555249351548314
   [junit4]   2> 1023463 INFO  (coreLoadExecutor-2089-thread-1-processing-n:127.0.0.1:56720_) [n:127.0.0.1:56720_ c:control_collection s:shard1 r:core_node1 x:collection1] o.a.s.c.SolrDeletionPolicy SolrDeletionPolicy.onInit: commits: num=1
   [junit4]   2> 	commit{dir=MockDirectoryWrapper(RAMDirectory@77ce88b0 lockFactory=org.apache.lucene.store.SingleInstanceLockFactory@b396e56),segFN=segments_1,generation=1}
   [junit4]   2> 1023463 INFO  (coreLoadExecutor-2089-thread-1-processing-n:127.0.0.1:56720_) [n:127.0.0.1:56720_ c:control_collection s:shard1 r:core_node1 x:collection1] o.a.s.c.SolrDeletionPolicy newest commit generation = 1
   [junit4]   2> 1023463 INFO  (coreLoadExecutor-2089-thread-1-processing-n:127.0.0.1:56720_) [n:127.0.0.1:56720_ c:control_collection s:shard1 r:core_node1 x:collection1] o.a.s.s.SolrIndexSearcher Opening [Searcher@55714c34[collection1] main]
   [junit4]   2> 1023479 INFO  (coreLoadExecutor-2089-thread-1-processing-n:127.0.0.1:56720_) [n:127.0.0.1:56720_ c:control_collection s:shard1 r:core_node1 x:collection1] o.a.s.r.ManagedResourceStorage Setting up ZooKeeper-based storage for the RestManager with znodeBase: /configs/conf1
   [junit4]   2> 1023574 INFO  (coreLoadExecutor-2089-thread-1-processing-n:127.0.0.1:56720_) [n:127.0.0.1:56720_ c:control_collection s:shard1 r:core_node1 x:collection1] o.a.s.r.ManagedResourceStorage Configured ZooKeeperStorageIO with znodeBase: /configs/conf1
   [junit4]   2> 1023574 INFO  (coreLoadExecutor-2089-thread-1-processing-n:127.0.0.1:56720_) [n:127.0.0.1:56720_ c:control_collection s:shard1 r:core_node1 x:collection1] o.a.s.r.RestManager Initializing RestManager with initArgs: {}
   [junit4]   2> 1023575 INFO  (coreLoadExecutor-2089-thread-1-processing-n:127.0.0.1:56720_) [n:127.0.0.1:56720_ c:control_collection s:shard1 r:core_node1 x:collection1] o.a.s.r.ManagedResourceStorage Reading _rest_managed.json using ZooKeeperStorageIO:path=/configs/conf1
   [junit4]   2> 1023579 INFO  (coreLoadExecutor-2089-thread-1-processing-n:127.0.0.1:56720_) [n:127.0.0.1:56720_ c:control_collection s:shard1 r:core_node1 x:collection1] o.a.s.r.ManagedResourceStorage No data found for znode /configs/conf1/_rest_managed.json
   [junit4]   2> 1023579 INFO  (coreLoadExecutor-2089-thread-1-processing-n:127.0.0.1:56720_) [n:127.0.0.1:56720_ c:control_collection s:shard1 r:core_node1 x:collection1] o.a.s.r.ManagedResourceStorage Loaded null at path _rest_managed.json using ZooKeeperStorageIO:path=/configs/conf1
   [junit4]   2> 1023579 INFO  (coreLoadExecutor-2089-thread-1-processing-n:127.0.0.1:56720_) [n:127.0.0.1:56720_ c:control_collection s:shard1 r:core_node1 x:collection1] o.a.s.r.RestManager Initializing 0 registered ManagedResources
   [junit4]   2> 1023579 INFO  (coreLoadExecutor-2089-thread-1-processing-n:127.0.0.1:56720_) [n:127.0.0.1:56720_ c:control_collection s:shard1 r:core_node1 x:collection1] o.a.s.h.ReplicationHandler Commits will be reserved for  10000
   [junit4]   2> 1023580 INFO  (coreLoadExecutor-2089-thread-1-processing-n:127.0.0.1:56720_) [n:127.0.0.1:56720_ c:control_collection s:shard1 r:core_node1 x:collection1] o.a.s.u.UpdateLog Looking up max value of version field to seed version buckets
   [junit4]   2> 1023580 INFO  (coreLoadExecutor-2089-thread-1-processing-n:127.0.0.1:56720_) [n:127.0.0.1:56720_ c:control_collection s:shard1 r:core_node1 x:collection1] o.a.s.u.VersionInfo Refreshing highest value of _version_ for 65536 version buckets from index
   [junit4]   2> 1023580 INFO  (coreLoadExecutor-2089-thread-1-processing-n:127.0.0.1:56720_) [n:127.0.0.1:56720_ c:control_collection s:shard1 r:core_node1 x:collection1] o.a.s.u.VersionInfo No terms found for _version_, cannot seed version bucket highest value from index
   [junit4]   2> 1023580 INFO  (coreLoadExecutor-2089-thread-1-processing-n:127.0.0.1:56720_) [n:127.0.0.1:56720_ c:control_collection s:shard1 r:core_node1 x:collection1] o.a.s.u.UpdateLog Could not find max version in index or recent updates, using new clock 1545882942610341888
   [junit4]   2> 1023582 INFO  (coreLoadExecutor-2089-thread-1-processing-n:127.0.0.1:56720_) [n:127.0.0.1:56720_ c:control_collection s:shard1 r:core_node1 x:collection1] o.a.s.u.UpdateLog Took 1.0ms to seed version buckets with highest version 1545882942610341888
   [junit4]   2> 1023582 INFO  (coreLoadExecutor-2089-thread-1-processing-n:127.0.0.1:56720_) [n:127.0.0.1:56720_ c:control_collection s:shard1 r:core_node1 x:collection1] o.a.s.c.ZkController watch zkdir /configs/conf1
   [junit4]   2> 1023582 INFO  (searcherExecutor-2090-thread-1-processing-n:127.0.0.1:56720_ x:collection1 s:shard1 c:control_collection r:core_node1) [n:127.0.0.1:56720_ c:control_collection s:shard1 r:core_node1 x:collection1] o.a.s.c.SolrCore [collection1] Registered new searcher Searcher@55714c34[collection1] main{ExitableDirectoryReader(UninvertingDirectoryReader())}
   [junit4]   2> 1023587 INFO  (coreLoadExecutor-2089-thread-1-processing-n:127.0.0.1:56720_) [n:127.0.0.1:56720_ c:control_collection s:shard1 r:core_node1 x:collection1] o.a.s.c.CoreContainer registering core: collection1
   [junit4]   2> 1023587 INFO  (coreZkRegister-2082-thread-1-processing-n:127.0.0.1:56720_ x:collection1 s:shard1 c:control_collection r:core_node1) [n:127.0.0.1:56720_ c:control_collection s:shard1 r:core_node1 x:collection1] o.a.s.c.ZkController Register replica - core:collection1 address:http://127.0.0.1:56720 collection:control_collection shard:shard1
   [junit4]   2> 1023588 INFO  (coreZkRegister-2082-thread-1-processing-n:127.0.0.1:56720_ x:collection1 s:shard1 c:control_collection r:core_node1) [n:127.0.0.1:56720_ c:control_collection s:shard1 r:core_node1 x:collection1] o.a.s.c.c.SolrZkClient makePath: /collections/control_collection/leader_elect/shard1/election
   [junit4]   2> 1023592 INFO  (coreZkRegister-2082-thread-1-processing-n:127.0.0.1:56720_ x:collection1 s:shard1 c:control_collection r:core_node1) [n:127.0.0.1:56720_ c:control_collection s:shard1 r:core_node1 x:collection1] o.a.s.c.LeaderElector Joined leadership election with path: /collections/control_collection/leader_elect/shard1/election/96617683825786884-core_node1-n_0000000000
   [junit4]   2> 1023592 INFO  (coreZkRegister-2082-thread-1-processing-n:127.0.0.1:56720_ x:collection1 s:shard1 c:control_collection r:core_node1) [n:127.0.0.1:56720_ c:control_collection s:shard1 r:core_node1 x:collection1] o.a.s.c.ShardLeaderElectionContext Running the leader process for shard=shard1 and weAreReplacement=false and leaderVoteWait=10000
   [junit4]   2> 1023594 INFO  (OverseerStateUpdate-96617683825786884-127.0.0.1:56720_-n_0000000000) [n:127.0.0.1:56720_    ] o.a.s.c.Overseer processMessage: queueSize: 1, message = {
   [junit4]   2>   "operation":"leader",
   [junit4]   2>   "shard":"shard1",
   [junit4]   2>   "collection":"control_collection"} current state version: 1
   [junit4]   2> 1023595 INFO  (coreZkRegister-2082-thread-1-processing-n:127.0.0.1:56720_ x:collection1 s:shard1 c:control_collection r:core_node1) [n:127.0.0.1:56720_ c:control_collection s:shard1 r:core_node1 x:collection1] o.a.s.c.ShardLeaderElectionContext Enough replicas found to continue.
   [junit4]   2> 1023595 INFO  (coreZkRegister-2082-thread-1-processing-n:127.0.0.1:56720_ x:collection1 s:shard1 c:control_collection r:core_node1) [n:127.0.0.1:56720_ c:control_collection s:shard1 r:core_node1 x:collection1] o.a.s.c.ShardLeaderElectionContext I may be the new leader - try and sync
   [junit4]   2> 1023595 INFO  (coreZkRegister-2082-thread-1-processing-n:127.0.0.1:56720_ x:collection1 s:shard1 c:control_collection r:core_node1) [n:127.0.0.1:56720_ c:control_collection s:shard1 r:core_node1 x:collection1] o.a.s.c.SyncStrategy Sync replicas to http://127.0.0.1:56720/collection1/
   [junit4]   2> 1023595 INFO  (coreZkRegister-2082-thread-1-processing-n:127.0.0.1:56720_ x:collection1 s:shard1 c:control_collection r:core_node1) [n:127.0.0.1:56720_ c:control_collection s:shard1 r:core_node1 x:collection1] o.a.s.c.SyncStrategy Sync Success - now sync replicas to me
   [junit4]   2> 1023596 INFO  (coreZkRegister-2082-thread-1-processing-n:127.0.0.1:56720_ x:collection1 s:shard1 c:control_collection r:core_node1) [n:127.0.0.1:56720_ c:control_collection s:shard1 r:core_node1 x:collection1] o.a.s.c.SyncStrategy http://127.0.0.1:56720/collection1/ has no replicas
   [junit4]   2> 1023596 INFO  (coreZkRegister-2082-thread-1-processing-n:127.0.0.1:56720_ x:collection1 s:shard1 c:control_collection r:core_node1) [n:127.0.0.1:56720_ c:control_collection s:shard1 r:core_node1 x:collection1] o.a.s.c.c.SolrZkClient makePath: /collections/control_collection/leaders/shard1
   [junit4]   2> 1023598 INFO  (coreZkRegister-2082-thread-1-processing-n:127.0.0.1:56720_ x:collection1 s:shard1 c:control_collection r:core_node1) [n:127.0.0.1:56720_ c:control_collection s:shard1 r:core_node1 x:collection1] o.a.s.c.ShardLeaderElectionContextBase Creating leader registration node /collections/control_collection/leaders/shard1/leader after winning as /collections/control_collection/leader_elect/shard1/election/96617683825786884-core_node1-n_0000000000
   [junit4]   2> 1023608 INFO  (coreZkRegister-2082-thread-1-processing-n:127.0.0.1:56720_ x:collection1 s:shard1 c:control_collection r:core_node1) [n:127.0.0.1:56720_ c:control_collection s:shard1 r:core_node1 x:collection1] o.a.s.c.ShardLeaderElectionContext I am the new leader: http://127.0.0.1:56720/collection1/ shard1
   [junit4]   2> 1023609 INFO  (OverseerStateUpdate-96617683825786884-127.0.0.1:56720_-n_0000000000) [n:127.0.0.1:56720_    ] o.a.s.c.Overseer processMessage: queueSize: 1, message = {
   [junit4]   2>   "operation":"leader",
   [junit4]   2>   "shard":"shard1",
   [junit4]   2>   "collection":"control_collection",
   [junit4]   2>   "base_url":"http://127.0.0.1:56720",
   [junit4]   2>   "core":"collection1",
   [junit4]   2>   "state":"active"} current state version: 1
   [junit4]   2> 1023721 INFO  (zkCallback-830-thread-4-processing-n:127.0.0.1:56720_) [n:127.0.0.1:56720_    ] o.a.s.c.c.ZkStateReader A cluster state change: [WatchedEvent state:SyncConnected type:NodeDataChanged path:/clusterstate.json], has occurred - updating... (live nodes size: [1])
   [junit4]   2> 1023763 INFO  (coreZkRegister-2082-thread-1-processing-n:127.0.0.1:56720_ x:collection1 s:shard1 c:control_collection r:core_node1) [n:127.0.0.1:56720_ c:control_collection s:shard1 r:core_node1 x:collection1] o.a.s.c.ZkController We are http://127.0.0.1:56720/collection1/ and leader is http://127.0.0.1:56720/collection1/
   [junit4]   2> 1023763 INFO  (coreZkRegister-2082-thread-1-processing-n:127.0.0.1:56720_ x:collection1 s:shard1 c:control_collection r:core_node1) [n:127.0.0.1:56720_ c:control_collection s:shard1 r:core_node1 x:collection1] o.a.s.c.ZkController No LogReplay needed for core=collection1 baseURL=http://127.0.0.1:56720
   [junit4]   2> 1023763 INFO  (coreZkRegister-2082-thread-1-processing-n:127.0.0.1:56720_ x:collection1 s:shard1 c:control_collection r:core_node1) [n:127.0.0.1:56720_ c:control_collection s:shard1 r:core_node1 x:collection1] o.a.s.c.ZkController I am the leader, no recovery necessary
   [junit4]   2> 1023763 INFO  (coreZkRegister-2082-thread-1-processing-n:127.0.0.1:56720_ x:collection1 s:shard1 c:control_collection r:core_node1) [n:127.0.0.1:56720_ c:control_collection s:shard1 r:core_node1 x:collection1] o.a.s.c.ZkController publishing state=active
   [junit4]   2> 1023763 INFO  (coreZkRegister-2082-thread-1-processing-n:127.0.0.1:56720_ x:collection1 s:shard1 c:control_collection r:core_node1) [n:127.0.0.1:56720_ c:control_collection s:shard1 r:core_node1 x:collection1] o.a.s.c.ZkController numShards not found on descriptor - reading it from system property
   [junit4]   2> 1023765 INFO  (coreZkRegister-2082-thread-1-processing-n:127.0.0.1:56720_ x:collection1 s:shard1 c:control_collection r:core_node1) [n:127.0.0.1:56720_ c:control_collection s:shard1 r:core_node1 x:collection1] o.a.s.c.c.ZkStateReader Checking legacy cluster state for collection control_collection
   [junit4]   2> 1023765 INFO  (OverseerStateUpdate-96617683825786884-127.0.0.1:56720_-n_0000000000) [n:127.0.0.1:56720_    ] o.a.s.c.Overseer processMessage: queueSize: 1, message = {
   [junit4]   2>   "core":"collection1",
   [junit4]   2>   "core_node_name":"core_node1",
   [junit4]   2>   "roles":null,
   [junit4]   2>   "base_url":"http://127.0.0.1:56720",
   [junit4]   2>   "node_name":"127.0.0.1:56720_",
   [junit4]   2>   "numShards":"1",
   [junit4]   2>   "state":"active",
   [junit4]   2>   "shard":"shard1",
   [junit4]   2>   "collection":"control_collection",
   [junit4]   2>   "operation":"state"} current state version: 2
   [junit4]   2> 1023765 INFO  (OverseerStateUpdate-96617683825786884-127.0.0.1:56720_-n_0000000000) [n:127.0.0.1:56720_    ] o.a.s.c.o.ReplicaMutator Update state numShards=1 message={
   [junit4]   2>   "core":"collection1",
   [junit4]   2>   "core_node_name":"core_node1",
   [junit4]   2>   "roles":null,
   [junit4]   2>   "base_url":"http://127.0.0.1:56720",
   [junit4]   2>   "node_name":"127.0.0.1:56720_",
   [junit4]   2>   "numShards":"1",
   [junit4]   2>   "state":"active",
   [junit4]   2>   "shard":"shard1",
   [junit4]   2>   "collection":"control_collection",
   [junit4]   2>   "operation":"state"}
   [junit4]   2> 1023871 INFO  (zkCallback-830-thread-5-processing-n:127.0.0.1:56720_) [n:127.0.0.1:56720_    ] o.a.s.c.c.ZkStateReader A cluster state change: [WatchedEvent state:SyncConnected type:NodeDataChanged path:/clusterstate.json], has occurred - updating... (live nodes size: [1])
   [junit4]   2> 1024097 INFO  (TEST-LeaderFailoverAfterPartitionTest.test-seed#[272CC8FD1EF4722F]) [    ] o.a.s.c.c.SolrZkClient Using default ZkCredentialsProvider
   [junit4]   2> 1024098 INFO  (TEST-LeaderFailoverAfterPartitionTest.test-seed#[272CC8FD1EF4722F]) [    ] o.a.s.c.c.ConnectionManager Waiting for client to connect to ZooKeeper
   [junit4]   2> 1024119 INFO  (zkCallback-834-thread-1) [    ] o.a.s.c.c.ConnectionManager Watcher org.apache.solr.common.cloud.ConnectionManager@6a8d28ab name:ZooKeeperConnection Watcher:127.0.0.1:60817/solr got event WatchedEvent state:SyncConnected type:None path:null path:null type:None
   [junit4]   2> 1024119 INFO  (TEST-LeaderFailoverAfterPartitionTest.test-seed#[272CC8FD1EF4722F]) [    ] o.a.s.c.c.ConnectionManager Client is connected to ZooKeeper
   [junit4]   2> 1024119 INFO  (TEST-LeaderFailoverAfterPartitionTest.test-seed#[272CC8FD1EF4722F]) [    ] o.a.s.c.c.SolrZkClient Using default ZkACLProvider
   [junit4]   2> 1024119 INFO  (TEST-LeaderFailoverAfterPartitionTest.test-seed#[272CC8FD1EF4722F]) [    ] o.a.s.c.c.ZkStateReader Updating cluster state from ZooKeeper... 
   [junit4]   2> 1024120 INFO  (TEST-LeaderFailoverAfterPartitionTest.test-seed#[272CC8FD1EF4722F]) [    ] o.a.s.c.c.ZkStateReader Loaded empty cluster properties
   [junit4]   2> 1024121 INFO  (TEST-LeaderFailoverAfterPartitionTest.test-seed#[272CC8FD1EF4722F]) [    ] o.a.s.c.c.ZkStateReader Updated live nodes from ZooKeeper... (0) -> (1)
   [junit4]   2> 1024121 INFO  (TEST-LeaderFailoverAfterPartitionTest.test-seed#[272CC8FD1EF4722F]) [    ] o.a.s.c.ChaosMonkey monkey: init - expire sessions:false cause connection loss:false
   [junit4]   2> 1024122 INFO  (TEST-LeaderFailoverAfterPartitionTest.test-seed#[272CC8FD1EF4722F]) [    ] o.a.s.c.AbstractFullDistribZkTestBase Creating collection1 with stateFormat=2
   [junit4]   2> 1024122 INFO  (TEST-LeaderFailoverAfterPartitionTest.test-seed#[272CC8FD1EF4722F]) [    ] o.a.s.c.c.SolrZkClient Using default ZkCredentialsProvider
   [junit4]   2> 1024143 INFO  (TEST-LeaderFailoverAfterPartitionTest.test-seed#[272CC8FD1EF4722F]) [    ] o.a.s.c.c.ConnectionManager Waiting for client to connect to ZooKeeper
   [junit4]   2> 1024143 INFO  (zkCallback-835-thread-1) [    ] o.a.s.c.c.ConnectionManager Watcher org.apache.solr.common.cloud.ConnectionManager@75fe6690 name:ZooKeeperConnection Watcher:127.0.0.1:60817/solr got event WatchedEvent state:SyncConnected type:None path:null path:null type:None
   [junit4]   2> 1024143 INFO  (TEST-LeaderFailoverAfterPartitionTest.test-seed#[272CC8FD1EF4722F]) [    ] o.a.s.c.c.ConnectionManager Client is connected to ZooKeeper
   [junit4]   2> 1024143 INFO  (TEST-LeaderFailoverAfterPartitionTest.test-seed#[272CC8FD1EF4722F]) [    ] o.a.s.c.c.SolrZkClient Using default ZkACLProvider
   [junit4]   2> 1024145 INFO  (OverseerStateUpdate-96617683825786884-127.0.0.1:56720_-n_0000000000) [n:127.0.0.1:56720_    ] o.a.s.c.Overseer processMessage: queueSize: 1, message = {
   [junit4]   2>   "operation":"create",
   [junit4]   2>   "name":"collection1",
   [junit4]   2>   "numShards":"2",
   [junit4]   2>   "stateFormat":"2"} current state version: 3
   [junit4]   2> 1024145 INFO  (OverseerStateUpdate-96617683825786884-127.0.0.1:56720_-n_0000000000) [n:127.0.0.1:56720_    ] o.a.s.c.o.ClusterStateMutator building a new cName: collection1
   [junit4]   2> 1024251 INFO  (OverseerStateUpdate-96617683825786884-127.0.0.1:56720_-n_0000000000) [n:127.0.0.1:56720_    ] o.a.s.c.o.ZkStateWriter going to create_collection /collections/collection1/state.json
   [junit4]   2> 1024287 INFO  (TEST-LeaderFailoverAfterPartitionTest.test-seed#[272CC8FD1EF4722F]) [    ] o.a.s.SolrTestCaseJ4 Writing core.properties file to /x1/jenkins/jenkins-slave/workspace/Lucene-Solr-Tests-6.x/solr/build/solr-core/test/J1/temp/solr.cloud.LeaderFailoverAfterPartitionTest_272CC8FD1EF4722F-001/shard-1-001/cores/collection1
   [junit4]   2> 1024288 INFO  (TEST-LeaderFailoverAfterPartitionTest.test-seed#[272CC8FD1EF4722F]) [    ] o.a.s.c.AbstractFullDistribZkTestBase create jetty 1 in directory /x1/jenkins/jenkins-slave/workspace/Lucene-Solr-Tests-6.x/solr/build/solr-core/test/J1/temp/solr.cloud.LeaderFailoverAfterPartitionTest_272CC8FD1EF4722F-001/shard-1-001
   [junit4]   2> 1024289 INFO  (TEST-LeaderFailoverAfterPartitionTest.test-seed#[272CC8FD1EF4722F]) [    ] o.e.j.s.Server jetty-9.3.8.v20160314
   [junit4]   2> 1024294 INFO  (TEST-LeaderFailoverAfterPartitionTest.test-seed#[272CC8FD1EF4722F]) [    ] o.e.j.s.h.ContextHandler Started o.e.j.s.ServletContextHandler@15e85115{/,null,AVAILABLE}
   [junit4]   2> 1024295 INFO  (TEST-LeaderFailoverAfterPartitionTest.test-seed#[272CC8FD1EF4722F]) [    ] o.e.j.s.ServerConnector Started ServerConnector@421958ad{HTTP/1.1,[http/1.1]}{127.0.0.1:55354}
   [junit4]   2> 1024295 INFO  (TEST-LeaderFailoverAfterPartitionTest.test-seed#[272CC8FD1EF4722F]) [    ] o.e.j.s.Server Started @1030028ms
   [junit4]   2> 1024295 INFO  (TEST-LeaderFailoverAfterPartitionTest.test-seed#[272CC8FD1EF4722F]) [    ] o.a.s.c.s.e.JettySolrRunner Jetty properties: {solr.data.dir=/x1/jenkins/jenkins-slave/workspace/Lucene-Solr-Tests-6.x/solr/build/solr-core/test/J1/temp/solr.cloud.LeaderFailoverAfterPartitionTest_272CC8FD1EF4722F-001/tempDir-001/jetty1, solrconfig=solrconfig.xml, hostContext=/, hostPort=46646, coreRootDirectory=/x1/jenkins/jenkins-slave/workspace/Lucene-Solr-Tests-6.x/solr/build/solr-core/test/J1/temp/solr.cloud.LeaderFailoverAfterPartitionTest_272CC8FD1EF4722F-001/shard-1-001/cores}
   [junit4]   2> 1024295 INFO  (TEST-LeaderFailoverAfterPartitionTest.test-seed#[272CC8FD1EF4722F]) [    ] o.a.s.s.SolrDispatchFilter SolrDispatchFilter.init(): sun.misc.Launcher$AppClassLoader@73d16e93
   [junit4]   2> 1024295 INFO  (TEST-LeaderFailoverAfterPartitionTest.test-seed#[272CC8FD1EF4722F]) [    ] o.a.s.c.SolrResourceLoader new SolrResourceLoader for directory: '/x1/jenkins/jenkins-slave/workspace/Lucene-Solr-Tests-6.x/solr/build/solr-core/test/J1/temp/solr.cloud.LeaderFailoverAfterPartitionTest_272CC8FD1EF4722F-001/shard-1-001'
   [junit4]   2> 1024295 INFO  (TEST-LeaderFailoverAfterPartitionTest.test-seed#[272CC8FD1EF4722F]) [    ] o.a.s.c.SolrResourceLoader JNDI not configured for solr (NoInitialContextEx)
   [junit4]   2> 1024295 INFO  (TEST-LeaderFailoverAfterPartitionTest.test-seed#[272CC8FD1EF4722F]) [    ] o.a.s.c.SolrResourceLoader solr home defaulted to 'solr/' (could not find system property or JNDI)
   [junit4]   2> 1024295 INFO  (TEST-LeaderFailoverAfterPartitionTest.test-seed#[272CC8FD1EF4722F]) [    ] o.a.s.c.c.SolrZkClient Using default ZkCredentialsProvider
   [junit4]   2> 1024297 INFO  (TEST-LeaderFailoverAfterPartitionTest.test-seed#[272CC8FD1EF4722F]) [    ] o.a.s.c.c.ConnectionManager Waiting for client to connect to ZooKeeper
   [junit4]   2> 1024297 INFO  (zkCallback-836-thread-1) [    ] o.a.s.c.c.ConnectionManager Watcher org.apache.solr.common.cloud.ConnectionManager@317601cc name:ZooKeeperConnection Watcher:127.0.0.1:60817/solr got event WatchedEvent state:SyncConnected type:None path:null path:null type:None
   [junit4]   2> 1024297 INFO  (TEST-LeaderFailoverAfterPartitionTest.test-seed#[272CC8FD1EF4722F]) [    ] o.a.s.c.c.ConnectionManager Client is connected to ZooKeeper
   [junit4]   2> 1024298 INFO  (TEST-LeaderFailoverAfterPartitionTest.test-seed#[272CC8FD1EF4722F]) [    ] o.a.s.c.c.SolrZkClient Using default ZkACLProvider
   [junit4]   2> 1024299 INFO  (TEST-LeaderFailoverAfterPartitionTest.test-seed#[272CC8FD1EF4722F]) [    ] o.a.s.s.SolrDispatchFilter Loading solr.xml from SolrHome (not found in ZooKeeper)
   [junit4]   2> 1024299 INFO  (TEST-LeaderFailoverAfterPartitionTest.test-seed#[272CC8FD1EF4722F]) [    ] o.a.s.c.SolrXmlConfig Loading container configuration from /x1/jenkins/jenkins-slave/workspace/Lucene-Solr-Tests-6.x/solr/build/solr-core/test/J1/temp/solr.cloud.LeaderFailoverAfterPartitionTest_272CC8FD1EF4722F-001/shard-1-001/solr.xml
   [junit4]   2> 1024308 INFO  (TEST-LeaderFailoverAfterPartitionTest.test-seed#[272CC8FD1EF4722F]) [    ] o.a.s.c.CorePropertiesLocator Config-defined core root directory: /x1/jenkins/jenkins-slave/workspace/Lucene-Solr-Tests-6.x/solr/build/solr-core/test/J1/temp/solr.cloud.LeaderFailoverAfterPartitionTest_272CC8FD1EF4722F-001/shard-1-001/cores
   [junit4]   2> 1024308 INFO  (TEST-LeaderFailoverAfterPartitionTest.test-seed#[272CC8FD1EF4722F]) [    ] o.a.s.c.CoreContainer New CoreContainer 320215391
   [junit4]   2> 1024308 INFO  (TEST-LeaderFailoverAfterPartitionTest.test-seed#[272CC8FD1EF4722F]) [    ] o.a.s.c.CoreContainer Loading cores into CoreContainer [instanceDir=/x1/jenkins/jenkins-slave/workspace/Lucene-Solr-Tests-6.x/solr/build/solr-core/test/J1/temp/solr.cloud.LeaderFailoverAfterPartitionTest_272CC8FD1EF4722F-001/shard-1-001]
   [junit4]   2> 1024309 WARN  (TEST-LeaderFailoverAfterPartitionTest.test-seed#[272CC8FD1EF4722F]) [    ] o.a.s.c.CoreContainer Couldn't add files from /x1/jenkins/jenkins-slave/workspace/Lucene-Solr-Tests-6.x/solr/build/solr-core/test/J1/temp/solr.cloud.LeaderFailoverAfterPartitionTest_272CC8FD1EF4722F-001/shard-1-001/lib to classpath: /x1/jenkins/jenkins-slave/workspace/Lucene-Solr-Tests-6.x/solr/build/solr-core/test/J1/temp/solr.cloud.LeaderFailoverAfterPartitionTest_272CC8FD1EF4722F-001/shard-1-001/lib
   [junit4]   2> 1024309 INFO  (TEST-LeaderFailoverAfterPartitionTest.test-seed#[272CC8FD1EF4722F]) [    ] o.a.s.h.c.HttpShardHandlerFactory created with socketTimeout : 90000,urlScheme : ,connTimeout : 15000,maxConnectionsPerHost : 20,maxConnections : 10000,corePoolSize : 0,maximumPoolSize : 2147483647,maxThreadIdleTime : 5,sizeOfQueue : -1,fairnessPolicy : false,useRetries : false,connectionsEvictorSleepDelay : 5000,maxConnectionIdleTime : 40000,
   [junit4]   2> 1024310 INFO  (TEST-LeaderFailoverAfterPartitionTest.test-seed#[272CC8FD1EF4722F]) [    ] o.a.s.u.UpdateShardHandler Creating UpdateShardHandler HTTP client with params: socketTimeout=340000&connTimeout=45000&retry=true
   [junit4]   2> 1024313 INFO  (TEST-LeaderFailoverAfterPartitionTest.test-seed#[272CC8FD1EF4722F]) [    ] o.a.s.l.LogWatcher SLF4J impl is org.slf4j.impl.Log4jLoggerFactory
   [junit4]   2> 1024313 INFO  (TEST-LeaderFailoverAfterPartitionTest.test-seed#[272CC8FD1EF4722F]) [    ] o.a.s.l.LogWatcher Registering Log Listener [Log4j (org.slf4j.impl.Log4jLoggerFactory)]
   [junit4]   2> 1024313 INFO  (TEST-LeaderFailoverAfterPartitionTest.test-seed#[272CC8FD1EF4722F]) [    ] o.a.s.c.ZkContainer Zookeeper client=127.0.0.1:60817/solr
   [junit4]   2> 1024313 INFO  (TEST-LeaderFailoverAfterPartitionTest.test-seed#[272CC8FD1EF4722F]) [    ] o.a.s.c.ZkController zkHost includes chroot
   [junit4]   2> 1024313 INFO  (TEST-LeaderFailoverAfterPartitionTest.test-seed#[272CC8FD1EF4722F]) [    ] o.a.s.c.c.SolrZkClient Using default ZkCredentialsProvider
   [junit4]   2> 1024315 INFO  (TEST-LeaderFailoverAfterPartitionTest.test-seed#[272CC8FD1EF4722F]) [    ] o.a.s.c.c.ConnectionManager Waiting for client to connect to ZooKeeper
   [junit4]   2> 1024335 INFO  (zkCallback-839-thread-1) [    ] o.a.s.c.c.ConnectionManager Watcher org.apache.solr.common.cloud.ConnectionManager@18224d56 name:ZooKeeperConnection Watcher:127.0.0.1:60817 got event WatchedEvent state:SyncConnected type:None path:null path:null type:None
   [junit4]   2> 1024347 INFO  (TEST-LeaderFailoverAfterPartitionTest.test-seed#[272CC8FD1EF4722F]) [    ] o.a.s.c.c.ConnectionManager Client is connected to ZooKeeper
   [junit4]   2> 1024347 INFO  (TEST-LeaderFailoverAfterPartitionTest.test-seed#[272CC8FD1EF4722F]) [    ] o.a.s.c.c.SolrZkClient Using default ZkACLProvider
   [junit4]   2> 1024364 INFO  (TEST-LeaderFailoverAfterPartitionTest.test-seed#[272CC8FD1EF4722F]) [n:127.0.0.1:46646_    ] o.a.s.c.ZkController Added new OnReconnect listener org.apache.solr.cloud.ZkController$$Lambda$23/101308563@5392162a
   [junit4]   2> 1024365 INFO  (TEST-LeaderFailoverAfterPartitionTest.test-seed#[272CC8FD1EF4722F]) [n:127.0.0.1:46646_    ] o.a.s.c.c.ConnectionManager Waiting for client to connect to ZooKeeper
   [junit4]   2> 1024368 INFO  (zkCallback-840-thread-1-processing-n:127.0.0.1:46646_) [n:127.0.0.1:46646_    ] o.a.s.c.c.ConnectionManager Watcher org.apache.solr.common.cloud.ConnectionManager@147cfe09 name:ZooKeeperConnection Watcher:127.0.0.1:60817/solr got event WatchedEvent state:SyncConnected type:None path:null path:null type:None
   [junit4]   2> 1024368 INFO  (TEST-LeaderFailoverAfterPartitionTest.test-seed#[272CC8FD1EF4722F]) [n:127.0.0.1:46646_    ] o.a.s.c.c.ConnectionManager Client is connected to ZooKeeper
   [junit4]   2> 1024378 INFO  (TEST-LeaderFailoverAfterPartitionTest.test-seed#[272CC8FD1EF4722F]) [n:127.0.0.1:46646_    ] o.a.s.c.c.ZkStateReader Updating cluster state from ZooKeeper... 
   [junit4]   2> 1024379 INFO  (TEST-LeaderFailoverAfterPartitionTest.test-seed#[272CC8FD1EF4722F]) [n:127.0.0.1:46646_    ] o.a.s.c.c.ZkStateReader Loaded empty cluster properties
   [junit4]   2> 1024379 INFO  (TEST-LeaderFailoverAfterPartitionTest.test-seed#[272CC8FD1EF4722F]) [n:127.0.0.1:46646_    ] o.a.s.c.c.ZkStateReader Updated live nodes from ZooKeeper... (0) -> (1)
   [junit4]   2> 1024381 INFO  (TEST-LeaderFailoverAfterPartitionTest.test-seed#[272CC8FD1EF4722F]) [n:127.0.0.1:46646_    ] o.a.s.c.Overseer Overseer (id=null) closing
   [junit4]   2> 1024382 INFO  (TEST-LeaderFailoverAfterPartitionTest.test-seed#[272CC8FD1EF4722F]) [n:127.0.0.1:46646_    ] o.a.s.c.LeaderElector Joined leadership election with path: /overseer_elect/election/96617683825786889-127.0.0.1:46646_-n_0000000001
   [junit4]   2> 1024382 INFO  (TEST-LeaderFailoverAfterPartitionTest.test-seed#[272CC8FD1EF4722F]) [n:127.0.0.1:46646_    ] o.a.s.c.LeaderElector Watching path /overseer_elect/election/96617683825786884-127.0.0.1:56720_-n_0000000000 to know if I could be the leader
   [junit4]   2> 1024383 INFO  (TEST-LeaderFailoverAfterPartitionTest.test-seed#[272CC8FD1EF4722F]) [n:127.0.0.1:46646_    ] o.a.s.c.ZkController Publish node=127.0.0.1:46646_ as DOWN
   [junit4]   2> 1024384 INFO  (OverseerStateUpdate-96617683825786884-127.0.0.1:56720_-n_0000000000) [n:127.0.0.1:56720_    ] o.a.s.c.Overseer processMessage: queueSize: 1, message = {
   [junit4]   2>   "operation":"downnode",
   [junit4]   2>   "node_name":"127.0.0.1:46646_"} current state version: 3
   [junit4]   2> 1024384 INFO  (OverseerStateUpdate-96617683825786884-127.0.0.1:56720_-n_0000000000) [n:127.0.0.1:56720_    ] o.a.s.c.o.NodeMutator DownNode state invoked for node: 127.0.0.1:46646_
   [junit4]   2> 1024385 INFO  (zkCallback-834-thread-1) [    ] o.a.s.c.c.ZkStateReader A cluster state change: [WatchedEvent state:SyncConnected type:NodeDataChanged path:/clusterstate.json], has occurred - updating... (live nodes size: [1])
   [junit4]   2> 1024385 INFO  (zkCallback-830-thread-3-processing-n:127.0.0.1:56720_) [n:127.0.0.1:56720_    ] o.a.s.c.c.ZkStateReader A cluster state change: [WatchedEvent state:SyncConnected type:NodeDataChanged path:/clusterstate.json], has occurred - updating... (live nodes size: [1])
   [junit4]   2> 1024386 INFO  (TEST-LeaderFailoverAfterPartitionTest.test-seed#[272CC8FD1EF4722F]) [n:127.0.0.1:46646_    ] o.a.s.c.ZkController Register node as live in ZooKeeper:/live_nodes/127.0.0.1:46646_
   [junit4]   2> 1024386 INFO  (TEST-LeaderFailoverAfterPartitionTest.test-seed#[272CC8FD1EF4722F]) [n:127.0.0.1:46646_    ] o.a.s.c.c.SolrZkClient makePath: /live_nodes/127.0.0.1:46646_
   [junit4]   2> 1024386 INFO  (zkCallback-840-thread-1-processing-n:127.0.0.1:46646_) [n:127.0.0.1:46646_    ] o.a.s.c.c.ZkStateReader A cluster state change: [WatchedEvent state:SyncConnected type:NodeDataChanged path:/clusterstate.json], has occurred - updating... (live nodes size: [1])
   [junit4]   2> 1024396 INFO  (zkCallback-830-thread-2-processing-n:127.0.0.1:56720_) [n:127.0.0.1:56720_    ] o.a.s.c.c.ZkStateReader A live node change: [WatchedEvent state:SyncConnected type:NodeChildrenChanged path:/live_nodes], has occurred - updating... (live nodes size: [1])
   [junit4]   2> 1024396 INFO  (zkCallback-834-thread-1) [    ] o.a.s.c.c.ZkStateReader A live node change: [WatchedEvent state:SyncConnected type:NodeChildrenChanged path:/live_nodes], has occurred - updating... (live nodes size: [1])
   [junit4]   2> 1024396 INFO  (zkCallback-830-thread-2-processing-n:127.0.0.1:56720_) [n:127.0.0.1:56720_    ] o.a.s.c.c.ZkStateReader Updated live nodes from ZooKeeper... (1) -> (2)
   [junit4]   2> 1024397 INFO  (zkCallback-834-thread-1) [    ] o.a.s.c.c.ZkStateReader Updated live nodes from ZooKeeper... (1) -> (2)
   [junit4]   2> 1024436 INFO  (zkCallback-840-thread-2-processing-n:127.0.0.1:46646_) [n:127.0.0.1:46646_    ] o.a.s.c.c.ZkStateReader A live node change: [WatchedEvent state:SyncConnected type:NodeChildrenChanged path:/live_nodes], has occurred - updating... (live nodes size: [1])
   [junit4]   2> 1024439 INFO  (TEST-LeaderFailoverAfterPartitionTest.test-seed#[272CC8FD1EF4722F]) [n:127.0.0.1:46646_    ] o.a.s.c.CoreContainer Security conf doesn't exist. Skipping setup for authorization module.
   [junit4]   2> 1024439 INFO  (TEST-LeaderFailoverAfterPartitionTest.test-seed#[272CC8FD1EF4722F]) [n:127.0.0.1:46646_    ] o.a.s.c.CoreContainer No authentication plugin used.
   [junit4]   2> 1024439 INFO  (zkCallback-840-thread-2-processing-n:127.0.0.1:46646_) [n:127.0.0.1:46646_    ] o.a.s.c.c.ZkStateReader Updated live nodes from ZooKeeper... (1) -> (2)
   [junit4]   2> 1024440 INFO  (TEST-LeaderFailoverAfterPartitionTest.test-seed#[272CC8FD1EF4722F]) [n:127.0.0.1:46646_    ] o.a.s.c.CorePropertiesLocator Looking for core definitions underneath /x1/jenkins/jenkins-slave/workspace/Lucene-Solr-Tests-6.x/solr/build/solr-core/test/J1/temp/solr.cloud.LeaderFailoverAfterPartitionTest_272CC8FD1EF4722F-001/shard-1-001/cores
   [junit4]   2> 1024441 INFO  (TEST-LeaderFailoverAfterPartitionTest.test-seed#[272CC8FD1EF4722F]) [n:127.0.0.1:46646_    ] o.a.s.c.CoreDescriptor Created CoreDescriptor: {name=collection1, config=solrconfig.xml, transient=false, schema=schema.xml, loadOnStartup=true, configSetProperties=configsetprops.json, collection=collection1, coreNodeName=, dataDir=data/, shard=}
   [junit4]   2> 1024441 INFO  (TEST-LeaderFailoverAfterPartitionTest.test-seed#[272CC8FD1EF4722F]) [n:127.0.0.1:46646_    ] o.a.s.c.CorePropertiesLocator Found core collection1 in /x1/jenkins/jenkins-slave/workspace/Lucene-Solr-Tests-6.x/solr/build/solr-core/test/J1/temp/solr.cloud.LeaderFailoverAfterPartitionTest_272CC8FD1EF4722F-001/shard-1-001/cores/collection1
   [junit4]   2> 1024441 INFO  (TEST-LeaderFailoverAfterPartitionTest.test-seed#[272CC8FD1EF4722F]) [n:127.0.0.1:46646_    ] o.a.s.c.CorePropertiesLocator Found 1 core definitions
   [junit4]   2> 1024451 INFO  (TEST-LeaderFailoverAfterPartitionTest.test-seed#[272CC8FD1EF4722F]) [n:127.0.0.1:46646_    ] o.a.s.s.SolrDispatchFilter user.dir=/x1/jenkins/jenkins-slave/workspace/Lucene-Solr-Tests-6.x/solr/build/solr-core/test/J1
   [junit4]   2> 1024451 INFO  (TEST-LeaderFailoverAfterPartitionTest.test-seed#[272CC8FD1EF4722F]) [n:127.0.0.1:46646_    ] o.a.s.s.SolrDispatchFilter SolrDispatchFilter.init() done
   [junit4]   2> 1024459 INFO  (coreLoadExecutor-2100-thread-1-processing-n:127.0.0.1:46646_) [n:127.0.0.1:46646_ c:collection1   x:collection1] o.a.s.c.ZkController publishing state=down
   [junit4]   2> 1024459 INFO  (coreLoadExecutor-2100-thread-1-processing-n:127.0.0.1:46646_) [n:127.0.0.1:46646_ c:collection1   x:collection1] o.a.s.c.ZkController numShards not found on descriptor - reading it from system property
   [junit4]   2> 1024475 INFO  (coreLoadExecutor-2100-thread-1-processing-n:127.0.0.1:46646_) [n:127.0.0.1:46646_ c:collection1   x:collection1] o.a.s.c.ZkController Registering watch for collection collection1
   [junit4]   2> 1024483 INFO  (coreLoadExecutor-2100-thread-1-processing-n:127.0.0.1:46646_) [n:127.0.0.1:46646_ c:collection1   x:collection1] o.a.s.c.c.ZkStateReader Add data for [collection1] ver [0]
   [junit4]   2> 1024483 INFO  (OverseerStateUpdate-96617683825786884-127.0.0.1:56720_-n_0000000000) [n:127.0.0.1:56720_    ] o.a.s.c.Overseer processMessage: queueSize: 1, message = {
   [junit4]   2>   "core":"collection1",
   [junit4]   2>   "roles":null,
   [junit4]   2>   "base_url":"http://127.0.0.1:46646",
   [junit4]   2>   "node_name":"127.0.0.1:46646_",
   [junit4]   2>   "numShards":"2",
   [junit4]   2>   "state":"down",
   [junit4]   2>   "shard":null,
   [junit4]   2>   "collection":"collection1",
   [junit4]   2>   "operation":"state"} current state version: 4
   [junit4]   2> 1024483 INFO  (OverseerStateUpdate-96617683825786884-127.0.0.1:56720_-n_0000000000) [n:127.0.0.1:56720_    ] o.a.s.c.o.ReplicaMutator Update state numShards=2 message={
   [junit4]   2>   "core":"collection1",
   [junit4]   2>   "roles":null,
   [junit4]   2>   "base_url":"http://127.0.0.1:46646",
   [junit4]   2>   "node_name":"127.0.0.1:46646_",
   [junit4]   2>   "numShards":"2",
   [junit4]   2>   "state":"down",
   [junit4]   2>   "shard":null,
   [junit4]   2>   "collection":"collection1",
   [junit4]   2>   "operation":"state"}
   [junit4]   2> 1024483 INFO  (OverseerStateUpdate-96617683825786884-127.0.0.1:56720_-n_0000000000) [n:127.0.0.1:56720_    ] o.a.s.c.o.ReplicaMutator Collection already exists with numShards=2
   [junit4]   2> 1024483 INFO  (OverseerStateUpdate-96617683825786884-127.0.0.1:56720_-n_0000000000) [n:127.0.0.1:56720_    ] o.a.s.c.o.ReplicaMutator Assigning new node to shard shard=shard2
   [junit4]   2> 1024483 INFO  (coreLoadExecutor-2100-thread-1-processing-n:127.0.0.1:46646_) [n:127.0.0.1:46646_ c:collection1   x:collection1] o.a.s.c.ZkController look for our core node name
   [junit4]   2> 1024619 INFO  (OverseerStateUpdate-96617683825786884-127.0.0.1:56720_-n_0000000000) [n:127.0.0.1:56720_    ] o.a.s.c.o.ZkStateWriter going to update_collection /collections/collection1/state.json version: 0
   [junit4]   2> 1024623 INFO  (zkCallback-840-thread-2-processing-n:127.0.0.1:46646_) [n:127.0.0.1:46646_    ] o.a.s.c.c.ZkStateReader A cluster state change: [WatchedEvent state:SyncConnected type:NodeDataChanged path:/collections/collection1/state.json] for collection [collection1] has occurred - updating... (live nodes size: [2])
   [junit4]   2> 1024631 INFO  (zkCallback-840-thread-2-processing-n:127.0.0.1:46646_) [n:127.0.0.1:46646_    ] o.a.s.c.c.ZkStateReader Updating data for [collection1] from [0] to [1]
   [junit4]   2> 1025483 INFO  (coreLoadExecutor-2100-thread-1-processing-n:127.0.0.1:46646_) [n:127.0.0.1:46646_ c:collection1   x:collection1] o.a.s.c.ZkController waiting to find shard id in clusterstate for collection1
   [junit4]   2> 1025484 INFO  (coreLoadExecutor-2100-thread-1-processing-n:127.0.0.1:46646_) [n:127.0.0.1:46646_ c:collection1   x:collection1] o.a.s.c.ZkController Check for collection zkNode:collection1
   [junit4]   2> 1025484 INFO  (coreLoadExecutor-2100-thread-1-processing-n:127.0.0.1:46646_) [n:127.0.0.1:46646_ c:collection1   x:collection1] o.a.s.c.ZkController Collection zkNode exists
   [j

[...truncated too long message...]

ches above limit:
   [junit4]   2> 
   [junit4]   2> 	5	/solr/clusterstate.json
   [junit4]   2> 	3	/solr/collections/c8n_1x3_lf/state.json
   [junit4]   2> 	3	/solr/collections/collection1/state.json
   [junit4]   2> 
   [junit4]   2> Maximum concurrent children watches above limit:
   [junit4]   2> 
   [junit4]   2> 	57	/solr/overseer/collection-queue-work
   [junit4]   2> 	52	/solr/overseer/queue
   [junit4]   2> 	25	/solr/overseer/queue-work
   [junit4]   2> 	5	/solr/live_nodes
   [junit4]   2> 	5	/solr/collections
   [junit4]   2> 
   [junit4]   2> 1086804 WARN  (TEST-LeaderFailoverAfterPartitionTest.test-seed#[272CC8FD1EF4722F]) [    ] o.a.s.c.SocketProxy Closing 6 connections to: http://127.0.0.1:46646/, target: http://127.0.0.1:55354/
   [junit4]   2> 1086804 WARN  (TEST-LeaderFailoverAfterPartitionTest.test-seed#[272CC8FD1EF4722F]) [    ] o.a.s.c.SocketProxy Closing 0 connections to: http://127.0.0.1:40895/, target: http://127.0.0.1:60258/
   [junit4]   2> 1086804 WARN  (TEST-LeaderFailoverAfterPartitionTest.test-seed#[272CC8FD1EF4722F]) [    ] o.a.s.c.SocketProxy Closing 7 connections to: http://127.0.0.1:56720/, target: http://127.0.0.1:45497/
   [junit4]   2> 1086804 WARN  (TEST-LeaderFailoverAfterPartitionTest.test-seed#[272CC8FD1EF4722F]) [    ] o.a.s.c.SocketProxy Closing 0 connections to: http://127.0.0.1:34292/, target: http://127.0.0.1:34577/
   [junit4]   2> NOTE: reproduce with: ant test  -Dtestcase=LeaderFailoverAfterPartitionTest -Dtests.method=test -Dtests.seed=272CC8FD1EF4722F -Dtests.multiplier=2 -Dtests.slow=true -Dtests.locale=en-GB -Dtests.timezone=Asia/Baku -Dtests.asserts=true -Dtests.file.encoding=UTF-8
   [junit4] ERROR   64.6s J1 | LeaderFailoverAfterPartitionTest.test <<<
   [junit4]    > Throwable #1: org.apache.solr.client.solrj.SolrServerException: org.apache.solr.client.solrj.SolrServerException: No live SolrServers available to handle this request:[http://127.0.0.1:34292/c8n_1x3_lf_shard1_replica3]
   [junit4]    > 	at __randomizedtesting.SeedInfo.seed([272CC8FD1EF4722F:AF78F727B0081FD7]:0)
   [junit4]    > 	at org.apache.solr.client.solrj.impl.CloudSolrClient.directUpdate(CloudSolrClient.java:769)
   [junit4]    > 	at org.apache.solr.client.solrj.impl.CloudSolrClient.sendRequest(CloudSolrClient.java:1161)
   [junit4]    > 	at org.apache.solr.client.solrj.impl.CloudSolrClient.requestWithRetryOnStaleState(CloudSolrClient.java:1050)
   [junit4]    > 	at org.apache.solr.client.solrj.impl.CloudSolrClient.request(CloudSolrClient.java:992)
   [junit4]    > 	at org.apache.solr.client.solrj.SolrClient.request(SolrClient.java:1219)
   [junit4]    > 	at org.apache.solr.cloud.HttpPartitionTest.sendDoc(HttpPartitionTest.java:592)
   [junit4]    > 	at org.apache.solr.cloud.HttpPartitionTest.sendDoc(HttpPartitionTest.java:578)
   [junit4]    > 	at org.apache.solr.cloud.LeaderFailoverAfterPartitionTest.testRf3WithLeaderFailover(LeaderFailoverAfterPartitionTest.java:174)
   [junit4]    > 	at org.apache.solr.cloud.LeaderFailoverAfterPartitionTest.test(LeaderFailoverAfterPartitionTest.java:55)
   [junit4]    > 	at org.apache.solr.BaseDistributedSearchTestCase$ShardsRepeatRule$ShardsFixedStatement.callStatement(BaseDistributedSearchTestCase.java:992)
   [junit4]    > 	at org.apache.solr.BaseDistributedSearchTestCase$ShardsRepeatRule$ShardsStatement.evaluate(BaseDistributedSearchTestCase.java:967)
   [junit4]    > 	at java.lang.Thread.run(Thread.java:745)
   [junit4]    > Caused by: org.apache.solr.client.solrj.SolrServerException: No live SolrServers available to handle this request:[http://127.0.0.1:34292/c8n_1x3_lf_shard1_replica3]
   [junit4]    > 	at org.apache.solr.client.solrj.impl.LBHttpSolrClient.request(LBHttpSolrClient.java:384)
   [junit4]    > 	at org.apache.solr.client.solrj.impl.CloudSolrClient.directUpdate(CloudSolrClient.java:763)
   [junit4]    > 	... 49 more
   [junit4]    > Caused by: org.apache.solr.client.solrj.SolrServerException: Server refused connection at: http://127.0.0.1:34292/c8n_1x3_lf_shard1_replica3
   [junit4]    > 	at org.apache.solr.client.solrj.impl.HttpSolrClient.executeMethod(HttpSolrClient.java:599)
   [junit4]    > 	at org.apache.solr.client.solrj.impl.HttpSolrClient.request(HttpSolrClient.java:261)
   [junit4]    > 	at org.apache.solr.client.solrj.impl.HttpSolrClient.request(HttpSolrClient.java:250)
   [junit4]    > 	at org.apache.solr.client.solrj.impl.LBHttpSolrClient.doRequest(LBHttpSolrClient.java:405)
   [junit4]    > 	at org.apache.solr.client.solrj.impl.LBHttpSolrClient.request(LBHttpSolrClient.java:357)
   [junit4]    > 	... 50 more
   [junit4]    > Caused by: java.net.ConnectException: Connection refused
   [junit4]    > 	at java.net.PlainSocketImpl.socketConnect(Native Method)
   [junit4]    > 	at java.net.AbstractPlainSocketImpl.doConnect(AbstractPlainSocketImpl.java:350)
   [junit4]    > 	at java.net.AbstractPlainSocketImpl.connectToAddress(AbstractPlainSocketImpl.java:206)
   [junit4]    > 	at java.net.AbstractPlainSocketImpl.connect(AbstractPlainSocketImpl.java:188)
   [junit4]    > 	at java.net.SocksSocketImpl.connect(SocksSocketImpl.java:392)
   [junit4]    > 	at java.net.Socket.connect(Socket.java:589)
   [junit4]    > 	at org.apache.http.conn.scheme.PlainSocketFactory.connectSocket(PlainSocketFactory.java:117)
   [junit4]    > 	at org.apache.http.impl.conn.DefaultClientConnectionOperator.openConnection(DefaultClientConnectionOperator.java:177)
   [junit4]    > 	at org.apache.http.impl.conn.ManagedClientConnectionImpl.open(ManagedClientConnectionImpl.java:304)
   [junit4]    > 	at org.apache.http.impl.client.DefaultRequestDirector.tryConnect(DefaultRequestDirector.java:611)
   [junit4]    > 	at org.apache.http.impl.client.DefaultRequestDirector.execute(DefaultRequestDirector.java:446)
   [junit4]    > 	at org.apache.http.impl.client.AbstractHttpClient.doExecute(AbstractHttpClient.java:882)
   [junit4]    > 	at org.apache.http.impl.client.CloseableHttpClient.execute(CloseableHttpClient.java:82)
   [junit4]    > 	at org.apache.http.impl.client.CloseableHttpClient.execute(CloseableHttpClient.java:107)
   [junit4]    > 	at org.apache.http.impl.client.CloseableHttpClient.execute(CloseableHttpClient.java:55)
   [junit4]    > 	at org.apache.solr.client.solrj.impl.HttpSolrClient.executeMethod(HttpSolrClient.java:497)
   [junit4]    > 	... 54 more
   [junit4]   2> 1086812 INFO  (SUITE-LeaderFailoverAfterPartitionTest-seed#[272CC8FD1EF4722F]-worker) [    ] o.a.s.SolrTestCaseJ4 ###deleteCore
   [junit4]   2> NOTE: leaving temporary files on disk at: /x1/jenkins/jenkins-slave/workspace/Lucene-Solr-Tests-6.x/solr/build/solr-core/test/J1/temp/solr.cloud.LeaderFailoverAfterPartitionTest_272CC8FD1EF4722F-001
   [junit4]   2> Sep 19, 2016 7:08:41 AM com.carrotsearch.randomizedtesting.ThreadLeakControl checkThreadLeaks
   [junit4]   2> WARNING: Will linger awaiting termination of 1 leaked thread(s).
   [junit4]   2> NOTE: test params are: codec=Asserting(Lucene62): {range_facet_l_dv=PostingsFormat(name=LuceneVarGapDocFreqInterval), _version_=PostingsFormat(name=LuceneFixedGap), multiDefault=PostingsFormat(name=Memory doPackFST= true), a_t=PostingsFormat(name=Memory doPackFST= true), intDefault=PostingsFormat(name=LuceneFixedGap), id=PostingsFormat(name=LuceneVarGapDocFreqInterval), range_facet_i_dv=PostingsFormat(name=Memory doPackFST= true), text=PostingsFormat(name=Direct), range_facet_l=PostingsFormat(name=Memory doPackFST= true), timestamp=PostingsFormat(name=Memory doPackFST= true)}, docValues:{range_facet_l_dv=DocValuesFormat(name=Lucene54), range_facet_i_dv=DocValuesFormat(name=Asserting), timestamp=DocValuesFormat(name=Asserting)}, maxPointsInLeafNode=1548, maxMBSortInHeap=7.313161575986047, sim=ClassicSimilarity, locale=en-GB, timezone=Asia/Baku
   [junit4]   2> NOTE: Linux 3.13.0-85-generic amd64/Oracle Corporation 1.8.0_102 (64-bit)/cpus=4,threads=1,free=65173640,total=523239424
   [junit4]   2> NOTE: All tests run in this JVM: [TestLeaderElectionZkExpiry, CollectionTooManyReplicasTest, TestSearchPerf, TestSystemIdResolver, TestNoOpRegenerator, TestSchemaVersionResource, DateMathParserTest, TestRequestForwarding, SpellCheckComponentTest, HdfsCollectionsAPIDistributedZkTest, TestSchemaNameResource, TestUninvertingReader, EnumFieldTest, TestStressVersions, UpdateRequestProcessorFactoryTest, TolerantUpdateProcessorTest, SolrInfoMBeanTest, TestJsonFacets, SolrCmdDistributorTest, SampleTest, HdfsBasicDistributedZkTest, HdfsRecoveryZkTest, IndexBasedSpellCheckerTest, TestFieldResource, TermVectorComponentTest, ChangedSchemaMergeTest, CloudExitableDirectoryReaderTest, SpellingQueryConverterTest, InfoHandlerTest, HdfsLockFactoryTest, TestLRUCache, TestQueryTypes, TestRTGBase, TestFastOutputStream, CopyFieldTest, TestTrieFacet, SpatialFilterTest, TestDynamicFieldCollectionResource, TestConfigSetImmutable, SolrXmlInZkTest, DeleteLastCustomShardedReplicaTest, TestFilteredDocIdSet, TestSurroundQueryParser, TestCloudInspectUtil, TestSortingResponseWriter, TestSortByMinMaxFunction, TestFuzzyAnalyzedSuggestions, OverriddenZkACLAndCredentialsProvidersTest, TestIntervalFaceting, HLLSerializationTest, RollingRestartTest, MigrateRouteKeyTest, ClusterStateUpdateTest, CoreAdminCreateDiscoverTest, CloudMLTQParserTest, AddSchemaFieldsUpdateProcessorFactoryTest, TestWordDelimiterFilterFactory, CollectionsAPIDistributedZkTest, TestSQLHandler, DistributedIntervalFacetingTest, DocValuesTest, TestTestInjection, SliceStateTest, TestRawResponseWriter, TestFiltering, ZkCLITest, DistributedMLTComponentTest, CdcrUpdateLogTest, TestInitQParser, URLClassifyProcessorTest, HighlighterTest, TestSolrXml, FileUtilsTest, TestUpdate, TestCSVResponseWriter, HdfsWriteToMultipleCollectionsTest, EchoParamsTest, TestManagedSynonymFilterFactory, TestFreeTextSuggestions, SimpleCollectionCreateDeleteTest, IndexSchemaTest, SearchHandlerTest, LeaderFailoverAfterPartitionTest]
   [junit4] Completed [188/630 (1!)] on J1 in 64.87s, 1 test, 1 error <<< FAILURES!

[...truncated 61672 lines...]



Mime
View raw message