lucene-dev mailing list archives

Site index · List index
Message view « Date » · « Thread »
Top « Date » · « Thread »
From Policeman Jenkins Server <jenk...@thetaphi.de>
Subject [JENKINS] Lucene-Solr-5.5-Linux (64bit/jdk1.8.0_102) - Build # 365 - Unstable!
Date Fri, 02 Sep 2016 01:53:10 GMT
Build: http://jenkins.thetaphi.de/job/Lucene-Solr-5.5-Linux/365/
Java: 64bit/jdk1.8.0_102 -XX:+UseCompressedOops -XX:+UseSerialGC

1 tests failed.
FAILED:  junit.framework.TestSuite.org.apache.solr.schema.TestManagedSchemaAPI

Error Message:
ObjectTracker found 0 object(s) that were not released!!! [MockDirectoryWrapper]

Stack Trace:
java.lang.AssertionError: ObjectTracker found 0 object(s) that were not released!!! [MockDirectoryWrapper]
	at __randomizedtesting.SeedInfo.seed([92F9D8EC820FF319]:0)
	at org.junit.Assert.fail(Assert.java:93)
	at org.junit.Assert.assertTrue(Assert.java:43)
	at org.junit.Assert.assertNull(Assert.java:551)
	at org.apache.solr.SolrTestCaseJ4.afterClass(SolrTestCaseJ4.java:238)
	at sun.reflect.NativeMethodAccessorImpl.invoke0(Native Method)
	at sun.reflect.NativeMethodAccessorImpl.invoke(NativeMethodAccessorImpl.java:62)
	at sun.reflect.DelegatingMethodAccessorImpl.invoke(DelegatingMethodAccessorImpl.java:43)
	at java.lang.reflect.Method.invoke(Method.java:498)
	at com.carrotsearch.randomizedtesting.RandomizedRunner.invoke(RandomizedRunner.java:1764)
	at com.carrotsearch.randomizedtesting.RandomizedRunner$7.evaluate(RandomizedRunner.java:834)
	at com.carrotsearch.randomizedtesting.rules.StatementAdapter.evaluate(StatementAdapter.java:36)
	at com.carrotsearch.randomizedtesting.rules.SystemPropertiesRestoreRule$1.evaluate(SystemPropertiesRestoreRule.java:57)
	at org.apache.lucene.util.AbstractBeforeAfterRule$1.evaluate(AbstractBeforeAfterRule.java:45)
	at com.carrotsearch.randomizedtesting.rules.StatementAdapter.evaluate(StatementAdapter.java:36)
	at org.apache.lucene.util.TestRuleStoreClassName$1.evaluate(TestRuleStoreClassName.java:41)
	at com.carrotsearch.randomizedtesting.rules.NoShadowingOrOverridesOnMethodsRule$1.evaluate(NoShadowingOrOverridesOnMethodsRule.java:40)
	at com.carrotsearch.randomizedtesting.rules.NoShadowingOrOverridesOnMethodsRule$1.evaluate(NoShadowingOrOverridesOnMethodsRule.java:40)
	at com.carrotsearch.randomizedtesting.rules.StatementAdapter.evaluate(StatementAdapter.java:36)
	at com.carrotsearch.randomizedtesting.rules.StatementAdapter.evaluate(StatementAdapter.java:36)
	at com.carrotsearch.randomizedtesting.rules.StatementAdapter.evaluate(StatementAdapter.java:36)
	at org.apache.lucene.util.TestRuleAssertionsRequired$1.evaluate(TestRuleAssertionsRequired.java:53)
	at org.apache.lucene.util.TestRuleMarkFailure$1.evaluate(TestRuleMarkFailure.java:47)
	at org.apache.lucene.util.TestRuleIgnoreAfterMaxFailures$1.evaluate(TestRuleIgnoreAfterMaxFailures.java:64)
	at org.apache.lucene.util.TestRuleIgnoreTestSuites$1.evaluate(TestRuleIgnoreTestSuites.java:54)
	at com.carrotsearch.randomizedtesting.rules.StatementAdapter.evaluate(StatementAdapter.java:36)
	at com.carrotsearch.randomizedtesting.ThreadLeakControl$StatementRunner.run(ThreadLeakControl.java:367)
	at java.lang.Thread.run(Thread.java:745)




Build Log:
[...truncated 10639 lines...]
   [junit4] Suite: org.apache.solr.schema.TestManagedSchemaAPI
   [junit4]   2> Creating dataDir: /home/jenkins/workspace/Lucene-Solr-5.5-Linux/solr/build/solr-core/test/J2/temp/solr.schema.TestManagedSchemaAPI_92F9D8EC820FF319-001/init-core-data-001
   [junit4]   2> 5521 INFO  (SUITE-TestManagedSchemaAPI-seed#[92F9D8EC820FF319]-worker) [    ] o.a.s.SolrTestCaseJ4 Randomized ssl (false) and clientAuth (false)
   [junit4]   2> 5523 INFO  (TEST-TestManagedSchemaAPI.test-seed#[92F9D8EC820FF319]) [    ] o.a.s.SolrTestCaseJ4 ###Starting test
   [junit4]   2> 5533 INFO  (TEST-TestManagedSchemaAPI.test-seed#[92F9D8EC820FF319]) [    ] o.a.s.c.ZkTestServer STARTING ZK TEST SERVER
   [junit4]   2> 5535 INFO  (Thread-23) [    ] o.a.s.c.ZkTestServer client port:0.0.0.0/0.0.0.0:0
   [junit4]   2> 5535 INFO  (Thread-23) [    ] o.a.s.c.ZkTestServer Starting server
   [junit4]   2> 5635 INFO  (TEST-TestManagedSchemaAPI.test-seed#[92F9D8EC820FF319]) [    ] o.a.s.c.ZkTestServer start zk server on port:45746
   [junit4]   2> 5651 INFO  (TEST-TestManagedSchemaAPI.test-seed#[92F9D8EC820FF319]) [    ] o.a.s.c.c.SolrZkClient Using default ZkCredentialsProvider
   [junit4]   2> 5743 INFO  (TEST-TestManagedSchemaAPI.test-seed#[92F9D8EC820FF319]) [    ] o.a.s.c.c.ConnectionManager Waiting for client to connect to ZooKeeper
   [junit4]   2> 5769 INFO  (zkCallback-8-thread-1) [    ] o.a.s.c.c.ConnectionManager Watcher org.apache.solr.common.cloud.ConnectionManager@6e80e9b3 name:ZooKeeperConnection Watcher:127.0.0.1:45746 got event WatchedEvent state:SyncConnected type:None path:null path:null type:None
   [junit4]   2> 5769 INFO  (TEST-TestManagedSchemaAPI.test-seed#[92F9D8EC820FF319]) [    ] o.a.s.c.c.ConnectionManager Client is connected to ZooKeeper
   [junit4]   2> 5769 INFO  (TEST-TestManagedSchemaAPI.test-seed#[92F9D8EC820FF319]) [    ] o.a.s.c.c.SolrZkClient Using default ZkACLProvider
   [junit4]   2> 5770 INFO  (TEST-TestManagedSchemaAPI.test-seed#[92F9D8EC820FF319]) [    ] o.a.s.c.c.SolrZkClient makePath: /solr/solr.xml
   [junit4]   2> 5792 INFO  (jetty-launcher-7-thread-2) [    ] o.e.j.s.Server jetty-9.2.13.v20150730
   [junit4]   2> 5792 INFO  (jetty-launcher-7-thread-1) [    ] o.e.j.s.Server jetty-9.2.13.v20150730
   [junit4]   2> 5796 INFO  (jetty-launcher-7-thread-2) [    ] o.e.j.s.h.ContextHandler Started o.e.j.s.ServletContextHandler@597d3e76{/solr,null,AVAILABLE}
   [junit4]   2> 5796 INFO  (jetty-launcher-7-thread-1) [    ] o.e.j.s.h.ContextHandler Started o.e.j.s.ServletContextHandler@19400f1a{/solr,null,AVAILABLE}
   [junit4]   2> 5799 INFO  (jetty-launcher-7-thread-1) [    ] o.e.j.s.ServerConnector Started ServerConnector@36b3b94f{HTTP/1.1}{127.0.0.1:36999}
   [junit4]   2> 5799 INFO  (jetty-launcher-7-thread-1) [    ] o.e.j.s.Server Started @7607ms
   [junit4]   2> 5799 INFO  (jetty-launcher-7-thread-1) [    ] o.a.s.c.s.e.JettySolrRunner Jetty properties: {hostContext=/solr, hostPort=36999}
   [junit4]   2> 5799 INFO  (jetty-launcher-7-thread-2) [    ] o.e.j.s.ServerConnector Started ServerConnector@65942ef3{HTTP/1.1}{127.0.0.1:44847}
   [junit4]   2> 5799 INFO  (jetty-launcher-7-thread-2) [    ] o.e.j.s.Server Started @7607ms
   [junit4]   2> 5800 INFO  (jetty-launcher-7-thread-2) [    ] o.a.s.c.s.e.JettySolrRunner Jetty properties: {hostContext=/solr, hostPort=44847}
   [junit4]   2> 5800 INFO  (jetty-launcher-7-thread-1) [    ] o.a.s.s.SolrDispatchFilter SolrDispatchFilter.init(): sun.misc.Launcher$AppClassLoader@73d16e93
   [junit4]   2> 5800 INFO  (jetty-launcher-7-thread-1) [    ] o.a.s.c.SolrResourceLoader new SolrResourceLoader for directory: '/home/jenkins/workspace/Lucene-Solr-5.5-Linux/solr/build/solr-core/test/J2/temp/solr.schema.TestManagedSchemaAPI_92F9D8EC820FF319-001/tempDir-001/node1'
   [junit4]   2> 5800 INFO  (jetty-launcher-7-thread-2) [    ] o.a.s.s.SolrDispatchFilter SolrDispatchFilter.init(): sun.misc.Launcher$AppClassLoader@73d16e93
   [junit4]   2> 5800 INFO  (jetty-launcher-7-thread-1) [    ] o.a.s.c.SolrResourceLoader JNDI not configured for solr (NoInitialContextEx)
   [junit4]   2> 5800 INFO  (jetty-launcher-7-thread-2) [    ] o.a.s.c.SolrResourceLoader new SolrResourceLoader for directory: '/home/jenkins/workspace/Lucene-Solr-5.5-Linux/solr/build/solr-core/test/J2/temp/solr.schema.TestManagedSchemaAPI_92F9D8EC820FF319-001/tempDir-001/node2'
   [junit4]   2> 5800 INFO  (jetty-launcher-7-thread-1) [    ] o.a.s.c.SolrResourceLoader solr home defaulted to 'solr/' (could not find system property or JNDI)
   [junit4]   2> 5800 INFO  (jetty-launcher-7-thread-2) [    ] o.a.s.c.SolrResourceLoader JNDI not configured for solr (NoInitialContextEx)
   [junit4]   2> 5800 INFO  (jetty-launcher-7-thread-2) [    ] o.a.s.c.SolrResourceLoader solr home defaulted to 'solr/' (could not find system property or JNDI)
   [junit4]   2> 5800 INFO  (jetty-launcher-7-thread-1) [    ] o.a.s.c.c.SolrZkClient Using default ZkCredentialsProvider
   [junit4]   2> 5801 INFO  (jetty-launcher-7-thread-2) [    ] o.a.s.c.c.SolrZkClient Using default ZkCredentialsProvider
   [junit4]   2> 5801 INFO  (jetty-launcher-7-thread-2) [    ] o.a.s.c.c.ConnectionManager Waiting for client to connect to ZooKeeper
   [junit4]   2> 5801 INFO  (jetty-launcher-7-thread-1) [    ] o.a.s.c.c.ConnectionManager Waiting for client to connect to ZooKeeper
   [junit4]   2> 5804 INFO  (zkCallback-9-thread-1) [    ] o.a.s.c.c.ConnectionManager Watcher org.apache.solr.common.cloud.ConnectionManager@726e0753 name:ZooKeeperConnection Watcher:127.0.0.1:45746/solr got event WatchedEvent state:SyncConnected type:None path:null path:null type:None
   [junit4]   2> 5804 INFO  (jetty-launcher-7-thread-1) [    ] o.a.s.c.c.ConnectionManager Client is connected to ZooKeeper
   [junit4]   2> 5805 INFO  (jetty-launcher-7-thread-1) [    ] o.a.s.c.c.SolrZkClient Using default ZkACLProvider
   [junit4]   2> 5805 INFO  (zkCallback-10-thread-1) [    ] o.a.s.c.c.ConnectionManager Watcher org.apache.solr.common.cloud.ConnectionManager@682e5378 name:ZooKeeperConnection Watcher:127.0.0.1:45746/solr got event WatchedEvent state:SyncConnected type:None path:null path:null type:None
   [junit4]   2> 5805 INFO  (jetty-launcher-7-thread-2) [    ] o.a.s.c.c.ConnectionManager Client is connected to ZooKeeper
   [junit4]   2> 5805 INFO  (jetty-launcher-7-thread-2) [    ] o.a.s.c.c.SolrZkClient Using default ZkACLProvider
   [junit4]   2> 5806 INFO  (jetty-launcher-7-thread-1) [    ] o.a.s.s.SolrDispatchFilter solr.xml found in ZooKeeper. Loading...
   [junit4]   2> 5806 INFO  (jetty-launcher-7-thread-2) [    ] o.a.s.s.SolrDispatchFilter solr.xml found in ZooKeeper. Loading...
   [junit4]   2> 5817 INFO  (jetty-launcher-7-thread-2) [    ] o.a.s.c.CorePropertiesLocator Config-defined core root directory: /home/jenkins/workspace/Lucene-Solr-5.5-Linux/solr/build/solr-core/test/J2/temp/solr.schema.TestManagedSchemaAPI_92F9D8EC820FF319-001/tempDir-001/node2/.
   [junit4]   2> 5817 INFO  (jetty-launcher-7-thread-1) [    ] o.a.s.c.CorePropertiesLocator Config-defined core root directory: /home/jenkins/workspace/Lucene-Solr-5.5-Linux/solr/build/solr-core/test/J2/temp/solr.schema.TestManagedSchemaAPI_92F9D8EC820FF319-001/tempDir-001/node1/.
   [junit4]   2> 5817 INFO  (jetty-launcher-7-thread-2) [    ] o.a.s.c.CoreContainer New CoreContainer 1761678159
   [junit4]   2> 5817 INFO  (jetty-launcher-7-thread-2) [    ] o.a.s.c.CoreContainer Loading cores into CoreContainer [instanceDir=/home/jenkins/workspace/Lucene-Solr-5.5-Linux/solr/build/solr-core/test/J2/temp/solr.schema.TestManagedSchemaAPI_92F9D8EC820FF319-001/tempDir-001/node2]
   [junit4]   2> 5817 INFO  (jetty-launcher-7-thread-1) [    ] o.a.s.c.CoreContainer New CoreContainer 609019909
   [junit4]   2> 5817 INFO  (jetty-launcher-7-thread-1) [    ] o.a.s.c.CoreContainer Loading cores into CoreContainer [instanceDir=/home/jenkins/workspace/Lucene-Solr-5.5-Linux/solr/build/solr-core/test/J2/temp/solr.schema.TestManagedSchemaAPI_92F9D8EC820FF319-001/tempDir-001/node1]
   [junit4]   2> 5817 WARN  (jetty-launcher-7-thread-2) [    ] o.a.s.c.CoreContainer Couldn't add files from /home/jenkins/workspace/Lucene-Solr-5.5-Linux/solr/build/solr-core/test/J2/temp/solr.schema.TestManagedSchemaAPI_92F9D8EC820FF319-001/tempDir-001/node2/lib to classpath: /home/jenkins/workspace/Lucene-Solr-5.5-Linux/solr/build/solr-core/test/J2/temp/solr.schema.TestManagedSchemaAPI_92F9D8EC820FF319-001/tempDir-001/node2/lib
   [junit4]   2> 5817 WARN  (jetty-launcher-7-thread-1) [    ] o.a.s.c.CoreContainer Couldn't add files from /home/jenkins/workspace/Lucene-Solr-5.5-Linux/solr/build/solr-core/test/J2/temp/solr.schema.TestManagedSchemaAPI_92F9D8EC820FF319-001/tempDir-001/node1/lib to classpath: /home/jenkins/workspace/Lucene-Solr-5.5-Linux/solr/build/solr-core/test/J2/temp/solr.schema.TestManagedSchemaAPI_92F9D8EC820FF319-001/tempDir-001/node1/lib
   [junit4]   2> 5817 INFO  (jetty-launcher-7-thread-2) [    ] o.a.s.h.c.HttpShardHandlerFactory created with socketTimeout : 90000,urlScheme : ,connTimeout : 15000,maxConnectionsPerHost : 20,maxConnections : 10000,corePoolSize : 0,maximumPoolSize : 2147483647,maxThreadIdleTime : 5,sizeOfQueue : -1,fairnessPolicy : false,useRetries : false,connectionsEvictorSleepDelay : 5000,maxConnectionIdleTime : 40000,
   [junit4]   2> 5817 INFO  (jetty-launcher-7-thread-1) [    ] o.a.s.h.c.HttpShardHandlerFactory created with socketTimeout : 90000,urlScheme : ,connTimeout : 15000,maxConnectionsPerHost : 20,maxConnections : 10000,corePoolSize : 0,maximumPoolSize : 2147483647,maxThreadIdleTime : 5,sizeOfQueue : -1,fairnessPolicy : false,useRetries : false,connectionsEvictorSleepDelay : 5000,maxConnectionIdleTime : 40000,
   [junit4]   2> 5818 WARN  (NIOServerCxn.Factory:0.0.0.0/0.0.0.0:0) [    ] o.a.z.s.NIOServerCnxn caught end of stream exception
   [junit4]   2> EndOfStreamException: Unable to read additional data from client sessionid 0x156e86f78610001, likely client has closed socket
   [junit4]   2> 	at org.apache.zookeeper.server.NIOServerCnxn.doIO(NIOServerCnxn.java:228)
   [junit4]   2> 	at org.apache.zookeeper.server.NIOServerCnxnFactory.run(NIOServerCnxnFactory.java:208)
   [junit4]   2> 	at java.lang.Thread.run(Thread.java:745)
   [junit4]   2> 5819 INFO  (jetty-launcher-7-thread-2) [    ] o.a.s.u.UpdateShardHandler Creating UpdateShardHandler HTTP client with params: socketTimeout=340000&connTimeout=45000&retry=true
   [junit4]   2> 5818 INFO  (jetty-launcher-7-thread-1) [    ] o.a.s.u.UpdateShardHandler Creating UpdateShardHandler HTTP client with params: socketTimeout=340000&connTimeout=45000&retry=true
   [junit4]   2> 5820 INFO  (jetty-launcher-7-thread-2) [    ] o.a.s.l.LogWatcher SLF4J impl is org.slf4j.impl.Log4jLoggerFactory
   [junit4]   2> 5820 INFO  (jetty-launcher-7-thread-1) [    ] o.a.s.l.LogWatcher SLF4J impl is org.slf4j.impl.Log4jLoggerFactory
   [junit4]   2> 5820 INFO  (jetty-launcher-7-thread-2) [    ] o.a.s.l.LogWatcher Registering Log Listener [Log4j (org.slf4j.impl.Log4jLoggerFactory)]
   [junit4]   2> 5821 INFO  (jetty-launcher-7-thread-1) [    ] o.a.s.l.LogWatcher Registering Log Listener [Log4j (org.slf4j.impl.Log4jLoggerFactory)]
   [junit4]   2> 5821 INFO  (jetty-launcher-7-thread-2) [    ] o.a.s.c.ZkContainer Zookeeper client=127.0.0.1:45746/solr
   [junit4]   2> 5821 INFO  (jetty-launcher-7-thread-1) [    ] o.a.s.c.ZkContainer Zookeeper client=127.0.0.1:45746/solr
   [junit4]   2> 5832 INFO  (jetty-launcher-7-thread-2) [    ] o.a.s.c.ZkController zkHost includes chroot
   [junit4]   2> 5832 INFO  (jetty-launcher-7-thread-1) [    ] o.a.s.c.ZkController zkHost includes chroot
   [junit4]   2> 5833 INFO  (jetty-launcher-7-thread-2) [    ] o.a.s.c.c.SolrZkClient Using default ZkCredentialsProvider
   [junit4]   2> 5833 INFO  (jetty-launcher-7-thread-1) [    ] o.a.s.c.c.SolrZkClient Using default ZkCredentialsProvider
   [junit4]   2> 5833 INFO  (jetty-launcher-7-thread-2) [    ] o.a.s.c.c.ConnectionManager Waiting for client to connect to ZooKeeper
   [junit4]   2> 5833 INFO  (jetty-launcher-7-thread-1) [    ] o.a.s.c.c.ConnectionManager Waiting for client to connect to ZooKeeper
   [junit4]   2> 5835 INFO  (zkCallback-16-thread-1) [    ] o.a.s.c.c.ConnectionManager Watcher org.apache.solr.common.cloud.ConnectionManager@3870d67e name:ZooKeeperConnection Watcher:127.0.0.1:45746 got event WatchedEvent state:SyncConnected type:None path:null path:null type:None
   [junit4]   2> 5835 INFO  (jetty-launcher-7-thread-1) [    ] o.a.s.c.c.ConnectionManager Client is connected to ZooKeeper
   [junit4]   2> 5835 INFO  (jetty-launcher-7-thread-1) [    ] o.a.s.c.c.SolrZkClient Using default ZkACLProvider
   [junit4]   2> 5836 INFO  (zkCallback-15-thread-1) [    ] o.a.s.c.c.ConnectionManager Watcher org.apache.solr.common.cloud.ConnectionManager@550d17d8 name:ZooKeeperConnection Watcher:127.0.0.1:45746 got event WatchedEvent state:SyncConnected type:None path:null path:null type:None
   [junit4]   2> 5836 INFO  (jetty-launcher-7-thread-2) [    ] o.a.s.c.c.ConnectionManager Client is connected to ZooKeeper
   [junit4]   2> 5836 INFO  (jetty-launcher-7-thread-2) [    ] o.a.s.c.c.SolrZkClient Using default ZkACLProvider
   [junit4]   2> 5840 INFO  (jetty-launcher-7-thread-2) [n:127.0.0.1:44847_solr    ] o.a.s.c.ZkController Added new OnReconnect listener org.apache.solr.cloud.ZkController$6@62cd9d09
   [junit4]   2> 5840 INFO  (jetty-launcher-7-thread-1) [n:127.0.0.1:36999_solr    ] o.a.s.c.ZkController Added new OnReconnect listener org.apache.solr.cloud.ZkController$6@26145448
   [junit4]   2> 5842 INFO  (jetty-launcher-7-thread-2) [n:127.0.0.1:44847_solr    ] o.a.s.c.c.ConnectionManager Waiting for client to connect to ZooKeeper
   [junit4]   2> 5842 INFO  (jetty-launcher-7-thread-1) [n:127.0.0.1:36999_solr    ] o.a.s.c.c.ConnectionManager Waiting for client to connect to ZooKeeper
   [junit4]   2> 5844 INFO  (zkCallback-17-thread-1-processing-n:127.0.0.1:44847_solr) [n:127.0.0.1:44847_solr    ] o.a.s.c.c.ConnectionManager Watcher org.apache.solr.common.cloud.ConnectionManager@bc87802 name:ZooKeeperConnection Watcher:127.0.0.1:45746/solr got event WatchedEvent state:SyncConnected type:None path:null path:null type:None
   [junit4]   2> 5844 INFO  (jetty-launcher-7-thread-2) [n:127.0.0.1:44847_solr    ] o.a.s.c.c.ConnectionManager Client is connected to ZooKeeper
   [junit4]   2> 5844 INFO  (zkCallback-18-thread-1-processing-n:127.0.0.1:36999_solr) [n:127.0.0.1:36999_solr    ] o.a.s.c.c.ConnectionManager Watcher org.apache.solr.common.cloud.ConnectionManager@64ac2284 name:ZooKeeperConnection Watcher:127.0.0.1:45746/solr got event WatchedEvent state:SyncConnected type:None path:null path:null type:None
   [junit4]   2> 5844 INFO  (jetty-launcher-7-thread-1) [n:127.0.0.1:36999_solr    ] o.a.s.c.c.ConnectionManager Client is connected to ZooKeeper
   [junit4]   2> 5851 INFO  (jetty-launcher-7-thread-2) [n:127.0.0.1:44847_solr    ] o.a.s.c.c.SolrZkClient makePath: /overseer/queue
   [junit4]   2> 5852 INFO  (jetty-launcher-7-thread-1) [n:127.0.0.1:36999_solr    ] o.a.s.c.c.SolrZkClient makePath: /overseer/queue
   [junit4]   2> 5855 INFO  (jetty-launcher-7-thread-2) [n:127.0.0.1:44847_solr    ] o.a.s.c.c.SolrZkClient makePath: /overseer/collection-queue-work
   [junit4]   2> 5855 INFO  (jetty-launcher-7-thread-1) [n:127.0.0.1:36999_solr    ] o.a.s.c.c.SolrZkClient makePath: /overseer/collection-queue-work
   [junit4]   2> 5859 INFO  (jetty-launcher-7-thread-2) [n:127.0.0.1:44847_solr    ] o.a.s.c.c.SolrZkClient makePath: /overseer/collection-map-running
   [junit4]   2> 5859 INFO  (jetty-launcher-7-thread-1) [n:127.0.0.1:36999_solr    ] o.a.s.c.c.SolrZkClient makePath: /overseer/collection-map-running
   [junit4]   2> 5862 INFO  (jetty-launcher-7-thread-2) [n:127.0.0.1:44847_solr    ] o.a.s.c.c.SolrZkClient makePath: /overseer/collection-map-completed
   [junit4]   2> 5862 INFO  (jetty-launcher-7-thread-1) [n:127.0.0.1:36999_solr    ] o.a.s.c.c.SolrZkClient makePath: /overseer/collection-map-completed
   [junit4]   2> 5865 INFO  (jetty-launcher-7-thread-1) [n:127.0.0.1:36999_solr    ] o.a.s.c.c.SolrZkClient makePath: /overseer/collection-map-failure
   [junit4]   2> 5865 INFO  (jetty-launcher-7-thread-2) [n:127.0.0.1:44847_solr    ] o.a.s.c.c.SolrZkClient makePath: /overseer/collection-map-failure
   [junit4]   2> 5872 INFO  (jetty-launcher-7-thread-2) [n:127.0.0.1:44847_solr    ] o.a.s.c.c.SolrZkClient makePath: /live_nodes
   [junit4]   2> 5872 INFO  (jetty-launcher-7-thread-1) [n:127.0.0.1:36999_solr    ] o.a.s.c.c.SolrZkClient makePath: /live_nodes
   [junit4]   2> 5873 INFO  (jetty-launcher-7-thread-1) [n:127.0.0.1:36999_solr    ] o.a.s.c.c.SolrZkClient makePath: /collections
   [junit4]   2> 5873 INFO  (jetty-launcher-7-thread-2) [n:127.0.0.1:44847_solr    ] o.a.s.c.c.SolrZkClient makePath: /collections
   [junit4]   2> 5874 INFO  (jetty-launcher-7-thread-2) [n:127.0.0.1:44847_solr    ] o.a.s.c.c.SolrZkClient makePath: /aliases.json
   [junit4]   2> 5874 INFO  (jetty-launcher-7-thread-1) [n:127.0.0.1:36999_solr    ] o.a.s.c.c.SolrZkClient makePath: /aliases.json
   [junit4]   2> 5876 INFO  (jetty-launcher-7-thread-1) [n:127.0.0.1:36999_solr    ] o.a.s.c.c.SolrZkClient makePath: /clusterstate.json
   [junit4]   2> 5876 INFO  (jetty-launcher-7-thread-2) [n:127.0.0.1:44847_solr    ] o.a.s.c.c.SolrZkClient makePath: /clusterstate.json
   [junit4]   2> 5877 INFO  (jetty-launcher-7-thread-2) [n:127.0.0.1:44847_solr    ] o.a.s.c.c.SolrZkClient makePath: /security.json
   [junit4]   2> 5878 INFO  (jetty-launcher-7-thread-1) [n:127.0.0.1:36999_solr    ] o.a.s.c.c.SolrZkClient makePath: /security.json
   [junit4]   2> 5878 INFO  (jetty-launcher-7-thread-2) [n:127.0.0.1:44847_solr    ] o.a.s.c.ZkController Register node as live in ZooKeeper:/live_nodes/127.0.0.1:44847_solr
   [junit4]   2> 5879 INFO  (jetty-launcher-7-thread-1) [n:127.0.0.1:36999_solr    ] o.a.s.c.ZkController Register node as live in ZooKeeper:/live_nodes/127.0.0.1:36999_solr
   [junit4]   2> 5880 INFO  (jetty-launcher-7-thread-2) [n:127.0.0.1:44847_solr    ] o.a.s.c.c.SolrZkClient makePath: /live_nodes/127.0.0.1:44847_solr
   [junit4]   2> 5880 INFO  (jetty-launcher-7-thread-1) [n:127.0.0.1:36999_solr    ] o.a.s.c.c.SolrZkClient makePath: /live_nodes/127.0.0.1:36999_solr
   [junit4]   2> 5884 INFO  (jetty-launcher-7-thread-2) [n:127.0.0.1:44847_solr    ] o.a.s.c.c.SolrZkClient makePath: /overseer_elect
   [junit4]   2> 5884 INFO  (jetty-launcher-7-thread-1) [n:127.0.0.1:36999_solr    ] o.a.s.c.c.SolrZkClient makePath: /overseer_elect
   [junit4]   2> 5885 INFO  (jetty-launcher-7-thread-1) [n:127.0.0.1:36999_solr    ] o.a.s.c.c.SolrZkClient makePath: /overseer_elect/election
   [junit4]   2> 5885 INFO  (jetty-launcher-7-thread-2) [n:127.0.0.1:44847_solr    ] o.a.s.c.c.SolrZkClient makePath: /overseer_elect/election
   [junit4]   2> 5887 INFO  (jetty-launcher-7-thread-2) [n:127.0.0.1:44847_solr    ] o.a.s.c.Overseer Overseer (id=null) closing
   [junit4]   2> 5887 INFO  (jetty-launcher-7-thread-1) [n:127.0.0.1:36999_solr    ] o.a.s.c.Overseer Overseer (id=null) closing
   [junit4]   2> 5888 INFO  (jetty-launcher-7-thread-2) [n:127.0.0.1:44847_solr    ] o.a.s.c.LeaderElector Joined leadership election with path: /overseer_elect/election/96520007493681157-127.0.0.1:44847_solr-n_0000000000
   [junit4]   2> 5888 INFO  (jetty-launcher-7-thread-1) [n:127.0.0.1:36999_solr    ] o.a.s.c.LeaderElector Joined leadership election with path: /overseer_elect/election/96520007493681158-127.0.0.1:36999_solr-n_0000000001
   [junit4]   2> 5891 INFO  (jetty-launcher-7-thread-2) [n:127.0.0.1:44847_solr    ] o.a.s.c.OverseerElectionContext I am going to be the leader 127.0.0.1:44847_solr
   [junit4]   2> 5892 INFO  (jetty-launcher-7-thread-1) [n:127.0.0.1:36999_solr    ] o.a.s.c.LeaderElector Watching path /overseer_elect/election/96520007493681157-127.0.0.1:44847_solr-n_0000000000 to know if I could be the leader
   [junit4]   2> 5893 INFO  (jetty-launcher-7-thread-1) [n:127.0.0.1:36999_solr    ] o.a.s.c.c.ZkStateReader Updating cluster state from ZooKeeper... 
   [junit4]   2> 5893 INFO  (jetty-launcher-7-thread-2) [n:127.0.0.1:44847_solr    ] o.a.s.c.c.SolrZkClient makePath: /overseer_elect/leader
   [junit4]   2> 5894 INFO  (jetty-launcher-7-thread-2) [n:127.0.0.1:44847_solr    ] o.a.s.c.Overseer Overseer (id=96520007493681157-127.0.0.1:44847_solr-n_0000000000) starting
   [junit4]   2> 5900 INFO  (jetty-launcher-7-thread-2) [n:127.0.0.1:44847_solr    ] o.a.s.c.c.SolrZkClient makePath: /overseer/queue-work
   [junit4]   2> 5919 INFO  (jetty-launcher-7-thread-2) [n:127.0.0.1:44847_solr    ] o.a.s.c.OverseerAutoReplicaFailoverThread Starting OverseerAutoReplicaFailoverThread autoReplicaFailoverWorkLoopDelay=10000 autoReplicaFailoverWaitAfterExpiration=30000 autoReplicaFailoverBadNodeExpiration=60000
   [junit4]   2> 5921 INFO  (jetty-launcher-7-thread-2) [n:127.0.0.1:44847_solr    ] o.a.s.c.c.ZkStateReader Updating cluster state from ZooKeeper... 
   [junit4]   2> 5922 INFO  (OverseerCollectionConfigSetProcessor-96520007493681157-127.0.0.1:44847_solr-n_0000000000) [n:127.0.0.1:44847_solr    ] o.a.s.c.OverseerTaskProcessor Process current queue of overseer operations
   [junit4]   2> 5924 INFO  (OverseerStateUpdate-96520007493681157-127.0.0.1:44847_solr-n_0000000000) [n:127.0.0.1:44847_solr    ] o.a.s.c.Overseer Starting to work on the main queue
   [junit4]   2> 5987 INFO  (jetty-launcher-7-thread-2) [n:127.0.0.1:44847_solr    ] o.a.s.c.CoreContainer Security conf doesn't exist. Skipping setup for authorization module.
   [junit4]   2> 5987 INFO  (jetty-launcher-7-thread-2) [n:127.0.0.1:44847_solr    ] o.a.s.c.CoreContainer No authentication plugin used.
   [junit4]   2> 5988 INFO  (jetty-launcher-7-thread-2) [n:127.0.0.1:44847_solr    ] o.a.s.c.CorePropertiesLocator Looking for core definitions underneath /home/jenkins/workspace/Lucene-Solr-5.5-Linux/solr/build/solr-core/test/J2/temp/solr.schema.TestManagedSchemaAPI_92F9D8EC820FF319-001/tempDir-001/node2/.
   [junit4]   2> 5988 INFO  (jetty-launcher-7-thread-2) [n:127.0.0.1:44847_solr    ] o.a.s.c.CorePropertiesLocator Found 0 core definitions
   [junit4]   2> 5991 INFO  (jetty-launcher-7-thread-2) [n:127.0.0.1:44847_solr    ] o.a.s.s.SolrDispatchFilter user.dir=/home/jenkins/workspace/Lucene-Solr-5.5-Linux/solr/build/solr-core/test/J2
   [junit4]   2> 5991 INFO  (jetty-launcher-7-thread-2) [n:127.0.0.1:44847_solr    ] o.a.s.s.SolrDispatchFilter SolrDispatchFilter.init() done
   [junit4]   2> 5994 INFO  (jetty-launcher-7-thread-1) [n:127.0.0.1:36999_solr    ] o.a.s.c.CoreContainer Security conf doesn't exist. Skipping setup for authorization module.
   [junit4]   2> 5994 INFO  (jetty-launcher-7-thread-1) [n:127.0.0.1:36999_solr    ] o.a.s.c.CoreContainer No authentication plugin used.
   [junit4]   2> 5996 INFO  (jetty-launcher-7-thread-1) [n:127.0.0.1:36999_solr    ] o.a.s.c.CorePropertiesLocator Looking for core definitions underneath /home/jenkins/workspace/Lucene-Solr-5.5-Linux/solr/build/solr-core/test/J2/temp/solr.schema.TestManagedSchemaAPI_92F9D8EC820FF319-001/tempDir-001/node1/.
   [junit4]   2> 5996 INFO  (jetty-launcher-7-thread-1) [n:127.0.0.1:36999_solr    ] o.a.s.c.CorePropertiesLocator Found 0 core definitions
   [junit4]   2> 5997 INFO  (jetty-launcher-7-thread-1) [n:127.0.0.1:36999_solr    ] o.a.s.s.SolrDispatchFilter user.dir=/home/jenkins/workspace/Lucene-Solr-5.5-Linux/solr/build/solr-core/test/J2
   [junit4]   2> 5997 INFO  (jetty-launcher-7-thread-1) [n:127.0.0.1:36999_solr    ] o.a.s.s.SolrDispatchFilter SolrDispatchFilter.init() done
   [junit4]   2> 5997 INFO  (TEST-TestManagedSchemaAPI.test-seed#[92F9D8EC820FF319]) [    ] o.a.s.c.c.SolrZkClient Using default ZkCredentialsProvider
   [junit4]   2> 5998 INFO  (TEST-TestManagedSchemaAPI.test-seed#[92F9D8EC820FF319]) [    ] o.a.s.c.c.ConnectionManager Waiting for client to connect to ZooKeeper
   [junit4]   2> 5999 INFO  (zkCallback-19-thread-1) [    ] o.a.s.c.c.ConnectionManager Watcher org.apache.solr.common.cloud.ConnectionManager@532e9b16 name:ZooKeeperConnection Watcher:127.0.0.1:45746 got event WatchedEvent state:SyncConnected type:None path:null path:null type:None
   [junit4]   2> 5999 INFO  (TEST-TestManagedSchemaAPI.test-seed#[92F9D8EC820FF319]) [    ] o.a.s.c.c.ConnectionManager Client is connected to ZooKeeper
   [junit4]   2> 6000 INFO  (TEST-TestManagedSchemaAPI.test-seed#[92F9D8EC820FF319]) [    ] o.a.s.c.c.SolrZkClient Using default ZkACLProvider
   [junit4]   2> 6005 INFO  (TEST-TestManagedSchemaAPI.test-seed#[92F9D8EC820FF319]) [    ] o.a.s.c.c.SolrZkClient Using default ZkCredentialsProvider
   [junit4]   2> 6005 INFO  (TEST-TestManagedSchemaAPI.test-seed#[92F9D8EC820FF319]) [    ] o.a.s.c.c.ConnectionManager Waiting for client to connect to ZooKeeper
   [junit4]   2> 6008 INFO  (zkCallback-21-thread-1) [    ] o.a.s.c.c.ConnectionManager Watcher org.apache.solr.common.cloud.ConnectionManager@5ecdd049 name:ZooKeeperConnection Watcher:127.0.0.1:45746/solr got event WatchedEvent state:SyncConnected type:None path:null path:null type:None
   [junit4]   2> 6008 INFO  (TEST-TestManagedSchemaAPI.test-seed#[92F9D8EC820FF319]) [    ] o.a.s.c.c.ConnectionManager Client is connected to ZooKeeper
   [junit4]   2> 6008 INFO  (TEST-TestManagedSchemaAPI.test-seed#[92F9D8EC820FF319]) [    ] o.a.s.c.c.SolrZkClient Using default ZkACLProvider
   [junit4]   2> 6009 INFO  (TEST-TestManagedSchemaAPI.test-seed#[92F9D8EC820FF319]) [    ] o.a.s.c.c.SolrZkClient makePath: /configs/conf1/solrconfig.xml
   [junit4]   2> 6012 INFO  (TEST-TestManagedSchemaAPI.test-seed#[92F9D8EC820FF319]) [    ] o.a.s.c.c.SolrZkClient makePath: /configs/conf1/managed-schema
   [junit4]   2> 6015 INFO  (TEST-TestManagedSchemaAPI.test-seed#[92F9D8EC820FF319]) [    ] o.a.s.c.c.SolrZkClient Using default ZkCredentialsProvider
   [junit4]   2> 6016 INFO  (TEST-TestManagedSchemaAPI.test-seed#[92F9D8EC820FF319]) [    ] o.a.s.c.c.ConnectionManager Waiting for client to connect to ZooKeeper
   [junit4]   2> 6017 INFO  (zkCallback-22-thread-1) [    ] o.a.s.c.c.ConnectionManager Watcher org.apache.solr.common.cloud.ConnectionManager@626ae52a name:ZooKeeperConnection Watcher:127.0.0.1:45746/solr got event WatchedEvent state:SyncConnected type:None path:null path:null type:None
   [junit4]   2> 6017 INFO  (TEST-TestManagedSchemaAPI.test-seed#[92F9D8EC820FF319]) [    ] o.a.s.c.c.ConnectionManager Client is connected to ZooKeeper
   [junit4]   2> 6017 INFO  (TEST-TestManagedSchemaAPI.test-seed#[92F9D8EC820FF319]) [    ] o.a.s.c.c.SolrZkClient Using default ZkACLProvider
   [junit4]   2> 6018 INFO  (TEST-TestManagedSchemaAPI.test-seed#[92F9D8EC820FF319]) [    ] o.a.s.c.c.ZkStateReader Updating cluster state from ZooKeeper... 
   [junit4]   2> 6048 INFO  (qtp1485363372-81) [n:127.0.0.1:44847_solr    ] o.a.s.h.a.CollectionsHandler Invoked Collection Action :create with params replicationFactor=2&collection.configName=conf1&name=testschemaapi&action=CREATE&numShards=1&wt=javabin&version=2 and sendToOCPQueue=true
   [junit4]   2> 6061 INFO  (OverseerCollectionConfigSetProcessor-96520007493681157-127.0.0.1:44847_solr-n_0000000000) [n:127.0.0.1:44847_solr    ] o.a.s.c.OverseerTaskProcessor Overseer Collection Message Handler: Get the message id:/overseer/collection-queue-work/qn-0000000000 message:{
   [junit4]   2>   "name":"testschemaapi",
   [junit4]   2>   "fromApi":"true",
   [junit4]   2>   "replicationFactor":"2",
   [junit4]   2>   "collection.configName":"conf1",
   [junit4]   2>   "numShards":"1",
   [junit4]   2>   "stateFormat":"2",
   [junit4]   2>   "operation":"create"}
   [junit4]   2> 6070 INFO  (OverseerThreadFactory-47-thread-1-processing-n:127.0.0.1:44847_solr) [n:127.0.0.1:44847_solr    ] o.a.s.c.OverseerCollectionMessageHandler OverseerCollectionMessageHandler.processMessage : create , {
   [junit4]   2>   "name":"testschemaapi",
   [junit4]   2>   "fromApi":"true",
   [junit4]   2>   "replicationFactor":"2",
   [junit4]   2>   "collection.configName":"conf1",
   [junit4]   2>   "numShards":"1",
   [junit4]   2>   "stateFormat":"2",
   [junit4]   2>   "operation":"create"}
   [junit4]   2> 6078 INFO  (OverseerThreadFactory-47-thread-1-processing-n:127.0.0.1:44847_solr) [n:127.0.0.1:44847_solr    ] o.a.s.c.OverseerCollectionMessageHandler Create collection testschemaapi
   [junit4]   2> 6083 INFO  (OverseerThreadFactory-47-thread-1-processing-n:127.0.0.1:44847_solr) [n:127.0.0.1:44847_solr    ] o.a.s.c.OverseerCollectionMessageHandler creating collections conf node /collections/testschemaapi 
   [junit4]   2> 6084 INFO  (OverseerThreadFactory-47-thread-1-processing-n:127.0.0.1:44847_solr) [n:127.0.0.1:44847_solr    ] o.a.s.c.c.SolrZkClient makePath: /collections/testschemaapi
   [junit4]   2> 6085 INFO  (zkCallback-17-thread-1-processing-n:127.0.0.1:44847_solr) [n:127.0.0.1:44847_solr    ] o.a.s.c.c.ZkStateReader A collections change: [WatchedEvent state:SyncConnected type:NodeChildrenChanged path:/collections], has occurred - updating...
   [junit4]   2> 6085 INFO  (zkCallback-18-thread-1-processing-n:127.0.0.1:36999_solr) [n:127.0.0.1:36999_solr    ] o.a.s.c.c.ZkStateReader A collections change: [WatchedEvent state:SyncConnected type:NodeChildrenChanged path:/collections], has occurred - updating...
   [junit4]   2> 6085 INFO  (zkCallback-22-thread-1) [    ] o.a.s.c.c.ZkStateReader A collections change: [WatchedEvent state:SyncConnected type:NodeChildrenChanged path:/collections], has occurred - updating...
   [junit4]   2> 6092 INFO  (OverseerStateUpdate-96520007493681157-127.0.0.1:44847_solr-n_0000000000) [n:127.0.0.1:44847_solr    ] o.a.s.c.Overseer processMessage: queueSize: 1, message = {
   [junit4]   2>   "name":"testschemaapi",
   [junit4]   2>   "fromApi":"true",
   [junit4]   2>   "replicationFactor":"2",
   [junit4]   2>   "collection.configName":"conf1",
   [junit4]   2>   "numShards":"1",
   [junit4]   2>   "stateFormat":"2",
   [junit4]   2>   "operation":"create"} current state version: 0
   [junit4]   2> 6094 INFO  (OverseerStateUpdate-96520007493681157-127.0.0.1:44847_solr-n_0000000000) [n:127.0.0.1:44847_solr    ] o.a.s.c.o.ClusterStateMutator building a new cName: testschemaapi
   [junit4]   2> 6101 INFO  (OverseerStateUpdate-96520007493681157-127.0.0.1:44847_solr-n_0000000000) [n:127.0.0.1:44847_solr    ] o.a.s.c.o.ZkStateWriter going to create_collection /collections/testschemaapi/state.json
   [junit4]   2> 6192 INFO  (OverseerThreadFactory-47-thread-1-processing-n:127.0.0.1:44847_solr) [n:127.0.0.1:44847_solr    ] o.a.s.c.OverseerCollectionMessageHandler Creating SolrCores for new collection testschemaapi, shardNames [shard1] , replicationFactor : 2
   [junit4]   2> 6192 INFO  (OverseerThreadFactory-47-thread-1-processing-n:127.0.0.1:44847_solr) [n:127.0.0.1:44847_solr    ] o.a.s.c.OverseerCollectionMessageHandler Creating core testschemaapi_shard1_replica1 as part of shard shard1 of collection testschemaapi on 127.0.0.1:36999_solr
   [junit4]   2> 6196 INFO  (OverseerThreadFactory-47-thread-1-processing-n:127.0.0.1:44847_solr) [n:127.0.0.1:44847_solr    ] o.a.s.c.OverseerCollectionMessageHandler Creating core testschemaapi_shard1_replica2 as part of shard shard1 of collection testschemaapi on 127.0.0.1:44847_solr
   [junit4]   2> 6210 INFO  (qtp1485363372-83) [n:127.0.0.1:44847_solr    ] o.a.s.h.a.CoreAdminOperation core create command qt=/admin/cores&collection.configName=conf1&name=testschemaapi_shard1_replica2&action=CREATE&numShards=1&collection=testschemaapi&shard=shard1&wt=javabin&version=2
   [junit4]   2> 6212 INFO  (qtp1485363372-83) [n:127.0.0.1:44847_solr    ] o.a.s.c.CoreDescriptor Created CoreDescriptor: {name=testschemaapi_shard1_replica2, collection.configName=conf1, config=solrconfig.xml, transient=false, schema=schema.xml, loadOnStartup=true, configSetProperties=configsetprops.json, collection=testschemaapi, numShards=1, dataDir=data/, shard=shard1}
   [junit4]   2> 6214 INFO  (qtp1485363372-83) [n:127.0.0.1:44847_solr c:testschemaapi s:shard1  x:testschemaapi_shard1_replica2] o.a.s.c.ZkController publishing state=down
   [junit4]   2> 6217 INFO  (qtp1056274183-84) [n:127.0.0.1:36999_solr    ] o.a.s.h.a.CoreAdminOperation core create command qt=/admin/cores&collection.configName=conf1&name=testschemaapi_shard1_replica1&action=CREATE&numShards=1&collection=testschemaapi&shard=shard1&wt=javabin&version=2
   [junit4]   2> 6217 INFO  (qtp1056274183-84) [n:127.0.0.1:36999_solr    ] o.a.s.c.CoreDescriptor Created CoreDescriptor: {name=testschemaapi_shard1_replica1, collection.configName=conf1, config=solrconfig.xml, transient=false, schema=schema.xml, loadOnStartup=true, configSetProperties=configsetprops.json, collection=testschemaapi, numShards=1, dataDir=data/, shard=shard1}
   [junit4]   2> 6217 INFO  (qtp1485363372-83) [n:127.0.0.1:44847_solr c:testschemaapi s:shard1  x:testschemaapi_shard1_replica2] o.a.s.c.ZkController Registering watch for collection testschemaapi
   [junit4]   2> 6217 INFO  (qtp1485363372-83) [n:127.0.0.1:44847_solr c:testschemaapi s:shard1  x:testschemaapi_shard1_replica2] o.a.s.c.c.ZkStateReader addZkWatch [testschemaapi]
   [junit4]   2> 6218 INFO  (OverseerStateUpdate-96520007493681157-127.0.0.1:44847_solr-n_0000000000) [n:127.0.0.1:44847_solr    ] o.a.s.c.Overseer processMessage: queueSize: 1, message = {
   [junit4]   2>   "core":"testschemaapi_shard1_replica2",
   [junit4]   2>   "roles":null,
   [junit4]   2>   "base_url":"http://127.0.0.1:44847/solr",
   [junit4]   2>   "node_name":"127.0.0.1:44847_solr",
   [junit4]   2>   "numShards":"1",
   [junit4]   2>   "state":"down",
   [junit4]   2>   "shard":"shard1",
   [junit4]   2>   "collection":"testschemaapi",
   [junit4]   2>   "operation":"state"} current state version: 0
   [junit4]   2> 6219 INFO  (qtp1056274183-84) [n:127.0.0.1:36999_solr c:testschemaapi s:shard1  x:testschemaapi_shard1_replica1] o.a.s.c.ZkController publishing state=down
   [junit4]   2> 6219 INFO  (qtp1485363372-83) [n:127.0.0.1:44847_solr c:testschemaapi s:shard1  x:testschemaapi_shard1_replica2] o.a.s.c.c.ZkStateReader Add data for [testschemaapi] ver [0]
   [junit4]   2> 6219 INFO  (qtp1485363372-83) [n:127.0.0.1:44847_solr c:testschemaapi s:shard1  x:testschemaapi_shard1_replica2] o.a.s.c.ZkController look for our core node name
   [junit4]   2> 6220 INFO  (qtp1056274183-84) [n:127.0.0.1:36999_solr c:testschemaapi s:shard1  x:testschemaapi_shard1_replica1] o.a.s.c.ZkController Registering watch for collection testschemaapi
   [junit4]   2> 6220 INFO  (qtp1056274183-84) [n:127.0.0.1:36999_solr c:testschemaapi s:shard1  x:testschemaapi_shard1_replica1] o.a.s.c.c.ZkStateReader addZkWatch [testschemaapi]
   [junit4]   2> 6221 INFO  (qtp1056274183-84) [n:127.0.0.1:36999_solr c:testschemaapi s:shard1  x:testschemaapi_shard1_replica1] o.a.s.c.c.ZkStateReader Add data for [testschemaapi] ver [0]
   [junit4]   2> 6221 INFO  (qtp1056274183-84) [n:127.0.0.1:36999_solr c:testschemaapi s:shard1  x:testschemaapi_shard1_replica1] o.a.s.c.ZkController look for our core node name
   [junit4]   2> 6221 INFO  (OverseerStateUpdate-96520007493681157-127.0.0.1:44847_solr-n_0000000000) [n:127.0.0.1:44847_solr    ] o.a.s.c.o.ReplicaMutator Update state numShards=1 message={
   [junit4]   2>   "core":"testschemaapi_shard1_replica2",
   [junit4]   2>   "roles":null,
   [junit4]   2>   "base_url":"http://127.0.0.1:44847/solr",
   [junit4]   2>   "node_name":"127.0.0.1:44847_solr",
   [junit4]   2>   "numShards":"1",
   [junit4]   2>   "state":"down",
   [junit4]   2>   "shard":"shard1",
   [junit4]   2>   "collection":"testschemaapi",
   [junit4]   2>   "operation":"state"}
   [junit4]   2> 6226 INFO  (OverseerStateUpdate-96520007493681157-127.0.0.1:44847_solr-n_0000000000) [n:127.0.0.1:44847_solr    ] o.a.s.c.Overseer processMessage: queueSize: 1, message = {
   [junit4]   2>   "core":"testschemaapi_shard1_replica1",
   [junit4]   2>   "roles":null,
   [junit4]   2>   "base_url":"http://127.0.0.1:36999/solr",
   [junit4]   2>   "node_name":"127.0.0.1:36999_solr",
   [junit4]   2>   "numShards":"1",
   [junit4]   2>   "state":"down",
   [junit4]   2>   "shard":"shard1",
   [junit4]   2>   "collection":"testschemaapi",
   [junit4]   2>   "operation":"state"} current state version: 0
   [junit4]   2> 6226 INFO  (OverseerStateUpdate-96520007493681157-127.0.0.1:44847_solr-n_0000000000) [n:127.0.0.1:44847_solr    ] o.a.s.c.o.ReplicaMutator Update state numShards=1 message={
   [junit4]   2>   "core":"testschemaapi_shard1_replica1",
   [junit4]   2>   "roles":null,
   [junit4]   2>   "base_url":"http://127.0.0.1:36999/solr",
   [junit4]   2>   "node_name":"127.0.0.1:36999_solr",
   [junit4]   2>   "numShards":"1",
   [junit4]   2>   "state":"down",
   [junit4]   2>   "shard":"shard1",
   [junit4]   2>   "collection":"testschemaapi",
   [junit4]   2>   "operation":"state"}
   [junit4]   2> 6329 INFO  (OverseerStateUpdate-96520007493681157-127.0.0.1:44847_solr-n_0000000000) [n:127.0.0.1:44847_solr    ] o.a.s.c.o.ZkStateWriter going to update_collection /collections/testschemaapi/state.json version: 0
   [junit4]   2> 6334 INFO  (zkCallback-17-thread-1-processing-n:127.0.0.1:44847_solr) [n:127.0.0.1:44847_solr    ] o.a.s.c.c.ZkStateReader A cluster state change: [WatchedEvent state:SyncConnected type:NodeDataChanged path:/collections/testschemaapi/state.json] for collection [testschemaapi] has occurred - updating... (live nodes size: [2])
   [junit4]   2> 6334 INFO  (zkCallback-18-thread-1-processing-n:127.0.0.1:36999_solr) [n:127.0.0.1:36999_solr    ] o.a.s.c.c.ZkStateReader A cluster state change: [WatchedEvent state:SyncConnected type:NodeDataChanged path:/collections/testschemaapi/state.json] for collection [testschemaapi] has occurred - updating... (live nodes size: [2])
   [junit4]   2> 6335 INFO  (zkCallback-18-thread-1-processing-n:127.0.0.1:36999_solr) [n:127.0.0.1:36999_solr    ] o.a.s.c.c.ZkStateReader Updating data for [testschemaapi] from [0] to [1]
   [junit4]   2> 6335 INFO  (zkCallback-17-thread-1-processing-n:127.0.0.1:44847_solr) [n:127.0.0.1:44847_solr    ] o.a.s.c.c.ZkStateReader Updating data for [testschemaapi] from [0] to [1]
   [junit4]   2> 7219 INFO  (qtp1485363372-83) [n:127.0.0.1:44847_solr c:testschemaapi s:shard1  x:testschemaapi_shard1_replica2] o.a.s.c.ZkController waiting to find shard id in clusterstate for testschemaapi_shard1_replica2
   [junit4]   2> 7220 INFO  (qtp1485363372-83) [n:127.0.0.1:44847_solr c:testschemaapi s:shard1  x:testschemaapi_shard1_replica2] o.a.s.c.ZkController Check for collection zkNode:testschemaapi
   [junit4]   2> 7220 INFO  (qtp1485363372-83) [n:127.0.0.1:44847_solr c:testschemaapi s:shard1  x:testschemaapi_shard1_replica2] o.a.s.c.ZkController Collection zkNode exists
   [junit4]   2> 7220 INFO  (qtp1485363372-83) [n:127.0.0.1:44847_solr c:testschemaapi s:shard1  x:testschemaapi_shard1_replica2] o.a.s.c.c.ZkStateReader Load collection config from: [/collections/testschemaapi]
   [junit4]   2> 7221 INFO  (qtp1485363372-83) [n:127.0.0.1:44847_solr c:testschemaapi s:shard1  x:testschemaapi_shard1_replica2] o.a.s.c.c.ZkStateReader path=[/collections/testschemaapi] [configName]=[conf1] specified config exists in ZooKeeper
   [junit4]   2> 7221 INFO  (qtp1056274183-84) [n:127.0.0.1:36999_solr c:testschemaapi s:shard1  x:testschemaapi_shard1_replica1] o.a.s.c.ZkController waiting to find shard id in clusterstate for testschemaapi_shard1_replica1
   [junit4]   2> 7221 INFO  (qtp1056274183-84) [n:127.0.0.1:36999_solr c:testschemaapi s:shard1  x:testschemaapi_shard1_replica1] o.a.s.c.ZkController Check for collection zkNode:testschemaapi
   [junit4]   2> 7221 INFO  (qtp1485363372-83) [n:127.0.0.1:44847_solr c:testschemaapi s:shard1  x:testschemaapi_shard1_replica2] o.a.s.c.SolrResourceLoader new SolrResourceLoader for directory: '/home/jenkins/workspace/Lucene-Solr-5.5-Linux/solr/build/solr-core/test/J2/temp/solr.schema.TestManagedSchemaAPI_92F9D8EC820FF319-001/tempDir-001/node2/testschemaapi_shard1_replica2'
   [junit4]   2> 7221 INFO  (qtp1485363372-83) [n:127.0.0.1:44847_solr c:testschemaapi s:shard1  x:testschemaapi_shard1_replica2] o.a.s.c.SolrResourceLoader JNDI not configured for solr (NoInitialContextEx)
   [junit4]   2> 7221 INFO  (qtp1485363372-83) [n:127.0.0.1:44847_solr c:testschemaapi s:shard1  x:testschemaapi_shard1_replica2] o.a.s.c.SolrResourceLoader solr home defaulted to 'solr/' (could not find system property or JNDI)
   [junit4]   2> 7221 INFO  (qtp1056274183-84) [n:127.0.0.1:36999_solr c:testschemaapi s:shard1  x:testschemaapi_shard1_replica1] o.a.s.c.ZkController Collection zkNode exists
   [junit4]   2> 7221 INFO  (qtp1056274183-84) [n:127.0.0.1:36999_solr c:testschemaapi s:shard1  x:testschemaapi_shard1_replica1] o.a.s.c.c.ZkStateReader Load collection config from: [/collections/testschemaapi]
   [junit4]   2> 7222 INFO  (qtp1056274183-84) [n:127.0.0.1:36999_solr c:testschemaapi s:shard1  x:testschemaapi_shard1_replica1] o.a.s.c.c.ZkStateReader path=[/collections/testschemaapi] [configName]=[conf1] specified config exists in ZooKeeper
   [junit4]   2> 7222 INFO  (qtp1056274183-84) [n:127.0.0.1:36999_solr c:testschemaapi s:shard1  x:testschemaapi_shard1_replica1] o.a.s.c.SolrResourceLoader new SolrResourceLoader for directory: '/home/jenkins/workspace/Lucene-Solr-5.5-Linux/solr/build/solr-core/test/J2/temp/solr.schema.TestManagedSchemaAPI_92F9D8EC820FF319-001/tempDir-001/node1/testschemaapi_shard1_replica1'
   [junit4]   2> 7222 INFO  (qtp1056274183-84) [n:127.0.0.1:36999_solr c:testschemaapi s:shard1  x:testschemaapi_shard1_replica1] o.a.s.c.SolrResourceLoader JNDI not configured for solr (NoInitialContextEx)
   [junit4]   2> 7223 INFO  (qtp1056274183-84) [n:127.0.0.1:36999_solr c:testschemaapi s:shard1  x:testschemaapi_shard1_replica1] o.a.s.c.SolrResourceLoader solr home defaulted to 'solr/' (could not find system property or JNDI)
   [junit4]   2> 7224 INFO  (qtp1485363372-83) [n:127.0.0.1:44847_solr c:testschemaapi s:shard1  x:testschemaapi_shard1_replica2] o.a.s.c.Config loaded config solrconfig.xml with version 0 
   [junit4]   2> 7224 INFO  (qtp1056274183-84) [n:127.0.0.1:36999_solr c:testschemaapi s:shard1  x:testschemaapi_shard1_replica1] o.a.s.c.Config loaded config solrconfig.xml with version 0 
   [junit4]   2> 7230 INFO  (qtp1056274183-84) [n:127.0.0.1:36999_solr c:testschemaapi s:shard1  x:testschemaapi_shard1_replica1] o.a.s.c.SolrConfig current version of requestparams : -1
   [junit4]   2> 7230 INFO  (qtp1485363372-83) [n:127.0.0.1:44847_solr c:testschemaapi s:shard1  x:testschemaapi_shard1_replica2] o.a.s.c.SolrConfig current version of requestparams : -1
   [junit4]   2> 7235 INFO  (qtp1485363372-83) [n:127.0.0.1:44847_solr c:testschemaapi s:shard1  x:testschemaapi_shard1_replica2] o.a.s.c.SolrConfig Using Lucene MatchVersion: 5.5.3
   [junit4]   2> 7235 INFO  (qtp1056274183-84) [n:127.0.0.1:36999_solr c:testschemaapi s:shard1  x:testschemaapi_shard1_replica1] o.a.s.c.SolrConfig Using Lucene MatchVersion: 5.5.3
   [junit4]   2> 7246 INFO  (qtp1485363372-83) [n:127.0.0.1:44847_solr c:testschemaapi s:shard1  x:testschemaapi_shard1_replica2] o.a.s.c.SolrConfig Loaded SolrConfig: solrconfig.xml
   [junit4]   2> 7247 INFO  (qtp1056274183-84) [n:127.0.0.1:36999_solr c:testschemaapi s:shard1  x:testschemaapi_shard1_replica1] o.a.s.c.SolrConfig Loaded SolrConfig: solrconfig.xml
   [junit4]   2> 7250 INFO  (qtp1485363372-83) [n:127.0.0.1:44847_solr c:testschemaapi s:shard1  x:testschemaapi_shard1_replica2] o.a.s.s.IndexSchema [testschemaapi_shard1_replica2] Schema name=minimal
   [junit4]   2> 7251 INFO  (qtp1056274183-84) [n:127.0.0.1:36999_solr c:testschemaapi s:shard1  x:testschemaapi_shard1_replica1] o.a.s.s.IndexSchema [testschemaapi_shard1_replica1] Schema name=minimal
   [junit4]   2> 7253 INFO  (qtp1056274183-84) [n:127.0.0.1:36999_solr c:testschemaapi s:shard1  x:testschemaapi_shard1_replica1] o.a.s.s.IndexSchema unique key field: id
   [junit4]   2> 7253 INFO  (qtp1485363372-83) [n:127.0.0.1:44847_solr c:testschemaapi s:shard1  x:testschemaapi_shard1_replica2] o.a.s.s.IndexSchema unique key field: id
   [junit4]   2> 7256 INFO  (qtp1485363372-83) [n:127.0.0.1:44847_solr c:testschemaapi s:shard1  x:testschemaapi_shard1_replica2] o.a.s.c.ConfigSetProperties Did not find ConfigSet properties, assuming default properties: Can't find resource 'configsetprops.json' in classpath or '/configs/conf1', cwd=/home/jenkins/workspace/Lucene-Solr-5.5-Linux/solr/build/solr-core/test/J2
   [junit4]   2> 7256 INFO  (qtp1056274183-84) [n:127.0.0.1:36999_solr c:testschemaapi s:shard1  x:testschemaapi_shard1_replica1] o.a.s.c.ConfigSetProperties Did not find ConfigSet properties, assuming default properties: Can't find resource 'configsetprops.json' in classpath or '/configs/conf1', cwd=/home/jenkins/workspace/Lucene-Solr-5.5-Linux/solr/build/solr-core/test/J2
   [junit4]   2> 7256 INFO  (qtp1485363372-83) [n:127.0.0.1:44847_solr c:testschemaapi s:shard1  x:testschemaapi_shard1_replica2] o.a.s.c.CoreContainer Creating SolrCore 'testschemaapi_shard1_replica2' using configuration from collection testschemaapi
   [junit4]   2> 7257 INFO  (qtp1056274183-84) [n:127.0.0.1:36999_solr c:testschemaapi s:shard1  x:testschemaapi_shard1_replica1] o.a.s.c.CoreContainer Creating SolrCore 'testschemaapi_shard1_replica1' using configuration from collection testschemaapi
   [junit4]   2> 7257 INFO  (qtp1485363372-83) [n:127.0.0.1:44847_solr c:testschemaapi s:shard1 r:core_node1 x:testschemaapi_shard1_replica2] o.a.s.c.SolrCore org.apache.solr.core.MockDirectoryFactory
   [junit4]   2> 7257 INFO  (qtp1056274183-84) [n:127.0.0.1:36999_solr c:testschemaapi s:shard1 r:core_node2 x:testschemaapi_shard1_replica1] o.a.s.c.SolrCore org.apache.solr.core.MockDirectoryFactory
   [junit4]   2> 7257 INFO  (qtp1056274183-84) [n:127.0.0.1:36999_solr c:testschemaapi s:shard1 r:core_node2 x:testschemaapi_shard1_replica1] o.a.s.c.SolrCore [[testschemaapi_shard1_replica1] ] Opening new SolrCore at [/home/jenkins/workspace/Lucene-Solr-5.5-Linux/solr/build/solr-core/test/J2/temp/solr.schema.TestManagedSchemaAPI_92F9D8EC820FF319-001/tempDir-001/node1/testschemaapi_shard1_replica1], dataDir=[/home/jenkins/workspace/Lucene-Solr-5.5-Linux/solr/build/solr-core/test/J2/temp/solr.schema.TestManagedSchemaAPI_92F9D8EC820FF319-001/tempDir-001/node1/./testschemaapi_shard1_replica1/data/]
   [junit4]   2> 7257 INFO  (qtp1485363372-83) [n:127.0.0.1:44847_solr c:testschemaapi s:shard1 r:core_node1 x:testschemaapi_shard1_replica2] o.a.s.c.SolrCore [[testschemaapi_shard1_replica2] ] Opening new SolrCore at [/home/jenkins/workspace/Lucene-Solr-5.5-Linux/solr/build/solr-core/test/J2/temp/solr.schema.TestManagedSchemaAPI_92F9D8EC820FF319-001/tempDir-001/node2/testschemaapi_shard1_replica2], dataDir=[/home/jenkins/workspace/Lucene-Solr-5.5-Linux/solr/build/solr-core/test/J2/temp/solr.schema.TestManagedSchemaAPI_92F9D8EC820FF319-001/tempDir-001/node2/./testschemaapi_shard1_replica2/data/]
   [junit4]   2> 7258 INFO  (qtp1056274183-84) [n:127.0.0.1:36999_solr c:testschemaapi s:shard1 r:core_node2 x:testschemaapi_shard1_replica1] o.a.s.c.SolrCore JMX monitoring not detected for core: testschemaapi_shard1_replica1
   [junit4]   2> 7258 INFO  (qtp1485363372-83) [n:127.0.0.1:44847_solr c:testschemaapi s:shard1 r:core_node1 x:testschemaapi_shard1_replica2] o.a.s.c.SolrCore JMX monitoring not detected for core: testschemaapi_shard1_replica2
   [junit4]   2> 7258 INFO  (qtp1056274183-84) [n:127.0.0.1:36999_solr c:testschemaapi s:shard1 r:core_node2 x:testschemaapi_shard1_replica1] o.a.s.c.CachingDirectoryFactory return new directory for /home/jenkins/workspace/Lucene-Solr-5.5-Linux/solr/build/solr-core/test/J2/temp/solr.schema.TestManagedSchemaAPI_92F9D8EC820FF319-001/tempDir-001/node1/./testschemaapi_shard1_replica1/data
   [junit4]   2> 7258 INFO  (qtp1485363372-83) [n:127.0.0.1:44847_solr c:testschemaapi s:shard1 r:core_node1 x:testschemaapi_shard1_replica2] o.a.s.c.CachingDirectoryFactory return new directory for /home/jenkins/workspace/Lucene-Solr-5.5-Linux/solr/build/solr-core/test/J2/temp/solr.schema.TestManagedSchemaAPI_92F9D8EC820FF319-001/tempDir-001/node2/./testschemaapi_shard1_replica2/data
   [junit4]   2> 7259 INFO  (qtp1485363372-83) [n:127.0.0.1:44847_solr c:testschemaapi s:shard1 r:core_node1 x:testschemaapi_shard1_replica2] o.a.s.c.SolrCore New index directory detected: old=null new=/home/jenkins/workspace/Lucene-Solr-5.5-Linux/solr/build/solr-core/test/J2/temp/solr.schema.TestManagedSchemaAPI_92F9D8EC820FF319-001/tempDir-001/node2/./testschemaapi_shard1_replica2/data/index/
   [junit4]   2> 7259 INFO  (qtp1056274183-84) [n:127.0.0.1:36999_solr c:testschemaapi s:shard1 r:core_node2 x:testschemaapi_shard1_replica1] o.a.s.c.SolrCore New index directory detected: old=null new=/home/jenkins/workspace/Lucene-Solr-5.5-Linux/solr/build/solr-core/test/J2/temp/solr.schema.TestManagedSchemaAPI_92F9D8EC820FF319-001/tempDir-001/node1/./testschemaapi_shard1_replica1/data/index/
   [junit4]   2> 7259 WARN  (qtp1485363372-83) [n:127.0.0.1:44847_solr c:testschemaapi s:shard1 r:core_node1 x:testschemaapi_shard1_replica2] o.a.s.c.SolrCore [testschemaapi_shard1_replica2] Solr index directory '/home/jenkins/workspace/Lucene-Solr-5.5-Linux/solr/build/solr-core/test/J2/temp/solr.schema.TestManagedSchemaAPI_92F9D8EC820FF319-001/tempDir-001/node2/./testschemaapi_shard1_replica2/data/index' doesn't exist. Creating new index...
   [junit4]   2> 7259 WARN  (qtp1056274183-84) [n:127.0.0.1:36999_solr c:testschemaapi s:shard1 r:core_node2 x:testschemaapi_shard1_replica1] o.a.s.c.SolrCore [testschemaapi_shard1_replica1] Solr index directory '/home/jenkins/workspace/Lucene-Solr-5.5-Linux/solr/build/solr-core/test/J2/temp/solr.schema.TestManagedSchemaAPI_92F9D8EC820FF319-001/tempDir-001/node1/./testschemaapi_shard1_replica1/data/index' doesn't exist. Creating new index...
   [junit4]   2> 7260 INFO  (qtp1485363372-83) [n:127.0.0.1:44847_solr c:testschemaapi s:shard1 r:core_node1 x:testschemaapi_shard1_replica2] o.a.s.c.CachingDirectoryFactory return new directory for /home/jenkins/workspace/Lucene-Solr-5.5-Linux/solr/build/solr-core/test/J2/temp/solr.schema.TestManagedSchemaAPI_92F9D8EC820FF319-001/tempDir-001/node2/./testschemaapi_shard1_replica2/data/index
   [junit4]   2> 7260 INFO  (qtp1056274183-84) [n:127.0.0.1:36999_solr c:testschemaapi s:shard1 r:core_node2 x:testschemaapi_shard1_replica1] o.a.s.c.CachingDirectoryFactory return new directory for /home/jenkins/workspace/Lucene-Solr-5.5-Linux/solr/build/solr-core/test/J2/temp/solr.schema.TestManagedSchemaAPI_92F9D8EC820FF319-001/tempDir-001/node1/./testschemaapi_shard1_replica1/data/index
   [junit4]   2> 7262 INFO  (qtp1056274183-84) [n:127.0.0.1:36999_solr c:testschemaapi s:shard1 r:core_node2 x:testschemaapi_shard1_replica1] o.a.s.c.SolrDeletionPolicy SolrDeletionPolicy.onCommit: commits: num=1
   [junit4]   2> 	commit{dir=MockDirectoryWrapper(NRTCachingDirectory(RAMDirectory@4f4e6243 lockFactory=org.apache.lucene.store.SingleInstanceLockFactory@26165fa2; maxCacheMB=0.6865234375 maxMergeSizeMB=0.6884765625)),segFN=segments_1,generation=1}
   [junit4]   2> 7262 INFO  (qtp1056274183-84) [n:127.0.0.1:36999_solr c:testschemaapi s:shard1 r:core_node2 x:testschemaapi_shard1_replica1] o.a.s.c.SolrDeletionPolicy newest commit generation = 1
   [junit4]   2> 7262 INFO  (OldIndexDirectoryCleanupThreadForCore-testschemaapi_shard1_replica1) [n:127.0.0.1:36999_solr c:testschemaapi s:shard1 r:core_node2 x:testschemaapi_shard1_replica1] o.a.s.c.SolrCore Looking for old index directories to cleanup for core testschemaapi_shard1_replica1 in /home/jenkins/workspace/Lucene-Solr-5.5-Linux/solr/build/solr-core/test/J2/temp/solr.schema.TestManagedSchemaAPI_92F9D8EC820FF319-001/tempDir-001/node1/./testschemaapi_shard1_replica1/data/
   [junit4]   2> 7263 WARN  (OldIndexDirectoryCleanupThreadForCore-testschemaapi_shard1_replica1) [n:127.0.0.1:36999_solr c:testschemaapi s:shard1 r:core_node2 x:testschemaapi_shard1_replica1] o.a.s.c.DirectoryFactory /home/jenkins/workspace/Lucene-Solr-5.5-Linux/solr/build/solr-core/test/J2/temp/solr.schema.TestManagedSchemaAPI_92F9D8EC820FF319-001/tempDir-001/node1/./testschemaapi_shard1_replica1/data/ does not point to a valid data directory; skipping clean-up of old index directories.
   [junit4]   2> 7269 INFO  (qtp1485363372-83) [n:127.0.0.1:44847_solr c:testschemaapi s:shard1 r:core_node1 x:testschemaapi_shard1_replica2] o.a.s.c.SolrDeletionPolicy SolrDeletionPolicy.onCommit: commits: num=1
   [junit4]   2> 	commit{dir=MockDirectoryWrapper(NRTCachingDirectory(RAMDirectory@15ebc632 lockFactory=org.apache.lucene.store.SingleInstanceLockFactory@2ba1eb2d; maxCacheMB=0.6865234375 maxMergeSizeMB=0.6884765625)),segFN=segments_1,generation=1}
   [junit4]   2> 7269 INFO  (qtp1485363372-83) [n:127.0.0.1:44847_solr c:testschemaapi s:shard1 r:core_node1 x:testschemaapi_shard1_replica2] o.a.s.c.SolrDeletionPolicy newest commit generation = 1
   [junit4]   2> 7269 INFO  (OldIndexDirectoryCleanupThreadForCore-testschemaapi_shard1_replica2) [n:127.0.0.1:44847_solr c:testschemaapi s:shard1 r:core_node1 x:testschemaapi_shard1_replica2] o.a.s.c.SolrCore Looking for old index directories to cleanup for core testschemaapi_shard1_replica2 in /home/jenkins/workspace/Lucene-Solr-5.5-Linux/solr/build/solr-core/test/J2/temp/solr.schema.TestManagedSchemaAPI_92F9D8EC820FF319-001/tempDir-001/node2/./testschemaapi_shard1_replica2/data/
   [junit4]   2> 7269 INFO  (qtp1056274183-84) [n:127.0.0.1:36999_solr c:testschemaapi s:shard1 r:core_node2 x:testschemaapi_shard1_replica1] o.a.s.c.SolrCore no updateRequestProcessorChain defined as default, creating implicit default
   [junit4]   2> 7270 WARN  (OldIndexDirectoryCleanupThreadForCore-testschemaapi_shard1_replica2) [n:127.0.0.1:44847_solr c:testschemaapi s:shard1 r:core_node1 x:testschemaapi_shard1_replica2] o.a.s.c.DirectoryFactory /home/jenkins/workspace/Lucene-Solr-5.5-Linux/solr/build/solr-core/test/J2/temp/solr.schema.TestManagedSchemaAPI_92F9D8EC820FF319-001/tempDir-001/node2/./testschemaapi_shard1_replica2/data/ does not point to a valid data directory; skipping clean-up of old index directories.
   [junit4]   2> 7271 INFO  (qtp1485363372-83) [n:127.0.0.1:44847_solr c:testschemaapi s:shard1 r:core_node1 x:testschemaapi_shard1_replica2] o.a.s.c.SolrCore no updateRequestProcessorChain defined as default, creating implicit default
   [junit4]   2> 7272 INFO  (qtp1056274183-84) [n:127.0.0.1:36999_solr c:testschemaapi s:shard1 r:core_node2 x:testschemaapi_shard1_replica1] o.a.s.h.l.XMLLoader xsltCacheLifetimeSeconds=60
   [junit4]   2> 7272 INFO  (qtp1485363372-83) [n:127.0.0.1:44847_solr c:testschemaapi s:shard1 r:core_node1 x:testschemaapi_shard1_replica2] o.a.s.h.l.XMLLoader xsltCacheLifetimeSeconds=60
   [junit4]   2> 7272 INFO  (qtp1056274183-84) [n:127.0.0.1:36999_solr c:testschemaapi s:shard1 r:core_node2 x:testschemaapi_shard1_replica1] o.a.s.h.l.XMLLoader xsltCacheLifetimeSeconds=60
   [junit4]   2> 7273 INFO  (qtp1056274183-84) [n:127.0.0.1:36999_solr c:testschemaapi s:shard1 r:core_node2 x:testschemaapi_shard1_replica1] o.a.s.h.l.XMLLoader xsltCacheLifetimeSeconds=60
   [junit4]   2> 7274 INFO  (qtp1485363372-83) [n:127.0.0.1:44847_solr c:testschemaapi s:shard1 r:core_node1 x:testschemaapi_shard1_replica2] o.a.s.h.l.XMLLoader xsltCacheLifetimeSeconds=60
   [junit4]   2> 7274 INFO  (qtp1056274183-84) [n:127.0.0.1:36999_solr c:testschemaapi s:shard1 r:core_node2 x:testschemaapi_shard1_replica1] o.a.s.h.l.XMLLoader xsltCacheLifetimeSeconds=60
   [junit4]   2> 7274 INFO  (qtp1485363372-83) [n:127.0.0.1:44847_solr c:testschemaapi s:shard1 r:core_node1 x:testschemaapi_shard1_replica2] o.a.s.h.l.XMLLoader xsltCacheLifetimeSeconds=60
   [junit4]   2> 7275 INFO  (qtp1056274183-84) [n:127.0.0.1:36999_solr c:testschemaapi s:shard1 r:core_node2 x:testschemaapi_shard1_replica1] o.a.s.c.RequestHandlers Registered paths: /admin/mbeans,/update/csv,/update/json/docs,/admin/luke,/select,/admin/segments,/get,/admin/system,/replication,/admin/properties,/config,/schema,/admin/plugins,/admin/logging,/update/json,/admin/threads,/admin/ping,/update,/admin/file
   [junit4]   2> 7275 INFO  (qtp1056274183-84) [n:127.0.0.1:36999_solr c:testschemaapi s:shard1 r:core_node2 x:testschemaapi_shard1_replica1] o.a.s.c.SolrCore Using default statsCache cache: org.apache.solr.search.stats.LocalStatsCache
   [junit4]   2> 7275 INFO  (qtp1485363372-83) [n:127.0.0.1:44847_solr c:testschemaapi s:shard1 r:core_node1 x:testschemaapi_shard1_replica2] o.a.s.h.l.XMLLoader xsltCacheLifetimeSeconds=60
   [junit4]   2> 7276 INFO  (qtp1056274183-84) [n:127.0.0.1:36999_solr c:testschemaapi s:shard1 r:core_node2 x:testschemaapi_shard1_replica1] o.a.s.u.UpdateHandler Using UpdateLog implementation: org.apache.solr.update.UpdateLog
   [junit4]   2> 7276 INFO  (qtp1056274183-84) [n:127.0.0.1:36999_solr c:testschemaapi s:shard1 r:core_node2 x:testschemaapi_shard1_replica1] o.a.s.u.UpdateLog Initializing UpdateLog: dataDir=null defaultSyncLevel=FLUSH numRecordsToKeep=100 maxNumLogsToKeep=10 numVersionBuckets=65536
   [junit4]   2> 7277 INFO  (qtp1485363372-83) [n:127.0.0.1:44847_solr c:testschemaapi s:shard1 r:core_node1 x:testschemaapi_shard1_replica2] o.a.s.c.RequestHandlers Registered paths: /admin/mbeans,/update/csv,/update/json/docs,/admin/luke,/select,/admin/segments,/get,/admin/system,/replication,/admin/properties,/config,/schema,/admin/plugins,/admin/logging,/update/json,/admin/threads,/admin/ping,/update,/admin/file
   [junit4]   2> 7277 INFO  (qtp1485363372-83) [n:127.0.0.1:44847_solr c:testschemaapi s:shard1 r:core_node1 x:testschemaapi_shard1_replica2] o.a.s.c.SolrCore Using default statsCache cache: org.apache.solr.search.stats.LocalStatsCache
   [junit4]   2> 7291 INFO  (qtp1485363372-83) [n:127.0.0.1:44847_solr c:testschemaapi s:shard1 r:core_node1 x:testschemaapi_shard1_replica2] o.a.s.u.UpdateHandler Using UpdateLog implementation: org.apache.solr.update.UpdateLog
   [junit4]   2> 7292 INFO  (qtp1485363372-83) [n:127.0.0.1:44847_solr c:testschemaapi s:shard1 r:core_node1 x:testschemaapi_shard1_replica2] o.a.s.u.UpdateLog Initializing UpdateLog: dataDir=null defaultSyncLevel=FLUSH numRecordsToKeep=100 maxNumLogsToKeep=10 numVersionBuckets=65536
   [junit4]   2> 7293 INFO  (qtp1485363372-83) [n:127.0.0.1:44847_solr c:testschemaapi s:shard1 r:core_node1 x:testschemaapi_shard1_replica2] o.a.s.u.CommitTracker Hard AutoCommit: disabled
   [junit4]   2> 7293 INFO  (qtp1485363372-83) [n:127.0.0.1:44847_solr c:testschemaapi s:shard1 r:core_node1 x:testschemaapi_shard1_replica2] o.a.s.u.CommitTracker Soft AutoCommit: disabled
   [junit4]   2> 7294 INFO  (qtp1056274183-84) [n:127.0.0.1:36999_solr c:testschemaapi s:shard1 r:core_node2 x:testschemaapi_shard1_replica1] o.a.s.u.CommitTracker Hard AutoCommit: disabled
   [junit4]   2> 7294 INFO  (qtp1056274183-84) [n:127.0.0.1:36999_solr c:testschemaapi s:shard1 r:core_node2 x:testschemaapi_shard1_replica1] o.a.s.u.CommitTracker Soft AutoCommit: disabled
   [junit4]   2> 7295 INFO  (qtp1485363372-83) [n:127.0.0.1:44847_solr c:testschemaapi s:shard1 r:core_node1 x:testschemaapi_shard1_replica2] o.a.s.c.SolrDeletionPolicy SolrDeletionPolicy.onInit: commits: num=1
   [junit4]   2> 	commit{dir=MockDirectoryWrapper(NRTCachingDirectory(RAMDirectory@15ebc632 lockFactory=org.apache.lucene.store.SingleInstanceLockFactory@2ba1eb2d; maxCacheMB=0.6865234375 maxMergeSizeMB=0.6884765625)),segFN=segments_1,generation=1}
   [junit4]   2> 7295 INFO  (qtp1485363372-83) [n:127.0.0.1:44847_solr c:testschemaapi s:shard1 r:core_node1 x:testschemaapi_shard1_replica2] o.a.s.c.SolrDeletionPolicy newest commit generation = 1
   [junit4]   2> 7295 INFO  (qtp1485363372-83) [n:127.0.0.1:44847_solr c:testschemaapi s:shard1 r:core_node1 x:testschemaapi_shard1_replica2] o.a.s.s.SolrIndexSearcher Opening Searcher@47f8071c[testschemaapi_shard1_replica2] main
   [junit4]   2> 7295 INFO  (qtp1485363372-83) [n:127.0.0.1:44847_solr c:testschemaapi s:shard1 r:core_node1 x:testschemaapi_shard1_replica2] o.a.s.c.c.ZkStateReader Load collection config from: [/collections/testschemaapi]
   [junit4]   2> 7295 INFO  (qtp1056274183-84) [n:127.0.0.1:36999_solr c:testschemaapi s:shard1 r:core_node2 x:testschemaapi_shard1_replica1] o.a.s.c.SolrDeletionPolicy SolrDeletionPolicy.onInit: commits: num=1
   [junit4]   2> 	commit{dir=MockDirectoryWrapper(NRTCachingDirectory(RAMDirectory@4f4e6243 lockFactory=org.apache.lucene.store.SingleInstanceLockFactory@26165fa2; maxCacheMB=0.6865234375 maxMergeSizeMB=0.6884765625)),segFN=segments_1,generation=1}
   [junit4]   2> 7296 INFO  (qtp1056274183-84) [n:127.0.0.1:36999_solr c:testschemaapi s:shard1 r:core_node2 x:testschemaapi_shard1_replica1] o.a.s.c.SolrDeletionPolicy newest commit generation = 1
   [junit4]   2> 7296 INFO  (qtp1056274183-84) [n:127.0.0.1:36999_solr c:testschemaapi s:shard1 r:core_node2 x:testschemaapi_shard1_replica1] o.a.s.s.SolrIndexSearcher Opening Searcher@4af2b1f2[testschemaapi_shard1_replica1] main
   [junit4]   2> 7296 INFO  (qtp1056274183-84) [n:127.0.0.1:36999_solr c:testschemaapi s:shard1 r:core_node2 x:testschemaapi_shard1_replica1] o.a.s.c.c.ZkStateReader Load collection config from: [/collections/testschemaapi]
   [junit4]   2> 7297 INFO  (qtp1485363372-83) [n:127.0.0.1:44847_solr c:testschemaapi s:shard1 r:core_node1 x:testschemaapi_shard1_replica2] o.a.s.c.c.ZkStateReader path=[/collections/testschemaapi] [configName]=[conf1] specified config exists in ZooKeeper
   [junit4]   2> 7297 INFO  (qtp1485363372-83) [n:127.0.0.1:44847_solr c:testschemaapi s:shard1 r:core_node1 x:testschemaapi_shard1_replica2] o.a.s.r.ManagedResourceStorage Setting up ZooKeeper-based storage for the RestManager with znodeBase: /configs/conf1
   [junit4]   2> 7297 INFO  (qtp1056274183-84) [n:127.0.0.1:36999_solr c:testschemaapi s:shard1 r:core_node2 x:testschemaapi_shard1_replica1] o.a.s.c.c.ZkStateReader path=[/collections/testschemaapi] [configName]=[conf1] specified config exists in ZooKeeper
   [junit4]   2> 7297 INFO  (qtp1056274183-84) [n:127.0.0.1:36999_solr c:testschemaapi s:shard1 r:core_node2 x:testschemaapi_shard1_replica1] o.a.s.r.ManagedResourceStorage Setting up ZooKeeper-based storage for the RestManager with znodeBase: /configs/conf1
   [junit4]   2> 7298 INFO  (qtp1485363372-83) [n:127.0.0.1:44847_solr c:testschemaapi s:shard1 r:core_node1 x:testschemaapi_shard1_replica2] o.a.s.r.ManagedResourceStorage Configured ZooKeeperStorageIO with znodeBase: /configs/conf1
   [junit4]   2> 7298 INFO  (qtp1056274183-84) [n:127.0.0.1:36999_solr c:testschemaapi s:shard1 r:core_node2 x:testschemaapi_shard1_replica1] o.a.s.r.ManagedResourceStorage Configured ZooKeeperStorageIO with znodeBase: /configs/conf1
   [junit4]   2> 7298 INFO  (qtp1485363372-83) [n:127.0.0.1:44847_solr c:testschemaapi s:shard1 r:core_node1 x:testschemaapi_shard1_replica2] o.a.s.r.RestManager Initializing RestManager with initArgs: {}
   [junit4]   2> 7298 INFO  (qtp1056274183-84) [n:127.0.0.1:36999_solr c:testschemaapi s:shard1 r:core_node2 x:testschemaapi_shard1_replica1] o.a.s.r.RestManager Initializing RestManager with initArgs: {}
   [junit4]   2> 7298 INFO  (qtp1485363372-83) [n:127.0.0.1:44847_solr c:testschemaapi s:shard1 r:core_node1 x:testschemaapi_shard1_replica2] o.a.s.r.ManagedResourceStorage Reading _rest_managed.json using ZooKeeperStorageIO:path=/configs/conf1
   [junit4]   2> 7298 INFO  (qtp1056274183-84) [n:127.0.0.1:36999_solr c:testschemaapi s:shard1 r:core_node2 x:testschemaapi_shard1_replica1] o.a.s.r.ManagedResourceStorage Reading _rest_managed.json using ZooKeeperStorageIO:path=/configs/conf1
   [junit4]   2> 7299 INFO  (qtp1056274183-84) [n:127.0.0.1:36999_solr c:testschemaapi s:shard1 r:core_node2 x:testschemaapi_shard1_replica1] o.a.s.r.ManagedResourceStorage No data found for znode /configs/conf1/_rest_managed.json
   [junit4]   2> 7299 INFO  (qtp1485363372-83) [n:127.0.0.1:44847_solr c:testschemaapi s:shard1 r:core_node1 x:testschemaapi_shard1_replica2] o.a.s.r.ManagedResourceStorage No data found for znode /configs/conf1/_rest_managed.json
   [junit4]   2> 7299 INFO  (qtp1056274183-84) [n:127.0.0.1:36999_solr c:testschemaapi s:shard1 r:core_node2 x:testschemaapi_shard1_replica1] o.a.s.r.ManagedResourceStorage Loaded null at path _rest_managed.json using ZooKeeperStorageIO:path=/configs/conf1
   [junit4]   2> 7299 INFO  (qtp1056274183-84) [n:127.0.0.1:36999_solr c:testschemaapi s:shard1 r:core_node2 x:testschemaapi_shard1_replica1] o.a.s.r.RestManager Initializing 0 registered ManagedResources
   [junit4]   2> 7299 INFO  (qtp1485363372-83) [n:127.0.0.1:44847_solr c:testschemaapi s:shard1 r:core_node1 x:testschemaapi_shard1_replica2] o.a.s.r.ManagedResourceStorage Loaded null at path _rest_managed.json using ZooKeeperStorageIO:path=/configs/conf1
   [junit4]   2> 7299 INFO  (qtp1485363372-83) [n:127.0.0.1:44847_solr c:testschemaapi s:shard1 r:core_node1 x:testschemaapi_shard1_replica2] o.a.s.r.RestManager Initializing 0 registered ManagedResources
   [junit4]   2> 7301 INFO  (qtp1485363372-83) [n:127.0.0.1:44847_solr c:testschemaapi s:shard1 r:core_node1 x:testschemaapi_shard1_replica2] o.a.s.s.ZkIndexSchemaReader Creating ZooKeeper watch for the managed schema at /configs/conf1/managed-schema
   [junit4]   2> 7301 INFO  (qtp1056274183-84) [n:127.0.0.1:36999_solr c:testschemaapi s:shard1 r:core_node2 x:testschemaapi_shard1_replica1] o.a.s.s.ZkIndexSchemaReader Creating ZooKeeper watch for the managed schema at /configs/conf1/managed-schema
   [junit4]   2> 7304 INFO  (qtp1056274183-84) [n:127.0.0.1:36999_solr c:testschemaapi s:shard1 r:core_node2 x:testschemaapi_shard1_replica1] o.a.s.c.ZkController Added new OnReconnect listener ZkIndexSchemaReader: /configs/conf1/managed-schema, uniqueCoreId: testschemaapi_shard1_replica1:4071266470105985
   [junit4]   2> 7304 INFO  (qtp1485363372-83) [n:127.0.0.1:44847_solr c:testschemaapi s:shard1 r:core_node1 x:testschemaapi_shard1_replica2] o.a.s.c.ZkController Added new OnReconnect listener ZkIndexSchemaReader: /configs/conf1/managed-schema, uniqueCoreId: testschemaapi_shard1_replica2:4071266470062034
   [junit4]   2> 7304 INFO  (qtp1056274183-84) [n:127.0.0.1:36999_solr c:testschemaapi s:shard1 r:core_node2 x:testschemaapi_shard1_replica1] o.a.s.h.ReplicationHandler Commits will be reserved for  10000
   [junit4]   2> 7304 INFO  (qtp1485363372-83) [n:127.0.0.1:44847_solr c:testschemaapi s:shard1 r:core_node1 x:testschemaapi_shard1_replica2] o.a.s.h.ReplicationHandler Commits will be reserved for  10000
   [junit4]   2> 7304 INFO  (searcherExecutor-53-thread-1-processing-n:127.0.0.1:36999_solr x:testschemaapi_shard1_replica1 s:shard1 c:testschemaapi r:core_node2) [n:127.0.0.1:36999_solr c:testschemaapi s:shard1 r:core_node2 x:testschemaapi_shard1_replica1] o.a.s.c.SolrCore [testschemaapi_shard1_replica1] Registered new searcher Searcher@4af2b1f2[testschemaapi_shard1_replica1] main{ExitableDirectoryReader(UninvertingDirectoryReader())}
   [junit4]   2> 7305 INFO  (qtp1056274183-84) [n:127.0.0.1:36999_solr c:testschemaapi s:shard1 r:core_node2 x:testschemaapi_shard1_replica1] o.a.s.u.UpdateLog Looking up max value of version field to seed version buckets
   [junit4]   2> 7305 INFO  (qtp1485363372-83) [n:127.0.0.1:44847_solr c:testschemaapi s:shard1 r:core_node1 x:testschemaapi_shard1_replica2] o.a.s.u.UpdateLog Looking up max value of version field to seed version buckets
   [junit4]   2> 7305 INFO  (qtp1056274183-84) [n:127.0.0.1:36999_solr c:testschemaapi s:shard1 r:core_node2 x:testschemaapi_shard1_replica1] o.a.s.u.VersionInfo Refreshing highest value of _version_ for 65536 version buckets from index
   [junit4]   2> 7305 INFO  (qtp1485363372-83) [n:127.0.0.1:44847_solr c:testschemaapi s:shard1 r:core_node1 x:testschemaapi_shard1_replica2] o.a.s.u.VersionInfo Refreshing highest value of _version_ for 65536 version buckets from index
   [junit4]   2> 7305 INFO  (qtp1056274183-84) [n:127.0.0.1:36999_solr c:testschemaapi s:shard1 r:core_node2 x:testschemaapi_shard1_replica1] o.a.s.u.VersionInfo No terms found for _version_, cannot seed version bucket highest value from index
   [junit4]   2> 7305 INFO  (qtp1485363372-83) [n:127.0.0.1:44847_solr c:testschemaapi s:shard1 r:core_node1 x:testschemaapi_shard1_replica2] o.a.s.u.VersionInfo No terms found for _version_, cannot seed version bucket highest value from index
   [junit4]   2> 7305 INFO  (qtp1056274183-84) [n:127.0.0.1:36999_solr c:testschemaapi s:shard1 r:core_node2 x:testschemaapi_shard1_replica1] o.a.s.u.UpdateLog Could not find max version in index or recent updates, using new clock 1544320121690914816
   [junit4]   2> 7305 INFO  (qtp1485363372-83) [n:127.0.0.1:44847_solr c:testschemaapi s:shard1 r:core_node1 x:testschemaapi_shard1_replica2] o.a.s.u.UpdateLog Could not find max version in index or recent updates, using new clock 1544320121690914816
   [junit4]   2> 7305 INFO  (searcherExecutor-52-thread-1-processing-n:127.0.0.1:44847_solr x:testschemaapi_shard1_replica2 s:shard1 c:testschemaapi r:core_node1) [n:127.0.0.1:44847_solr c:testschemaapi s:shard1 r:core_node1 x:testschemaapi_shard1_replica2] o.a.s.c.SolrCore [testschemaapi_shard1_replica2] Registered new searcher Searcher@47f8071c[testschemaapi_shard1_replica2] main{ExitableDirectoryReader(UninvertingDirectoryReader())}
   [junit4]   2> 7306 INFO  (qtp1485363372-83) [n:127.0.0.1:44847_solr c:testschemaapi s:shard1 r:core_node1 x:testschemaapi_shard1_replica2] o.a.s.u.UpdateLog Took 1.0ms to seed version buckets with highest version 1544320121690914816
   [junit4]   2> 7307 INFO  (qtp1056274183-84) [n:127.0.0.1:36999_solr c:testschemaapi s:shard1 r:core_node2 x:testschemaapi_shard1_replica1] o.a.s.u.UpdateLog Took 1.0ms to seed version buckets with highest version 1544320121690914816
   [junit4]   2> 7308 INFO  (qtp1485363372-83) [n:127.0.0.1:44847_solr c:testschemaapi s:shard1 r:core_node1 x:testschemaapi_shard1_replica2] o.a.s.c.ZkController watch zkdir /configs/conf1
   [junit4]   2> 7308 INFO  (qtp1056274183-84) [n:127.0.0.1:36999_solr c:testschemaapi s:shard1 r:core_node2 x:testschemaapi_shard1_replica1] o.a.s.c.ZkController watch zkdir /configs/conf1
   [junit4]   2> 7309 INFO  (qtp1485363372-83) [n:127.0.0.1:44847_solr c:testschemaapi s:shard1 r:core_node1 x:testschemaapi_shard1_replica2] o.a.s.c.CoreContainer registering core: testschemaapi_shard1_replica2
   [junit4]   2> 7309 INFO  (qtp1056274183-84) [n:127.0.0.1:36999_solr c:testschemaapi s:shard1 r:core_node2 x:testschemaapi_shard1_replica1] o.a.s.c.CoreContainer registering core: testschemaapi_shard1_replica1
   [junit4]   2> 7309 INFO  (qtp1485363372-83) [n:127.0.0.1:44847_solr c:testschemaapi s:shard1 r:core_node1 x:testschemaapi_shard1_replica2] o.a.s.c.ZkController Register replica - core:testschemaapi_shard1_replica2 address:http://127.0.0.1:44847/solr collection:testschemaapi shard:shard1
   [junit4]   2> 7309 INFO  (qtp1056274183-84) [n:127.0.0.1:36999_solr c:testschemaapi s:shard1 r:core_node2 x:testschemaapi_shard1_replica1] o.a.s.c.ZkController Register replica - core:testschemaapi_shard1_replica1 address:http://127.0.0.1:36999/solr collection:testschemaapi shard:shard1
   [junit4]   2> 7316 INFO  (qtp1056274183-84) [n:127.0.0.1:36999_solr c:testschemaapi s:shard1 r:core_node2 x:testschemaapi_shard1_replica1] o.a.s.c.c.SolrZkClient makePath: /collections/testschemaapi/leader_elect/shard1/election
   [junit4]   2> 7316 INFO  (qtp1485363372-83) [n:127.0.0.1:44847_solr c:testschemaapi s:shard1 r:core_node1 x:testschemaapi_shard1_replica2] o.a.s.c.c.SolrZkClient makePath: /collections/testschemaapi/leader_elect/shard1/election
   [junit4]   2> 7319 INFO  (qtp1056274183-84) [n:127.0.0.1:36999_solr c:testschemaapi s:shard1 r:core_node2 x:testschemaapi_shard1_replica1] o.a.s.c.LeaderElector Joined leadership election with path: /collections/testschemaapi/leader_elect/shard1/election/96520007493681158-core_node2-n_0000000000
   [junit4]   2> 7319 INFO  (qtp1485363372-83) [n:127.0.0.1:44847_solr c:testschemaapi s:shard1 r:core_node1 x:testschemaapi_shard1_replica2] o.a.s.c.LeaderElector Joined leadership election with path: /collections/testschemaapi/leader_elect/shard1/election/96520007493681157-core_node1-n_0000000001
   [junit4]   2> 7320 INFO  (qtp1056274183-84) [n:127.0.0.1:36999_solr c:testschemaapi s:shard1 r:core_node2 x:testschemaapi_shard1_replica1] o.a.s.c.ShardLeaderElectionContext Running the leader process for shard=shard1 and weAreReplacement=false and leaderVoteWait=10000
   [junit4]   2> 7320 INFO  (qtp1485363372-83) [n:127.0.0.1:44847_solr c:testschemaapi s:shard1 r:core_node1 x:testschemaapi_shard1_replica2] o.a.s.c.LeaderElector Watching path /collections/testschemaapi/leader_elect/shard1/election/96520007493681158-core_node2-n_0000000000 to know if I could be the leader
   [junit4]   2> 7322 INFO  (qtp1056274183-84) [n:127.0.0.1:36999_solr c:testschemaapi s:shard1 r:core_node2 x:testschemaapi_shard1_replica1] o.a.s.c.ShardLeaderElectionContext Enough replicas found to continue.
   [junit4]   2> 7322 INFO  (qtp1056274183-84) [n:127.0.0.1:36999_solr c:testschemaapi s:shard1 r:core_node2 x:testschemaapi_shard1_replica1] o.a.s.c.ShardLeaderElectionContext I may be the new leader - try and sync
   [junit4]   2> 7322 INFO  (OverseerStateUpdate-96520007493681157-127.0.0.1:44847_solr-n_0000000000) [n:127.0.0.1:44847_solr    ] o.a.s.c.Overseer processMessage: queueSize: 1, message = {
   [junit4]   2>   "operation":"leader",
   [junit4]   2>   "shard":"shard1",
   [junit4]   2>   "collection":"testschemaapi"} current state version: 0
   [junit4]   2> 7323 INFO  (qtp1056274183-84) [n:127.0.0.1:36999_solr c:testschemaapi s:shard1 r:core_node2 x:testschemaapi_shard1_replica1] o.a.s.c.SyncStrategy Sync replicas to http://127.0.0.1:36999/solr/testschemaapi_shard1_replica1/
   [junit4]   2> 7326 INFO  (qtp1056274183-84) [n:127.0.0.1:36999_solr c:testschemaapi s:shard1 r:core_node2 x:testschemaapi_shard1_replica1] o.a.s.u.PeerSync PeerSync: core=testschemaapi_shard1_replica1 url=http://127.0.0.1:36999/solr START replicas=[http://127.0.0.1:44847/solr/testschemaapi_shard1_replica2/] nUpdates=100
   [junit4]   2> 7328 INFO  (qtp1056274183-84) [n:127.0.0.1:36999_solr c:testschemaapi s:shard1 r:core_node2 x:testschemaapi_shard1_replica1] o.a.s.u.PeerSync PeerSync: core=testschemaapi_shard1_replica1 url=http://127.0.0.1:36999/solr DONE.  We have no versions.  sync failed.
   [junit4]   2> 7328 INFO  (qtp1056274183-84) [n:127.0.0.1:36999_solr c:testschemaapi s:shard1 r:core_node2 x:testschemaapi_shard1_replica1] o.a.s.c.SyncStrategy Leader's attempt to sync with shard failed, moving to the next candidate
   [junit4]   2> 7328 INFO  (qtp1056274183-84) [n:127.0.0.1:36999_solr c:testschemaapi s:shard1 r:core_node2 x:testschemaapi_shard1_replica1] o.a.s.c.ShardLeaderElectionContext We failed sync, but we have no versions - we can't sync in that case - we were active before, so become leader anyway
   [junit4]   2> 7333 INFO  (qtp1485363372-85) [n:127.0.0.1:44847_solr c:testschemaapi s:shard1 r:core_node1 x:testschemaapi_shard1_replica2] o.a.s.c.S.Request [testschemaapi_shard1_replica2]  webapp=/solr path=/get params={distrib=false&qt=/get&fingerprint=false&getVersions=100&wt=javabin&version=2} status=0 QTime=0
   [junit4]   2> 7333 INFO  (qtp1056274183-84) [n:127.0.0.1:36999_solr c:testschemaapi s:shard1 r:core_node2 x:testschemaapi_shard1_replica1] o.a.s.c.c.SolrZkClient makePath: /collections/testschemaapi/leaders/shard1
   [junit4]   2> 7339 INFO  (qtp1056274183-84) [n:127.0.0.1:36999_solr c:testschemaapi s:shard1 r:core_node2 x:testschemaapi_shard1_replica1] o.a.s.c.ShardLeaderElectionContextBase Creating leader registration node /collections/testschemaapi/leaders/shard1/leader after winning as /collections/testschemaapi/leader_elect/shard1/election/96520007493681158-core_node2-n_0000000000
   [junit4]   2> 7353 INFO  (qtp1056274183-84) [n:127.0.0.1:36999_solr c:testschemaapi s:shard1 r:core_node2 x:testschemaapi_shard1_replica1] o.a.s.c.ShardLeaderElectionContext I am the new leader: http://127.0.0.1:36999/solr/testschemaapi_shard1_replica1/ shard1
   [junit4]   2> 7354 INFO  (OverseerStateUpdate-96520007493681157-127.0.0.1:44847_solr-n_0000000000) [n:127.0.0.1:44847_solr    ] o.a.s.c.Overseer processMessage: queueSize: 1, message = {
   [junit4]   2>   "operation":"leader",
   [junit4]   2>   "shard":"shard1",
   [junit4]   2>   "collection":"testschemaapi",
   [junit4]   2>   "base_url":"http://127.0.0.1:36999/solr",
   [junit4]   2>   "core":"testschemaapi_shard1_replica1",
   [junit4]   2>   "state":"active"} current state version: 0
   [junit4]   2> 7456 INFO  (OverseerStateUpdate-96520007493681157-127.0.0.1:44847_solr-n_0000000000) [n:127.0.0.1:44847_solr    ] o.a.s.c.o.ZkStateWriter going to update_collection /collections/testschemaapi/state.json version: 1
   [junit4]   2> 7457 INFO  (zkCallback-18-thread-1-processing-n:127.0.0.1:36999_solr) [n:127.0.0.1:36999_solr    ] o.a.s.c.c.ZkStateReader A cluster state change: [WatchedEvent state:SyncConnected type:NodeDataChanged path:/collections/testschemaapi/state.json] for collection [testschemaapi] has occurred - updating... (live nodes size: [2])
   [junit4]   2> 7457 INFO  (zkCallback-17-thread-2-processing-n:127.0.0.1:44847_solr) [n:127.0.0.1:44847_solr    ] o.a.s.c.c.ZkStateReader A cluster state change: [WatchedEvent state:SyncConnected type:NodeDataChanged path:/collections/testschemaapi/state.json] for collection [testschemaapi] has occurred - updating... (live nodes size: [2])
   [junit4]   2> 7457 INFO  (zkCallback-18-thread-1-processing-n:127.0.0.1:36999_solr) [n:127.0.0.1:36999_solr    ] o.a.s.c.c.ZkStateReader Updating data for [testschemaapi] from [1] to [2]
   [junit4]   2> 7457 INFO  (zkCallback-17-thread-2-processing-n:127.0.0.1:44847_solr) [n:127.0.0.1:44847_solr    ] o.a.s.c.c.ZkStateReader Updating data for [testschemaapi] from [1] to [2]
   [junit4]   2> 7504 INFO  (qtp1056274183-84) [n:127.0.0.1:36999_solr c:testschemaapi s:shard1 r:core_node2 x:testschemaapi_shard1_replica1] o.a.s.c.ZkController We are http://127.0.0.1:36999/solr/testschemaapi_shard1_replica1/ and leader is http://127.0.0.1:36999/solr/testschemaapi_shard1_replica1/
   [junit4]   2> 7505 INFO  (qtp1056274183-84) [n:127.0.0.1:36999_solr c:testschemaapi s:shard1 r:core_node2 x:testschemaapi_shard1_replica1] o.a.s.c.ZkController No LogReplay needed for core=testschemaapi_shard1_replica1 baseURL=http://127.0.0.1:36999/solr
   [junit4]   2> 7505 INFO  (qtp1056274183-84) [n:127.0.0.1:36999_solr c:testschemaapi s:shard1 r:core_node2 x:testschemaapi_shard1_replica1] o.a.s.c.ZkController I am the leader, no recovery necessary
   [junit4]   2> 7505 INFO  (qtp1056274183-84) [n:127.0.0.1:36999_solr c:testschemaapi s:shard1 r:core_node2 x:testschemaapi_shard1_replica1] o.a.s.c.ZkController publishing state=active
   [junit4]   2> 7507 INFO  (OverseerStateUpdate-96520007493681157-127.0.0.1:44847_solr-n_0000000000) [n:127.0.0.1:44847_solr    ] o.a.s.c.Overseer processMessage: queueSize: 1, message = {
   [junit4]   2>   "core":"testschemaapi_shard1_replica1",
   [junit4]   2>   "core_node_name":"core_node2",
   [junit4]   2>   "roles":null,
   [junit4]   2>   "base_url":"http://127.0.0.1:36999/solr",
   [junit4]   2>   "node_name":"127.0.0.1:36999_solr",
   [junit4]   2>   "numShards":"1",
   [junit4]   2>   "state":"active",
   [junit4]   2>   "shard":"shard1",
   [junit4]   2>   "collection":"testschemaapi",
   [junit4]   2>   "operation":"state"} current state version: 0
   [junit4]   2> 7507 INFO  (OverseerStateUpdate-96520007493681157-127.0.0.1:44847_solr-n_0000000000) [n:127.0.0.1:44847_solr    ] o.a.s.c.o.ReplicaMutator Update state numShards=1 message={
   [junit4]   2>   "core":"testschemaapi_shard1_replica1",
   [junit4]   2>   "core_node_name":"core_node2",
   [junit4]   2>   "roles":null,
   [junit4]   2>   "base_url":"http://127.0.0.1:36999/solr",
   [junit4]   2>   "node_name":"127.0.0.1:36999_solr",
   [junit4]   2>   "numShards":"1",
   [junit4]   2>   "state":"active",
   [junit4]   2>   "shard":"shard1",
   [junit4]   2>   "collection":"testschemaapi",
   [junit4]   2>   "operation":"state"}
   [junit4]   2> 7508 INFO  (qtp1056274183-84) [n:127.0.0.1:36999_solr c:testschemaapi s:shard1 r:core_node2 x:testschemaapi_shard1_replica1] o.a.s.s.HttpSolrCall [admin] webapp=null path=/admin/cores params={qt=/admin/cores&collection.configName=conf1&name=testschemaapi_shard1_replica1&action=CREATE&numShards=1&collection=testschemaapi&shard=shard1&wt=javabin&version=2} status=0 QTime=1292
   [junit4]   2> 7610 INFO  (OverseerStateUpdate-96520007493681157-127.0.0.1:44847_solr-n_0000000000) [n:127.0.0.1:44847_solr    ] o.a.s.c.o.ZkStateWriter going to update_collection /collections/testschemaapi/state.json version: 2
   [junit4]   2> 7613 INFO  (zkCallback-18-thread-1-processing-n:127.0.0.1:36999_solr) [n:127.0.0.1:36999_solr    ] o.a.s.c.c.ZkStateReader A cluster state change: [WatchedEvent state:SyncConnected type:NodeDataChanged path:/collections/testschemaapi/state.json] for collection [testschemaapi] has occurred - updating... (live nodes size: [2])
   [junit4]   2> 7613 INFO  (zkCallback-17-thread-1-processing-n:127.0.0.1:44847_solr) [n:127.0.0.1:44847_solr    ] o.a.s.c.c.ZkStateReader A cluster state change: [WatchedEvent state:SyncConnected type:NodeDataChanged path:/collections/testschemaapi/state.json] for collection [testschemaapi] has occurred - updating... (live nodes size: [2])
   [junit4]   2> 7613 INFO  (zkCallback-18-thread-1-processing-n:127.0.0.1:36999_solr) [n:127.0.0.1:36999_solr    ] o.a.s.c.c.ZkStateReader Updating data for [testschemaapi] from [2] to [3]
   [junit4]   2> 7614 INFO  (zkCallback-17-thread-1-processing-n:127.0.0.1:44847_solr) [n:127.0.0.1:44847_solr    ] o.a.s.c.c.ZkStateReader Updating data for [testschemaapi] from [2] to [3]
   [junit4]   2> 8324 INFO  (qtp1485363372-83) [n:127.0.0.1:44847_solr c:testschemaapi s:shard1 r:core_node1 x:testschemaapi_shard1_replica2] o.a.s.c.ZkController We are http://127.0.0.1:44847/solr/testschemaapi_shard1_replica2/ and leader is http://127.0.0.1:36999/solr/testschemaapi_shard1_replica1/
   [junit4]   2> 8324 INFO  (qtp1485363372-83) [n:127.0.0.1:44847_solr c:testschemaapi s:shard1 r:core_node1 x:testschemaapi_shard1_replica2] o.a.s.c.ZkController No LogReplay needed for core=testschemaapi_shard1_replica2 baseURL=http://127.0.0.1:44847/solr
   [junit4]   2> 8324 INFO  (qtp1485363372-83) [n:127.0.0.1:44847_solr c:testschemaapi s:shard1 r:core_node1 x:testschemaapi_shard1_replica2] o.a.s.c.ZkController Core needs to recover:testschemaapi_shard1_replica2
   [junit4]   2> 8325 INFO  (updateExecutor-13-thread-1-processing-n:127.0.0.1:44847_solr x:testschemaapi_shard1_replica2 s:shard1 c:testschemaapi r:core_node1) [n:127.0.0.1:44847_solr c:testschemaapi s:shard1 r:core_node1 x:testschemaapi_shard1_replica2] o.a.s.u.DefaultSolrCoreState Running recovery
   [junit4]   2> 8327 INFO  (qtp1485363372-83) [n:127.0.0.1:44847_solr c:testschemaapi s:shard1 r:core_node1 x:testschemaapi_shard1_replica2] o.a.s.s.HttpSolrCall [admin] webapp=null path=/admin/cores params={qt=/admin/cores&collection.configName=conf1&name=testschemaapi_shard1_replica2&action=CREATE&numShards=1&collection=testschemaapi&shard=shard1&wt=javabin&version=2} status=0 QTime=2120
   [junit4]   2> 8339 INFO  (recoveryExecutor-14-thread-1-processing-n:127.0.0.1:44847_solr x:testschemaapi_shard1_replica2 s:shard1 c:testschemaapi r:core_node1) [n:127.0.0.1:44847_solr c:testschemaapi s:shard1 r:core_node1 x:testschemaapi_shard1_replica2] o.a.s.c.RecoveryStrategy Starting recovery process. recoveringAfterStartup=true
   [junit4]   2> 8339 INFO  (recoveryExecutor-14-thread-1-processing-n:127.0.0.1:44847_solr x:testschemaapi_shard1_replica2 s:shard1 c:testschemaapi r:core_node1) [n:127.0.0.1:44847_solr c:testschemaapi s:shard1 r:core_node1 x:testschemaapi_shard1_replica2] o.a.s.c.RecoveryStrategy ###### startupVersions=[[]]
   [junit4]   2> 8339 INFO  (recoveryExecutor-14-thread-1-processing-n:127.0.0.1:44847_solr x:testschemaapi_shard1_replica2 s:shard1 c:testschemaapi r:core_node1) [n:127.0.0.1:44847_solr c:testschemaapi s:shard1 r:core_node1 x:testschemaapi_shard1_replica2] o.a.s.c.RecoveryStrategy Begin buffering updates. core=[testschemaapi_shard1_replica2]
   [junit4]   2> 8339 INFO  (recoveryExecutor-14-thread-1-processing-n:127.0.0.1:44847_solr x:testschemaapi_shard1_replica2 s:shard1 c:testschemaapi r:core_node1) [n:127.0.0.1:44847_solr c:testschemaapi s:shard1 r:core_node1 x:testschemaapi_shard1_replica2] o.a.s.u.UpdateLog Starting to buffer updates. FSUpdateLog{state=ACTIVE, tlog=null}
   [junit4]   2> 8339 INFO  (recoveryExecutor-14-thread-1-processing-n:127.0.0.1:44847_solr x:testschemaapi_shard1_replica2 s:shard1 c:testschemaapi r:core_node1) [n:127.0.0.1:44847_solr c:testschemaapi s:shard1 r:core_node1 x:testschemaapi_shard1_replica2] o.a.s.c.RecoveryStrategy Publishing state of core [testschemaapi_shard1_replica2] as recovering, leader is [http://127.0.0.1:36999/solr/testschemaapi_shard1_replica1/] and I am [http://127.0.0.1:44847/solr/testschemaapi_shard1_replica2/]
   [junit4]   2> 8339 INFO  (recoveryExecutor-14-thread-1-processing-n:127.0.0.1:44847_solr x:testschemaapi_shard1_replica2 s:shard1 c:testschemaapi r:core_node1) [n:127.0.0.1:44847_solr c:testschemaapi s:shard1 r:core_node1 x:testschemaapi_shard1_replica2] o.a.s.c.ZkController publishing state=recovering
   [junit4]   2> 8341 INFO  (OverseerStateUpdate-96520007493681157-127.0.0.1:44847_solr-n_0000000000) [n:127.0.0.1:44847_solr    ] o.a.s.c.Overseer processMessage: queueSize: 1, message = {
   [junit4]   2>   "core":"testschemaapi_shard1_replica2",
   [junit4]   2>   "core_node_name":"core_node1",
   [junit4]   2>   "roles":null,
   [junit4]   2>   "base_url":"http://127.0.0.1:44847/solr",
   [junit4]   2>   "node_name":"127.0.0.1:44847_solr",
   [junit4]   2>   "numShards":"1",
   [junit4]   2>   "state":"recovering",
   [junit4]   2>   "shard":"shard1",
   [junit4]   2>   "collection":"testschemaapi",
   [junit4]   2>   "operation":"state"} current state version: 0
   [junit4]   2> 8341 INFO  (OverseerStateUpdate-96520007493681157-127.0.0.1:44847_solr-n_0000000000) [n:127.0.0.1:44847_solr    ] o.a.s.c.o.ReplicaMutator Update state numShards=1 message={
   [junit4]   2>   "core":"testschemaapi_shard1_replica2",
   [junit4]   2>   "core_node_name":"core_node1",
   [junit4]   2>   "roles":null,
   [junit4]   2>   "base_url":"http://127.0.0.1:44847/solr",
   [junit4]   2>   "node_name":"127.0.0.1:44847_solr",
   [junit4]   2>   "numShards":"1",
   [junit4]   2>   "state":"recovering",
   [junit4]   2>   "shard":"shard1",
   [junit4]   2>   "collection":"testschemaapi",
   [junit4]   2>   "operation":"state"}
   [junit4]   2> 8346 INFO  (recoveryExecutor-14-thread-1-processing-n:127.0.0.1:44847_solr x:testschemaa

[...truncated too long message...]

t4]   2> 	3	/solr/aliases.json
   [junit4]   2> 	2	/solr/security.json
   [junit4]   2> 
   [junit4]   2> Maximum concurrent data watches above limit:
   [junit4]   2> 
   [junit4]   2> 	3	/solr/clusterstate.json
   [junit4]   2> 	2	/solr/collections/testschemaapi/state.json
   [junit4]   2> 
   [junit4]   2> Maximum concurrent children watches above limit:
   [junit4]   2> 
   [junit4]   2> 	9	/solr/overseer/collection-queue-work
   [junit4]   2> 	8	/solr/overseer/queue
   [junit4]   2> 	3	/solr/live_nodes
   [junit4]   2> 	3	/solr/collections
   [junit4]   2> 	3	/solr/overseer/queue-work
   [junit4]   2> 
   [junit4]   2> 17787 INFO  (TEST-TestManagedSchemaAPI.test-seed#[92F9D8EC820FF319]) [    ] o.a.s.SolrTestCaseJ4 ###Ending test
   [junit4]   2> 17788 INFO  (Thread-60) [n:127.0.0.1:36999_solr c:testschemaapi s:shard1 r:core_node2 x:testschemaapi_shard1_replica1] o.a.s.c.SolrCore [testschemaapi_shard1_replica1] Closing main searcher on request.
   [junit4]   2> 17788 INFO  (Thread-61) [n:127.0.0.1:44847_solr c:testschemaapi s:shard1 r:core_node1 x:testschemaapi_shard1_replica2] o.a.s.c.SolrCore [testschemaapi_shard1_replica2] Closing main searcher on request.
   [junit4]   2> 17788 INFO  (Thread-60) [n:127.0.0.1:36999_solr c:testschemaapi s:shard1 r:core_node2 x:testschemaapi_shard1_replica1] o.a.s.c.CachingDirectoryFactory Closing MockDirectoryFactory - 2 directories currently being tracked
   [junit4]   2> 17788 INFO  (Thread-61) [n:127.0.0.1:44847_solr c:testschemaapi s:shard1 r:core_node1 x:testschemaapi_shard1_replica2] o.a.s.c.CachingDirectoryFactory Closing MockDirectoryFactory - 2 directories currently being tracked
   [junit4]   2> 17788 INFO  (Thread-60) [n:127.0.0.1:36999_solr c:testschemaapi s:shard1 r:core_node2 x:testschemaapi_shard1_replica1] o.a.s.c.CachingDirectoryFactory looking to close /home/jenkins/workspace/Lucene-Solr-5.5-Linux/solr/build/solr-core/test/J2/temp/solr.schema.TestManagedSchemaAPI_92F9D8EC820FF319-001/tempDir-001/node1/./testschemaapi_shard1_replica1/data [CachedDir<<refCount=0;path=/home/jenkins/workspace/Lucene-Solr-5.5-Linux/solr/build/solr-core/test/J2/temp/solr.schema.TestManagedSchemaAPI_92F9D8EC820FF319-001/tempDir-001/node1/./testschemaapi_shard1_replica1/data;done=false>>]
   [junit4]   2> 17788 INFO  (Thread-61) [n:127.0.0.1:44847_solr c:testschemaapi s:shard1 r:core_node1 x:testschemaapi_shard1_replica2] o.a.s.c.CachingDirectoryFactory looking to close /home/jenkins/workspace/Lucene-Solr-5.5-Linux/solr/build/solr-core/test/J2/temp/solr.schema.TestManagedSchemaAPI_92F9D8EC820FF319-001/tempDir-001/node2/./testschemaapi_shard1_replica2/data [CachedDir<<refCount=0;path=/home/jenkins/workspace/Lucene-Solr-5.5-Linux/solr/build/solr-core/test/J2/temp/solr.schema.TestManagedSchemaAPI_92F9D8EC820FF319-001/tempDir-001/node2/./testschemaapi_shard1_replica2/data;done=false>>]
   [junit4]   2> 17788 INFO  (Thread-60) [n:127.0.0.1:36999_solr c:testschemaapi s:shard1 r:core_node2 x:testschemaapi_shard1_replica1] o.a.s.c.CachingDirectoryFactory Closing directory: /home/jenkins/workspace/Lucene-Solr-5.5-Linux/solr/build/solr-core/test/J2/temp/solr.schema.TestManagedSchemaAPI_92F9D8EC820FF319-001/tempDir-001/node1/./testschemaapi_shard1_replica1/data
   [junit4]   2> 17788 INFO  (Thread-61) [n:127.0.0.1:44847_solr c:testschemaapi s:shard1 r:core_node1 x:testschemaapi_shard1_replica2] o.a.s.c.CachingDirectoryFactory Closing directory: /home/jenkins/workspace/Lucene-Solr-5.5-Linux/solr/build/solr-core/test/J2/temp/solr.schema.TestManagedSchemaAPI_92F9D8EC820FF319-001/tempDir-001/node2/./testschemaapi_shard1_replica2/data
   [junit4]   2> 17788 INFO  (Thread-60) [n:127.0.0.1:36999_solr c:testschemaapi s:shard1 r:core_node2 x:testschemaapi_shard1_replica1] o.a.s.c.CachingDirectoryFactory looking to close /home/jenkins/workspace/Lucene-Solr-5.5-Linux/solr/build/solr-core/test/J2/temp/solr.schema.TestManagedSchemaAPI_92F9D8EC820FF319-001/tempDir-001/node1/./testschemaapi_shard1_replica1/data/index [CachedDir<<refCount=0;path=/home/jenkins/workspace/Lucene-Solr-5.5-Linux/solr/build/solr-core/test/J2/temp/solr.schema.TestManagedSchemaAPI_92F9D8EC820FF319-001/tempDir-001/node1/./testschemaapi_shard1_replica1/data/index;done=false>>]
   [junit4]   2> 17788 INFO  (Thread-61) [n:127.0.0.1:44847_solr c:testschemaapi s:shard1 r:core_node1 x:testschemaapi_shard1_replica2] o.a.s.c.CachingDirectoryFactory looking to close /home/jenkins/workspace/Lucene-Solr-5.5-Linux/solr/build/solr-core/test/J2/temp/solr.schema.TestManagedSchemaAPI_92F9D8EC820FF319-001/tempDir-001/node2/./testschemaapi_shard1_replica2/data/index [CachedDir<<refCount=0;path=/home/jenkins/workspace/Lucene-Solr-5.5-Linux/solr/build/solr-core/test/J2/temp/solr.schema.TestManagedSchemaAPI_92F9D8EC820FF319-001/tempDir-001/node2/./testschemaapi_shard1_replica2/data/index;done=false>>]
   [junit4]   2> 17788 INFO  (Thread-60) [n:127.0.0.1:36999_solr c:testschemaapi s:shard1 r:core_node2 x:testschemaapi_shard1_replica1] o.a.s.c.CachingDirectoryFactory Closing directory: /home/jenkins/workspace/Lucene-Solr-5.5-Linux/solr/build/solr-core/test/J2/temp/solr.schema.TestManagedSchemaAPI_92F9D8EC820FF319-001/tempDir-001/node1/./testschemaapi_shard1_replica1/data/index
   [junit4]   2> 17788 INFO  (SUITE-TestManagedSchemaAPI-seed#[92F9D8EC820FF319]-worker) [    ] o.a.s.SolrTestCaseJ4 ###deleteCore
   [junit4]   2> 17789 INFO  (Thread-61) [n:127.0.0.1:44847_solr c:testschemaapi s:shard1 r:core_node1 x:testschemaapi_shard1_replica2] o.a.s.c.CachingDirectoryFactory Closing directory: /home/jenkins/workspace/Lucene-Solr-5.5-Linux/solr/build/solr-core/test/J2/temp/solr.schema.TestManagedSchemaAPI_92F9D8EC820FF319-001/tempDir-001/node2/./testschemaapi_shard1_replica2/data/index
   [junit4]   2> ObjectTracker found 0 object(s) that were not released!!! [MockDirectoryWrapper]
   [junit4]   2> 17790 WARN  (Thread-60) [n:127.0.0.1:36999_solr c:testschemaapi s:shard1 r:core_node2 x:testschemaapi_shard1_replica1] o.a.s.c.ZkController listener throws error
   [junit4]   2> org.apache.solr.common.SolrException: Unable to reload core [testschemaapi_shard1_replica1]
   [junit4]   2> 	at org.apache.solr.core.CoreContainer.reload(CoreContainer.java:927)
   [junit4]   2> 	at org.apache.solr.core.SolrCore$11.run(SolrCore.java:2623)
   [junit4]   2> 	at org.apache.solr.cloud.ZkController$5.run(ZkController.java:2480)
   [junit4]   2> Caused by: org.apache.solr.common.SolrException: Could not find config name for collection:testschemaapi
   [junit4]   2> 	at org.apache.solr.core.SolrCore.<init>(SolrCore.java:820)
   [junit4]   2> 	at org.apache.solr.core.SolrCore.reload(SolrCore.java:461)
   [junit4]   2> 	at org.apache.solr.core.CoreContainer.reload(CoreContainer.java:922)
   [junit4]   2> 	... 2 more
   [junit4]   2> Caused by: org.apache.solr.common.SolrException: Could not find config name for collection:testschemaapi
   [junit4]   2> 	at org.apache.solr.rest.ManagedResourceStorage.newStorageIO(ManagedResourceStorage.java:101)
   [junit4]   2> 	at org.apache.solr.core.SolrCore.initRestManager(SolrCore.java:2417)
   [junit4]   2> 	at org.apache.solr.core.SolrCore.<init>(SolrCore.java:796)
   [junit4]   2> 	... 4 more
   [junit4]   2> 17790 WARN  (Thread-61) [n:127.0.0.1:44847_solr c:testschemaapi s:shard1 r:core_node1 x:testschemaapi_shard1_replica2] o.a.s.c.ZkController listener throws error
   [junit4]   2> org.apache.solr.common.SolrException: Unable to reload core [testschemaapi_shard1_replica2]
   [junit4]   2> 	at org.apache.solr.core.CoreContainer.reload(CoreContainer.java:927)
   [junit4]   2> 	at org.apache.solr.core.SolrCore$11.run(SolrCore.java:2623)
   [junit4]   2> 	at org.apache.solr.cloud.ZkController$5.run(ZkController.java:2480)
   [junit4]   2> Caused by: org.apache.solr.common.SolrException: Could not find config name for collection:testschemaapi
   [junit4]   2> 	at org.apache.solr.core.SolrCore.<init>(SolrCore.java:820)
   [junit4]   2> 	at org.apache.solr.core.SolrCore.reload(SolrCore.java:461)
   [junit4]   2> 	at org.apache.solr.core.CoreContainer.reload(CoreContainer.java:922)
   [junit4]   2> 	... 2 more
   [junit4]   2> Caused by: org.apache.solr.common.SolrException: Could not find config name for collection:testschemaapi
   [junit4]   2> 	at org.apache.solr.rest.ManagedResourceStorage.newStorageIO(ManagedResourceStorage.java:101)
   [junit4]   2> 	at org.apache.solr.core.SolrCore.initRestManager(SolrCore.java:2417)
   [junit4]   2> 	at org.apache.solr.core.SolrCore.<init>(SolrCore.java:796)
   [junit4]   2> 	... 4 more
   [junit4]   2> Sep 02, 2016 1:07:26 AM com.carrotsearch.randomizedtesting.ThreadLeakControl checkThreadLeaks
   [junit4]   2> WARNING: Will linger awaiting termination of 4 leaked thread(s).
   [junit4]   2> NOTE: test params are: codec=CheapBastard, sim=RandomSimilarity(queryNorm=true,coord=yes): {}, locale=ar-SD, timezone=Asia/Novosibirsk
   [junit4]   2> NOTE: Linux 4.4.0-31-generic amd64/Oracle Corporation 1.8.0_102 (64-bit)/cpus=12,threads=1,free=447674296,total=508952576
   [junit4]   2> NOTE: All tests run in this JVM: [ShowFileRequestHandlerTest, ReplicationFactorTest, DirectUpdateHandlerOptimizeTest, TestManagedSchemaAPI]
   [junit4]   2> NOTE: reproduce with: ant test  -Dtestcase=TestManagedSchemaAPI -Dtests.seed=92F9D8EC820FF319 -Dtests.multiplier=3 -Dtests.slow=true -Dtests.locale=ar-SD -Dtests.timezone=Asia/Novosibirsk -Dtests.asserts=true -Dtests.file.encoding=ISO-8859-1
   [junit4] ERROR   0.00s J2 | TestManagedSchemaAPI (suite) <<<
   [junit4]    > Throwable #1: java.lang.AssertionError: ObjectTracker found 0 object(s) that were not released!!! [MockDirectoryWrapper]
   [junit4]    > 	at __randomizedtesting.SeedInfo.seed([92F9D8EC820FF319]:0)
   [junit4]    > 	at org.apache.solr.SolrTestCaseJ4.afterClass(SolrTestCaseJ4.java:238)
   [junit4]    > 	at java.lang.Thread.run(Thread.java:745)
   [junit4] Completed [8/575 (1!)] on J2 in 12.55s, 1 test, 1 failure <<< FAILURES!

[...truncated 58481 lines...]


Mime
View raw message