lucene-dev mailing list archives

Site index · List index
Message view « Date » · « Thread »
Top « Date » · « Thread »
From Policeman Jenkins Server <jenk...@thetaphi.de>
Subject [JENKINS] Lucene-Solr-5.5-Linux (32bit/jdk1.7.0_80) - Build # 363 - Still Unstable!
Date Thu, 01 Sep 2016 18:26:14 GMT
Build: http://jenkins.thetaphi.de/job/Lucene-Solr-5.5-Linux/363/
Java: 32bit/jdk1.7.0_80 -client -XX:+UseSerialGC

2 tests failed.
FAILED:  junit.framework.TestSuite.org.apache.solr.security.BasicAuthIntegrationTest

Error Message:
Suite timeout exceeded (>= 7200000 msec).

Stack Trace:
java.lang.Exception: Suite timeout exceeded (>= 7200000 msec).
	at __randomizedtesting.SeedInfo.seed([A3F55B0C9543EB14]:0)


FAILED:  org.apache.solr.security.BasicAuthIntegrationTest.testBasics

Error Message:
Test abandoned because suite timeout was reached.

Stack Trace:
java.lang.Exception: Test abandoned because suite timeout was reached.
	at __randomizedtesting.SeedInfo.seed([A3F55B0C9543EB14]:0)




Build Log:
[...truncated 12514 lines...]
   [junit4] Suite: org.apache.solr.security.BasicAuthIntegrationTest
   [junit4]   2> 2117770 INFO  (TEST-BasicAuthIntegrationTest.testBasics-seed#[A3F55B0C9543EB14]) [    ] o.a.s.c.ZkTestServer STARTING ZK TEST SERVER
   [junit4]   2> 2117770 INFO  (Thread-5536) [    ] o.a.s.c.ZkTestServer client port:0.0.0.0/0.0.0.0:0
   [junit4]   2> 2117770 INFO  (Thread-5536) [    ] o.a.s.c.ZkTestServer Starting server
   [junit4]   2> 2117870 INFO  (TEST-BasicAuthIntegrationTest.testBasics-seed#[A3F55B0C9543EB14]) [    ] o.a.s.c.ZkTestServer start zk server on port:36810
   [junit4]   2> 2117870 INFO  (TEST-BasicAuthIntegrationTest.testBasics-seed#[A3F55B0C9543EB14]) [    ] o.a.s.c.c.SolrZkClient Using default ZkCredentialsProvider
   [junit4]   2> 2117871 INFO  (TEST-BasicAuthIntegrationTest.testBasics-seed#[A3F55B0C9543EB14]) [    ] o.a.s.c.c.ConnectionManager Waiting for client to connect to ZooKeeper
   [junit4]   2> 2117899 INFO  (zkCallback-2333-thread-1) [    ] o.a.s.c.c.ConnectionManager Watcher org.apache.solr.common.cloud.ConnectionManager@1041560 name:ZooKeeperConnection Watcher:127.0.0.1:36810 got event WatchedEvent state:SyncConnected type:None path:null path:null type:None
   [junit4]   2> 2117899 INFO  (TEST-BasicAuthIntegrationTest.testBasics-seed#[A3F55B0C9543EB14]) [    ] o.a.s.c.c.ConnectionManager Client is connected to ZooKeeper
   [junit4]   2> 2117899 INFO  (TEST-BasicAuthIntegrationTest.testBasics-seed#[A3F55B0C9543EB14]) [    ] o.a.s.c.c.SolrZkClient Using default ZkACLProvider
   [junit4]   2> 2117899 INFO  (TEST-BasicAuthIntegrationTest.testBasics-seed#[A3F55B0C9543EB14]) [    ] o.a.s.c.c.SolrZkClient makePath: /solr/solr.xml
   [junit4]   2> 2118016 INFO  (jetty-launcher-2332-thread-1) [    ] o.e.j.s.Server jetty-9.2.13.v20150730
   [junit4]   2> 2118016 INFO  (jetty-launcher-2332-thread-3) [    ] o.e.j.s.Server jetty-9.2.13.v20150730
   [junit4]   2> 2118017 INFO  (jetty-launcher-2332-thread-5) [    ] o.e.j.s.Server jetty-9.2.13.v20150730
   [junit4]   2> 2118017 INFO  (jetty-launcher-2332-thread-4) [    ] o.e.j.s.Server jetty-9.2.13.v20150730
   [junit4]   2> 2118017 INFO  (jetty-launcher-2332-thread-2) [    ] o.e.j.s.Server jetty-9.2.13.v20150730
   [junit4]   2> 2118019 INFO  (jetty-launcher-2332-thread-1) [    ] o.e.j.s.h.ContextHandler Started o.e.j.s.ServletContextHandler@1777eb6{/solr,null,AVAILABLE}
   [junit4]   2> 2118019 INFO  (jetty-launcher-2332-thread-5) [    ] o.e.j.s.h.ContextHandler Started o.e.j.s.ServletContextHandler@2010b7{/solr,null,AVAILABLE}
   [junit4]   2> 2118019 INFO  (jetty-launcher-2332-thread-3) [    ] o.e.j.s.h.ContextHandler Started o.e.j.s.ServletContextHandler@158a93e{/solr,null,AVAILABLE}
   [junit4]   2> 2118019 INFO  (jetty-launcher-2332-thread-5) [    ] o.e.j.s.ServerConnector Started ServerConnector@5dd9b{HTTP/1.1}{127.0.0.1:32897}
   [junit4]   2> 2118019 INFO  (jetty-launcher-2332-thread-4) [    ] o.e.j.s.h.ContextHandler Started o.e.j.s.ServletContextHandler@763b90{/solr,null,AVAILABLE}
   [junit4]   2> 2118019 INFO  (jetty-launcher-2332-thread-5) [    ] o.e.j.s.Server Started @2119265ms
   [junit4]   2> 2118019 INFO  (jetty-launcher-2332-thread-1) [    ] o.e.j.s.ServerConnector Started ServerConnector@117fd96{HTTP/1.1}{127.0.0.1:34957}
   [junit4]   2> 2118019 INFO  (jetty-launcher-2332-thread-3) [    ] o.e.j.s.ServerConnector Started ServerConnector@13236d1{HTTP/1.1}{127.0.0.1:37235}
   [junit4]   2> 2118019 INFO  (jetty-launcher-2332-thread-1) [    ] o.e.j.s.Server Started @2119265ms
   [junit4]   2> 2118019 INFO  (jetty-launcher-2332-thread-3) [    ] o.e.j.s.Server Started @2119265ms
   [junit4]   2> 2118019 INFO  (jetty-launcher-2332-thread-1) [    ] o.a.s.c.s.e.JettySolrRunner Jetty properties: {hostContext=/solr, hostPort=34957}
   [junit4]   2> 2118019 INFO  (jetty-launcher-2332-thread-4) [    ] o.e.j.s.ServerConnector Started ServerConnector@17095ef{HTTP/1.1}{127.0.0.1:38125}
   [junit4]   2> 2118020 INFO  (jetty-launcher-2332-thread-3) [    ] o.a.s.c.s.e.JettySolrRunner Jetty properties: {hostPort=37235, hostContext=/solr}
   [junit4]   2> 2118019 INFO  (jetty-launcher-2332-thread-2) [    ] o.e.j.s.h.ContextHandler Started o.e.j.s.ServletContextHandler@823c3{/solr,null,AVAILABLE}
   [junit4]   2> 2118020 INFO  (jetty-launcher-2332-thread-1) [    ] o.a.s.s.SolrDispatchFilter SolrDispatchFilter.init(): sun.misc.Launcher$AppClassLoader@752144
   [junit4]   2> 2118019 INFO  (jetty-launcher-2332-thread-5) [    ] o.a.s.c.s.e.JettySolrRunner Jetty properties: {hostPort=32897, hostContext=/solr}
   [junit4]   2> 2118020 INFO  (jetty-launcher-2332-thread-3) [    ] o.a.s.s.SolrDispatchFilter SolrDispatchFilter.init(): sun.misc.Launcher$AppClassLoader@752144
   [junit4]   2> 2118020 INFO  (jetty-launcher-2332-thread-1) [    ] o.a.s.c.SolrResourceLoader new SolrResourceLoader for directory: '/home/jenkins/workspace/Lucene-Solr-5.5-Linux/solr/build/solr-core/test/J2/temp/solr.security.BasicAuthIntegrationTest_A3F55B0C9543EB14-001/tempDir-001/node1'
   [junit4]   2> 2118020 INFO  (jetty-launcher-2332-thread-3) [    ] o.a.s.c.SolrResourceLoader new SolrResourceLoader for directory: '/home/jenkins/workspace/Lucene-Solr-5.5-Linux/solr/build/solr-core/test/J2/temp/solr.security.BasicAuthIntegrationTest_A3F55B0C9543EB14-001/tempDir-001/node3'
   [junit4]   2> 2118020 INFO  (jetty-launcher-2332-thread-5) [    ] o.a.s.s.SolrDispatchFilter SolrDispatchFilter.init(): sun.misc.Launcher$AppClassLoader@752144
   [junit4]   2> 2118020 INFO  (jetty-launcher-2332-thread-1) [    ] o.a.s.c.SolrResourceLoader JNDI not configured for solr (NoInitialContextEx)
   [junit4]   2> 2118020 INFO  (jetty-launcher-2332-thread-3) [    ] o.a.s.c.SolrResourceLoader JNDI not configured for solr (NoInitialContextEx)
   [junit4]   2> 2118020 INFO  (jetty-launcher-2332-thread-5) [    ] o.a.s.c.SolrResourceLoader new SolrResourceLoader for directory: '/home/jenkins/workspace/Lucene-Solr-5.5-Linux/solr/build/solr-core/test/J2/temp/solr.security.BasicAuthIntegrationTest_A3F55B0C9543EB14-001/tempDir-001/node5'
   [junit4]   2> 2118020 INFO  (jetty-launcher-2332-thread-3) [    ] o.a.s.c.SolrResourceLoader solr home defaulted to 'solr/' (could not find system property or JNDI)
   [junit4]   2> 2118020 INFO  (jetty-launcher-2332-thread-4) [    ] o.e.j.s.Server Started @2119266ms
   [junit4]   2> 2118020 INFO  (jetty-launcher-2332-thread-5) [    ] o.a.s.c.SolrResourceLoader JNDI not configured for solr (NoInitialContextEx)
   [junit4]   2> 2118020 INFO  (jetty-launcher-2332-thread-4) [    ] o.a.s.c.s.e.JettySolrRunner Jetty properties: {hostPort=38125, hostContext=/solr}
   [junit4]   2> 2118020 INFO  (jetty-launcher-2332-thread-3) [    ] o.a.s.c.c.SolrZkClient Using default ZkCredentialsProvider
   [junit4]   2> 2118020 INFO  (jetty-launcher-2332-thread-5) [    ] o.a.s.c.SolrResourceLoader solr home defaulted to 'solr/' (could not find system property or JNDI)
   [junit4]   2> 2118020 INFO  (jetty-launcher-2332-thread-1) [    ] o.a.s.c.SolrResourceLoader solr home defaulted to 'solr/' (could not find system property or JNDI)
   [junit4]   2> 2118020 INFO  (jetty-launcher-2332-thread-2) [    ] o.e.j.s.ServerConnector Started ServerConnector@7cd946{HTTP/1.1}{127.0.0.1:40278}
   [junit4]   2> 2118021 INFO  (jetty-launcher-2332-thread-4) [    ] o.a.s.s.SolrDispatchFilter SolrDispatchFilter.init(): sun.misc.Launcher$AppClassLoader@752144
   [junit4]   2> 2118021 INFO  (jetty-launcher-2332-thread-1) [    ] o.a.s.c.c.SolrZkClient Using default ZkCredentialsProvider
   [junit4]   2> 2118021 INFO  (jetty-launcher-2332-thread-4) [    ] o.a.s.c.SolrResourceLoader new SolrResourceLoader for directory: '/home/jenkins/workspace/Lucene-Solr-5.5-Linux/solr/build/solr-core/test/J2/temp/solr.security.BasicAuthIntegrationTest_A3F55B0C9543EB14-001/tempDir-001/node4'
   [junit4]   2> 2118021 INFO  (jetty-launcher-2332-thread-2) [    ] o.e.j.s.Server Started @2119267ms
   [junit4]   2> 2118021 INFO  (jetty-launcher-2332-thread-5) [    ] o.a.s.c.c.SolrZkClient Using default ZkCredentialsProvider
   [junit4]   2> 2118021 INFO  (jetty-launcher-2332-thread-4) [    ] o.a.s.c.SolrResourceLoader JNDI not configured for solr (NoInitialContextEx)
   [junit4]   2> 2118021 INFO  (jetty-launcher-2332-thread-2) [    ] o.a.s.c.s.e.JettySolrRunner Jetty properties: {hostPort=40278, hostContext=/solr}
   [junit4]   2> 2118021 INFO  (jetty-launcher-2332-thread-4) [    ] o.a.s.c.SolrResourceLoader solr home defaulted to 'solr/' (could not find system property or JNDI)
   [junit4]   2> 2118021 INFO  (jetty-launcher-2332-thread-3) [    ] o.a.s.c.c.ConnectionManager Waiting for client to connect to ZooKeeper
   [junit4]   2> 2118021 INFO  (jetty-launcher-2332-thread-2) [    ] o.a.s.s.SolrDispatchFilter SolrDispatchFilter.init(): sun.misc.Launcher$AppClassLoader@752144
   [junit4]   2> 2118021 INFO  (jetty-launcher-2332-thread-4) [    ] o.a.s.c.c.SolrZkClient Using default ZkCredentialsProvider
   [junit4]   2> 2118021 INFO  (jetty-launcher-2332-thread-2) [    ] o.a.s.c.SolrResourceLoader new SolrResourceLoader for directory: '/home/jenkins/workspace/Lucene-Solr-5.5-Linux/solr/build/solr-core/test/J2/temp/solr.security.BasicAuthIntegrationTest_A3F55B0C9543EB14-001/tempDir-001/node2'
   [junit4]   2> 2118021 INFO  (jetty-launcher-2332-thread-1) [    ] o.a.s.c.c.ConnectionManager Waiting for client to connect to ZooKeeper
   [junit4]   2> 2118021 INFO  (jetty-launcher-2332-thread-5) [    ] o.a.s.c.c.ConnectionManager Waiting for client to connect to ZooKeeper
   [junit4]   2> 2118021 INFO  (jetty-launcher-2332-thread-2) [    ] o.a.s.c.SolrResourceLoader JNDI not configured for solr (NoInitialContextEx)
   [junit4]   2> 2118022 INFO  (jetty-launcher-2332-thread-4) [    ] o.a.s.c.c.ConnectionManager Waiting for client to connect to ZooKeeper
   [junit4]   2> 2118022 INFO  (jetty-launcher-2332-thread-2) [    ] o.a.s.c.SolrResourceLoader solr home defaulted to 'solr/' (could not find system property or JNDI)
   [junit4]   2> 2118022 INFO  (jetty-launcher-2332-thread-2) [    ] o.a.s.c.c.SolrZkClient Using default ZkCredentialsProvider
   [junit4]   2> 2118022 INFO  (jetty-launcher-2332-thread-2) [    ] o.a.s.c.c.ConnectionManager Waiting for client to connect to ZooKeeper
   [junit4]   2> 2118030 INFO  (zkCallback-2334-thread-1) [    ] o.a.s.c.c.ConnectionManager Watcher org.apache.solr.common.cloud.ConnectionManager@83e43e name:ZooKeeperConnection Watcher:127.0.0.1:36810/solr got event WatchedEvent state:SyncConnected type:None path:null path:null type:None
   [junit4]   2> 2118030 INFO  (jetty-launcher-2332-thread-3) [    ] o.a.s.c.c.ConnectionManager Client is connected to ZooKeeper
   [junit4]   2> 2118031 INFO  (jetty-launcher-2332-thread-3) [    ] o.a.s.c.c.SolrZkClient Using default ZkACLProvider
   [junit4]   2> 2118060 INFO  (zkCallback-2336-thread-1) [    ] o.a.s.c.c.ConnectionManager Watcher org.apache.solr.common.cloud.ConnectionManager@1795889 name:ZooKeeperConnection Watcher:127.0.0.1:36810/solr got event WatchedEvent state:SyncConnected type:None path:null path:null type:None
   [junit4]   2> 2118060 INFO  (jetty-launcher-2332-thread-1) [    ] o.a.s.c.c.ConnectionManager Client is connected to ZooKeeper
   [junit4]   2> 2118060 INFO  (zkCallback-2335-thread-1) [    ] o.a.s.c.c.ConnectionManager Watcher org.apache.solr.common.cloud.ConnectionManager@87bd13 name:ZooKeeperConnection Watcher:127.0.0.1:36810/solr got event WatchedEvent state:SyncConnected type:None path:null path:null type:None
   [junit4]   2> 2118060 INFO  (jetty-launcher-2332-thread-5) [    ] o.a.s.c.c.ConnectionManager Client is connected to ZooKeeper
   [junit4]   2> 2118060 INFO  (zkCallback-2337-thread-1) [    ] o.a.s.c.c.ConnectionManager Watcher org.apache.solr.common.cloud.ConnectionManager@105a5b6 name:ZooKeeperConnection Watcher:127.0.0.1:36810/solr got event WatchedEvent state:SyncConnected type:None path:null path:null type:None
   [junit4]   2> 2118060 INFO  (jetty-launcher-2332-thread-3) [    ] o.a.s.s.SolrDispatchFilter solr.xml found in ZooKeeper. Loading...
   [junit4]   2> 2118061 INFO  (zkCallback-2338-thread-1) [    ] o.a.s.c.c.ConnectionManager Watcher org.apache.solr.common.cloud.ConnectionManager@170ed85 name:ZooKeeperConnection Watcher:127.0.0.1:36810/solr got event WatchedEvent state:SyncConnected type:None path:null path:null type:None
   [junit4]   2> 2118061 INFO  (jetty-launcher-2332-thread-5) [    ] o.a.s.c.c.SolrZkClient Using default ZkACLProvider
   [junit4]   2> 2118061 INFO  (jetty-launcher-2332-thread-2) [    ] o.a.s.c.c.ConnectionManager Client is connected to ZooKeeper
   [junit4]   2> 2118061 INFO  (jetty-launcher-2332-thread-1) [    ] o.a.s.c.c.SolrZkClient Using default ZkACLProvider
   [junit4]   2> 2118061 INFO  (jetty-launcher-2332-thread-4) [    ] o.a.s.c.c.ConnectionManager Client is connected to ZooKeeper
   [junit4]   2> 2118061 INFO  (jetty-launcher-2332-thread-5) [    ] o.a.s.s.SolrDispatchFilter solr.xml found in ZooKeeper. Loading...
   [junit4]   2> 2118061 INFO  (jetty-launcher-2332-thread-2) [    ] o.a.s.c.c.SolrZkClient Using default ZkACLProvider
   [junit4]   2> 2118061 INFO  (jetty-launcher-2332-thread-1) [    ] o.a.s.s.SolrDispatchFilter solr.xml found in ZooKeeper. Loading...
   [junit4]   2> 2118061 INFO  (jetty-launcher-2332-thread-4) [    ] o.a.s.c.c.SolrZkClient Using default ZkACLProvider
   [junit4]   2> 2118061 INFO  (jetty-launcher-2332-thread-2) [    ] o.a.s.s.SolrDispatchFilter solr.xml found in ZooKeeper. Loading...
   [junit4]   2> 2118061 INFO  (jetty-launcher-2332-thread-4) [    ] o.a.s.s.SolrDispatchFilter solr.xml found in ZooKeeper. Loading...
   [junit4]   2> 2118088 INFO  (jetty-launcher-2332-thread-3) [    ] o.a.s.c.CorePropertiesLocator Config-defined core root directory: /home/jenkins/workspace/Lucene-Solr-5.5-Linux/solr/build/solr-core/test/J2/temp/solr.security.BasicAuthIntegrationTest_A3F55B0C9543EB14-001/tempDir-001/node3/.
   [junit4]   2> 2118089 INFO  (jetty-launcher-2332-thread-3) [    ] o.a.s.c.CoreContainer New CoreContainer 18235516
   [junit4]   2> 2118089 INFO  (jetty-launcher-2332-thread-3) [    ] o.a.s.c.CoreContainer Loading cores into CoreContainer [instanceDir=/home/jenkins/workspace/Lucene-Solr-5.5-Linux/solr/build/solr-core/test/J2/temp/solr.security.BasicAuthIntegrationTest_A3F55B0C9543EB14-001/tempDir-001/node3]
   [junit4]   2> 2118089 WARN  (jetty-launcher-2332-thread-3) [    ] o.a.s.c.CoreContainer Couldn't add files from /home/jenkins/workspace/Lucene-Solr-5.5-Linux/solr/build/solr-core/test/J2/temp/solr.security.BasicAuthIntegrationTest_A3F55B0C9543EB14-001/tempDir-001/node3/lib to classpath: /home/jenkins/workspace/Lucene-Solr-5.5-Linux/solr/build/solr-core/test/J2/temp/solr.security.BasicAuthIntegrationTest_A3F55B0C9543EB14-001/tempDir-001/node3/lib
   [junit4]   2> 2118089 INFO  (jetty-launcher-2332-thread-3) [    ] o.a.s.h.c.HttpShardHandlerFactory created with socketTimeout : 90000,urlScheme : ,connTimeout : 15000,maxConnectionsPerHost : 20,maxConnections : 10000,corePoolSize : 0,maximumPoolSize : 2147483647,maxThreadIdleTime : 5,sizeOfQueue : -1,fairnessPolicy : false,useRetries : false,connectionsEvictorSleepDelay : 5000,maxConnectionIdleTime : 40000,
   [junit4]   2> 2118090 INFO  (jetty-launcher-2332-thread-3) [    ] o.a.s.u.UpdateShardHandler Creating UpdateShardHandler HTTP client with params: socketTimeout=340000&connTimeout=45000&retry=true
   [junit4]   2> 2118090 INFO  (jetty-launcher-2332-thread-3) [    ] o.a.s.l.LogWatcher SLF4J impl is org.slf4j.impl.Log4jLoggerFactory
   [junit4]   2> 2118090 INFO  (jetty-launcher-2332-thread-3) [    ] o.a.s.l.LogWatcher Registering Log Listener [Log4j (org.slf4j.impl.Log4jLoggerFactory)]
   [junit4]   2> 2118091 INFO  (jetty-launcher-2332-thread-3) [    ] o.a.s.c.ZkContainer Zookeeper client=127.0.0.1:36810/solr
   [junit4]   2> 2118091 INFO  (jetty-launcher-2332-thread-3) [    ] o.a.s.c.ZkController zkHost includes chroot
   [junit4]   2> 2118091 INFO  (jetty-launcher-2332-thread-4) [    ] o.a.s.c.CorePropertiesLocator Config-defined core root directory: /home/jenkins/workspace/Lucene-Solr-5.5-Linux/solr/build/solr-core/test/J2/temp/solr.security.BasicAuthIntegrationTest_A3F55B0C9543EB14-001/tempDir-001/node4/.
   [junit4]   2> 2118091 INFO  (jetty-launcher-2332-thread-5) [    ] o.a.s.c.CorePropertiesLocator Config-defined core root directory: /home/jenkins/workspace/Lucene-Solr-5.5-Linux/solr/build/solr-core/test/J2/temp/solr.security.BasicAuthIntegrationTest_A3F55B0C9543EB14-001/tempDir-001/node5/.
   [junit4]   2> 2118091 INFO  (jetty-launcher-2332-thread-4) [    ] o.a.s.c.CoreContainer New CoreContainer 12786174
   [junit4]   2> 2118091 INFO  (jetty-launcher-2332-thread-1) [    ] o.a.s.c.CorePropertiesLocator Config-defined core root directory: /home/jenkins/workspace/Lucene-Solr-5.5-Linux/solr/build/solr-core/test/J2/temp/solr.security.BasicAuthIntegrationTest_A3F55B0C9543EB14-001/tempDir-001/node1/.
   [junit4]   2> 2118091 INFO  (jetty-launcher-2332-thread-4) [    ] o.a.s.c.CoreContainer Loading cores into CoreContainer [instanceDir=/home/jenkins/workspace/Lucene-Solr-5.5-Linux/solr/build/solr-core/test/J2/temp/solr.security.BasicAuthIntegrationTest_A3F55B0C9543EB14-001/tempDir-001/node4]
   [junit4]   2> 2118091 INFO  (jetty-launcher-2332-thread-1) [    ] o.a.s.c.CoreContainer New CoreContainer 20894545
   [junit4]   2> 2118091 INFO  (jetty-launcher-2332-thread-3) [    ] o.a.s.c.c.SolrZkClient Using default ZkCredentialsProvider
   [junit4]   2> 2118091 WARN  (jetty-launcher-2332-thread-4) [    ] o.a.s.c.CoreContainer Couldn't add files from /home/jenkins/workspace/Lucene-Solr-5.5-Linux/solr/build/solr-core/test/J2/temp/solr.security.BasicAuthIntegrationTest_A3F55B0C9543EB14-001/tempDir-001/node4/lib to classpath: /home/jenkins/workspace/Lucene-Solr-5.5-Linux/solr/build/solr-core/test/J2/temp/solr.security.BasicAuthIntegrationTest_A3F55B0C9543EB14-001/tempDir-001/node4/lib
   [junit4]   2> 2118091 INFO  (jetty-launcher-2332-thread-1) [    ] o.a.s.c.CoreContainer Loading cores into CoreContainer [instanceDir=/home/jenkins/workspace/Lucene-Solr-5.5-Linux/solr/build/solr-core/test/J2/temp/solr.security.BasicAuthIntegrationTest_A3F55B0C9543EB14-001/tempDir-001/node1]
   [junit4]   2> 2118091 INFO  (jetty-launcher-2332-thread-2) [    ] o.a.s.c.CorePropertiesLocator Config-defined core root directory: /home/jenkins/workspace/Lucene-Solr-5.5-Linux/solr/build/solr-core/test/J2/temp/solr.security.BasicAuthIntegrationTest_A3F55B0C9543EB14-001/tempDir-001/node2/.
   [junit4]   2> 2118092 INFO  (jetty-launcher-2332-thread-3) [    ] o.a.s.c.c.ConnectionManager Waiting for client to connect to ZooKeeper
   [junit4]   2> 2118092 INFO  (jetty-launcher-2332-thread-2) [    ] o.a.s.c.CoreContainer New CoreContainer 8194420
   [junit4]   2> 2118091 INFO  (jetty-launcher-2332-thread-5) [    ] o.a.s.c.CoreContainer New CoreContainer 14659221
   [junit4]   2> 2118092 INFO  (jetty-launcher-2332-thread-2) [    ] o.a.s.c.CoreContainer Loading cores into CoreContainer [instanceDir=/home/jenkins/workspace/Lucene-Solr-5.5-Linux/solr/build/solr-core/test/J2/temp/solr.security.BasicAuthIntegrationTest_A3F55B0C9543EB14-001/tempDir-001/node2]
   [junit4]   2> 2118092 INFO  (jetty-launcher-2332-thread-5) [    ] o.a.s.c.CoreContainer Loading cores into CoreContainer [instanceDir=/home/jenkins/workspace/Lucene-Solr-5.5-Linux/solr/build/solr-core/test/J2/temp/solr.security.BasicAuthIntegrationTest_A3F55B0C9543EB14-001/tempDir-001/node5]
   [junit4]   2> 2118093 WARN  (jetty-launcher-2332-thread-2) [    ] o.a.s.c.CoreContainer Couldn't add files from /home/jenkins/workspace/Lucene-Solr-5.5-Linux/solr/build/solr-core/test/J2/temp/solr.security.BasicAuthIntegrationTest_A3F55B0C9543EB14-001/tempDir-001/node2/lib to classpath: /home/jenkins/workspace/Lucene-Solr-5.5-Linux/solr/build/solr-core/test/J2/temp/solr.security.BasicAuthIntegrationTest_A3F55B0C9543EB14-001/tempDir-001/node2/lib
   [junit4]   2> 2118092 WARN  (jetty-launcher-2332-thread-1) [    ] o.a.s.c.CoreContainer Couldn't add files from /home/jenkins/workspace/Lucene-Solr-5.5-Linux/solr/build/solr-core/test/J2/temp/solr.security.BasicAuthIntegrationTest_A3F55B0C9543EB14-001/tempDir-001/node1/lib to classpath: /home/jenkins/workspace/Lucene-Solr-5.5-Linux/solr/build/solr-core/test/J2/temp/solr.security.BasicAuthIntegrationTest_A3F55B0C9543EB14-001/tempDir-001/node1/lib
   [junit4]   2> 2118093 INFO  (jetty-launcher-2332-thread-2) [    ] o.a.s.h.c.HttpShardHandlerFactory created with socketTimeout : 90000,urlScheme : ,connTimeout : 15000,maxConnectionsPerHost : 20,maxConnections : 10000,corePoolSize : 0,maximumPoolSize : 2147483647,maxThreadIdleTime : 5,sizeOfQueue : -1,fairnessPolicy : false,useRetries : false,connectionsEvictorSleepDelay : 5000,maxConnectionIdleTime : 40000,
   [junit4]   2> 2118093 INFO  (jetty-launcher-2332-thread-1) [    ] o.a.s.h.c.HttpShardHandlerFactory created with socketTimeout : 90000,urlScheme : ,connTimeout : 15000,maxConnectionsPerHost : 20,maxConnections : 10000,corePoolSize : 0,maximumPoolSize : 2147483647,maxThreadIdleTime : 5,sizeOfQueue : -1,fairnessPolicy : false,useRetries : false,connectionsEvictorSleepDelay : 5000,maxConnectionIdleTime : 40000,
   [junit4]   2> 2118092 INFO  (jetty-launcher-2332-thread-4) [    ] o.a.s.h.c.HttpShardHandlerFactory created with socketTimeout : 90000,urlScheme : ,connTimeout : 15000,maxConnectionsPerHost : 20,maxConnections : 10000,corePoolSize : 0,maximumPoolSize : 2147483647,maxThreadIdleTime : 5,sizeOfQueue : -1,fairnessPolicy : false,useRetries : false,connectionsEvictorSleepDelay : 5000,maxConnectionIdleTime : 40000,
   [junit4]   2> 2118093 WARN  (jetty-launcher-2332-thread-5) [    ] o.a.s.c.CoreContainer Couldn't add files from /home/jenkins/workspace/Lucene-Solr-5.5-Linux/solr/build/solr-core/test/J2/temp/solr.security.BasicAuthIntegrationTest_A3F55B0C9543EB14-001/tempDir-001/node5/lib to classpath: /home/jenkins/workspace/Lucene-Solr-5.5-Linux/solr/build/solr-core/test/J2/temp/solr.security.BasicAuthIntegrationTest_A3F55B0C9543EB14-001/tempDir-001/node5/lib
   [junit4]   2> 2118093 INFO  (jetty-launcher-2332-thread-5) [    ] o.a.s.h.c.HttpShardHandlerFactory created with socketTimeout : 90000,urlScheme : ,connTimeout : 15000,maxConnectionsPerHost : 20,maxConnections : 10000,corePoolSize : 0,maximumPoolSize : 2147483647,maxThreadIdleTime : 5,sizeOfQueue : -1,fairnessPolicy : false,useRetries : false,connectionsEvictorSleepDelay : 5000,maxConnectionIdleTime : 40000,
   [junit4]   2> 2118094 INFO  (jetty-launcher-2332-thread-2) [    ] o.a.s.u.UpdateShardHandler Creating UpdateShardHandler HTTP client with params: socketTimeout=340000&connTimeout=45000&retry=true
   [junit4]   2> 2118094 INFO  (jetty-launcher-2332-thread-1) [    ] o.a.s.u.UpdateShardHandler Creating UpdateShardHandler HTTP client with params: socketTimeout=340000&connTimeout=45000&retry=true
   [junit4]   2> 2118094 INFO  (jetty-launcher-2332-thread-4) [    ] o.a.s.u.UpdateShardHandler Creating UpdateShardHandler HTTP client with params: socketTimeout=340000&connTimeout=45000&retry=true
   [junit4]   2> 2118094 INFO  (jetty-launcher-2332-thread-5) [    ] o.a.s.u.UpdateShardHandler Creating UpdateShardHandler HTTP client with params: socketTimeout=340000&connTimeout=45000&retry=true
   [junit4]   2> 2118094 INFO  (jetty-launcher-2332-thread-2) [    ] o.a.s.l.LogWatcher SLF4J impl is org.slf4j.impl.Log4jLoggerFactory
   [junit4]   2> 2118094 INFO  (jetty-launcher-2332-thread-2) [    ] o.a.s.l.LogWatcher Registering Log Listener [Log4j (org.slf4j.impl.Log4jLoggerFactory)]
   [junit4]   2> 2118094 INFO  (jetty-launcher-2332-thread-1) [    ] o.a.s.l.LogWatcher SLF4J impl is org.slf4j.impl.Log4jLoggerFactory
   [junit4]   2> 2118094 INFO  (jetty-launcher-2332-thread-1) [    ] o.a.s.l.LogWatcher Registering Log Listener [Log4j (org.slf4j.impl.Log4jLoggerFactory)]
   [junit4]   2> 2118094 INFO  (jetty-launcher-2332-thread-2) [    ] o.a.s.c.ZkContainer Zookeeper client=127.0.0.1:36810/solr
   [junit4]   2> 2118094 INFO  (jetty-launcher-2332-thread-2) [    ] o.a.s.c.ZkController zkHost includes chroot
   [junit4]   2> 2118094 INFO  (jetty-launcher-2332-thread-1) [    ] o.a.s.c.ZkContainer Zookeeper client=127.0.0.1:36810/solr
   [junit4]   2> 2118094 INFO  (jetty-launcher-2332-thread-4) [    ] o.a.s.l.LogWatcher SLF4J impl is org.slf4j.impl.Log4jLoggerFactory
   [junit4]   2> 2118094 INFO  (jetty-launcher-2332-thread-5) [    ] o.a.s.l.LogWatcher SLF4J impl is org.slf4j.impl.Log4jLoggerFactory
   [junit4]   2> 2118095 INFO  (jetty-launcher-2332-thread-5) [    ] o.a.s.l.LogWatcher Registering Log Listener [Log4j (org.slf4j.impl.Log4jLoggerFactory)]
   [junit4]   2> 2118094 INFO  (jetty-launcher-2332-thread-2) [    ] o.a.s.c.c.SolrZkClient Using default ZkCredentialsProvider
   [junit4]   2> 2118095 INFO  (jetty-launcher-2332-thread-4) [    ] o.a.s.l.LogWatcher Registering Log Listener [Log4j (org.slf4j.impl.Log4jLoggerFactory)]
   [junit4]   2> 2118095 INFO  (jetty-launcher-2332-thread-5) [    ] o.a.s.c.ZkContainer Zookeeper client=127.0.0.1:36810/solr
   [junit4]   2> 2118095 INFO  (jetty-launcher-2332-thread-1) [    ] o.a.s.c.ZkController zkHost includes chroot
   [junit4]   2> 2118095 INFO  (jetty-launcher-2332-thread-5) [    ] o.a.s.c.ZkController zkHost includes chroot
   [junit4]   2> 2118095 INFO  (jetty-launcher-2332-thread-1) [    ] o.a.s.c.c.SolrZkClient Using default ZkCredentialsProvider
   [junit4]   2> 2118095 INFO  (jetty-launcher-2332-thread-5) [    ] o.a.s.c.c.SolrZkClient Using default ZkCredentialsProvider
   [junit4]   2> 2118095 INFO  (jetty-launcher-2332-thread-2) [    ] o.a.s.c.c.ConnectionManager Waiting for client to connect to ZooKeeper
   [junit4]   2> 2118095 INFO  (jetty-launcher-2332-thread-4) [    ] o.a.s.c.ZkContainer Zookeeper client=127.0.0.1:36810/solr
   [junit4]   2> 2118095 INFO  (jetty-launcher-2332-thread-1) [    ] o.a.s.c.c.ConnectionManager Waiting for client to connect to ZooKeeper
   [junit4]   2> 2118095 INFO  (jetty-launcher-2332-thread-5) [    ] o.a.s.c.c.ConnectionManager Waiting for client to connect to ZooKeeper
   [junit4]   2> 2118095 INFO  (jetty-launcher-2332-thread-4) [    ] o.a.s.c.ZkController zkHost includes chroot
   [junit4]   2> 2118096 INFO  (jetty-launcher-2332-thread-4) [    ] o.a.s.c.c.SolrZkClient Using default ZkCredentialsProvider
   [junit4]   2> 2118096 INFO  (jetty-launcher-2332-thread-4) [    ] o.a.s.c.c.ConnectionManager Waiting for client to connect to ZooKeeper
   [junit4]   2> 2118119 INFO  (zkCallback-2341-thread-1) [    ] o.a.s.c.c.ConnectionManager Watcher org.apache.solr.common.cloud.ConnectionManager@31a51c name:ZooKeeperConnection Watcher:127.0.0.1:36810 got event WatchedEvent state:SyncConnected type:None path:null path:null type:None
   [junit4]   2> 2118120 INFO  (jetty-launcher-2332-thread-3) [    ] o.a.s.c.c.ConnectionManager Client is connected to ZooKeeper
   [junit4]   2> 2118120 INFO  (jetty-launcher-2332-thread-3) [    ] o.a.s.c.c.SolrZkClient Using default ZkACLProvider
   [junit4]   2> 2118128 INFO  (zkCallback-2350-thread-1) [    ] o.a.s.c.c.ConnectionManager Watcher org.apache.solr.common.cloud.ConnectionManager@79eb53 name:ZooKeeperConnection Watcher:127.0.0.1:36810 got event WatchedEvent state:SyncConnected type:None path:null path:null type:None
   [junit4]   2> 2118128 INFO  (jetty-launcher-2332-thread-2) [    ] o.a.s.c.c.ConnectionManager Client is connected to ZooKeeper
   [junit4]   2> 2118128 INFO  (zkCallback-2351-thread-1) [    ] o.a.s.c.c.ConnectionManager Watcher org.apache.solr.common.cloud.ConnectionManager@19552dd name:ZooKeeperConnection Watcher:127.0.0.1:36810 got event WatchedEvent state:SyncConnected type:None path:null path:null type:None
   [junit4]   2> 2118128 INFO  (jetty-launcher-2332-thread-1) [    ] o.a.s.c.c.ConnectionManager Client is connected to ZooKeeper
   [junit4]   2> 2118128 INFO  (zkCallback-2352-thread-1) [    ] o.a.s.c.c.ConnectionManager Watcher org.apache.solr.common.cloud.ConnectionManager@164a43b name:ZooKeeperConnection Watcher:127.0.0.1:36810 got event WatchedEvent state:SyncConnected type:None path:null path:null type:None
   [junit4]   2> 2118128 INFO  (zkCallback-2353-thread-1) [    ] o.a.s.c.c.ConnectionManager Watcher org.apache.solr.common.cloud.ConnectionManager@1ecb7 name:ZooKeeperConnection Watcher:127.0.0.1:36810 got event WatchedEvent state:SyncConnected type:None path:null path:null type:None
   [junit4]   2> 2118128 INFO  (jetty-launcher-2332-thread-5) [    ] o.a.s.c.c.ConnectionManager Client is connected to ZooKeeper
   [junit4]   2> 2118128 INFO  (jetty-launcher-2332-thread-1) [    ] o.a.s.c.c.SolrZkClient Using default ZkACLProvider
   [junit4]   2> 2118128 INFO  (jetty-launcher-2332-thread-4) [    ] o.a.s.c.c.ConnectionManager Client is connected to ZooKeeper
   [junit4]   2> 2118128 INFO  (jetty-launcher-2332-thread-2) [    ] o.a.s.c.c.SolrZkClient Using default ZkACLProvider
   [junit4]   2> 2118129 INFO  (jetty-launcher-2332-thread-5) [    ] o.a.s.c.c.SolrZkClient Using default ZkACLProvider
   [junit4]   2> 2118129 INFO  (jetty-launcher-2332-thread-4) [    ] o.a.s.c.c.SolrZkClient Using default ZkACLProvider
   [junit4]   2> 2118168 INFO  (jetty-launcher-2332-thread-3) [n:127.0.0.1:37235_solr    ] o.a.s.c.ZkController Added new OnReconnect listener org.apache.solr.cloud.ZkController$6@da7f62
   [junit4]   2> 2118168 INFO  (jetty-launcher-2332-thread-3) [n:127.0.0.1:37235_solr    ] o.a.s.c.c.ConnectionManager Waiting for client to connect to ZooKeeper
   [junit4]   2> 2118187 WARN  (NIOServerCxn.Factory:0.0.0.0/0.0.0.0:0) [    ] o.a.z.s.NIOServerCnxn caught end of stream exception
   [junit4]   2> EndOfStreamException: Unable to read additional data from client sessionid 0x156e689f9b30009, likely client has closed socket
   [junit4]   2> 	at org.apache.zookeeper.server.NIOServerCnxn.doIO(NIOServerCnxn.java:228)
   [junit4]   2> 	at org.apache.zookeeper.server.NIOServerCnxnFactory.run(NIOServerCnxnFactory.java:208)
   [junit4]   2> 	at java.lang.Thread.run(Thread.java:745)
   [junit4]   2> 2118187 INFO  (jetty-launcher-2332-thread-2) [n:127.0.0.1:40278_solr    ] o.a.s.c.ZkController Added new OnReconnect listener org.apache.solr.cloud.ZkController$6@1c1bc5c
   [junit4]   2> 2118187 INFO  (jetty-launcher-2332-thread-1) [n:127.0.0.1:34957_solr    ] o.a.s.c.ZkController Added new OnReconnect listener org.apache.solr.cloud.ZkController$6@1bd7962
   [junit4]   2> 2118187 INFO  (jetty-launcher-2332-thread-5) [n:127.0.0.1:32897_solr    ] o.a.s.c.ZkController Added new OnReconnect listener org.apache.solr.cloud.ZkController$6@6c2656
   [junit4]   2> 2118188 INFO  (jetty-launcher-2332-thread-2) [n:127.0.0.1:40278_solr    ] o.a.s.c.c.ConnectionManager Waiting for client to connect to ZooKeeper
   [junit4]   2> 2118188 INFO  (jetty-launcher-2332-thread-5) [n:127.0.0.1:32897_solr    ] o.a.s.c.c.ConnectionManager Waiting for client to connect to ZooKeeper
   [junit4]   2> 2118188 INFO  (jetty-launcher-2332-thread-1) [n:127.0.0.1:34957_solr    ] o.a.s.c.c.ConnectionManager Waiting for client to connect to ZooKeeper
   [junit4]   2> 2118219 INFO  (jetty-launcher-2332-thread-4) [n:127.0.0.1:38125_solr    ] o.a.s.c.ZkController Added new OnReconnect listener org.apache.solr.cloud.ZkController$6@54b2a6
   [junit4]   2> 2118219 INFO  (zkCallback-2354-thread-1-processing-n:127.0.0.1:37235_solr) [n:127.0.0.1:37235_solr    ] o.a.s.c.c.ConnectionManager Watcher org.apache.solr.common.cloud.ConnectionManager@1910941 name:ZooKeeperConnection Watcher:127.0.0.1:36810/solr got event WatchedEvent state:SyncConnected type:None path:null path:null type:None
   [junit4]   2> 2118219 INFO  (jetty-launcher-2332-thread-4) [n:127.0.0.1:38125_solr    ] o.a.s.c.c.ConnectionManager Waiting for client to connect to ZooKeeper
   [junit4]   2> 2118219 INFO  (jetty-launcher-2332-thread-3) [n:127.0.0.1:37235_solr    ] o.a.s.c.c.ConnectionManager Client is connected to ZooKeeper
   [junit4]   2> 2118229 INFO  (zkCallback-2355-thread-1-processing-n:127.0.0.1:40278_solr) [n:127.0.0.1:40278_solr    ] o.a.s.c.c.ConnectionManager Watcher org.apache.solr.common.cloud.ConnectionManager@f91514 name:ZooKeeperConnection Watcher:127.0.0.1:36810/solr got event WatchedEvent state:SyncConnected type:None path:null path:null type:None
   [junit4]   2> 2118229 INFO  (jetty-launcher-2332-thread-2) [n:127.0.0.1:40278_solr    ] o.a.s.c.c.ConnectionManager Client is connected to ZooKeeper
   [junit4]   2> 2118229 INFO  (zkCallback-2357-thread-1-processing-n:127.0.0.1:32897_solr) [n:127.0.0.1:32897_solr    ] o.a.s.c.c.ConnectionManager Watcher org.apache.solr.common.cloud.ConnectionManager@a0d19b name:ZooKeeperConnection Watcher:127.0.0.1:36810/solr got event WatchedEvent state:SyncConnected type:None path:null path:null type:None
   [junit4]   2> 2118229 INFO  (jetty-launcher-2332-thread-5) [n:127.0.0.1:32897_solr    ] o.a.s.c.c.ConnectionManager Client is connected to ZooKeeper
   [junit4]   2> 2118229 INFO  (zkCallback-2356-thread-1-processing-n:127.0.0.1:34957_solr) [n:127.0.0.1:34957_solr    ] o.a.s.c.c.ConnectionManager Watcher org.apache.solr.common.cloud.ConnectionManager@e594bb name:ZooKeeperConnection Watcher:127.0.0.1:36810/solr got event WatchedEvent state:SyncConnected type:None path:null path:null type:None
   [junit4]   2> 2118229 INFO  (jetty-launcher-2332-thread-1) [n:127.0.0.1:34957_solr    ] o.a.s.c.c.ConnectionManager Client is connected to ZooKeeper
   [junit4]   2> 2118259 INFO  (zkCallback-2358-thread-1-processing-n:127.0.0.1:38125_solr) [n:127.0.0.1:38125_solr    ] o.a.s.c.c.ConnectionManager Watcher org.apache.solr.common.cloud.ConnectionManager@7ce305 name:ZooKeeperConnection Watcher:127.0.0.1:36810/solr got event WatchedEvent state:SyncConnected type:None path:null path:null type:None
   [junit4]   2> 2118259 INFO  (jetty-launcher-2332-thread-4) [n:127.0.0.1:38125_solr    ] o.a.s.c.c.ConnectionManager Client is connected to ZooKeeper
   [junit4]   2> 2118270 INFO  (jetty-launcher-2332-thread-3) [n:127.0.0.1:37235_solr    ] o.a.s.c.c.SolrZkClient makePath: /overseer/queue
   [junit4]   2> 2118287 INFO  (jetty-launcher-2332-thread-2) [n:127.0.0.1:40278_solr    ] o.a.s.c.c.SolrZkClient makePath: /overseer/queue
   [junit4]   2> 2118287 INFO  (jetty-launcher-2332-thread-5) [n:127.0.0.1:32897_solr    ] o.a.s.c.c.SolrZkClient makePath: /overseer/queue
   [junit4]   2> 2118287 INFO  (jetty-launcher-2332-thread-1) [n:127.0.0.1:34957_solr    ] o.a.s.c.c.SolrZkClient makePath: /overseer/queue
   [junit4]   2> 2118287 INFO  (jetty-launcher-2332-thread-4) [n:127.0.0.1:38125_solr    ] o.a.s.c.c.SolrZkClient makePath: /overseer/queue
   [junit4]   2> 2118396 INFO  (jetty-launcher-2332-thread-3) [n:127.0.0.1:37235_solr    ] o.a.s.c.c.SolrZkClient makePath: /overseer/collection-queue-work
   [junit4]   2> 2118408 INFO  (jetty-launcher-2332-thread-5) [n:127.0.0.1:32897_solr    ] o.a.s.c.c.SolrZkClient makePath: /overseer/collection-queue-work
   [junit4]   2> 2118408 INFO  (jetty-launcher-2332-thread-1) [n:127.0.0.1:34957_solr    ] o.a.s.c.c.SolrZkClient makePath: /overseer/collection-queue-work
   [junit4]   2> 2118408 INFO  (jetty-launcher-2332-thread-2) [n:127.0.0.1:40278_solr    ] o.a.s.c.c.SolrZkClient makePath: /overseer/collection-queue-work
   [junit4]   2> 2118408 INFO  (jetty-launcher-2332-thread-4) [n:127.0.0.1:38125_solr    ] o.a.s.c.c.SolrZkClient makePath: /overseer/collection-queue-work
   [junit4]   2> 2118645 INFO  (jetty-launcher-2332-thread-5) [n:127.0.0.1:32897_solr    ] o.a.s.c.c.SolrZkClient makePath: /overseer/collection-map-running
   [junit4]   2> 2118645 INFO  (jetty-launcher-2332-thread-2) [n:127.0.0.1:40278_solr    ] o.a.s.c.c.SolrZkClient makePath: /overseer/collection-map-running
   [junit4]   2> 2118645 INFO  (jetty-launcher-2332-thread-1) [n:127.0.0.1:34957_solr    ] o.a.s.c.c.SolrZkClient makePath: /overseer/collection-map-running
   [junit4]   2> 2118645 INFO  (jetty-launcher-2332-thread-3) [n:127.0.0.1:37235_solr    ] o.a.s.c.c.SolrZkClient makePath: /overseer/collection-map-running
   [junit4]   2> 2118645 INFO  (jetty-launcher-2332-thread-4) [n:127.0.0.1:38125_solr    ] o.a.s.c.c.SolrZkClient makePath: /overseer/collection-map-running
   [junit4]   2> 2118709 INFO  (jetty-launcher-2332-thread-4) [n:127.0.0.1:38125_solr    ] o.a.s.c.c.SolrZkClient makePath: /overseer/collection-map-completed
   [junit4]   2> 2118709 INFO  (jetty-launcher-2332-thread-5) [n:127.0.0.1:32897_solr    ] o.a.s.c.c.SolrZkClient makePath: /overseer/collection-map-completed
   [junit4]   2> 2118709 INFO  (jetty-launcher-2332-thread-1) [n:127.0.0.1:34957_solr    ] o.a.s.c.c.SolrZkClient makePath: /overseer/collection-map-completed
   [junit4]   2> 2118709 INFO  (jetty-launcher-2332-thread-3) [n:127.0.0.1:37235_solr    ] o.a.s.c.c.SolrZkClient makePath: /overseer/collection-map-completed
   [junit4]   2> 2118710 INFO  (jetty-launcher-2332-thread-2) [n:127.0.0.1:40278_solr    ] o.a.s.c.c.SolrZkClient makePath: /overseer/collection-map-completed
   [junit4]   2> 2118778 INFO  (jetty-launcher-2332-thread-5) [n:127.0.0.1:32897_solr    ] o.a.s.c.c.SolrZkClient makePath: /overseer/collection-map-failure
   [junit4]   2> 2118792 INFO  (jetty-launcher-2332-thread-1) [n:127.0.0.1:34957_solr    ] o.a.s.c.c.SolrZkClient makePath: /overseer/collection-map-failure
   [junit4]   2> 2118792 INFO  (jetty-launcher-2332-thread-3) [n:127.0.0.1:37235_solr    ] o.a.s.c.c.SolrZkClient makePath: /overseer/collection-map-failure
   [junit4]   2> 2118793 INFO  (jetty-launcher-2332-thread-4) [n:127.0.0.1:38125_solr    ] o.a.s.c.c.SolrZkClient makePath: /overseer/collection-map-failure
   [junit4]   2> 2118793 INFO  (jetty-launcher-2332-thread-2) [n:127.0.0.1:40278_solr    ] o.a.s.c.c.SolrZkClient makePath: /overseer/collection-map-failure
   [junit4]   2> 2118821 INFO  (jetty-launcher-2332-thread-5) [n:127.0.0.1:32897_solr    ] o.a.s.c.c.SolrZkClient makePath: /live_nodes
   [junit4]   2> 2118821 INFO  (jetty-launcher-2332-thread-3) [n:127.0.0.1:37235_solr    ] o.a.s.c.c.SolrZkClient makePath: /live_nodes
   [junit4]   2> 2118821 INFO  (jetty-launcher-2332-thread-4) [n:127.0.0.1:38125_solr    ] o.a.s.c.c.SolrZkClient makePath: /live_nodes
   [junit4]   2> 2118821 INFO  (jetty-launcher-2332-thread-2) [n:127.0.0.1:40278_solr    ] o.a.s.c.c.SolrZkClient makePath: /live_nodes
   [junit4]   2> 2118821 INFO  (jetty-launcher-2332-thread-1) [n:127.0.0.1:34957_solr    ] o.a.s.c.c.SolrZkClient makePath: /live_nodes
   [junit4]   2> 2118857 INFO  (jetty-launcher-2332-thread-5) [n:127.0.0.1:32897_solr    ] o.a.s.c.c.SolrZkClient makePath: /collections
   [junit4]   2> 2118857 INFO  (jetty-launcher-2332-thread-3) [n:127.0.0.1:37235_solr    ] o.a.s.c.c.SolrZkClient makePath: /collections
   [junit4]   2> 2118857 INFO  (jetty-launcher-2332-thread-1) [n:127.0.0.1:34957_solr    ] o.a.s.c.c.SolrZkClient makePath: /collections
   [junit4]   2> 2118857 INFO  (jetty-launcher-2332-thread-2) [n:127.0.0.1:40278_solr    ] o.a.s.c.c.SolrZkClient makePath: /collections
   [junit4]   2> 2118857 INFO  (jetty-launcher-2332-thread-4) [n:127.0.0.1:38125_solr    ] o.a.s.c.c.SolrZkClient makePath: /collections
   [junit4]   2> 2118913 INFO  (jetty-launcher-2332-thread-3) [n:127.0.0.1:37235_solr    ] o.a.s.c.c.SolrZkClient makePath: /aliases.json
   [junit4]   2> 2118913 INFO  (jetty-launcher-2332-thread-1) [n:127.0.0.1:34957_solr    ] o.a.s.c.c.SolrZkClient makePath: /aliases.json
   [junit4]   2> 2118913 INFO  (jetty-launcher-2332-thread-5) [n:127.0.0.1:32897_solr    ] o.a.s.c.c.SolrZkClient makePath: /aliases.json
   [junit4]   2> 2118932 INFO  (jetty-launcher-2332-thread-4) [n:127.0.0.1:38125_solr    ] o.a.s.c.c.SolrZkClient makePath: /aliases.json
   [junit4]   2> 2118974 INFO  (jetty-launcher-2332-thread-2) [n:127.0.0.1:40278_solr    ] o.a.s.c.c.SolrZkClient makePath: /clusterstate.json
   [junit4]   2> 2118974 INFO  (jetty-launcher-2332-thread-5) [n:127.0.0.1:32897_solr    ] o.a.s.c.c.SolrZkClient makePath: /clusterstate.json
   [junit4]   2> 2118974 INFO  (jetty-launcher-2332-thread-1) [n:127.0.0.1:34957_solr    ] o.a.s.c.c.SolrZkClient makePath: /clusterstate.json
   [junit4]   2> 2118974 INFO  (jetty-launcher-2332-thread-3) [n:127.0.0.1:37235_solr    ] o.a.s.c.c.SolrZkClient makePath: /clusterstate.json
   [junit4]   2> 2118974 INFO  (jetty-launcher-2332-thread-4) [n:127.0.0.1:38125_solr    ] o.a.s.c.c.SolrZkClient makePath: /clusterstate.json
   [junit4]   2> 2118993 INFO  (jetty-launcher-2332-thread-2) [n:127.0.0.1:40278_solr    ] o.a.s.c.c.SolrZkClient makePath: /security.json
   [junit4]   2> 2119022 INFO  (jetty-launcher-2332-thread-1) [n:127.0.0.1:34957_solr    ] o.a.s.c.c.SolrZkClient makePath: /security.json
   [junit4]   2> 2119022 INFO  (jetty-launcher-2332-thread-5) [n:127.0.0.1:32897_solr    ] o.a.s.c.c.SolrZkClient makePath: /security.json
   [junit4]   2> 2119043 INFO  (jetty-launcher-2332-thread-3) [n:127.0.0.1:37235_solr    ] o.a.s.c.c.SolrZkClient makePath: /security.json
   [junit4]   2> 2119061 INFO  (jetty-launcher-2332-thread-4) [n:127.0.0.1:38125_solr    ] o.a.s.c.ZkController Register node as live in ZooKeeper:/live_nodes/127.0.0.1:38125_solr
   [junit4]   2> 2119093 INFO  (jetty-launcher-2332-thread-5) [n:127.0.0.1:32897_solr    ] o.a.s.c.ZkController Register node as live in ZooKeeper:/live_nodes/127.0.0.1:32897_solr
   [junit4]   2> 2119093 INFO  (jetty-launcher-2332-thread-2) [n:127.0.0.1:40278_solr    ] o.a.s.c.ZkController Register node as live in ZooKeeper:/live_nodes/127.0.0.1:40278_solr
   [junit4]   2> 2119093 INFO  (jetty-launcher-2332-thread-1) [n:127.0.0.1:34957_solr    ] o.a.s.c.ZkController Register node as live in ZooKeeper:/live_nodes/127.0.0.1:34957_solr
   [junit4]   2> 2119111 INFO  (jetty-launcher-2332-thread-4) [n:127.0.0.1:38125_solr    ] o.a.s.c.c.SolrZkClient makePath: /live_nodes/127.0.0.1:38125_solr
   [junit4]   2> 2119129 INFO  (jetty-launcher-2332-thread-3) [n:127.0.0.1:37235_solr    ] o.a.s.c.ZkController Register node as live in ZooKeeper:/live_nodes/127.0.0.1:37235_solr
   [junit4]   2> 2119129 INFO  (jetty-launcher-2332-thread-1) [n:127.0.0.1:34957_solr    ] o.a.s.c.c.SolrZkClient makePath: /live_nodes/127.0.0.1:34957_solr
   [junit4]   2> 2119129 INFO  (jetty-launcher-2332-thread-2) [n:127.0.0.1:40278_solr    ] o.a.s.c.c.SolrZkClient makePath: /live_nodes/127.0.0.1:40278_solr
   [junit4]   2> 2119129 INFO  (jetty-launcher-2332-thread-5) [n:127.0.0.1:32897_solr    ] o.a.s.c.c.SolrZkClient makePath: /live_nodes/127.0.0.1:32897_solr
   [junit4]   2> 2119136 INFO  (jetty-launcher-2332-thread-3) [n:127.0.0.1:37235_solr    ] o.a.s.c.c.SolrZkClient makePath: /live_nodes/127.0.0.1:37235_solr
   [junit4]   2> 2119155 INFO  (jetty-launcher-2332-thread-4) [n:127.0.0.1:38125_solr    ] o.a.s.c.c.SolrZkClient makePath: /overseer_elect
   [junit4]   2> 2119172 INFO  (jetty-launcher-2332-thread-5) [n:127.0.0.1:32897_solr    ] o.a.s.c.c.SolrZkClient makePath: /overseer_elect
   [junit4]   2> 2119172 INFO  (jetty-launcher-2332-thread-1) [n:127.0.0.1:34957_solr    ] o.a.s.c.c.SolrZkClient makePath: /overseer_elect
   [junit4]   2> 2119173 INFO  (jetty-launcher-2332-thread-2) [n:127.0.0.1:40278_solr    ] o.a.s.c.c.SolrZkClient makePath: /overseer_elect
   [junit4]   2> 2119282 INFO  (jetty-launcher-2332-thread-3) [n:127.0.0.1:37235_solr    ] o.a.s.c.c.SolrZkClient makePath: /overseer_elect/election
   [junit4]   2> 2119282 INFO  (jetty-launcher-2332-thread-1) [n:127.0.0.1:34957_solr    ] o.a.s.c.c.SolrZkClient makePath: /overseer_elect/election
   [junit4]   2> 2119282 INFO  (jetty-launcher-2332-thread-4) [n:127.0.0.1:38125_solr    ] o.a.s.c.c.SolrZkClient makePath: /overseer_elect/election
   [junit4]   2> 2119282 INFO  (jetty-launcher-2332-thread-2) [n:127.0.0.1:40278_solr    ] o.a.s.c.c.SolrZkClient makePath: /overseer_elect/election
   [junit4]   2> 2119282 INFO  (jetty-launcher-2332-thread-5) [n:127.0.0.1:32897_solr    ] o.a.s.c.c.SolrZkClient makePath: /overseer_elect/election
   [junit4]   2> 2119346 INFO  (jetty-launcher-2332-thread-1) [n:127.0.0.1:34957_solr    ] o.a.s.c.Overseer Overseer (id=null) closing
   [junit4]   2> 2119346 INFO  (jetty-launcher-2332-thread-4) [n:127.0.0.1:38125_solr    ] o.a.s.c.Overseer Overseer (id=null) closing
   [junit4]   2> 2119362 INFO  (jetty-launcher-2332-thread-3) [n:127.0.0.1:37235_solr    ] o.a.s.c.Overseer Overseer (id=null) closing
   [junit4]   2> 2119362 INFO  (jetty-launcher-2332-thread-2) [n:127.0.0.1:40278_solr    ] o.a.s.c.Overseer Overseer (id=null) closing
   [junit4]   2> 2119377 INFO  (jetty-launcher-2332-thread-5) [n:127.0.0.1:32897_solr    ] o.a.s.c.Overseer Overseer (id=null) closing
   [junit4]   2> 2119377 INFO  (jetty-launcher-2332-thread-4) [n:127.0.0.1:38125_solr    ] o.a.s.c.LeaderElector Joined leadership election with path: /overseer_elect/election/96517922309210127-127.0.0.1:38125_solr-n_0000000001
   [junit4]   2> 2119377 INFO  (jetty-launcher-2332-thread-1) [n:127.0.0.1:34957_solr    ] o.a.s.c.LeaderElector Joined leadership election with path: /overseer_elect/election/96517922309210126-127.0.0.1:34957_solr-n_0000000000
   [junit4]   2> 2119396 INFO  (jetty-launcher-2332-thread-2) [n:127.0.0.1:40278_solr    ] o.a.s.c.LeaderElector Joined leadership election with path: /overseer_elect/election/96517922309210124-127.0.0.1:40278_solr-n_0000000003
   [junit4]   2> 2119396 INFO  (jetty-launcher-2332-thread-3) [n:127.0.0.1:37235_solr    ] o.a.s.c.LeaderElector Joined leadership election with path: /overseer_elect/election/96517922309210123-127.0.0.1:37235_solr-n_0000000002
   [junit4]   2> 2119415 INFO  (jetty-launcher-2332-thread-5) [n:127.0.0.1:32897_solr    ] o.a.s.c.LeaderElector Joined leadership election with path: /overseer_elect/election/96517922309210125-127.0.0.1:32897_solr-n_0000000004
   [junit4]   2> 2119415 INFO  (jetty-launcher-2332-thread-1) [n:127.0.0.1:34957_solr    ] o.a.s.c.OverseerElectionContext I am going to be the leader 127.0.0.1:34957_solr
   [junit4]   2> 2119415 INFO  (jetty-launcher-2332-thread-1) [n:127.0.0.1:34957_solr    ] o.a.s.c.c.SolrZkClient makePath: /overseer_elect/leader
   [junit4]   2> 2119415 INFO  (jetty-launcher-2332-thread-4) [n:127.0.0.1:38125_solr    ] o.a.s.c.LeaderElector Watching path /overseer_elect/election/96517922309210126-127.0.0.1:34957_solr-n_0000000000 to know if I could be the leader
   [junit4]   2> 2119415 INFO  (jetty-launcher-2332-thread-4) [n:127.0.0.1:38125_solr    ] o.a.s.c.c.ZkStateReader Updating cluster state from ZooKeeper... 
   [junit4]   2> 2119415 INFO  (jetty-launcher-2332-thread-2) [n:127.0.0.1:40278_solr    ] o.a.s.c.LeaderElector Watching path /overseer_elect/election/96517922309210123-127.0.0.1:37235_solr-n_0000000002 to know if I could be the leader
   [junit4]   2> 2119415 INFO  (jetty-launcher-2332-thread-3) [n:127.0.0.1:37235_solr    ] o.a.s.c.LeaderElector Watching path /overseer_elect/election/96517922309210127-127.0.0.1:38125_solr-n_0000000001 to know if I could be the leader
   [junit4]   2> 2119415 INFO  (jetty-launcher-2332-thread-2) [n:127.0.0.1:40278_solr    ] o.a.s.c.c.ZkStateReader Updating cluster state from ZooKeeper... 
   [junit4]   2> 2119415 INFO  (jetty-launcher-2332-thread-5) [n:127.0.0.1:32897_solr    ] o.a.s.c.LeaderElector Watching path /overseer_elect/election/96517922309210124-127.0.0.1:40278_solr-n_0000000003 to know if I could be the leader
   [junit4]   2> 2119415 INFO  (jetty-launcher-2332-thread-3) [n:127.0.0.1:37235_solr    ] o.a.s.c.c.ZkStateReader Updating cluster state from ZooKeeper... 
   [junit4]   2> 2119415 INFO  (jetty-launcher-2332-thread-5) [n:127.0.0.1:32897_solr    ] o.a.s.c.c.ZkStateReader Updating cluster state from ZooKeeper... 
   [junit4]   2> 2119439 INFO  (jetty-launcher-2332-thread-1) [n:127.0.0.1:34957_solr    ] o.a.s.c.Overseer Overseer (id=96517922309210126-127.0.0.1:34957_solr-n_0000000000) starting
   [junit4]   2> 2119483 INFO  (jetty-launcher-2332-thread-1) [n:127.0.0.1:34957_solr    ] o.a.s.c.c.SolrZkClient makePath: /overseer/queue-work
   [junit4]   2> 2119491 INFO  (jetty-launcher-2332-thread-4) [n:127.0.0.1:38125_solr    ] o.a.s.c.CoreContainer Security conf doesn't exist. Skipping setup for authorization module.
   [junit4]   2> 2119491 INFO  (jetty-launcher-2332-thread-4) [n:127.0.0.1:38125_solr    ] o.a.s.c.CoreContainer No authentication plugin used.
   [junit4]   2> 2119492 INFO  (jetty-launcher-2332-thread-4) [n:127.0.0.1:38125_solr    ] o.a.s.c.CorePropertiesLocator Looking for core definitions underneath /home/jenkins/workspace/Lucene-Solr-5.5-Linux/solr/build/solr-core/test/J2/temp/solr.security.BasicAuthIntegrationTest_A3F55B0C9543EB14-001/tempDir-001/node4/.
   [junit4]   2> 2119492 INFO  (jetty-launcher-2332-thread-4) [n:127.0.0.1:38125_solr    ] o.a.s.c.CorePropertiesLocator Found 0 core definitions
   [junit4]   2> 2119504 INFO  (jetty-launcher-2332-thread-2) [n:127.0.0.1:40278_solr    ] o.a.s.c.CoreContainer Security conf doesn't exist. Skipping setup for authorization module.
   [junit4]   2> 2119504 INFO  (jetty-launcher-2332-thread-2) [n:127.0.0.1:40278_solr    ] o.a.s.c.CoreContainer No authentication plugin used.
   [junit4]   2> 2119504 INFO  (jetty-launcher-2332-thread-2) [n:127.0.0.1:40278_solr    ] o.a.s.c.CorePropertiesLocator Looking for core definitions underneath /home/jenkins/workspace/Lucene-Solr-5.5-Linux/solr/build/solr-core/test/J2/temp/solr.security.BasicAuthIntegrationTest_A3F55B0C9543EB14-001/tempDir-001/node2/.
   [junit4]   2> 2119504 INFO  (jetty-launcher-2332-thread-2) [n:127.0.0.1:40278_solr    ] o.a.s.c.CorePropertiesLocator Found 0 core definitions
   [junit4]   2> 2119505 INFO  (jetty-launcher-2332-thread-4) [n:127.0.0.1:38125_solr    ] o.a.s.s.SolrDispatchFilter user.dir=/home/jenkins/workspace/Lucene-Solr-5.5-Linux/solr/build/solr-core/test/J2
   [junit4]   2> 2119505 INFO  (jetty-launcher-2332-thread-4) [n:127.0.0.1:38125_solr    ] o.a.s.s.SolrDispatchFilter SolrDispatchFilter.init() done
   [junit4]   2> 2119505 INFO  (jetty-launcher-2332-thread-2) [n:127.0.0.1:40278_solr    ] o.a.s.s.SolrDispatchFilter user.dir=/home/jenkins/workspace/Lucene-Solr-5.5-Linux/solr/build/solr-core/test/J2
   [junit4]   2> 2119506 INFO  (jetty-launcher-2332-thread-2) [n:127.0.0.1:40278_solr    ] o.a.s.s.SolrDispatchFilter SolrDispatchFilter.init() done
   [junit4]   2> 2119514 INFO  (jetty-launcher-2332-thread-5) [n:127.0.0.1:32897_solr    ] o.a.s.c.CoreContainer Security conf doesn't exist. Skipping setup for authorization module.
   [junit4]   2> 2119514 INFO  (jetty-launcher-2332-thread-5) [n:127.0.0.1:32897_solr    ] o.a.s.c.CoreContainer No authentication plugin used.
   [junit4]   2> 2119514 INFO  (jetty-launcher-2332-thread-5) [n:127.0.0.1:32897_solr    ] o.a.s.c.CorePropertiesLocator Looking for core definitions underneath /home/jenkins/workspace/Lucene-Solr-5.5-Linux/solr/build/solr-core/test/J2/temp/solr.security.BasicAuthIntegrationTest_A3F55B0C9543EB14-001/tempDir-001/node5/.
   [junit4]   2> 2119514 INFO  (jetty-launcher-2332-thread-5) [n:127.0.0.1:32897_solr    ] o.a.s.c.CorePropertiesLocator Found 0 core definitions
   [junit4]   2> 2119517 INFO  (jetty-launcher-2332-thread-3) [n:127.0.0.1:37235_solr    ] o.a.s.c.CoreContainer Security conf doesn't exist. Skipping setup for authorization module.
   [junit4]   2> 2119517 INFO  (jetty-launcher-2332-thread-3) [n:127.0.0.1:37235_solr    ] o.a.s.c.CoreContainer No authentication plugin used.
   [junit4]   2> 2119517 INFO  (jetty-launcher-2332-thread-3) [n:127.0.0.1:37235_solr    ] o.a.s.c.CorePropertiesLocator Looking for core definitions underneath /home/jenkins/workspace/Lucene-Solr-5.5-Linux/solr/build/solr-core/test/J2/temp/solr.security.BasicAuthIntegrationTest_A3F55B0C9543EB14-001/tempDir-001/node3/.
   [junit4]   2> 2119517 INFO  (jetty-launcher-2332-thread-3) [n:127.0.0.1:37235_solr    ] o.a.s.c.CorePropertiesLocator Found 0 core definitions
   [junit4]   2> 2119524 INFO  (jetty-launcher-2332-thread-5) [n:127.0.0.1:32897_solr    ] o.a.s.s.SolrDispatchFilter user.dir=/home/jenkins/workspace/Lucene-Solr-5.5-Linux/solr/build/solr-core/test/J2
   [junit4]   2> 2119524 INFO  (jetty-launcher-2332-thread-5) [n:127.0.0.1:32897_solr    ] o.a.s.s.SolrDispatchFilter SolrDispatchFilter.init() done
   [junit4]   2> 2119524 INFO  (jetty-launcher-2332-thread-3) [n:127.0.0.1:37235_solr    ] o.a.s.s.SolrDispatchFilter user.dir=/home/jenkins/workspace/Lucene-Solr-5.5-Linux/solr/build/solr-core/test/J2
   [junit4]   2> 2119524 INFO  (jetty-launcher-2332-thread-3) [n:127.0.0.1:37235_solr    ] o.a.s.s.SolrDispatchFilter SolrDispatchFilter.init() done
   [junit4]   2> 2119618 INFO  (jetty-launcher-2332-thread-1) [n:127.0.0.1:34957_solr    ] o.a.s.c.OverseerAutoReplicaFailoverThread Starting OverseerAutoReplicaFailoverThread autoReplicaFailoverWorkLoopDelay=10000 autoReplicaFailoverWaitAfterExpiration=30000 autoReplicaFailoverBadNodeExpiration=60000
   [junit4]   2> 2119618 INFO  (OverseerCollectionConfigSetProcessor-96517922309210126-127.0.0.1:34957_solr-n_0000000000) [n:127.0.0.1:34957_solr    ] o.a.s.c.OverseerTaskProcessor Process current queue of overseer operations
   [junit4]   2> 2119618 INFO  (jetty-launcher-2332-thread-1) [n:127.0.0.1:34957_solr    ] o.a.s.c.c.ZkStateReader Updating cluster state from ZooKeeper... 
   [junit4]   2> 2119618 INFO  (OverseerStateUpdate-96517922309210126-127.0.0.1:34957_solr-n_0000000000) [n:127.0.0.1:34957_solr    ] o.a.s.c.Overseer Starting to work on the main queue
   [junit4]   2> 2119638 INFO  (jetty-launcher-2332-thread-1) [n:127.0.0.1:34957_solr    ] o.a.s.c.CoreContainer Security conf doesn't exist. Skipping setup for authorization module.
   [junit4]   2> 2119638 INFO  (jetty-launcher-2332-thread-1) [n:127.0.0.1:34957_solr    ] o.a.s.c.CoreContainer No authentication plugin used.
   [junit4]   2> 2119639 INFO  (jetty-launcher-2332-thread-1) [n:127.0.0.1:34957_solr    ] o.a.s.c.CorePropertiesLocator Looking for core definitions underneath /home/jenkins/workspace/Lucene-Solr-5.5-Linux/solr/build/solr-core/test/J2/temp/solr.security.BasicAuthIntegrationTest_A3F55B0C9543EB14-001/tempDir-001/node1/.
   [junit4]   2> 2119639 INFO  (jetty-launcher-2332-thread-1) [n:127.0.0.1:34957_solr    ] o.a.s.c.CorePropertiesLocator Found 0 core definitions
   [junit4]   2> 2119639 INFO  (jetty-launcher-2332-thread-1) [n:127.0.0.1:34957_solr    ] o.a.s.s.SolrDispatchFilter user.dir=/home/jenkins/workspace/Lucene-Solr-5.5-Linux/solr/build/solr-core/test/J2
   [junit4]   2> 2119639 INFO  (jetty-launcher-2332-thread-1) [n:127.0.0.1:34957_solr    ] o.a.s.s.SolrDispatchFilter SolrDispatchFilter.init() done
   [junit4]   2> 2119640 INFO  (TEST-BasicAuthIntegrationTest.testBasics-seed#[A3F55B0C9543EB14]) [    ] o.a.s.c.c.SolrZkClient Using default ZkCredentialsProvider
   [junit4]   2> 2119640 INFO  (TEST-BasicAuthIntegrationTest.testBasics-seed#[A3F55B0C9543EB14]) [    ] o.a.s.c.c.ConnectionManager Waiting for client to connect to ZooKeeper
   [junit4]   2> 2119667 INFO  (zkCallback-2359-thread-1) [    ] o.a.s.c.c.ConnectionManager Watcher org.apache.solr.common.cloud.ConnectionManager@1063a0e name:ZooKeeperConnection Watcher:127.0.0.1:36810 got event WatchedEvent state:SyncConnected type:None path:null path:null type:None
   [junit4]   2> 2119667 INFO  (TEST-BasicAuthIntegrationTest.testBasics-seed#[A3F55B0C9543EB14]) [    ] o.a.s.c.c.ConnectionManager Client is connected to ZooKeeper
   [junit4]   2> 2119668 INFO  (TEST-BasicAuthIntegrationTest.testBasics-seed#[A3F55B0C9543EB14]) [    ] o.a.s.c.c.SolrZkClient Using default ZkACLProvider
   [junit4]   2> 2119697 INFO  (TEST-BasicAuthIntegrationTest.testBasics-seed#[A3F55B0C9543EB14]) [    ] o.e.j.s.ServerConnector Stopped ServerConnector@17095ef{HTTP/1.1}{127.0.0.1:0}
   [junit4]   2> 2119697 INFO  (TEST-BasicAuthIntegrationTest.testBasics-seed#[A3F55B0C9543EB14]) [    ] o.a.s.c.CoreContainer Shutting down CoreContainer instance=12786174
   [junit4]   2> 2119697 INFO  (TEST-BasicAuthIntegrationTest.testBasics-seed#[A3F55B0C9543EB14]) [    ] o.a.s.c.ZkController Publish node=127.0.0.1:38125_solr as DOWN
   [junit4]   2> 2119751 INFO  (OverseerStateUpdate-96517922309210126-127.0.0.1:34957_solr-n_0000000000) [n:127.0.0.1:34957_solr    ] o.a.s.c.Overseer processMessage: queueSize: 1, message = {
   [junit4]   2>   "operation":"downnode",
   [junit4]   2>   "node_name":"127.0.0.1:38125_solr"} current state version: 0
   [junit4]   2> 2119751 INFO  (OverseerStateUpdate-96517922309210126-127.0.0.1:34957_solr-n_0000000000) [n:127.0.0.1:34957_solr    ] o.a.s.c.o.NodeMutator DownNode state invoked for node: 127.0.0.1:38125_solr
   [junit4]   2> 2119773 INFO  (zkCallback-2356-thread-1-processing-n:127.0.0.1:34957_solr) [n:127.0.0.1:34957_solr    ] o.a.s.c.c.ZkStateReader A live node change: [WatchedEvent state:SyncConnected type:NodeChildrenChanged path:/live_nodes], has occurred - updating... (live nodes size: [5])
   [junit4]   2> 2119774 INFO  (zkCallback-2354-thread-2-processing-n:127.0.0.1:37235_solr) [n:127.0.0.1:37235_solr    ] o.a.s.c.c.ZkStateReader A live node change: [WatchedEvent state:SyncConnected type:NodeChildrenChanged path:/live_nodes], has occurred - updating... (live nodes size: [5])
   [junit4]   2> 2119773 INFO  (zkCallback-2358-thread-1-processing-n:127.0.0.1:38125_solr) [n:127.0.0.1:38125_solr    ] o.a.s.c.c.ZkStateReader A live node change: [WatchedEvent state:SyncConnected type:NodeChildrenChanged path:/live_nodes], has occurred - updating... (live nodes size: [5])
   [junit4]   2> 2119773 INFO  (zkCallback-2355-thread-1-processing-n:127.0.0.1:40278_solr) [n:127.0.0.1:40278_solr    ] o.a.s.c.c.ZkStateReader A live node change: [WatchedEvent state:SyncConnected type:NodeChildrenChanged path:/live_nodes], has occurred - updating... (live nodes size: [5])
   [junit4]   2> 2119773 INFO  (zkCallback-2357-thread-1-processing-n:127.0.0.1:32897_solr) [n:127.0.0.1:32897_solr    ] o.a.s.c.c.ZkStateReader A live node change: [WatchedEvent state:SyncConnected type:NodeChildrenChanged path:/live_nodes], has occurred - updating... (live nodes size: [5])
   [junit4]   2> 2119774 WARN  (zkCallback-2358-thread-1-processing-n:127.0.0.1:38125_solr) [n:127.0.0.1:38125_solr    ] o.a.s.c.c.ZkStateReader ZooKeeper watch triggered, but Solr cannot talk to ZK: [KeeperErrorCode = Session expired for /live_nodes]
   [junit4]   2> 2119775 INFO  (TEST-BasicAuthIntegrationTest.testBasics-seed#[A3F55B0C9543EB14]) [    ] o.e.j.s.h.ContextHandler Stopped o.e.j.s.ServletContextHandler@763b90{/solr,null,UNAVAILABLE}
   [junit4]   2> 2119776 INFO  (TEST-BasicAuthIntegrationTest.testBasics-seed#[A3F55B0C9543EB14]) [    ] o.e.j.s.Server jetty-9.2.13.v20150730
   [junit4]   2> 2119777 INFO  (TEST-BasicAuthIntegrationTest.testBasics-seed#[A3F55B0C9543EB14]) [    ] o.e.j.s.h.ContextHandler Started o.e.j.s.ServletContextHandler@a5460e{/solr,null,AVAILABLE}
   [junit4]   2> 2119777 INFO  (TEST-BasicAuthIntegrationTest.testBasics-seed#[A3F55B0C9543EB14]) [    ] o.e.j.s.ServerConnector Started ServerConnector@10a3f65{HTTP/1.1}{127.0.0.1:38094}
   [junit4]   2> 2119777 INFO  (TEST-BasicAuthIntegrationTest.testBasics-seed#[A3F55B0C9543EB14]) [    ] o.e.j.s.Server Started @2121023ms
   [junit4]   2> 2119777 INFO  (TEST-BasicAuthIntegrationTest.testBasics-seed#[A3F55B0C9543EB14]) [    ] o.a.s.c.s.e.JettySolrRunner Jetty properties: {hostContext=/solr, hostPort=38094}
   [junit4]   2> 2119777 INFO  (TEST-BasicAuthIntegrationTest.testBasics-seed#[A3F55B0C9543EB14]) [    ] o.a.s.s.SolrDispatchFilter SolrDispatchFilter.init(): sun.misc.Launcher$AppClassLoader@752144
   [junit4]   2> 2119777 INFO  (TEST-BasicAuthIntegrationTest.testBasics-seed#[A3F55B0C9543EB14]) [    ] o.a.s.c.SolrResourceLoader new SolrResourceLoader for directory: '/home/jenkins/workspace/Lucene-Solr-5.5-Linux/solr/build/solr-core/test/J2/temp/solr.security.BasicAuthIntegrationTest_A3F55B0C9543EB14-001/tempDir-001/node6'
   [junit4]   2> 2119777 INFO  (TEST-BasicAuthIntegrationTest.testBasics-seed#[A3F55B0C9543EB14]) [    ] o.a.s.c.SolrResourceLoader JNDI not configured for solr (NoInitialContextEx)
   [junit4]   2> 2119777 INFO  (TEST-BasicAuthIntegrationTest.testBasics-seed#[A3F55B0C9543EB14]) [    ] o.a.s.c.SolrResourceLoader solr home defaulted to 'solr/' (could not find system property or JNDI)
   [junit4]   2> 2119778 INFO  (TEST-BasicAuthIntegrationTest.testBasics-seed#[A3F55B0C9543EB14]) [    ] o.a.s.c.c.SolrZkClient Using default ZkCredentialsProvider
   [junit4]   2> 2119778 INFO  (TEST-BasicAuthIntegrationTest.testBasics-seed#[A3F55B0C9543EB14]) [    ] o.a.s.c.c.ConnectionManager Waiting for client to connect to ZooKeeper
   [junit4]   2> 2119821 INFO  (zkCallback-2354-thread-1-processing-n:127.0.0.1:37235_solr) [n:127.0.0.1:37235_solr    ] o.a.s.c.LeaderElector Watching path /overseer_elect/election/96517922309210126-127.0.0.1:34957_solr-n_0000000000 to know if I could be the leader
   [junit4]   2> 2119821 INFO  (zkCallback-2361-thread-1) [    ] o.a.s.c.c.ConnectionManager Watcher org.apache.solr.common.cloud.ConnectionManager@172c8f2 name:ZooKeeperConnection Watcher:127.0.0.1:36810/solr got event WatchedEvent state:SyncConnected type:None path:null path:null type:None
   [junit4]   2> 2119822 INFO  (TEST-BasicAuthIntegrationTest.testBasics-seed#[A3F55B0C9543EB14]) [    ] o.a.s.c.c.ConnectionManager Client is connected to ZooKeeper
   [junit4]   2> 2119822 INFO  (TEST-BasicAuthIntegrationTest.testBasics-seed#[A3F55B0C9543EB14]) [    ] o.a.s.c.c.SolrZkClient Using default ZkACLProvider
   [junit4]   2> 2119822 INFO  (TEST-BasicAuthIntegrationTest.testBasics-seed#[A3F55B0C9543EB14]) [    ] o.a.s.s.SolrDispatchFilter solr.xml found in ZooKeeper. Loading...
   [junit4]   2> 2119857 INFO  (TEST-BasicAuthIntegrationTest.testBasics-seed#[A3F55B0C9543EB14]) [    ] o.a.s.c.CorePropertiesLocator Config-defined core root directory: /home/jenkins/workspace/Lucene-Solr-5.5-Linux/solr/build/solr-core/test/J2/temp/solr.security.BasicAuthIntegrationTest_A3F55B0C9543EB14-001/tempDir-001/node6/.
   [junit4]   2> 2119858 INFO  (TEST-BasicAuthIntegrationTest.testBasics-seed#[A3F55B0C9543EB14]) [    ] o.a.s.c.CoreContainer New CoreContainer 13053732
   [junit4]   2> 2119858 INFO  (TEST-BasicAuthIntegrationTest.testBasics-seed#[A3F55B0C9543EB14]) [    ] o.a.s.c.CoreContainer Loading cores into CoreContainer [instanceDir=/home/jenkins/workspace/Lucene-Solr-5.5-Linux/solr/build/solr-core/test/J2/temp/solr.security.BasicAuthIntegrationTest_A3F55B0C9543EB14-001/tempDir-001/node6]
   [junit4]   2> 2119858 WARN  (TEST-BasicAuthIntegrationTest.testBasics-seed#[A3F55B0C9543EB14]) [    ] o.a.s.c.CoreContainer Couldn't add files from /home/jenkins/workspace/Lucene-Solr-5.5-Linux/solr/build/solr-core/test/J2/temp/solr.security.BasicAuthIntegrationTest_A3F55B0C9543EB14-001/tempDir-001/node6/lib to classpath: /home/jenkins/workspace/Lucene-Solr-5.5-Linux/solr/build/solr-core/test/J2/temp/solr.security.BasicAuthIntegrationTest_A3F55B0C9543EB14-001/tempDir-001/node6/lib
   [junit4]   2> 2119858 INFO  (TEST-BasicAuthIntegrationTest.testBasics-seed#[A3F55B0C9543EB14]) [    ] o.a.s.h.c.HttpShardHandlerFactory created with socketTimeout : 90000,urlScheme : ,connTimeout : 15000,maxConnectionsPerHost : 20,maxConnections : 10000,corePoolSize : 0,maximumPoolSize : 2147483647,maxThreadIdleTime : 5,sizeOfQueue : -1,fairnessPolicy : false,useRetries : false,connectionsEvictorSleepDelay : 5000,maxConnectionIdleTime : 40000,
   [junit4]   2> 2119859 INFO  (TEST-BasicAuthIntegrationTest.testBasics-seed#[A3F55B0C9543EB14]) [    ] o.a.s.u.UpdateShardHandler Creating UpdateShardHandler HTTP client with params: socketTimeout=340000&connTimeout=45000&retry=true
   [junit4]   2> 2119859 INFO  (TEST-BasicAuthIntegrationTest.testBasics-seed#[A3F55B0C9543EB14]) [    ] o.a.s.l.LogWatcher SLF4J impl is org.slf4j.impl.Log4jLoggerFactory
   [junit4]   2> 2119859 INFO  (TEST-BasicAuthIntegrationTest.testBasics-seed#[A3F55B0C9543EB14]) [    ] o.a.s.l.LogWatcher Registering Log Listener [Log4j (org.slf4j.impl.Log4jLoggerFactory)]
   [junit4]   2> 2119859 INFO  (TEST-BasicAuthIntegrationTest.testBasics-seed#[A3F55B0C9543EB14]) [    ] o.a.s.c.ZkContainer Zookeeper client=127.0.0.1:36810/solr
   [junit4]   2> 2119859 INFO  (TEST-BasicAuthIntegrationTest.testBasics-seed#[A3F55B0C9543EB14]) [    ] o.a.s.c.ZkController zkHost includes chroot
   [junit4]   2> 2119859 INFO  (TEST-BasicAuthIntegrationTest.testBasics-seed#[A3F55B0C9543EB14]) [    ] o.a.s.c.c.SolrZkClient Using default ZkCredentialsProvider
   [junit4]   2> 2119860 INFO  (TEST-BasicAuthIntegrationTest.testBasics-seed#[A3F55B0C9543EB14]) [    ] o.a.s.c.c.ConnectionManager Waiting for client to connect to ZooKeeper
   [junit4]   2> 2119889 INFO  (zkCallback-2364-thread-1) [    ] o.a.s.c.c.ConnectionManager Watcher org.apache.solr.common.cloud.ConnectionManager@1fe7550 name:ZooKeeperConnection Watcher:127.0.0.1:36810 got event WatchedEvent state:SyncConnected type:None path:null path:null type:None
   [junit4]   2> 2119889 INFO  (TEST-BasicAuthIntegrationTest.testBasics-seed#[A3F55B0C9543EB14]) [    ] o.a.s.c.c.ConnectionManager Client is connected to ZooKeeper
   [junit4]   2> 2119889 INFO  (TEST-BasicAuthIntegrationTest.testBasics-seed#[A3F55B0C9543EB14]) [    ] o.a.s.c.c.SolrZkClient Using default ZkACLProvider
   [junit4]   2> 2119912 INFO  (TEST-BasicAuthIntegrationTest.testBasics-seed#[A3F55B0C9543EB14]) [n:127.0.0.1:38094_solr    ] o.a.s.c.ZkController Added new OnReconnect listener org.apache.solr.cloud.ZkController$6@e56831
   [junit4]   2> 2119913 INFO  (TEST-BasicAuthIntegrationTest.testBasics-seed#[A3F55B0C9543EB14]) [n:127.0.0.1:38094_solr    ] o.a.s.c.c.ConnectionManager Waiting for client to connect to ZooKeeper
   [junit4]   2> 2119933 INFO  (zkCallback-2365-thread-1-processing-n:127.0.0.1:38094_solr) [n:127.0.0.1:38094_solr    ] o.a.s.c.c.ConnectionManager Watcher org.apache.solr.common.cloud.ConnectionManager@17d2d9f name:ZooKeeperConnection Watcher:127.0.0.1:36810/solr got event WatchedEvent state:SyncConnected type:None path:null path:null type:None
   [junit4]   2> 2119933 INFO  (TEST-BasicAuthIntegrationTest.testBasics-seed#[A3F55B0C9543EB14]) [n:127.0.0.1:38094_solr    ] o.a.s.c.c.ConnectionManager Client is connected to ZooKeeper
   [junit4]   2> 2120085 INFO  (TEST-BasicAuthIntegrationTest.testBasics-seed#[A3F55B0C9543EB14]) [n:127.0.0.1:38094_solr    ] o.a.s.c.c.ZkStateReader Updating cluster state from ZooKeeper... 
   [junit4]   2> 2121086 INFO  (TEST-BasicAuthIntegrationTest.testBasics-seed#[A3F55B0C9543EB14]) [n:127.0.0.1:38094_solr    ] o.a.s.c.ZkController Register node as live in ZooKeeper:/live_nodes/127.0.0.1:38094_solr
   [junit4]   2> 2121109 INFO  (TEST-BasicAuthIntegrationTest.testBasics-seed#[A3F55B0C9543EB14]) [n:127.0.0.1:38094_solr    ] o.a.s.c.c.SolrZkClient makePath: /live_nodes/127.0.0.1:38094_solr
   [junit4]   2> 2121126 INFO  (zkCallback-2365-thread-1-processing-n:127.0.0.1:38094_solr) [n:127.0.0.1:38094_solr    ] o.a.s.c.c.ZkStateReader A live node change: [WatchedEvent state:SyncConnected type:NodeChildrenChanged path:/live_nodes], has occurred - updating... (live nodes size: [4])
   [junit4]   2> 2121126 INFO  (zkCallback-2357-thread-1-processing-n:127.0.0.1:32897_solr) [n:127.0.0.1:32897_solr    ] o.a.s.c.c.ZkStateReader A live node change: [WatchedEvent state:SyncConnected type:NodeChildrenChanged path:/live_nodes], has occurred - updating... (live nodes size: [4])
   [junit4]   2> 2121126 INFO  (zkCallback-2355-thread-1-processing-n:127.0.0.1:40278_solr) [n:127.0.0.1:40278_solr    ] o.a.s.c.c.ZkStateReader A live node change: [WatchedEvent state:SyncConnected type:NodeChildrenChanged path:/live_nodes], has occurred - updating... (live nodes size: [4])
   [junit4]   2> 2121126 INFO  (zkCallback-2354-thread-1-processing-n:127.0.0.1:37235_solr) [n:127.0.0.1:37235_solr    ] o.a.s.c.c.ZkStateReader A live node change: [WatchedEvent state:SyncConnected type:NodeChildrenChanged path:/live_nodes], has occurred - updating... (live nodes size: [4])
   [junit4]   2> 2121126 INFO  (zkCallback-2356-thread-2-processing-n:127.0.0.1:34957_solr) [n:127.0.0.1:34957_solr    ] o.a.s.c.c.ZkStateReader A live node change: [WatchedEvent state:SyncConnected type:NodeChildrenChanged path:/live_nodes], has occurred - updating... (live nodes size: [4])
   [junit4]   2> 2121127 INFO  (TEST-BasicAuthIntegrationTest.testBasics-seed#[A3F55B0C9543EB14]) [n:127.0.0.1:38094_solr    ] o.a.s.c.Overseer Overseer (id=null) closing
   [junit4]   2> 2121151 INFO  (TEST-BasicAuthIntegrationTest.testBasics-seed#[A3F55B0C9543EB14]) [n:127.0.0.1:38094_solr    ] o.a.s.c.LeaderElector Joined leadership election with path: /overseer_elect/election/96517922309210131-127.0.0.1:38094_solr-n_0000000005
   [junit4]   2> 2121152 INFO  (TEST-BasicAuthIntegrationTest.testBasics-seed#[A3F55B0C9543EB14]) [n:127.0.0.1:38094_solr    ] o.a.s.c.LeaderElector Watching path /overseer_elect/election/96517922309210125-127.0.0.1:32897_solr-n_0000000004 to know if I could be the leader
   [junit4]   2> 2121192 INFO  (TEST-BasicAuthIntegrationTest.testBasics-seed#[A3F55B0C9543EB14]) [n:127.0.0.1:38094_solr    ] o.a.s.c.CoreContainer Security conf doesn't exist. Skipping setup for authorization module.
   [junit4]   2> 2121192 INFO  (TEST-BasicAuthIntegrationTest.testBasics-seed#[A3F55B0C9543EB14]) [n:127.0.0.1:38094_solr    ] o.a.s.c.CoreContainer No authentication plugin used.
   [junit4]   2> 2121192 INFO  (TEST-BasicAuthIntegrationTest.testBasics-seed#[A3F55B0C9543EB14]) [n:127.0.0.1:38094_solr    ] o.a.s.c.CorePropertiesLocator Looking for core definitions underneath /home/jenkins/workspace/Lucene-Solr-5.5-Linux/solr/build/solr-core/test/J2/temp/solr.security.BasicAuthIntegrationTest_A3F55B0C9543EB14-001/tempDir-001/node6/.
   [junit4]   2> 2121192 INFO  (TEST-BasicAuthIntegrationTest.testBasics-seed#[A3F55B0C9543EB14]) [n:127.0.0.1:38094_solr    ] o.a.s.c.CorePropertiesLocator Found 0 core definitions
   [junit4]   2> 2121193 INFO  (TEST-BasicAuthIntegrationTest.testBasics-seed#[A3F55B0C9543EB14]) [n:127.0.0.1:38094_solr    ] o.a.s.s.SolrDispatchFilter user.dir=/home/jenkins/workspace/Lucene-Solr-5.5-Linux/solr/build/solr-core/test/J2
   [junit4]   2> 2121193 INFO  (TEST-BasicAuthIntegrationTest.testBasics-seed#[A3F55B0C9543EB14]) [n:127.0.0.1:38094_solr    ] o.a.s.s.SolrDispatchFilter SolrDispatchFilter.init() done
   [junit4]   2> 2121193 INFO  (TEST-BasicAuthIntegrationTest.testBasics-seed#[A3F55B0C9543EB14]) [    ] o.a.s.c.c.SolrZkClient Using default ZkCredentialsProvider
   [junit4]   2> 2121193 INFO  (TEST-BasicAuthIntegrationTest.testBasics-seed#[A3F55B0C9543EB14]) [    ] o.a.s.c.c.ConnectionManager Waiting for client to connect to ZooKeeper
   [junit4]   2> 2121214 INFO  (zkCallback-2366-thread-1) [    ] o.a.s.c.c.ConnectionManager Watcher org.apache.solr.common.cloud.ConnectionManager@1284393 name:ZooKeeperConnection Watcher:127.0.0.1:36810/solr got event WatchedEvent state:SyncConnected type:None path:null path:null type:None
   [junit4]   2> 2121214 INFO  (TEST-BasicAuthIntegrationTest.testBasics-seed#[A3F55B0C9543EB14]) [    ] o.a.s.c.c.ConnectionManager Client is connected to ZooKeeper
   [junit4]   2> 2121215 INFO  (TEST-BasicAuthIntegrationTest.testBasics-seed#[A3F55B0C9543EB14]) [    ] o.a.s.c.c.SolrZkClient Using default ZkACLProvider
   [junit4]   2> 2121215 INFO  (TEST-BasicAuthIntegrationTest.testBasics-seed#[A3F55B0C9543EB14]) [    ] o.a.s.c.c.SolrZkClient makePath: /configs/solrCloudCollectionConfig/protwords.txt
   [junit4]   2> 2121297 INFO  (TEST-BasicAuthIntegrationTest.testBasics-seed#[A3F55B0C9543EB14]) [    ] o.a.s.c.c.SolrZkClient makePath: /configs/solrCloudCollectionConfig/solrconfig-delaying-component.xml
   [junit4]   2> 2121324 INFO  (TEST-BasicAuthIntegrationTest.testBasics-seed#[A3F55B0C9543EB14]) [    ] o.a.s.c.c.SolrZkClient makePath: /configs/solrCloudCollectionConfig/bad_solrconfig.xml
   [junit4]   2> 2121420 INFO  (TEST-BasicAuthIntegrationTest.testBasics-seed#[A3F55B0C9543EB14]) [    ] o.a.s.c.c.SolrZkClient makePath: /configs/solrCloudCollectionConfig/solrconfig-nocache.xml
   [junit4]   2> 2121437 INFO  (TEST-BasicAuthIntegrationTest.testBasics-seed#[A3F55B0C9543EB14]) [    ] o.a.s.c.c.SolrZkClient makePath: /configs/solrCloudCollectionConfig/solrconfig-implicitproperties.xml
   [junit4]   2> 2121488 INFO  (TEST-BasicAuthIntegrationTest.testBasics-seed#[A3F55B0C9543EB14]) [    ] o.a.s.c.c.SolrZkClient makePath: /configs/solrCloudCollectionConfig/solrconfig-mergepolicy-legacy.xml
   [junit4]   2> 2121491 INFO  (TEST-BasicAuthIntegrationTest.testBasics-seed#[A3F55B0C9543EB14]) [    ] o.a.s.c.c.SolrZkClient makePath: /configs/solrCloudCollectionConfig/bad-schema-uniquekey-uses-default.xml
   [junit4]   2> 2121504 INFO  (TEST-BasicAuthIntegrationTest.testBasics-seed#[A3F55B0C9543EB14]) [    ] o.a.s.c.c.SolrZkClient makePath: /configs/solrCloudCollectionConfig/bad-schema-sim-default-has-no-explicit-sim.xml
   [junit4]   2> 2121561 INFO  (TEST-BasicAuthIntegrationTest.testBasics-seed#[A3F55B0C9543EB14]) [    ] o.a.s.c.c.SolrZkClient makePath: /configs/solrCloudCollectionConfig/bad-schema-uniquekey-multivalued.xml
   [junit4]   2> 2121586 INFO  (TEST-BasicAuthIntegrationTest.testBasics-seed#[A3F55B0C9543EB14]) [    ] o.a.s.c.c.SolrZkClient makePath: /configs/solrCloudCollectionConfig/analyzingInfixSuggest.txt
   [junit4]   2> 2121603 INFO  (TEST-BasicAuthIntegrationTest.testBasics-seed#[A3F55B0C9543EB14]) [    ] o.a.s.c.c.SolrZkClient makePath: /configs/solrCloudCollectionConfig/missleading.extension.updateprocessor.js.txt
   [junit4]   2> 2121613 INFO  (TEST-BasicAuthIntegrationTest.testBasics-seed#[A3F55B0C9543EB14]) [    ] o.a.s.c.c.SolrZkClient makePath: /configs/solrCloudCollectionConfig/bad-schema-multiple-asterisk-copyfield-source-should-fail-test.xml
   [junit4]   2> 2121645 INFO  (TEST-BasicAuthIntegrationTest.testBasics-seed#[A3F55B0C9543EB14]) [    ] o.a.s.c.c.SolrZkClient makePath: /configs/solrCloudCollectionConfig/schema-replication2.xml
   [junit4]   2> 2121662 INFO  (TEST-BasicAuthIntegrationTest.testBasics-seed#[A3F55B0C9543EB14]) [    ] o.a.s.c.c.SolrZkClient makePath: /configs/solrCloudCollectionConfig/solrconfig-infostream-logging.xml
   [junit4]   2> 2121676 INFO  (TEST-BasicAuthIntegrationTest.testBasics-seed#[A3F55B0C9543EB14]) [    ] o.a.s.c.c.SolrZkClient makePath: /configs/solrCloudCollectionConfig/solrconfig-collapseqparser.xml
   [junit4]   2> 2121709 INFO  (TEST-BasicAuthIntegrationTest.testBasics-seed#[A3F55B0C9543EB14]) [    ] o.a.s.c.c.SolrZkClient makePath: /configs/solrCloudCollectionConfig/bad-schema-currency-ft-bogus-code-in-xml.xml
   [junit4]   2> 2121719 INFO  (TEST-BasicAuthIntegrationTest.testBasics-seed#[A3F55B0C9543EB14]) [    ] o.a.s.c.c.SolrZkClient makePath: /configs/solrCloudCollectionConfig/old_synonyms.txt
   [junit4]   2> 2121731 INFO  (TEST-BasicAuthIntegrationTest.testBasics-seed#[A3F55B0C9543EB14]) [    ] o.a.s.c.c.SolrZkClient makePath: /configs/solrCloudCollectionConfig/enumsConfig.xml
   [junit4]   2> 2121804 INFO  (TEST-BasicAuthIntegrationTest.testBasics-seed#[A3F55B0C9543EB14]) [    ] o.a.s.c.c.SolrZkClient makePath: /configs/solrCloudCollectionConfig/solrconfig-script-updateprocessor.xml
   [junit4]   2> 2121877 INFO  (TEST-BasicAuthIntegrationTest.testBasics-seed#[A3F55B0C9543EB14]) [    ] o.a.s.c.c.SolrZkClient makePath: /configs/solrCloudCollectionConfig/schema-add-schema-fields-update-processor.xml
   [junit4]   2> 2121928 INFO  (TEST-BasicAuthIntegrationTest.testBasics-seed#[A3F55B0C9543EB14]) [    ] o.a.s.c.c.SolrZkClient makePath: /configs/solrCloudCollectionConfig/solrconfig-mergepolicyfactory-nocfs.xml
   [junit4]   2> 2121931 INFO  (TEST-BasicAuthIntegrationTest.testBasics-seed#[A3F55B0C9543EB14]) [    ] o.a.s.c.c.SolrZkClient makePath: /configs/solrCloudCollectionConfig/bad-schema-sweetspot-both-tf.xml
   [junit4]   2> 2121950 INFO  (TEST-BasicAuthIntegrationTest.testBasics-seed#[A3F55B0C9543EB14]) [    ] o.a.s.c.c.SolrZkClient makePath: /configs/solrCloudCollectionConfig/schema-phrasesuggest.xml
   [junit4]   2> 2121960 INFO  (TEST-BasicAuthIntegrationTest.testBasics-seed#[A3F55B0C9543EB14]) [    ] o.a.s.c.c.SolrZkClient makePath: /configs/solrCloudCollectionConfig/solrconfig.xml
   [junit4]   2> 2122000 INFO  (TEST-BasicAuthIntegrationTest.testBasics-seed#[A3F55B0C9543EB14]) [    ] o.a.s.c.c.SolrZkClient makePath: /configs/solrCloudCollectionConfig/solrconfig-delpolicy1.xml
   [junit4]   2> 2122022 INFO  (TEST-BasicAuthIntegrationTest.testBasics-seed#[A3F55B0C9543EB14]) [    ] o.a.s.c.c.SolrZkClient makePath: /configs/solrCloudCollectionConfig/schema-sim.xml
   [junit4]   2> 2122061 INFO  (TEST-BasicAuthIntegrationTest.testBasics-seed#[A3F55B0C9543EB14]) [    ] o.a.s.c.c.SolrZkClient makePath: /configs/solrCloudCollectionConfig/schema15.xml
   [junit4]   2> 2122100 INFO  (TEST-BasicAuthIntegrationTest.testBasics-seed#[A3F55B0C9543EB14]) [    ] o.a.s.c.c.SolrZkClient makePath: /configs/solrCloudCollectionConfig/bad-schema-misplaced-asterisk-copyfield-source-should-fail-test.xml
   [junit4]   2> 2122111 INFO  (TEST-BasicAuthIntegrationTest.testBasics-seed#[A3F55B0C9543EB14]) [    ] o.a.s.c.c.SolrZkClient makePath: /configs/solrCloudCollectionConfig/stemdict.txt
   [junit4]   2> 2122152 INFO  (TEST-BasicAuthIntegrationTest.testBasics-seed#[A3F55B0C9543EB14]) [    ] o.a.s.c.c.SolrZkClient makePath: /configs/solrCloudCollectionConfig/hunspell-test.aff
   [junit4]   2> 2122173 INFO  (TEST-BasicAuthIntegrationTest.testBasics-seed#[A3F55B0C9543EB14]) [    ] o.a.s.c.c.SolrZkClient makePath: /configs/solrCloudCollectionConfig/solrconfig-spatial.xml
   [junit4]   2> 2122183 INFO  (TEST-BasicAuthIntegrationTest.testBasics-seed#[A3F55B0C9543EB14]) [    ] o.a.s.c.c.SolrZkClient makePath: /configs/solrCloudCollectionConfig/solrconfig-slave1.xml
   [junit4]   2> 2122220 INFO  (TEST-BasicAuthIntegrationTest.testBasics-seed#[A3F55B0C9543EB14]) [    ] o.a.s.c.c.SolrZkClient makePath: /configs/solrCloudCollectionConfig/bad-schema-dup-fieldType.xml
   [junit4]   2> 2122236 INFO  (TEST-BasicAuthIntegrationTest.testBasics-seed#[A3F55B0C9543EB14]) [    ] o.a.s.c.c.SolrZkClient makePath: /configs/solrCloudCollectionConfig/bad-schema-external-filefield.xml
   [junit4]   2> 2122253 INFO  (TEST-BasicAuthIntegrationTest.testBasics-seed#[A3F55B0C9543EB14]) [    ] o.a.s.c.c.SolrZkClient makePath: /configs/solrCloudCollectionConfig/solrconfig-query-parser-init.xml
   [junit4]   2> 2122318 INFO  (TEST-BasicAuthIntegrationTest.testBasics-seed#[A3F55B0C9543EB14]) [    ] o.a.s.c.c.SolrZkClient makePath: /configs/solrCloudCollectionConfig/schema-complex-phrase.xml
   [junit4]   2> 2122345 INFO  (TEST-BasicAuthIntegrationTest.testBasics-seed#[A3F55B0C9543EB14]) [    ] o.a.s.c.c.SolrZkClient makePath: /configs/solrCloudCollectionConfig/conditional.updateprocessor.js
   [junit4]   2> 2122348 INFO  (TEST-BasicAuthIntegrationTest.testBasics-seed#[A3F55B0C9543EB14]) [    ] o.a.s.c.c.SolrZkClient makePath: /configs/solrCloudCollectionConfig/bad-schema-analyzer-class-and-nested.xml
   [junit4]   2> 2122388 INFO  (TEST-BasicAuthIntegrationTest.testBasics-seed#[A3F55B0C9543EB14]) [    ] o.a.s.c.c.SolrZkClient makePath: /configs/solrCloudCollectionConfig/solrconfig-returnfields.xml
   [junit4]   2> 2122438 INFO  (TEST-BasicAuthIntegrationTest.testBasics-seed#[A3F55B0C9543EB14]) [    ] o.a.s.c.c.SolrZkClient makePath: /configs/solrCloudCollectionConfig/schema-eff.xml
   [junit4]   2> 2122461 INFO  (TEST-BasicAuthIntegrationTest.testBasics-seed#[A3F55B0C9543EB14]) [    ] o.a.s.c.c.SolrZkClient makePath: /configs/solrCloudCollectionConfig/schema-folding.xml
   [junit4]   2> 2122498 INFO  (TEST-BasicAuthIntegrationTest.testBasics-seed#[A3F55B0C9543EB14]) [    ] o.a.s.c.c.SolrZkClient makePath: /configs/solrCloudCollectionConfig/solrconfig-tieredmergepolicyfactory.xml
   [junit4]   2> 2122537 INFO  (TEST-BasicAuthIntegrationTest.testBasics-seed#[A3F55B0C9543EB14]) [    ] o.a.s.c.c.SolrZkClient makePath: /configs/solrCloudCollectionConfig/schema-simpleqpplugin.xml
   [junit4]   2> 2122573 INFO  (TEST-BasicAuthIntegrationTest.testBasics-seed#[A3F55B0C9543EB14]) [    ] o.a.s.c.c.SolrZkClient makePath: /configs/solrCloudCollectionConfig/solrconfig-hash.xml
   [junit4]   2> 2122584 INFO  (TEST-BasicAuthIntegrationTest.testBasics-seed#[A3F55B0C9543EB14]) [    ] o.a.s.c.c.SolrZkClient makePath: /configs/solrCloudCollectionConfig/stopwords.txt
   [junit4]   2> 2122615 INFO  (TEST-BasicAuthIntegrationTest.testBasics-seed#[A3F55B0C9543EB14]) [    ] o.a.s.c.c.SolrZkClient makePath: /configs/solrCloudCollectionConfig/bad-schema-dynamicfield-required.xml
   [junit4]   2> 2122627 INFO  (TEST-BasicAuthIntegrationTest.testBasics-seed#[A3F55B0C9543EB14]) [    ] o.a.s.c.c.SolrZkClient makePath: /configs/solrCloudCollectionConfig/solrconfig-mergepolicy-nocfs.xml
   [junit4]   2> 2122637 INFO  (TEST-BasicAuthIntegrationTest.testBasics-seed#[A3F55B0C9543EB14]) [    ] o.a.s.c.c.SolrZkClient makePath: /configs/solrCloudCollectionConfig/bad-solrconfig-bogus-scriptengine-name.xml
   [junit4]   2> 2122680 INFO  (TEST-BasicAuthIntegrationTest.testBasics-seed#[A3F55B0C9543EB14]) [    ] o.a.s.c.c.SolrZkClient makePath: /configs/solrCloudCollectionConfig/throw.error.on.add.updateprocessor.js
   [junit4]   2> 2122705 INFO  (TEST-BasicAuthIntegrationTest.testBasics-seed#[A3F55B0C9543EB14]) [    ] o.a.s.c.c.SolrZkClient makePath: /configs/solrCloudCollectionConfig/solrconfig-minimal.xml
   [junit4]   2> 2122724 INFO  (TEST-BasicAuthIntegrationTest.testBasics-seed#[A3F55B0C9543EB14]) [    ] o.a.s.c.c.SolrZkClient makePath: /configs/solrCloudCollectionConfig/solrconfig-defaults.xml
   [junit4]   2> 2122763 INFO  (TEST-BasicAuthIntegrationTest.testBasics-seed#[A3F55B0C9543EB14]) [    ] o.a.s.c.c.SolrZkClient makePath: /configs/solrCloudCollectionConfig/blendedInfixSuggest.txt
   [junit4]   2> 2122787 INFO  (TEST-BasicAuthIntegrationTest.testBasics-seed#[A3F55B0C9543EB14]) [    ] o.a.s.c.c.SolrZkClient makePath: /configs/solrCloudCollectionConfig/solrconfig-postingshighlight.xml
   [junit4]   2> 2122798 INFO  (TEST-BasicAuthIntegrationTest.testBasics-seed#[A3F55B0C9543EB14]) [    ] o.a.s.c.c.SolrZkClient makePath: /configs/solrCloudCollectionConfig/schema-docValuesJoin.xml
   [junit4]   2> 2122874 INFO  (TEST-BasicAuthIntegrationTest.testBasics-seed#[A3F55B0C9543EB14]) [    ] o.a.s.c.c.SolrZkClient makePath: /configs/solrCloudCollectionConfig/schema-docValues.xml
   [junit4]   2> 2122887 INFO  (TEST-BasicAuthIntegrationTest.testBasics-seed#[A3F55B0C9543EB14]) [    ] o.a.s.c.c.SolrZkClient makePath: /configs/solrCloudCollectionConfig/bad-schema-misplaced-asterisk-copyfield-dest-should-fail-test.xml
   [junit4]   2> 2122897 INFO  (TEST-BasicAuthIntegrationTest.testBasics-seed#[A3F55B0C9543EB14]) [    ] o.a.s.c.c.SolrZkClient makePath: /configs/solrCloudCollectionConfig/schema-snippet-types.incl
   [junit4]   2> 2122919 INFO  (TEST-BasicAuthIntegrationTest.testBasics-seed#[A3F55B0C9543EB14]) [    ] o.a.s.c.c.SolrZkClient makePath: /configs/solrCloudCollectionConfig/schema-minimal.xml
   [junit4]   2> 2122953 INFO  (TEST-BasicAuthIntegrationTest.testBasics-seed#[A3F55B0C9543EB14]) [    ] o.a.s.c.c.SolrZkClient makePath: /configs/solrCloudCollectionConfig/solrconfig.snippet.randomindexconfig.xml
   [junit4]   2> 2122969 INFO  (TEST-BasicAuthIntegrationTest.testBasics-seed#[A3F55B0C9543EB14]) [    ] o.a.s.c.c.SolrZkClient makePath: /configs/solrCloudCollectionConfig/schema-collate.xml
   [junit4]   2> 2123015 INFO  (TEST-BasicAuthIntegrationTest.testBasics-seed#[A3F55B0C9543EB14]) [    ] o.a.s.c.c.SolrZkClient makePath: /configs/solrCloudCollectionConfig/schema-rest.xml
   [junit4]   2> 2123063 INFO  (TEST-BasicAuthIntegrationTest.testBasics-seed#[A3F55B0C9543EB14]) [    ] o.a.s.c.c.SolrZkClient makePath: /configs/solrCloudCollectionConfig/bad-schema-codec-global-vs-ft-mismatch.xml
   [junit4]   2> 2123080 INFO  (TEST-BasicAuthIntegrationTest.testBasics-seed#[A3F55B0C9543EB14]) [    ] o.a.s.c.c.SolrZkClient makePath: /configs/solrCloudCollectionConfig/bad-schema-not-indexed-but-norms.xml
   [junit4]   2> 2123118 INFO  (TEST-BasicAuthIntegrationTest.testBasics-seed#[A3F55B0C9543EB14]) [    ] o.a.s.c.c.SolrZkClient makePath: /configs/solrCloudCollectionConfig/phrasesuggest.txt
   [junit4]   2> 2123128 INFO  (TEST-BasicAuthIntegrationTest.testBasics-seed#[A3F55B0C9543EB14]) [    ] o.a.s.c.c.SolrZkClient makePath: /configs/solrCloudCollectionConfig/stopwordsWrongEncoding.txt
   [junit4]   2> 2123139 INFO  (TEST-BasicAuthIntegrationTest.testBasics-seed#[A3F55B0C9543EB14]) [    ] o.a.s.c.c.SolrZkClient makePath: /configs/solrCloudCollectionConfig/solrconfig-logmergepolicy.xml
   [junit4]   2> 2123184 INFO  (TEST-BasicAuthIntegrationTest.testBasics-seed#[A3F55B0C9543EB14]) [    ] o.a.s.c.c.SolrZkClient makePath: /configs/solrCloudCollectionConfig/solrconfig-plugcollector.xml
   [junit4]   2> 2123215 INFO  (TEST-BasicAuthIntegrationTest.testBasics-seed#[A3F55B0C9543EB14]) [    ] o.a.s.c.c.SolrZkClient makePath: /configs/solrCloudCollectionConfig/solrconfig-noopregen.xml
   [junit4]   2> 2123225 INFO  (TEST-BasicAuthIntegrationTest.testBasics-seed#[A3F55B0C9543EB14]) [    ] o.a.s.c.c.SolrZkClient makePath: /configs/solrCloudCollectionConfig/solrconfig-analytics-query.xml
   [junit4]   2> 2123247 INFO  (TEST-BasicAuthIntegrationTest.testBasics-seed#[A3F55B0C9543EB14]) [    ] o.a.s.c.c.SolrZkClient makePath: /configs/solrCloudCollectionConfig/stoptypes-1.txt
   [junit4]   2> 2123271 INFO  (TEST-BasicAuthIntegrationTest.testBasics-seed#[A3F55B0C9543EB14]) [    ] o.a.s.c.c.SolrZkClient makePath: /configs/solrCloudCollectionConfig/solrconfig-warmer-randommergepolicyfactory.xml
   [junit4]   2> 2123285 INFO  (TEST-BasicAuthIntegrationTest.testBasics-seed#[A3F55B0C9543EB14]) [    ] o.a.s.c.c.SolrZkClient makePath: /configs/solrCloudCollectionConfig/schema-spatial.xml
   [junit4]   2> 2123336 INFO  (TEST-BasicAuthIntegrationTest.testBasics-seed#[A3F55B0C9543EB14]) [    ] o.a.s.c.c.SolrZkClient makePath: /configs/solrCloudCollectionConfig/schema-spellchecker.xml
   [junit4]   2> 2123360 INFO  (TEST-BasicAuthIntegrationTest.testBasics-seed#[A3F55B0C9543EB14]) [    ] o.a.s.c.c.SolrZkClient makePath: /configs/solrCloudCollectionConfig/schema-non-stored-docvalues.xml
   [junit4]   2> 2123400 INFO  (TEST-BasicAuthIntegrationTest.testBasics-seed#[A3F55B0C9543EB14]) [    ] o.a.s.c.c.SolrZkClient makePath: /configs/solrCloudCollectionConfig/schema-distrib-interval-faceting.xml
   [junit4]   2> 2123451 INFO  (TEST-BasicAuthIntegrationTest.testBasics-seed#[A3F55B0C9543EB14]) [    ] o.a.s.c.c.SolrZkClient makePath: /configs/solrCloudCollectionConfig/stop-1.txt
   [junit4]   2> 2123455 INFO  (TEST-BasicAuthIntegrationTest.testBasics-seed#[A3F55B0C9543EB14]) [    ] o.a.s.c.c.SolrZkClient makePath: /configs/solrCloudCollectionConfig/schema-docValuesMissing.xml
   [junit4]   2> 2123496 INFO  (TEST-BasicAuthIntegrationTest.testBasics-seed#[A3F55B0C9543EB14]) [    ] o.a.s.c.c.SolrZkClient makePath: /configs/solrCloudCollectionConfig/solrconfig-caching.xml
   [junit4]   2> 2123527 INFO  (TEST-BasicAuthIntegrationTest.testBasics-seed#[A3F55B0C9543EB14]) [    ] o.a.s.c.c.SolrZkClient makePath: /configs/solrCloudCollectionConfig/solrconfig-doctransformers.xml
   [junit4]   2> 2123563 INFO  (TEST-BasicAuthIntegrationTest.testBasics-seed#[A3F55B0C9543EB14]) [    ] o.a.s.c.c.SolrZkClient makePath: /configs/solrCloudCollectionConfig/freeTextSuggest.txt
   [junit4]   2> 2123579 INFO  (TEST-BasicAuthIntegrationTest.testBasics-seed#[A3F55B0C9543EB14]) [    ] o.a.s.c.c.SolrZkClient makePath: /configs/solrCloudCollectionConfig/schema.xml
   [junit4]   2> 2123606 INFO  (TEST-BasicAuthIntegrationTest.testBasics-seed#[A3F55B0C9543EB14]) [    ] o.a.s.c.c.SolrZkClient makePath: /configs/solrCloudCollectionConfig/solrconfig-querysender-noquery.xml
   [junit4]   2> 2123647 INFO  (TEST-BasicAuthIntegrationTest.testBasics-seed#[A3F55B0C9543EB14]) [    ] o.a.s.c.c.SolrZkClient makePath: /configs/solrCloudCollectionConfig/schema-sortingresponse.xml
   [junit4]   2> 2123697 INFO  (TEST-BasicAuthIntegrationTest.testBasics-seed#[A3F55B0C9543EB14]) [    ] o.a.s.c.c.SolrZkClient makePath: /configs/solrCloudCollectionConfig/trivial.updateprocessor1.js
   [junit4]   2> 2123729 INFO  (TEST-BasicAuthIntegrationTest.testBasics-seed#[A3F55B0C9543EB14]) [    ] o.a.s.c.c.SolrZkClient makePath: /configs/solrCloudCollectionConfig/bad-solrconfig-managed-schema-named-schema.xml.xml
   [junit4]   2> 2123748 INFO  (TEST-BasicAuthIntegrationTest.testBasics-seed#[A3F55B0C9543EB14]) [    ] o.a.s.c.c.SolrZkClient makePath: /configs/solrCloudCollectionConfig/solrconfig-paramset.xml
   [junit4]   2> 2123812 INFO  (TEST-BasicAuthIntegrationTest.testBasics-seed#[A3F55B0C9543EB14]) [    ] o.a.s.c.c.SolrZkClient makePath: /configs/solrCloudCollectionConfig/schema-lmdirichlet.xml
   [junit4]   2> 2123829 INFO  (TEST-BasicAuthIntegrationTest.testBasics-seed#[A3F55B0C9543EB14]) [    ] o.a.s.c.c.SolrZkClient makePath: /configs/solrCloudCollectionConfig/bad-solrconfig-multiple-dirfactory.xml
   [junit4]   2> 2123883 INFO  (TEST-BasicAuthIntegrationTes

[...truncated too long message...]

2>         at java.util.concurrent.locks.LockSupport.park(LockSupport.java:186)
   [junit4]   2>         at java.util.concurrent.locks.AbstractQueuedSynchronizer$ConditionObject.await(AbstractQueuedSynchronizer.java:2043)
   [junit4]   2>         at java.util.concurrent.LinkedBlockingQueue.take(LinkedBlockingQueue.java:442)
   [junit4]   2>         at java.util.concurrent.ThreadPoolExecutor.getTask(ThreadPoolExecutor.java:1068)
   [junit4]   2>         at java.util.concurrent.ThreadPoolExecutor.runWorker(ThreadPoolExecutor.java:1130)
   [junit4]   2>         at java.util.concurrent.ThreadPoolExecutor$Worker.run(ThreadPoolExecutor.java:615)
   [junit4]   2>         at java.lang.Thread.run(Thread.java:745)
   [junit4]   2>   48) Thread[id=16358, name=qtp22449934-16358-selector-ServerConnectorManager@a4e44c/3, state=RUNNABLE, group=TGRP-BasicAuthIntegrationTest]
   [junit4]   2>         at sun.nio.ch.EPollArrayWrapper.epollWait(Native Method)
   [junit4]   2>         at sun.nio.ch.EPollArrayWrapper.poll(EPollArrayWrapper.java:269)
   [junit4]   2>         at sun.nio.ch.EPollSelectorImpl.doSelect(EPollSelectorImpl.java:79)
   [junit4]   2>         at sun.nio.ch.SelectorImpl.lockAndDoSelect(SelectorImpl.java:87)
   [junit4]   2>         at sun.nio.ch.SelectorImpl.select(SelectorImpl.java:98)
   [junit4]   2>         at sun.nio.ch.SelectorImpl.select(SelectorImpl.java:102)
   [junit4]   2>         at org.eclipse.jetty.io.SelectorManager$ManagedSelector.select(SelectorManager.java:600)
   [junit4]   2>         at org.eclipse.jetty.io.SelectorManager$ManagedSelector.run(SelectorManager.java:549)
   [junit4]   2>         at org.eclipse.jetty.util.thread.NonBlockingThread.run(NonBlockingThread.java:52)
   [junit4]   2>         at org.eclipse.jetty.util.thread.QueuedThreadPool.runJob(QueuedThreadPool.java:635)
   [junit4]   2>         at org.eclipse.jetty.util.thread.QueuedThreadPool$3.run(QueuedThreadPool.java:555)
   [junit4]   2>         at java.lang.Thread.run(Thread.java:745)
   [junit4]   2>   49) Thread[id=16357, name=qtp22449934-16357-selector-ServerConnectorManager@a4e44c/2, state=RUNNABLE, group=TGRP-BasicAuthIntegrationTest]
   [junit4]   2>         at sun.nio.ch.EPollArrayWrapper.epollWait(Native Method)
   [junit4]   2>         at sun.nio.ch.EPollArrayWrapper.poll(EPollArrayWrapper.java:269)
   [junit4]   2>         at sun.nio.ch.EPollSelectorImpl.doSelect(EPollSelectorImpl.java:79)
   [junit4]   2>         at sun.nio.ch.SelectorImpl.lockAndDoSelect(SelectorImpl.java:87)
   [junit4]   2>         at sun.nio.ch.SelectorImpl.select(SelectorImpl.java:98)
   [junit4]   2>         at sun.nio.ch.SelectorImpl.select(SelectorImpl.java:102)
   [junit4]   2>         at org.eclipse.jetty.io.SelectorManager$ManagedSelector.select(SelectorManager.java:600)
   [junit4]   2>         at org.eclipse.jetty.io.SelectorManager$ManagedSelector.run(SelectorManager.java:549)
   [junit4]   2>         at org.eclipse.jetty.util.thread.NonBlockingThread.run(NonBlockingThread.java:52)
   [junit4]   2>         at org.eclipse.jetty.util.thread.QueuedThreadPool.runJob(QueuedThreadPool.java:635)
   [junit4]   2>         at org.eclipse.jetty.util.thread.QueuedThreadPool$3.run(QueuedThreadPool.java:555)
   [junit4]   2>         at java.lang.Thread.run(Thread.java:745)
   [junit4]   2>   50) Thread[id=16115, name=qtp29222172-16115-selector-ServerConnectorManager@181099c/0, state=RUNNABLE, group=TGRP-BasicAuthIntegrationTest]
   [junit4]   2>         at java.lang.Thread.isInterrupted(Native Method)
   [junit4]   2>         at java.lang.Thread.isInterrupted(Thread.java:1000)
   [junit4]   2>         at java.nio.channels.spi.AbstractSelector.begin(AbstractSelector.java:215)
   [junit4]   2>         at sun.nio.ch.EPollSelectorImpl.doSelect(EPollSelectorImpl.java:78)
   [junit4]   2>         at sun.nio.ch.SelectorImpl.lockAndDoSelect(SelectorImpl.java:87)
   [junit4]   2>         at sun.nio.ch.SelectorImpl.select(SelectorImpl.java:98)
   [junit4]   2>         at sun.nio.ch.SelectorImpl.select(SelectorImpl.java:102)
   [junit4]   2>         at org.eclipse.jetty.io.SelectorManager$ManagedSelector.select(SelectorManager.java:600)
   [junit4]   2>         at org.eclipse.jetty.io.SelectorManager$ManagedSelector.run(SelectorManager.java:549)
   [junit4]   2>         at org.eclipse.jetty.util.thread.NonBlockingThread.run(NonBlockingThread.java:52)
   [junit4]   2>         at org.eclipse.jetty.util.thread.QueuedThreadPool.runJob(QueuedThreadPool.java:635)
   [junit4]   2>         at org.eclipse.jetty.util.thread.QueuedThreadPool$3.run(QueuedThreadPool.java:555)
   [junit4]   2>         at java.lang.Thread.run(Thread.java:745)
   [junit4]   2> NOTE: test params are: codec=DummyCompressingStoredFields(storedFieldsFormat=CompressingStoredFieldsFormat(compressionMode=DUMMY, chunkSize=6, maxDocsPerChunk=109, blockSize=9), termVectorsFormat=CompressingTermVectorsFormat(compressionMode=DUMMY, chunkSize=6, blockSize=9)), sim=RandomSimilarity(queryNorm=true,coord=no): {}, locale=lt, timezone=Israel
   [junit4]   2> NOTE: Linux 4.4.0-31-generic i386/Oracle Corporation 1.7.0_80 (32-bit)/cpus=12,threads=76,free=376741344,total=518979584
   [junit4]   2> NOTE: All tests run in this JVM: [TestBulkSchemaAPI, RegexBoostProcessorTest, BJQParserTest, ConfigSetsAPITest, HardAutoCommitTest, TestLRUStatsCache, TestClusterStateMutator, TestPerFieldSimilarity, RuleEngineTest, TestClassicSimilarityFactory, CollectionsAPIAsyncDistributedZkTest, TestNamedUpdateProcessors, TestSearcherReuse, TestPHPSerializedResponseWriter, TestCollapseQParserPlugin, StatsComponentTest, BadCopyFieldTest, IgnoreCommitOptimizeUpdateProcessorFactoryTest, TestFreeTextSuggestions, SolrTestCaseJ4Test, HttpPartitionTest, TestCloudSchemaless, TestFuzzyAnalyzedSuggestions, TestRawTransformer, TestChildDocTransformer, AtomicUpdatesTest, DirectUpdateHandlerOptimizeTest, SearchHandlerTest, AutoCommitTest, CollectionReloadTest, LeaderInitiatedRecoveryOnShardRestartTest, TestFieldSortValues, TestSchemaResource, TestExtendedDismaxParser, TestConfigSetsAPIZkFailure, TestFieldTypeResource, FieldMutatingUpdateProcessorTest, TestAuthorizationFramework, RequestHandlersTest, TestSolr4Spatial2, TestCharFilters, TestPostingsSolrHighlighter, TestCollectionAPI, HdfsLockFactoryTest, CursorMarkTest, SolrCoreCheckLockOnStartupTest, PeerSyncReplicationTest, RecoveryZkTest, TestStressRecovery, PluginInfoTest, TestUniqueKeyFieldResource, TestGroupingSearch, DistributedSuggestComponentTest, SuggestComponentContextFilterQueryTest, TestTestInjection, OutOfBoxZkACLAndCredentialsProvidersTest, TestUtils, TestUseDocValuesAsStored2, VMParamsZkACLAndCredentialsProvidersTest, TestConfigSetImmutable, CoreAdminHandlerTest, TestSolrQueryParser, DistributedFacetPivotLongTailTest, InfoHandlerTest, UpdateParamsTest, ShowFileRequestHandlerTest, TestTrieFacet, CircularListTest, OverseerTest, TestLeaderInitiatedRecoveryThread, DirectUpdateHandlerTest, TestFastWriter, SolrCloudExampleTest, TestSort, SampleTest, TestMaxScoreQueryParser, TestSolrCloudWithKerberosAlt, HdfsDirectoryFactoryTest, BlockDirectoryTest, TestRestoreCore, TestShardHandlerFactory, UnloadDistributedZkTest, TestCoreDiscovery, TestBulkSchemaConcurrent, TermVectorComponentDistributedTest, TestHdfsUpdateLog, TestRecovery, BinaryUpdateRequestHandlerTest, TestCollationField, BasicDistributedZk2Test, ShardRoutingTest, LeaderElectionTest, TestZkChroot, TestRandomDVFaceting, TestStressReorder, TestReload, SimpleFacetsTest, PeerSyncTest, TestIndexSearcher, SimplePostToolTest, SignatureUpdateProcessorFactoryTest, DocValuesTest, TestMergePolicyConfig, TestDocSet, TestSearchPerf, TestElisionMultitermQuery, TestSolrCoreProperties, NotRequiredUniqueKeyTest, TestXIncludeConfig, EchoParamsTest, TestJmxMonitoredMap, TimeZoneUtilsTest, URLClassifyProcessorTest, ChaosMonkeyNothingIsSafeTest, CollectionStateFormat2Test, ConcurrentDeleteAndCreateCollectionTest, ConnectionManagerTest, CustomCollectionTest, DistributedVersionInfoTest, OverseerTaskQueueTest, ReplicationFactorTest, SSLMigrationTest, SaslZkACLProviderTest, SharedFSAutoReplicaFailoverTest, SharedFSAutoReplicaFailoverUtilsTest, SolrXmlInZkTest, TestAuthenticationFramework, TestOnReconnectListenerSupport, TestRandomRequestDistribution, HdfsChaosMonkeyNothingIsSafeTest, HdfsCollectionsAPIDistributedZkTest, HdfsNNFailoverTest, HdfsRestartWhileUpdatingTest, HdfsUnloadDistributedZkTest, ZkStateReaderTest, CachingDirectoryFactoryTest, CoreSorterTest, TestConfigOverlay, TestConfigSetProperties, TestDynamicLoading, DistributedFacetPivotSmallTest, DistributedFacetPivotWhiteBoxTest, TestExpandComponent, TestPivotHelperCode, TestTrackingShardHandlerFactory, JavabinLoaderTest, HighlighterMaxOffsetTest, WrapperMergePolicyFactoryTest, CheckHdfsIndexTest, TestMacros, TestCustomDocTransformer, TestRawResponseWriter, TestManagedResource, TestManagedResourceStorage, TestRestManager, TestDefaultSearchFieldResource, TestFieldCollectionResource, TestManagedSchemaDynamicFieldResource, TestManagedSchemaFieldResource, TestSerializedLuceneMatchVersion, TestManagedSynonymFilterFactory, TestCloudManagedSchema, TestMissingGroups, TestReRankQParserPlugin, TestReloadDeadlock, TestSmileRequest, TestJsonFacets, TestMinMaxOnMultiValuedField, TestSortByMinMaxFunction, BlockJoinFacetRandomTest, BlockJoinFacetSimpleTest, TestJsonRequest, CloudMLTQParserTest, BasicAuthIntegrationTest]
   [junit4]   2> NOTE: reproduce with: ant test  -Dtestcase=BasicAuthIntegrationTest -Dtests.seed=A3F55B0C9543EB14 -Dtests.multiplier=3 -Dtests.slow=true -Dtests.locale=lt -Dtests.timezone=Israel -Dtests.asserts=true -Dtests.file.encoding=UTF-8
   [junit4] ERROR   0.00s J2 | BasicAuthIntegrationTest (suite) <<<
   [junit4]    > Throwable #1: java.lang.Exception: Suite timeout exceeded (>= 7200000 msec).
   [junit4]    > 	at __randomizedtesting.SeedInfo.seed([A3F55B0C9543EB14]:0)
   [junit4] Completed [575/575 (1!)] on J2 in 7224.01s, 1 test, 2 errors <<< FAILURES!

[...truncated 49123 lines...]


Mime
View raw message