lucene-dev mailing list archives

Site index · List index
Message view « Date » · « Thread »
Top « Date » · « Thread »
From Policeman Jenkins Server <jenk...@thetaphi.de>
Subject [JENKINS] Lucene-Solr-5.5-Linux (64bit/jdk1.7.0_80) - Build # 417 - Still Unstable!
Date Sat, 10 Sep 2016 15:43:23 GMT
Build: http://jenkins.thetaphi.de/job/Lucene-Solr-5.5-Linux/417/
Java: 64bit/jdk1.7.0_80 -XX:+UseCompressedOops -XX:+UseConcMarkSweepGC

1 tests failed.
FAILED:  org.apache.solr.schema.TestManagedSchemaAPI.test

Error Message:
Error from server at http://127.0.0.1:38834/solr/testschemaapi_shard1_replica2: ERROR: [doc=2] unknown field 'myNewField1'

Stack Trace:
org.apache.solr.client.solrj.impl.CloudSolrClient$RouteException: Error from server at http://127.0.0.1:38834/solr/testschemaapi_shard1_replica2: ERROR: [doc=2] unknown field 'myNewField1'
	at __randomizedtesting.SeedInfo.seed([E26F4EFD00885B42:6A3B7127AE7436BA]:0)
	at org.apache.solr.client.solrj.impl.CloudSolrClient.directUpdate(CloudSolrClient.java:653)
	at org.apache.solr.client.solrj.impl.CloudSolrClient.sendRequest(CloudSolrClient.java:1002)
	at org.apache.solr.client.solrj.impl.CloudSolrClient.requestWithRetryOnStaleState(CloudSolrClient.java:891)
	at org.apache.solr.client.solrj.impl.CloudSolrClient.request(CloudSolrClient.java:827)
	at org.apache.solr.schema.TestManagedSchemaAPI.testAddFieldAndDocument(TestManagedSchemaAPI.java:101)
	at org.apache.solr.schema.TestManagedSchemaAPI.test(TestManagedSchemaAPI.java:69)
	at sun.reflect.NativeMethodAccessorImpl.invoke0(Native Method)
	at sun.reflect.NativeMethodAccessorImpl.invoke(NativeMethodAccessorImpl.java:57)
	at sun.reflect.DelegatingMethodAccessorImpl.invoke(DelegatingMethodAccessorImpl.java:43)
	at java.lang.reflect.Method.invoke(Method.java:606)
	at com.carrotsearch.randomizedtesting.RandomizedRunner.invoke(RandomizedRunner.java:1764)
	at com.carrotsearch.randomizedtesting.RandomizedRunner$8.evaluate(RandomizedRunner.java:871)
	at com.carrotsearch.randomizedtesting.RandomizedRunner$9.evaluate(RandomizedRunner.java:907)
	at com.carrotsearch.randomizedtesting.RandomizedRunner$10.evaluate(RandomizedRunner.java:921)
	at com.carrotsearch.randomizedtesting.rules.SystemPropertiesRestoreRule$1.evaluate(SystemPropertiesRestoreRule.java:57)
	at org.apache.lucene.util.TestRuleSetupTeardownChained$1.evaluate(TestRuleSetupTeardownChained.java:49)
	at org.apache.lucene.util.AbstractBeforeAfterRule$1.evaluate(AbstractBeforeAfterRule.java:45)
	at org.apache.lucene.util.TestRuleThreadAndTestName$1.evaluate(TestRuleThreadAndTestName.java:48)
	at org.apache.lucene.util.TestRuleIgnoreAfterMaxFailures$1.evaluate(TestRuleIgnoreAfterMaxFailures.java:64)
	at org.apache.lucene.util.TestRuleMarkFailure$1.evaluate(TestRuleMarkFailure.java:47)
	at com.carrotsearch.randomizedtesting.rules.StatementAdapter.evaluate(StatementAdapter.java:36)
	at com.carrotsearch.randomizedtesting.ThreadLeakControl$StatementRunner.run(ThreadLeakControl.java:367)
	at com.carrotsearch.randomizedtesting.ThreadLeakControl.forkTimeoutingTask(ThreadLeakControl.java:809)
	at com.carrotsearch.randomizedtesting.ThreadLeakControl$3.evaluate(ThreadLeakControl.java:460)
	at com.carrotsearch.randomizedtesting.RandomizedRunner.runSingleTest(RandomizedRunner.java:880)
	at com.carrotsearch.randomizedtesting.RandomizedRunner$5.evaluate(RandomizedRunner.java:781)
	at com.carrotsearch.randomizedtesting.RandomizedRunner$6.evaluate(RandomizedRunner.java:816)
	at com.carrotsearch.randomizedtesting.RandomizedRunner$7.evaluate(RandomizedRunner.java:827)
	at com.carrotsearch.randomizedtesting.rules.StatementAdapter.evaluate(StatementAdapter.java:36)
	at com.carrotsearch.randomizedtesting.rules.SystemPropertiesRestoreRule$1.evaluate(SystemPropertiesRestoreRule.java:57)
	at org.apache.lucene.util.AbstractBeforeAfterRule$1.evaluate(AbstractBeforeAfterRule.java:45)
	at com.carrotsearch.randomizedtesting.rules.StatementAdapter.evaluate(StatementAdapter.java:36)
	at org.apache.lucene.util.TestRuleStoreClassName$1.evaluate(TestRuleStoreClassName.java:41)
	at com.carrotsearch.randomizedtesting.rules.NoShadowingOrOverridesOnMethodsRule$1.evaluate(NoShadowingOrOverridesOnMethodsRule.java:40)
	at com.carrotsearch.randomizedtesting.rules.NoShadowingOrOverridesOnMethodsRule$1.evaluate(NoShadowingOrOverridesOnMethodsRule.java:40)
	at com.carrotsearch.randomizedtesting.rules.StatementAdapter.evaluate(StatementAdapter.java:36)
	at com.carrotsearch.randomizedtesting.rules.StatementAdapter.evaluate(StatementAdapter.java:36)
	at com.carrotsearch.randomizedtesting.rules.StatementAdapter.evaluate(StatementAdapter.java:36)
	at org.apache.lucene.util.TestRuleAssertionsRequired$1.evaluate(TestRuleAssertionsRequired.java:53)
	at org.apache.lucene.util.TestRuleMarkFailure$1.evaluate(TestRuleMarkFailure.java:47)
	at org.apache.lucene.util.TestRuleIgnoreAfterMaxFailures$1.evaluate(TestRuleIgnoreAfterMaxFailures.java:64)
	at org.apache.lucene.util.TestRuleIgnoreTestSuites$1.evaluate(TestRuleIgnoreTestSuites.java:54)
	at com.carrotsearch.randomizedtesting.rules.StatementAdapter.evaluate(StatementAdapter.java:36)
	at com.carrotsearch.randomizedtesting.ThreadLeakControl$StatementRunner.run(ThreadLeakControl.java:367)
	at java.lang.Thread.run(Thread.java:745)
Caused by: org.apache.solr.client.solrj.impl.HttpSolrClient$RemoteSolrException: Error from server at http://127.0.0.1:38834/solr/testschemaapi_shard1_replica2: ERROR: [doc=2] unknown field 'myNewField1'
	at org.apache.solr.client.solrj.impl.HttpSolrClient.executeMethod(HttpSolrClient.java:577)
	at org.apache.solr.client.solrj.impl.HttpSolrClient.request(HttpSolrClient.java:241)
	at org.apache.solr.client.solrj.impl.HttpSolrClient.request(HttpSolrClient.java:230)
	at org.apache.solr.client.solrj.impl.LBHttpSolrClient.doRequest(LBHttpSolrClient.java:372)
	at org.apache.solr.client.solrj.impl.LBHttpSolrClient.request(LBHttpSolrClient.java:325)
	at org.apache.solr.client.solrj.impl.CloudSolrClient$2.call(CloudSolrClient.java:628)
	at org.apache.solr.client.solrj.impl.CloudSolrClient$2.call(CloudSolrClient.java:625)
	at java.util.concurrent.FutureTask.run(FutureTask.java:262)
	at org.apache.solr.common.util.ExecutorUtil$MDCAwareThreadPoolExecutor$1.run(ExecutorUtil.java:231)
	at java.util.concurrent.ThreadPoolExecutor.runWorker(ThreadPoolExecutor.java:1145)
	at java.util.concurrent.ThreadPoolExecutor$Worker.run(ThreadPoolExecutor.java:615)
	... 1 more




Build Log:
[...truncated 11350 lines...]
   [junit4] Suite: org.apache.solr.schema.TestManagedSchemaAPI
   [junit4]   2> Creating dataDir: /home/jenkins/workspace/Lucene-Solr-5.5-Linux/solr/build/solr-core/test/J2/temp/solr.schema.TestManagedSchemaAPI_E26F4EFD00885B42-001/init-core-data-001
   [junit4]   2> 1018922 INFO  (SUITE-TestManagedSchemaAPI-seed#[E26F4EFD00885B42]-worker) [    ] o.a.s.SolrTestCaseJ4 Randomized ssl (false) and clientAuth (false)
   [junit4]   2> 1018924 INFO  (TEST-TestManagedSchemaAPI.test-seed#[E26F4EFD00885B42]) [    ] o.a.s.SolrTestCaseJ4 ###Starting test
   [junit4]   2> 1018925 INFO  (TEST-TestManagedSchemaAPI.test-seed#[E26F4EFD00885B42]) [    ] o.a.s.c.ZkTestServer STARTING ZK TEST SERVER
   [junit4]   2> 1018925 INFO  (Thread-2232) [    ] o.a.s.c.ZkTestServer client port:0.0.0.0/0.0.0.0:0
   [junit4]   2> 1018925 INFO  (Thread-2232) [    ] o.a.s.c.ZkTestServer Starting server
   [junit4]   2> 1019026 INFO  (TEST-TestManagedSchemaAPI.test-seed#[E26F4EFD00885B42]) [    ] o.a.s.c.ZkTestServer start zk server on port:39507
   [junit4]   2> 1019026 INFO  (TEST-TestManagedSchemaAPI.test-seed#[E26F4EFD00885B42]) [    ] o.a.s.c.c.SolrZkClient Using default ZkCredentialsProvider
   [junit4]   2> 1019027 INFO  (TEST-TestManagedSchemaAPI.test-seed#[E26F4EFD00885B42]) [    ] o.a.s.c.c.ConnectionManager Waiting for client to connect to ZooKeeper
   [junit4]   2> 1019042 INFO  (zkCallback-909-thread-1) [    ] o.a.s.c.c.ConnectionManager Watcher org.apache.solr.common.cloud.ConnectionManager@63ecd1f7 name:ZooKeeperConnection Watcher:127.0.0.1:39507 got event WatchedEvent state:SyncConnected type:None path:null path:null type:None
   [junit4]   2> 1019042 INFO  (TEST-TestManagedSchemaAPI.test-seed#[E26F4EFD00885B42]) [    ] o.a.s.c.c.ConnectionManager Client is connected to ZooKeeper
   [junit4]   2> 1019042 INFO  (TEST-TestManagedSchemaAPI.test-seed#[E26F4EFD00885B42]) [    ] o.a.s.c.c.SolrZkClient Using default ZkACLProvider
   [junit4]   2> 1019042 INFO  (TEST-TestManagedSchemaAPI.test-seed#[E26F4EFD00885B42]) [    ] o.a.s.c.c.SolrZkClient makePath: /solr/solr.xml
   [junit4]   2> 1019044 INFO  (jetty-launcher-908-thread-1) [    ] o.e.j.s.Server jetty-9.2.13.v20150730
   [junit4]   2> 1019044 INFO  (jetty-launcher-908-thread-2) [    ] o.e.j.s.Server jetty-9.2.13.v20150730
   [junit4]   2> 1019045 INFO  (jetty-launcher-908-thread-1) [    ] o.e.j.s.h.ContextHandler Started o.e.j.s.ServletContextHandler@7b612542{/solr,null,AVAILABLE}
   [junit4]   2> 1019045 INFO  (jetty-launcher-908-thread-2) [    ] o.e.j.s.h.ContextHandler Started o.e.j.s.ServletContextHandler@26d54f56{/solr,null,AVAILABLE}
   [junit4]   2> 1019046 INFO  (jetty-launcher-908-thread-1) [    ] o.e.j.s.ServerConnector Started ServerConnector@2067a61b{HTTP/1.1}{127.0.0.1:38834}
   [junit4]   2> 1019046 INFO  (jetty-launcher-908-thread-2) [    ] o.e.j.s.ServerConnector Started ServerConnector@4fefbcce{HTTP/1.1}{127.0.0.1:34411}
   [junit4]   2> 1019046 INFO  (jetty-launcher-908-thread-1) [    ] o.e.j.s.Server Started @1020891ms
   [junit4]   2> 1019046 INFO  (jetty-launcher-908-thread-2) [    ] o.e.j.s.Server Started @1020891ms
   [junit4]   2> 1019046 INFO  (jetty-launcher-908-thread-1) [    ] o.a.s.c.s.e.JettySolrRunner Jetty properties: {hostContext=/solr, hostPort=38834}
   [junit4]   2> 1019046 INFO  (jetty-launcher-908-thread-2) [    ] o.a.s.c.s.e.JettySolrRunner Jetty properties: {hostPort=34411, hostContext=/solr}
   [junit4]   2> 1019047 INFO  (jetty-launcher-908-thread-1) [    ] o.a.s.s.SolrDispatchFilter SolrDispatchFilter.init(): sun.misc.Launcher$AppClassLoader@8f8acd0
   [junit4]   2> 1019047 INFO  (jetty-launcher-908-thread-2) [    ] o.a.s.s.SolrDispatchFilter SolrDispatchFilter.init(): sun.misc.Launcher$AppClassLoader@8f8acd0
   [junit4]   2> 1019047 INFO  (jetty-launcher-908-thread-1) [    ] o.a.s.c.SolrResourceLoader new SolrResourceLoader for directory: '/home/jenkins/workspace/Lucene-Solr-5.5-Linux/solr/build/solr-core/test/J2/temp/solr.schema.TestManagedSchemaAPI_E26F4EFD00885B42-001/tempDir-001/node1'
   [junit4]   2> 1019047 INFO  (jetty-launcher-908-thread-2) [    ] o.a.s.c.SolrResourceLoader new SolrResourceLoader for directory: '/home/jenkins/workspace/Lucene-Solr-5.5-Linux/solr/build/solr-core/test/J2/temp/solr.schema.TestManagedSchemaAPI_E26F4EFD00885B42-001/tempDir-001/node2'
   [junit4]   2> 1019047 INFO  (jetty-launcher-908-thread-1) [    ] o.a.s.c.SolrResourceLoader JNDI not configured for solr (NoInitialContextEx)
   [junit4]   2> 1019047 INFO  (jetty-launcher-908-thread-2) [    ] o.a.s.c.SolrResourceLoader JNDI not configured for solr (NoInitialContextEx)
   [junit4]   2> 1019047 INFO  (jetty-launcher-908-thread-1) [    ] o.a.s.c.SolrResourceLoader solr home defaulted to 'solr/' (could not find system property or JNDI)
   [junit4]   2> 1019047 INFO  (jetty-launcher-908-thread-2) [    ] o.a.s.c.SolrResourceLoader solr home defaulted to 'solr/' (could not find system property or JNDI)
   [junit4]   2> 1019047 INFO  (jetty-launcher-908-thread-1) [    ] o.a.s.c.c.SolrZkClient Using default ZkCredentialsProvider
   [junit4]   2> 1019047 INFO  (jetty-launcher-908-thread-2) [    ] o.a.s.c.c.SolrZkClient Using default ZkCredentialsProvider
   [junit4]   2> 1019047 INFO  (jetty-launcher-908-thread-1) [    ] o.a.s.c.c.ConnectionManager Waiting for client to connect to ZooKeeper
   [junit4]   2> 1019047 INFO  (jetty-launcher-908-thread-2) [    ] o.a.s.c.c.ConnectionManager Waiting for client to connect to ZooKeeper
   [junit4]   2> 1019048 INFO  (zkCallback-910-thread-1) [    ] o.a.s.c.c.ConnectionManager Watcher org.apache.solr.common.cloud.ConnectionManager@44c7f0d8 name:ZooKeeperConnection Watcher:127.0.0.1:39507/solr got event WatchedEvent state:SyncConnected type:None path:null path:null type:None
   [junit4]   2> 1019048 INFO  (jetty-launcher-908-thread-1) [    ] o.a.s.c.c.ConnectionManager Client is connected to ZooKeeper
   [junit4]   2> 1019048 INFO  (jetty-launcher-908-thread-1) [    ] o.a.s.c.c.SolrZkClient Using default ZkACLProvider
   [junit4]   2> 1019048 INFO  (zkCallback-911-thread-1) [    ] o.a.s.c.c.ConnectionManager Watcher org.apache.solr.common.cloud.ConnectionManager@78afa4c8 name:ZooKeeperConnection Watcher:127.0.0.1:39507/solr got event WatchedEvent state:SyncConnected type:None path:null path:null type:None
   [junit4]   2> 1019048 INFO  (jetty-launcher-908-thread-2) [    ] o.a.s.c.c.ConnectionManager Client is connected to ZooKeeper
   [junit4]   2> 1019048 INFO  (jetty-launcher-908-thread-1) [    ] o.a.s.s.SolrDispatchFilter solr.xml found in ZooKeeper. Loading...
   [junit4]   2> 1019048 INFO  (jetty-launcher-908-thread-2) [    ] o.a.s.c.c.SolrZkClient Using default ZkACLProvider
   [junit4]   2> 1019049 INFO  (jetty-launcher-908-thread-2) [    ] o.a.s.s.SolrDispatchFilter solr.xml found in ZooKeeper. Loading...
   [junit4]   2> 1019059 INFO  (jetty-launcher-908-thread-1) [    ] o.a.s.c.CorePropertiesLocator Config-defined core root directory: /home/jenkins/workspace/Lucene-Solr-5.5-Linux/solr/build/solr-core/test/J2/temp/solr.schema.TestManagedSchemaAPI_E26F4EFD00885B42-001/tempDir-001/node1/.
   [junit4]   2> 1019059 INFO  (jetty-launcher-908-thread-2) [    ] o.a.s.c.CorePropertiesLocator Config-defined core root directory: /home/jenkins/workspace/Lucene-Solr-5.5-Linux/solr/build/solr-core/test/J2/temp/solr.schema.TestManagedSchemaAPI_E26F4EFD00885B42-001/tempDir-001/node2/.
   [junit4]   2> 1019059 INFO  (jetty-launcher-908-thread-1) [    ] o.a.s.c.CoreContainer New CoreContainer 351354653
   [junit4]   2> 1019059 WARN  (NIOServerCxn.Factory:0.0.0.0/0.0.0.0:0) [    ] o.a.z.s.NIOServerCnxn caught end of stream exception
   [junit4]   2> EndOfStreamException: Unable to read additional data from client sessionid 0x15714a733a70001, likely client has closed socket
   [junit4]   2> 	at org.apache.zookeeper.server.NIOServerCnxn.doIO(NIOServerCnxn.java:228)
   [junit4]   2> 	at org.apache.zookeeper.server.NIOServerCnxnFactory.run(NIOServerCnxnFactory.java:208)
   [junit4]   2> 	at java.lang.Thread.run(Thread.java:745)
   [junit4]   2> 1019059 INFO  (jetty-launcher-908-thread-2) [    ] o.a.s.c.CoreContainer New CoreContainer 1785107368
   [junit4]   2> 1019059 INFO  (jetty-launcher-908-thread-1) [    ] o.a.s.c.CoreContainer Loading cores into CoreContainer [instanceDir=/home/jenkins/workspace/Lucene-Solr-5.5-Linux/solr/build/solr-core/test/J2/temp/solr.schema.TestManagedSchemaAPI_E26F4EFD00885B42-001/tempDir-001/node1]
   [junit4]   2> 1019059 INFO  (jetty-launcher-908-thread-2) [    ] o.a.s.c.CoreContainer Loading cores into CoreContainer [instanceDir=/home/jenkins/workspace/Lucene-Solr-5.5-Linux/solr/build/solr-core/test/J2/temp/solr.schema.TestManagedSchemaAPI_E26F4EFD00885B42-001/tempDir-001/node2]
   [junit4]   2> 1019059 WARN  (jetty-launcher-908-thread-1) [    ] o.a.s.c.CoreContainer Couldn't add files from /home/jenkins/workspace/Lucene-Solr-5.5-Linux/solr/build/solr-core/test/J2/temp/solr.schema.TestManagedSchemaAPI_E26F4EFD00885B42-001/tempDir-001/node1/lib to classpath: /home/jenkins/workspace/Lucene-Solr-5.5-Linux/solr/build/solr-core/test/J2/temp/solr.schema.TestManagedSchemaAPI_E26F4EFD00885B42-001/tempDir-001/node1/lib
   [junit4]   2> 1019059 WARN  (jetty-launcher-908-thread-2) [    ] o.a.s.c.CoreContainer Couldn't add files from /home/jenkins/workspace/Lucene-Solr-5.5-Linux/solr/build/solr-core/test/J2/temp/solr.schema.TestManagedSchemaAPI_E26F4EFD00885B42-001/tempDir-001/node2/lib to classpath: /home/jenkins/workspace/Lucene-Solr-5.5-Linux/solr/build/solr-core/test/J2/temp/solr.schema.TestManagedSchemaAPI_E26F4EFD00885B42-001/tempDir-001/node2/lib
   [junit4]   2> 1019059 INFO  (jetty-launcher-908-thread-1) [    ] o.a.s.h.c.HttpShardHandlerFactory created with socketTimeout : 90000,urlScheme : ,connTimeout : 15000,maxConnectionsPerHost : 20,maxConnections : 10000,corePoolSize : 0,maximumPoolSize : 2147483647,maxThreadIdleTime : 5,sizeOfQueue : -1,fairnessPolicy : false,useRetries : false,connectionsEvictorSleepDelay : 5000,maxConnectionIdleTime : 40000,
   [junit4]   2> 1019060 INFO  (jetty-launcher-908-thread-2) [    ] o.a.s.h.c.HttpShardHandlerFactory created with socketTimeout : 90000,urlScheme : ,connTimeout : 15000,maxConnectionsPerHost : 20,maxConnections : 10000,corePoolSize : 0,maximumPoolSize : 2147483647,maxThreadIdleTime : 5,sizeOfQueue : -1,fairnessPolicy : false,useRetries : false,connectionsEvictorSleepDelay : 5000,maxConnectionIdleTime : 40000,
   [junit4]   2> 1019060 INFO  (jetty-launcher-908-thread-1) [    ] o.a.s.u.UpdateShardHandler Creating UpdateShardHandler HTTP client with params: socketTimeout=340000&connTimeout=45000&retry=true
   [junit4]   2> 1019060 INFO  (jetty-launcher-908-thread-2) [    ] o.a.s.u.UpdateShardHandler Creating UpdateShardHandler HTTP client with params: socketTimeout=340000&connTimeout=45000&retry=true
   [junit4]   2> 1019061 INFO  (jetty-launcher-908-thread-1) [    ] o.a.s.l.LogWatcher SLF4J impl is org.slf4j.impl.Log4jLoggerFactory
   [junit4]   2> 1019061 INFO  (jetty-launcher-908-thread-1) [    ] o.a.s.l.LogWatcher Registering Log Listener [Log4j (org.slf4j.impl.Log4jLoggerFactory)]
   [junit4]   2> 1019061 INFO  (jetty-launcher-908-thread-2) [    ] o.a.s.l.LogWatcher SLF4J impl is org.slf4j.impl.Log4jLoggerFactory
   [junit4]   2> 1019061 INFO  (jetty-launcher-908-thread-2) [    ] o.a.s.l.LogWatcher Registering Log Listener [Log4j (org.slf4j.impl.Log4jLoggerFactory)]
   [junit4]   2> 1019061 INFO  (jetty-launcher-908-thread-1) [    ] o.a.s.c.ZkContainer Zookeeper client=127.0.0.1:39507/solr
   [junit4]   2> 1019061 INFO  (jetty-launcher-908-thread-1) [    ] o.a.s.c.ZkController zkHost includes chroot
   [junit4]   2> 1019061 INFO  (jetty-launcher-908-thread-2) [    ] o.a.s.c.ZkContainer Zookeeper client=127.0.0.1:39507/solr
   [junit4]   2> 1019061 INFO  (jetty-launcher-908-thread-1) [    ] o.a.s.c.c.SolrZkClient Using default ZkCredentialsProvider
   [junit4]   2> 1019061 INFO  (jetty-launcher-908-thread-2) [    ] o.a.s.c.ZkController zkHost includes chroot
   [junit4]   2> 1019061 INFO  (jetty-launcher-908-thread-2) [    ] o.a.s.c.c.SolrZkClient Using default ZkCredentialsProvider
   [junit4]   2> 1019062 INFO  (jetty-launcher-908-thread-1) [    ] o.a.s.c.c.ConnectionManager Waiting for client to connect to ZooKeeper
   [junit4]   2> 1019062 INFO  (jetty-launcher-908-thread-2) [    ] o.a.s.c.c.ConnectionManager Waiting for client to connect to ZooKeeper
   [junit4]   2> 1019062 INFO  (zkCallback-916-thread-1) [    ] o.a.s.c.c.ConnectionManager Watcher org.apache.solr.common.cloud.ConnectionManager@11ac701d name:ZooKeeperConnection Watcher:127.0.0.1:39507 got event WatchedEvent state:SyncConnected type:None path:null path:null type:None
   [junit4]   2> 1019062 INFO  (jetty-launcher-908-thread-1) [    ] o.a.s.c.c.ConnectionManager Client is connected to ZooKeeper
   [junit4]   2> 1019062 INFO  (zkCallback-917-thread-1) [    ] o.a.s.c.c.ConnectionManager Watcher org.apache.solr.common.cloud.ConnectionManager@5a27e313 name:ZooKeeperConnection Watcher:127.0.0.1:39507 got event WatchedEvent state:SyncConnected type:None path:null path:null type:None
   [junit4]   2> 1019062 INFO  (jetty-launcher-908-thread-1) [    ] o.a.s.c.c.SolrZkClient Using default ZkACLProvider
   [junit4]   2> 1019062 INFO  (jetty-launcher-908-thread-2) [    ] o.a.s.c.c.ConnectionManager Client is connected to ZooKeeper
   [junit4]   2> 1019063 INFO  (jetty-launcher-908-thread-2) [    ] o.a.s.c.c.SolrZkClient Using default ZkACLProvider
   [junit4]   2> 1019064 INFO  (jetty-launcher-908-thread-1) [n:127.0.0.1:38834_solr    ] o.a.s.c.ZkController Added new OnReconnect listener org.apache.solr.cloud.ZkController$6@1738ead8
   [junit4]   2> 1019064 INFO  (jetty-launcher-908-thread-1) [n:127.0.0.1:38834_solr    ] o.a.s.c.c.ConnectionManager Waiting for client to connect to ZooKeeper
   [junit4]   2> 1019064 INFO  (jetty-launcher-908-thread-2) [n:127.0.0.1:34411_solr    ] o.a.s.c.ZkController Added new OnReconnect listener org.apache.solr.cloud.ZkController$6@7fb74a8a
   [junit4]   2> 1019064 INFO  (jetty-launcher-908-thread-2) [n:127.0.0.1:34411_solr    ] o.a.s.c.c.ConnectionManager Waiting for client to connect to ZooKeeper
   [junit4]   2> 1019065 INFO  (zkCallback-918-thread-1-processing-n:127.0.0.1:38834_solr) [n:127.0.0.1:38834_solr    ] o.a.s.c.c.ConnectionManager Watcher org.apache.solr.common.cloud.ConnectionManager@5f0205ff name:ZooKeeperConnection Watcher:127.0.0.1:39507/solr got event WatchedEvent state:SyncConnected type:None path:null path:null type:None
   [junit4]   2> 1019065 INFO  (jetty-launcher-908-thread-1) [n:127.0.0.1:38834_solr    ] o.a.s.c.c.ConnectionManager Client is connected to ZooKeeper
   [junit4]   2> 1019065 INFO  (zkCallback-919-thread-1-processing-n:127.0.0.1:34411_solr) [n:127.0.0.1:34411_solr    ] o.a.s.c.c.ConnectionManager Watcher org.apache.solr.common.cloud.ConnectionManager@5d7b3c71 name:ZooKeeperConnection Watcher:127.0.0.1:39507/solr got event WatchedEvent state:SyncConnected type:None path:null path:null type:None
   [junit4]   2> 1019065 INFO  (jetty-launcher-908-thread-2) [n:127.0.0.1:34411_solr    ] o.a.s.c.c.ConnectionManager Client is connected to ZooKeeper
   [junit4]   2> 1019066 INFO  (jetty-launcher-908-thread-1) [n:127.0.0.1:38834_solr    ] o.a.s.c.c.SolrZkClient makePath: /overseer/queue
   [junit4]   2> 1019066 INFO  (jetty-launcher-908-thread-2) [n:127.0.0.1:34411_solr    ] o.a.s.c.c.SolrZkClient makePath: /overseer/queue
   [junit4]   2> 1019066 INFO  (jetty-launcher-908-thread-2) [n:127.0.0.1:34411_solr    ] o.a.s.c.c.SolrZkClient makePath: /overseer/collection-queue-work
   [junit4]   2> 1019067 INFO  (jetty-launcher-908-thread-1) [n:127.0.0.1:38834_solr    ] o.a.s.c.c.SolrZkClient makePath: /overseer/collection-queue-work
   [junit4]   2> 1019068 INFO  (jetty-launcher-908-thread-2) [n:127.0.0.1:34411_solr    ] o.a.s.c.c.SolrZkClient makePath: /overseer/collection-map-running
   [junit4]   2> 1019068 INFO  (jetty-launcher-908-thread-1) [n:127.0.0.1:38834_solr    ] o.a.s.c.c.SolrZkClient makePath: /overseer/collection-map-running
   [junit4]   2> 1019069 INFO  (jetty-launcher-908-thread-1) [n:127.0.0.1:38834_solr    ] o.a.s.c.c.SolrZkClient makePath: /overseer/collection-map-completed
   [junit4]   2> 1019069 INFO  (jetty-launcher-908-thread-2) [n:127.0.0.1:34411_solr    ] o.a.s.c.c.SolrZkClient makePath: /overseer/collection-map-completed
   [junit4]   2> 1019070 INFO  (jetty-launcher-908-thread-1) [n:127.0.0.1:38834_solr    ] o.a.s.c.c.SolrZkClient makePath: /overseer/collection-map-failure
   [junit4]   2> 1019070 INFO  (jetty-launcher-908-thread-2) [n:127.0.0.1:34411_solr    ] o.a.s.c.c.SolrZkClient makePath: /overseer/collection-map-failure
   [junit4]   2> 1019071 INFO  (jetty-launcher-908-thread-2) [n:127.0.0.1:34411_solr    ] o.a.s.c.c.SolrZkClient makePath: /live_nodes
   [junit4]   2> 1019071 INFO  (jetty-launcher-908-thread-1) [n:127.0.0.1:38834_solr    ] o.a.s.c.c.SolrZkClient makePath: /live_nodes
   [junit4]   2> 1019071 INFO  (jetty-launcher-908-thread-1) [n:127.0.0.1:38834_solr    ] o.a.s.c.c.SolrZkClient makePath: /collections
   [junit4]   2> 1019071 INFO  (jetty-launcher-908-thread-2) [n:127.0.0.1:34411_solr    ] o.a.s.c.c.SolrZkClient makePath: /collections
   [junit4]   2> 1019072 INFO  (jetty-launcher-908-thread-2) [n:127.0.0.1:34411_solr    ] o.a.s.c.c.SolrZkClient makePath: /aliases.json
   [junit4]   2> 1019072 INFO  (jetty-launcher-908-thread-1) [n:127.0.0.1:38834_solr    ] o.a.s.c.c.SolrZkClient makePath: /aliases.json
   [junit4]   2> 1019072 INFO  (jetty-launcher-908-thread-1) [n:127.0.0.1:38834_solr    ] o.a.s.c.c.SolrZkClient makePath: /clusterstate.json
   [junit4]   2> 1019072 INFO  (jetty-launcher-908-thread-2) [n:127.0.0.1:34411_solr    ] o.a.s.c.c.SolrZkClient makePath: /clusterstate.json
   [junit4]   2> 1019073 INFO  (jetty-launcher-908-thread-2) [n:127.0.0.1:34411_solr    ] o.a.s.c.c.SolrZkClient makePath: /security.json
   [junit4]   2> 1019073 INFO  (jetty-launcher-908-thread-1) [n:127.0.0.1:38834_solr    ] o.a.s.c.c.SolrZkClient makePath: /security.json
   [junit4]   2> 1019073 INFO  (jetty-launcher-908-thread-2) [n:127.0.0.1:34411_solr    ] o.a.s.c.ZkController Register node as live in ZooKeeper:/live_nodes/127.0.0.1:34411_solr
   [junit4]   2> 1019073 INFO  (jetty-launcher-908-thread-1) [n:127.0.0.1:38834_solr    ] o.a.s.c.ZkController Register node as live in ZooKeeper:/live_nodes/127.0.0.1:38834_solr
   [junit4]   2> 1019073 INFO  (jetty-launcher-908-thread-2) [n:127.0.0.1:34411_solr    ] o.a.s.c.c.SolrZkClient makePath: /live_nodes/127.0.0.1:34411_solr
   [junit4]   2> 1019073 INFO  (jetty-launcher-908-thread-1) [n:127.0.0.1:38834_solr    ] o.a.s.c.c.SolrZkClient makePath: /live_nodes/127.0.0.1:38834_solr
   [junit4]   2> 1019074 INFO  (jetty-launcher-908-thread-2) [n:127.0.0.1:34411_solr    ] o.a.s.c.c.SolrZkClient makePath: /overseer_elect
   [junit4]   2> 1019074 INFO  (jetty-launcher-908-thread-1) [n:127.0.0.1:38834_solr    ] o.a.s.c.c.SolrZkClient makePath: /overseer_elect
   [junit4]   2> 1019074 INFO  (jetty-launcher-908-thread-2) [n:127.0.0.1:34411_solr    ] o.a.s.c.c.SolrZkClient makePath: /overseer_elect/election
   [junit4]   2> 1019074 INFO  (jetty-launcher-908-thread-1) [n:127.0.0.1:38834_solr    ] o.a.s.c.c.SolrZkClient makePath: /overseer_elect/election
   [junit4]   2> 1019075 INFO  (jetty-launcher-908-thread-2) [n:127.0.0.1:34411_solr    ] o.a.s.c.Overseer Overseer (id=null) closing
   [junit4]   2> 1019076 INFO  (jetty-launcher-908-thread-1) [n:127.0.0.1:38834_solr    ] o.a.s.c.Overseer Overseer (id=null) closing
   [junit4]   2> 1019076 INFO  (jetty-launcher-908-thread-2) [n:127.0.0.1:34411_solr    ] o.a.s.c.LeaderElector Joined leadership election with path: /overseer_elect/election/96568625370431494-127.0.0.1:34411_solr-n_0000000000
   [junit4]   2> 1019076 INFO  (jetty-launcher-908-thread-1) [n:127.0.0.1:38834_solr    ] o.a.s.c.LeaderElector Joined leadership election with path: /overseer_elect/election/96568625370431493-127.0.0.1:38834_solr-n_0000000001
   [junit4]   2> 1019076 INFO  (jetty-launcher-908-thread-2) [n:127.0.0.1:34411_solr    ] o.a.s.c.OverseerElectionContext I am going to be the leader 127.0.0.1:34411_solr
   [junit4]   2> 1019076 INFO  (jetty-launcher-908-thread-2) [n:127.0.0.1:34411_solr    ] o.a.s.c.c.SolrZkClient makePath: /overseer_elect/leader
   [junit4]   2> 1019077 INFO  (jetty-launcher-908-thread-1) [n:127.0.0.1:38834_solr    ] o.a.s.c.LeaderElector Watching path /overseer_elect/election/96568625370431494-127.0.0.1:34411_solr-n_0000000000 to know if I could be the leader
   [junit4]   2> 1019077 INFO  (jetty-launcher-908-thread-1) [n:127.0.0.1:38834_solr    ] o.a.s.c.c.ZkStateReader Updating cluster state from ZooKeeper... 
   [junit4]   2> 1019077 INFO  (jetty-launcher-908-thread-2) [n:127.0.0.1:34411_solr    ] o.a.s.c.Overseer Overseer (id=96568625370431494-127.0.0.1:34411_solr-n_0000000000) starting
   [junit4]   2> 1019078 INFO  (jetty-launcher-908-thread-2) [n:127.0.0.1:34411_solr    ] o.a.s.c.c.SolrZkClient makePath: /overseer/queue-work
   [junit4]   2> 1019080 INFO  (jetty-launcher-908-thread-2) [n:127.0.0.1:34411_solr    ] o.a.s.c.OverseerAutoReplicaFailoverThread Starting OverseerAutoReplicaFailoverThread autoReplicaFailoverWorkLoopDelay=10000 autoReplicaFailoverWaitAfterExpiration=30000 autoReplicaFailoverBadNodeExpiration=60000
   [junit4]   2> 1019080 INFO  (jetty-launcher-908-thread-2) [n:127.0.0.1:34411_solr    ] o.a.s.c.c.ZkStateReader Updating cluster state from ZooKeeper... 
   [junit4]   2> 1019080 INFO  (OverseerCollectionConfigSetProcessor-96568625370431494-127.0.0.1:34411_solr-n_0000000000) [n:127.0.0.1:34411_solr    ] o.a.s.c.OverseerTaskProcessor Process current queue of overseer operations
   [junit4]   2> 1019080 INFO  (OverseerStateUpdate-96568625370431494-127.0.0.1:34411_solr-n_0000000000) [n:127.0.0.1:34411_solr    ] o.a.s.c.Overseer Starting to work on the main queue
   [junit4]   2> 1019088 INFO  (jetty-launcher-908-thread-1) [n:127.0.0.1:38834_solr    ] o.a.s.c.CoreContainer Security conf doesn't exist. Skipping setup for authorization module.
   [junit4]   2> 1019088 INFO  (jetty-launcher-908-thread-1) [n:127.0.0.1:38834_solr    ] o.a.s.c.CoreContainer No authentication plugin used.
   [junit4]   2> 1019089 INFO  (jetty-launcher-908-thread-1) [n:127.0.0.1:38834_solr    ] o.a.s.c.CorePropertiesLocator Looking for core definitions underneath /home/jenkins/workspace/Lucene-Solr-5.5-Linux/solr/build/solr-core/test/J2/temp/solr.schema.TestManagedSchemaAPI_E26F4EFD00885B42-001/tempDir-001/node1/.
   [junit4]   2> 1019089 INFO  (jetty-launcher-908-thread-1) [n:127.0.0.1:38834_solr    ] o.a.s.c.CorePropertiesLocator Found 0 core definitions
   [junit4]   2> 1019089 INFO  (jetty-launcher-908-thread-1) [n:127.0.0.1:38834_solr    ] o.a.s.s.SolrDispatchFilter user.dir=/home/jenkins/workspace/Lucene-Solr-5.5-Linux/solr/build/solr-core/test/J2
   [junit4]   2> 1019089 INFO  (jetty-launcher-908-thread-1) [n:127.0.0.1:38834_solr    ] o.a.s.s.SolrDispatchFilter SolrDispatchFilter.init() done
   [junit4]   2> 1019094 INFO  (jetty-launcher-908-thread-2) [n:127.0.0.1:34411_solr    ] o.a.s.c.CoreContainer Security conf doesn't exist. Skipping setup for authorization module.
   [junit4]   2> 1019094 INFO  (jetty-launcher-908-thread-2) [n:127.0.0.1:34411_solr    ] o.a.s.c.CoreContainer No authentication plugin used.
   [junit4]   2> 1019095 INFO  (jetty-launcher-908-thread-2) [n:127.0.0.1:34411_solr    ] o.a.s.c.CorePropertiesLocator Looking for core definitions underneath /home/jenkins/workspace/Lucene-Solr-5.5-Linux/solr/build/solr-core/test/J2/temp/solr.schema.TestManagedSchemaAPI_E26F4EFD00885B42-001/tempDir-001/node2/.
   [junit4]   2> 1019095 INFO  (jetty-launcher-908-thread-2) [n:127.0.0.1:34411_solr    ] o.a.s.c.CorePropertiesLocator Found 0 core definitions
   [junit4]   2> 1019095 INFO  (jetty-launcher-908-thread-2) [n:127.0.0.1:34411_solr    ] o.a.s.s.SolrDispatchFilter user.dir=/home/jenkins/workspace/Lucene-Solr-5.5-Linux/solr/build/solr-core/test/J2
   [junit4]   2> 1019095 INFO  (jetty-launcher-908-thread-2) [n:127.0.0.1:34411_solr    ] o.a.s.s.SolrDispatchFilter SolrDispatchFilter.init() done
   [junit4]   2> 1019096 INFO  (TEST-TestManagedSchemaAPI.test-seed#[E26F4EFD00885B42]) [    ] o.a.s.c.c.SolrZkClient Using default ZkCredentialsProvider
   [junit4]   2> 1019096 INFO  (TEST-TestManagedSchemaAPI.test-seed#[E26F4EFD00885B42]) [    ] o.a.s.c.c.ConnectionManager Waiting for client to connect to ZooKeeper
   [junit4]   2> 1019097 INFO  (zkCallback-920-thread-1) [    ] o.a.s.c.c.ConnectionManager Watcher org.apache.solr.common.cloud.ConnectionManager@47b1825c name:ZooKeeperConnection Watcher:127.0.0.1:39507 got event WatchedEvent state:SyncConnected type:None path:null path:null type:None
   [junit4]   2> 1019097 INFO  (TEST-TestManagedSchemaAPI.test-seed#[E26F4EFD00885B42]) [    ] o.a.s.c.c.ConnectionManager Client is connected to ZooKeeper
   [junit4]   2> 1019097 INFO  (TEST-TestManagedSchemaAPI.test-seed#[E26F4EFD00885B42]) [    ] o.a.s.c.c.SolrZkClient Using default ZkACLProvider
   [junit4]   2> 1019098 INFO  (TEST-TestManagedSchemaAPI.test-seed#[E26F4EFD00885B42]) [    ] o.a.s.c.c.SolrZkClient Using default ZkCredentialsProvider
   [junit4]   2> 1019098 INFO  (TEST-TestManagedSchemaAPI.test-seed#[E26F4EFD00885B42]) [    ] o.a.s.c.c.ConnectionManager Waiting for client to connect to ZooKeeper
   [junit4]   2> 1019099 INFO  (zkCallback-922-thread-1) [    ] o.a.s.c.c.ConnectionManager Watcher org.apache.solr.common.cloud.ConnectionManager@482b8bbb name:ZooKeeperConnection Watcher:127.0.0.1:39507/solr got event WatchedEvent state:SyncConnected type:None path:null path:null type:None
   [junit4]   2> 1019099 INFO  (TEST-TestManagedSchemaAPI.test-seed#[E26F4EFD00885B42]) [    ] o.a.s.c.c.ConnectionManager Client is connected to ZooKeeper
   [junit4]   2> 1019100 INFO  (TEST-TestManagedSchemaAPI.test-seed#[E26F4EFD00885B42]) [    ] o.a.s.c.c.SolrZkClient Using default ZkACLProvider
   [junit4]   2> 1019100 INFO  (TEST-TestManagedSchemaAPI.test-seed#[E26F4EFD00885B42]) [    ] o.a.s.c.c.SolrZkClient makePath: /configs/conf1/solrconfig.xml
   [junit4]   2> 1019101 INFO  (TEST-TestManagedSchemaAPI.test-seed#[E26F4EFD00885B42]) [    ] o.a.s.c.c.SolrZkClient makePath: /configs/conf1/managed-schema
   [junit4]   2> 1019102 INFO  (TEST-TestManagedSchemaAPI.test-seed#[E26F4EFD00885B42]) [    ] o.a.s.c.c.SolrZkClient Using default ZkCredentialsProvider
   [junit4]   2> 1019102 INFO  (TEST-TestManagedSchemaAPI.test-seed#[E26F4EFD00885B42]) [    ] o.a.s.c.c.ConnectionManager Waiting for client to connect to ZooKeeper
   [junit4]   2> 1019103 INFO  (zkCallback-923-thread-1) [    ] o.a.s.c.c.ConnectionManager Watcher org.apache.solr.common.cloud.ConnectionManager@585d112b name:ZooKeeperConnection Watcher:127.0.0.1:39507/solr got event WatchedEvent state:SyncConnected type:None path:null path:null type:None
   [junit4]   2> 1019103 INFO  (TEST-TestManagedSchemaAPI.test-seed#[E26F4EFD00885B42]) [    ] o.a.s.c.c.ConnectionManager Client is connected to ZooKeeper
   [junit4]   2> 1019103 INFO  (TEST-TestManagedSchemaAPI.test-seed#[E26F4EFD00885B42]) [    ] o.a.s.c.c.SolrZkClient Using default ZkACLProvider
   [junit4]   2> 1019103 INFO  (TEST-TestManagedSchemaAPI.test-seed#[E26F4EFD00885B42]) [    ] o.a.s.c.c.ZkStateReader Updating cluster state from ZooKeeper... 
   [junit4]   2> 1019106 INFO  (qtp1775476444-6598) [n:127.0.0.1:38834_solr    ] o.a.s.h.a.CollectionsHandler Invoked Collection Action :create with params action=CREATE&name=testschemaapi&numShards=1&collection.configName=conf1&wt=javabin&version=2&replicationFactor=2 and sendToOCPQueue=true
   [junit4]   2> 1019107 INFO  (OverseerCollectionConfigSetProcessor-96568625370431494-127.0.0.1:34411_solr-n_0000000000) [n:127.0.0.1:34411_solr    ] o.a.s.c.OverseerTaskProcessor Overseer Collection Message Handler: Get the message id:/overseer/collection-queue-work/qn-0000000000 message:{
   [junit4]   2>   "name":"testschemaapi",
   [junit4]   2>   "fromApi":"true",
   [junit4]   2>   "replicationFactor":"2",
   [junit4]   2>   "collection.configName":"conf1",
   [junit4]   2>   "numShards":"1",
   [junit4]   2>   "stateFormat":"2",
   [junit4]   2>   "operation":"create"}
   [junit4]   2> 1019107 INFO  (OverseerThreadFactory-3010-thread-1-processing-n:127.0.0.1:34411_solr) [n:127.0.0.1:34411_solr    ] o.a.s.c.OverseerCollectionMessageHandler OverseerCollectionMessageHandler.processMessage : create , {
   [junit4]   2>   "name":"testschemaapi",
   [junit4]   2>   "fromApi":"true",
   [junit4]   2>   "replicationFactor":"2",
   [junit4]   2>   "collection.configName":"conf1",
   [junit4]   2>   "numShards":"1",
   [junit4]   2>   "stateFormat":"2",
   [junit4]   2>   "operation":"create"}
   [junit4]   2> 1019108 INFO  (OverseerThreadFactory-3010-thread-1-processing-n:127.0.0.1:34411_solr) [n:127.0.0.1:34411_solr    ] o.a.s.c.OverseerCollectionMessageHandler Create collection testschemaapi
   [junit4]   2> 1019108 INFO  (OverseerThreadFactory-3010-thread-1-processing-n:127.0.0.1:34411_solr) [n:127.0.0.1:34411_solr    ] o.a.s.c.OverseerCollectionMessageHandler creating collections conf node /collections/testschemaapi 
   [junit4]   2> 1019108 INFO  (OverseerThreadFactory-3010-thread-1-processing-n:127.0.0.1:34411_solr) [n:127.0.0.1:34411_solr    ] o.a.s.c.c.SolrZkClient makePath: /collections/testschemaapi
   [junit4]   2> 1019109 INFO  (zkCallback-919-thread-1-processing-n:127.0.0.1:34411_solr) [n:127.0.0.1:34411_solr    ] o.a.s.c.c.ZkStateReader A collections change: [WatchedEvent state:SyncConnected type:NodeChildrenChanged path:/collections], has occurred - updating...
   [junit4]   2> 1019109 INFO  (zkCallback-923-thread-1) [    ] o.a.s.c.c.ZkStateReader A collections change: [WatchedEvent state:SyncConnected type:NodeChildrenChanged path:/collections], has occurred - updating...
   [junit4]   2> 1019109 INFO  (zkCallback-918-thread-1-processing-n:127.0.0.1:38834_solr) [n:127.0.0.1:38834_solr    ] o.a.s.c.c.ZkStateReader A collections change: [WatchedEvent state:SyncConnected type:NodeChildrenChanged path:/collections], has occurred - updating...
   [junit4]   2> 1019110 INFO  (OverseerStateUpdate-96568625370431494-127.0.0.1:34411_solr-n_0000000000) [n:127.0.0.1:34411_solr    ] o.a.s.c.Overseer processMessage: queueSize: 1, message = {
   [junit4]   2>   "name":"testschemaapi",
   [junit4]   2>   "fromApi":"true",
   [junit4]   2>   "replicationFactor":"2",
   [junit4]   2>   "collection.configName":"conf1",
   [junit4]   2>   "numShards":"1",
   [junit4]   2>   "stateFormat":"2",
   [junit4]   2>   "operation":"create"} current state version: 0
   [junit4]   2> 1019110 INFO  (OverseerStateUpdate-96568625370431494-127.0.0.1:34411_solr-n_0000000000) [n:127.0.0.1:34411_solr    ] o.a.s.c.o.ClusterStateMutator building a new cName: testschemaapi
   [junit4]   2> 1019110 INFO  (OverseerStateUpdate-96568625370431494-127.0.0.1:34411_solr-n_0000000000) [n:127.0.0.1:34411_solr    ] o.a.s.c.o.ZkStateWriter going to create_collection /collections/testschemaapi/state.json
   [junit4]   2> 1019210 INFO  (OverseerThreadFactory-3010-thread-1-processing-n:127.0.0.1:34411_solr) [n:127.0.0.1:34411_solr    ] o.a.s.c.OverseerCollectionMessageHandler Creating SolrCores for new collection testschemaapi, shardNames [shard1] , replicationFactor : 2
   [junit4]   2> 1019210 INFO  (OverseerThreadFactory-3010-thread-1-processing-n:127.0.0.1:34411_solr) [n:127.0.0.1:34411_solr    ] o.a.s.c.OverseerCollectionMessageHandler Creating core testschemaapi_shard1_replica2 as part of shard shard1 of collection testschemaapi on 127.0.0.1:38834_solr
   [junit4]   2> 1019211 INFO  (OverseerThreadFactory-3010-thread-1-processing-n:127.0.0.1:34411_solr) [n:127.0.0.1:34411_solr    ] o.a.s.c.OverseerCollectionMessageHandler Creating core testschemaapi_shard1_replica1 as part of shard shard1 of collection testschemaapi on 127.0.0.1:34411_solr
   [junit4]   2> 1019212 INFO  (qtp1147319243-6601) [n:127.0.0.1:34411_solr    ] o.a.s.h.a.CoreAdminOperation core create command action=CREATE&shard=shard1&name=testschemaapi_shard1_replica1&numShards=1&collection.configName=conf1&collection=testschemaapi&wt=javabin&qt=/admin/cores&version=2
   [junit4]   2> 1019212 INFO  (qtp1775476444-6600) [n:127.0.0.1:38834_solr    ] o.a.s.h.a.CoreAdminOperation core create command action=CREATE&shard=shard1&name=testschemaapi_shard1_replica2&numShards=1&collection.configName=conf1&collection=testschemaapi&wt=javabin&qt=/admin/cores&version=2
   [junit4]   2> 1019213 INFO  (qtp1147319243-6601) [n:127.0.0.1:34411_solr    ] o.a.s.c.CoreDescriptor Created CoreDescriptor: {dataDir=data/, collection.configName=conf1, transient=false, configSetProperties=configsetprops.json, shard=shard1, name=testschemaapi_shard1_replica1, loadOnStartup=true, config=solrconfig.xml, schema=schema.xml, collection=testschemaapi, numShards=1}
   [junit4]   2> 1019213 INFO  (qtp1775476444-6600) [n:127.0.0.1:38834_solr    ] o.a.s.c.CoreDescriptor Created CoreDescriptor: {collection.configName=conf1, name=testschemaapi_shard1_replica2, collection=testschemaapi, transient=false, schema=schema.xml, shard=shard1, loadOnStartup=true, numShards=1, configSetProperties=configsetprops.json, config=solrconfig.xml, dataDir=data/}
   [junit4]   2> 1019213 INFO  (qtp1147319243-6601) [n:127.0.0.1:34411_solr c:testschemaapi s:shard1  x:testschemaapi_shard1_replica1] o.a.s.c.ZkController publishing state=down
   [junit4]   2> 1019213 INFO  (qtp1775476444-6600) [n:127.0.0.1:38834_solr c:testschemaapi s:shard1  x:testschemaapi_shard1_replica2] o.a.s.c.ZkController publishing state=down
   [junit4]   2> 1019214 INFO  (qtp1147319243-6601) [n:127.0.0.1:34411_solr c:testschemaapi s:shard1  x:testschemaapi_shard1_replica1] o.a.s.c.ZkController Registering watch for collection testschemaapi
   [junit4]   2> 1019214 INFO  (qtp1147319243-6601) [n:127.0.0.1:34411_solr c:testschemaapi s:shard1  x:testschemaapi_shard1_replica1] o.a.s.c.c.ZkStateReader addZkWatch [testschemaapi]
   [junit4]   2> 1019214 INFO  (qtp1775476444-6600) [n:127.0.0.1:38834_solr c:testschemaapi s:shard1  x:testschemaapi_shard1_replica2] o.a.s.c.ZkController Registering watch for collection testschemaapi
   [junit4]   2> 1019214 INFO  (qtp1775476444-6600) [n:127.0.0.1:38834_solr c:testschemaapi s:shard1  x:testschemaapi_shard1_replica2] o.a.s.c.c.ZkStateReader addZkWatch [testschemaapi]
   [junit4]   2> 1019214 INFO  (OverseerStateUpdate-96568625370431494-127.0.0.1:34411_solr-n_0000000000) [n:127.0.0.1:34411_solr    ] o.a.s.c.Overseer processMessage: queueSize: 2, message = {
   [junit4]   2>   "core":"testschemaapi_shard1_replica1",
   [junit4]   2>   "shard":"shard1",
   [junit4]   2>   "node_name":"127.0.0.1:34411_solr",
   [junit4]   2>   "state":"down",
   [junit4]   2>   "roles":null,
   [junit4]   2>   "numShards":"1",
   [junit4]   2>   "base_url":"http://127.0.0.1:34411/solr",
   [junit4]   2>   "collection":"testschemaapi",
   [junit4]   2>   "operation":"state"} current state version: 0
   [junit4]   2> 1019214 INFO  (qtp1147319243-6601) [n:127.0.0.1:34411_solr c:testschemaapi s:shard1  x:testschemaapi_shard1_replica1] o.a.s.c.c.ZkStateReader Add data for [testschemaapi] ver [0]
   [junit4]   2> 1019214 INFO  (qtp1775476444-6600) [n:127.0.0.1:38834_solr c:testschemaapi s:shard1  x:testschemaapi_shard1_replica2] o.a.s.c.c.ZkStateReader Add data for [testschemaapi] ver [0]
   [junit4]   2> 1019214 INFO  (qtp1147319243-6601) [n:127.0.0.1:34411_solr c:testschemaapi s:shard1  x:testschemaapi_shard1_replica1] o.a.s.c.ZkController look for our core node name
   [junit4]   2> 1019214 INFO  (qtp1775476444-6600) [n:127.0.0.1:38834_solr c:testschemaapi s:shard1  x:testschemaapi_shard1_replica2] o.a.s.c.ZkController look for our core node name
   [junit4]   2> 1019214 INFO  (OverseerStateUpdate-96568625370431494-127.0.0.1:34411_solr-n_0000000000) [n:127.0.0.1:34411_solr    ] o.a.s.c.o.ReplicaMutator Update state numShards=1 message={
   [junit4]   2>   "core":"testschemaapi_shard1_replica1",
   [junit4]   2>   "shard":"shard1",
   [junit4]   2>   "node_name":"127.0.0.1:34411_solr",
   [junit4]   2>   "state":"down",
   [junit4]   2>   "roles":null,
   [junit4]   2>   "numShards":"1",
   [junit4]   2>   "base_url":"http://127.0.0.1:34411/solr",
   [junit4]   2>   "collection":"testschemaapi",
   [junit4]   2>   "operation":"state"}
   [junit4]   2> 1019215 INFO  (OverseerStateUpdate-96568625370431494-127.0.0.1:34411_solr-n_0000000000) [n:127.0.0.1:34411_solr    ] o.a.s.c.Overseer processMessage: queueSize: 2, message = {
   [junit4]   2>   "core":"testschemaapi_shard1_replica2",
   [junit4]   2>   "shard":"shard1",
   [junit4]   2>   "node_name":"127.0.0.1:38834_solr",
   [junit4]   2>   "state":"down",
   [junit4]   2>   "roles":null,
   [junit4]   2>   "numShards":"1",
   [junit4]   2>   "base_url":"http://127.0.0.1:38834/solr",
   [junit4]   2>   "collection":"testschemaapi",
   [junit4]   2>   "operation":"state"} current state version: 0
   [junit4]   2> 1019215 INFO  (OverseerStateUpdate-96568625370431494-127.0.0.1:34411_solr-n_0000000000) [n:127.0.0.1:34411_solr    ] o.a.s.c.o.ReplicaMutator Update state numShards=1 message={
   [junit4]   2>   "core":"testschemaapi_shard1_replica2",
   [junit4]   2>   "shard":"shard1",
   [junit4]   2>   "node_name":"127.0.0.1:38834_solr",
   [junit4]   2>   "state":"down",
   [junit4]   2>   "roles":null,
   [junit4]   2>   "numShards":"1",
   [junit4]   2>   "base_url":"http://127.0.0.1:38834/solr",
   [junit4]   2>   "collection":"testschemaapi",
   [junit4]   2>   "operation":"state"}
   [junit4]   2> 1019316 INFO  (OverseerStateUpdate-96568625370431494-127.0.0.1:34411_solr-n_0000000000) [n:127.0.0.1:34411_solr    ] o.a.s.c.o.ZkStateWriter going to update_collection /collections/testschemaapi/state.json version: 0
   [junit4]   2> 1019317 INFO  (zkCallback-918-thread-1-processing-n:127.0.0.1:38834_solr) [n:127.0.0.1:38834_solr    ] o.a.s.c.c.ZkStateReader A cluster state change: [WatchedEvent state:SyncConnected type:NodeDataChanged path:/collections/testschemaapi/state.json] for collection [testschemaapi] has occurred - updating... (live nodes size: [2])
   [junit4]   2> 1019317 INFO  (zkCallback-919-thread-3-processing-n:127.0.0.1:34411_solr) [n:127.0.0.1:34411_solr    ] o.a.s.c.c.ZkStateReader A cluster state change: [WatchedEvent state:SyncConnected type:NodeDataChanged path:/collections/testschemaapi/state.json] for collection [testschemaapi] has occurred - updating... (live nodes size: [2])
   [junit4]   2> 1019317 INFO  (zkCallback-919-thread-3-processing-n:127.0.0.1:34411_solr) [n:127.0.0.1:34411_solr    ] o.a.s.c.c.ZkStateReader Updating data for [testschemaapi] from [0] to [1]
   [junit4]   2> 1019317 INFO  (zkCallback-918-thread-1-processing-n:127.0.0.1:38834_solr) [n:127.0.0.1:38834_solr    ] o.a.s.c.c.ZkStateReader Updating data for [testschemaapi] from [0] to [1]
   [junit4]   2> 1020214 INFO  (qtp1775476444-6600) [n:127.0.0.1:38834_solr c:testschemaapi s:shard1  x:testschemaapi_shard1_replica2] o.a.s.c.ZkController waiting to find shard id in clusterstate for testschemaapi_shard1_replica2
   [junit4]   2> 1020214 INFO  (qtp1147319243-6601) [n:127.0.0.1:34411_solr c:testschemaapi s:shard1  x:testschemaapi_shard1_replica1] o.a.s.c.ZkController waiting to find shard id in clusterstate for testschemaapi_shard1_replica1
   [junit4]   2> 1020214 INFO  (qtp1775476444-6600) [n:127.0.0.1:38834_solr c:testschemaapi s:shard1  x:testschemaapi_shard1_replica2] o.a.s.c.ZkController Check for collection zkNode:testschemaapi
   [junit4]   2> 1020214 INFO  (qtp1147319243-6601) [n:127.0.0.1:34411_solr c:testschemaapi s:shard1  x:testschemaapi_shard1_replica1] o.a.s.c.ZkController Check for collection zkNode:testschemaapi
   [junit4]   2> 1020215 INFO  (qtp1775476444-6600) [n:127.0.0.1:38834_solr c:testschemaapi s:shard1  x:testschemaapi_shard1_replica2] o.a.s.c.ZkController Collection zkNode exists
   [junit4]   2> 1020215 INFO  (qtp1147319243-6601) [n:127.0.0.1:34411_solr c:testschemaapi s:shard1  x:testschemaapi_shard1_replica1] o.a.s.c.ZkController Collection zkNode exists
   [junit4]   2> 1020215 INFO  (qtp1775476444-6600) [n:127.0.0.1:38834_solr c:testschemaapi s:shard1  x:testschemaapi_shard1_replica2] o.a.s.c.c.ZkStateReader Load collection config from: [/collections/testschemaapi]
   [junit4]   2> 1020215 INFO  (qtp1147319243-6601) [n:127.0.0.1:34411_solr c:testschemaapi s:shard1  x:testschemaapi_shard1_replica1] o.a.s.c.c.ZkStateReader Load collection config from: [/collections/testschemaapi]
   [junit4]   2> 1020215 INFO  (qtp1775476444-6600) [n:127.0.0.1:38834_solr c:testschemaapi s:shard1  x:testschemaapi_shard1_replica2] o.a.s.c.c.ZkStateReader path=[/collections/testschemaapi] [configName]=[conf1] specified config exists in ZooKeeper
   [junit4]   2> 1020215 INFO  (qtp1147319243-6601) [n:127.0.0.1:34411_solr c:testschemaapi s:shard1  x:testschemaapi_shard1_replica1] o.a.s.c.c.ZkStateReader path=[/collections/testschemaapi] [configName]=[conf1] specified config exists in ZooKeeper
   [junit4]   2> 1020215 INFO  (qtp1775476444-6600) [n:127.0.0.1:38834_solr c:testschemaapi s:shard1  x:testschemaapi_shard1_replica2] o.a.s.c.SolrResourceLoader new SolrResourceLoader for directory: '/home/jenkins/workspace/Lucene-Solr-5.5-Linux/solr/build/solr-core/test/J2/temp/solr.schema.TestManagedSchemaAPI_E26F4EFD00885B42-001/tempDir-001/node1/testschemaapi_shard1_replica2'
   [junit4]   2> 1020215 INFO  (qtp1147319243-6601) [n:127.0.0.1:34411_solr c:testschemaapi s:shard1  x:testschemaapi_shard1_replica1] o.a.s.c.SolrResourceLoader new SolrResourceLoader for directory: '/home/jenkins/workspace/Lucene-Solr-5.5-Linux/solr/build/solr-core/test/J2/temp/solr.schema.TestManagedSchemaAPI_E26F4EFD00885B42-001/tempDir-001/node2/testschemaapi_shard1_replica1'
   [junit4]   2> 1020216 INFO  (qtp1775476444-6600) [n:127.0.0.1:38834_solr c:testschemaapi s:shard1  x:testschemaapi_shard1_replica2] o.a.s.c.SolrResourceLoader JNDI not configured for solr (NoInitialContextEx)
   [junit4]   2> 1020216 INFO  (qtp1147319243-6601) [n:127.0.0.1:34411_solr c:testschemaapi s:shard1  x:testschemaapi_shard1_replica1] o.a.s.c.SolrResourceLoader JNDI not configured for solr (NoInitialContextEx)
   [junit4]   2> 1020216 INFO  (qtp1775476444-6600) [n:127.0.0.1:38834_solr c:testschemaapi s:shard1  x:testschemaapi_shard1_replica2] o.a.s.c.SolrResourceLoader solr home defaulted to 'solr/' (could not find system property or JNDI)
   [junit4]   2> 1020216 INFO  (qtp1147319243-6601) [n:127.0.0.1:34411_solr c:testschemaapi s:shard1  x:testschemaapi_shard1_replica1] o.a.s.c.SolrResourceLoader solr home defaulted to 'solr/' (could not find system property or JNDI)
   [junit4]   2> 1020217 INFO  (qtp1775476444-6600) [n:127.0.0.1:38834_solr c:testschemaapi s:shard1  x:testschemaapi_shard1_replica2] o.a.s.c.Config loaded config solrconfig.xml with version 0 
   [junit4]   2> 1020217 INFO  (qtp1147319243-6601) [n:127.0.0.1:34411_solr c:testschemaapi s:shard1  x:testschemaapi_shard1_replica1] o.a.s.c.Config loaded config solrconfig.xml with version 0 
   [junit4]   2> 1020220 INFO  (qtp1775476444-6600) [n:127.0.0.1:38834_solr c:testschemaapi s:shard1  x:testschemaapi_shard1_replica2] o.a.s.c.SolrConfig current version of requestparams : -1
   [junit4]   2> 1020220 INFO  (qtp1147319243-6601) [n:127.0.0.1:34411_solr c:testschemaapi s:shard1  x:testschemaapi_shard1_replica1] o.a.s.c.SolrConfig current version of requestparams : -1
   [junit4]   2> 1020226 INFO  (qtp1147319243-6601) [n:127.0.0.1:34411_solr c:testschemaapi s:shard1  x:testschemaapi_shard1_replica1] o.a.s.c.SolrConfig Using Lucene MatchVersion: 5.5.3
   [junit4]   2> 1020227 INFO  (qtp1775476444-6600) [n:127.0.0.1:38834_solr c:testschemaapi s:shard1  x:testschemaapi_shard1_replica2] o.a.s.c.SolrConfig Using Lucene MatchVersion: 5.5.3
   [junit4]   2> 1020253 INFO  (qtp1147319243-6601) [n:127.0.0.1:34411_solr c:testschemaapi s:shard1  x:testschemaapi_shard1_replica1] o.a.s.c.SolrConfig Loaded SolrConfig: solrconfig.xml
   [junit4]   2> 1020255 INFO  (qtp1775476444-6600) [n:127.0.0.1:38834_solr c:testschemaapi s:shard1  x:testschemaapi_shard1_replica2] o.a.s.c.SolrConfig Loaded SolrConfig: solrconfig.xml
   [junit4]   2> 1020256 INFO  (qtp1147319243-6601) [n:127.0.0.1:34411_solr c:testschemaapi s:shard1  x:testschemaapi_shard1_replica1] o.a.s.s.IndexSchema [testschemaapi_shard1_replica1] Schema name=minimal
   [junit4]   2> 1020258 INFO  (qtp1775476444-6600) [n:127.0.0.1:38834_solr c:testschemaapi s:shard1  x:testschemaapi_shard1_replica2] o.a.s.s.IndexSchema [testschemaapi_shard1_replica2] Schema name=minimal
   [junit4]   2> 1020262 INFO  (qtp1147319243-6601) [n:127.0.0.1:34411_solr c:testschemaapi s:shard1  x:testschemaapi_shard1_replica1] o.a.s.s.IndexSchema unique key field: id
   [junit4]   2> 1020263 INFO  (qtp1147319243-6601) [n:127.0.0.1:34411_solr c:testschemaapi s:shard1  x:testschemaapi_shard1_replica1] o.a.s.c.ConfigSetProperties Did not find ConfigSet properties, assuming default properties: Can't find resource 'configsetprops.json' in classpath or '/configs/conf1', cwd=/home/jenkins/workspace/Lucene-Solr-5.5-Linux/solr/build/solr-core/test/J2
   [junit4]   2> 1020263 INFO  (qtp1147319243-6601) [n:127.0.0.1:34411_solr c:testschemaapi s:shard1  x:testschemaapi_shard1_replica1] o.a.s.c.CoreContainer Creating SolrCore 'testschemaapi_shard1_replica1' using configuration from collection testschemaapi
   [junit4]   2> 1020264 INFO  (qtp1147319243-6601) [n:127.0.0.1:34411_solr c:testschemaapi s:shard1 r:core_node1 x:testschemaapi_shard1_replica1] o.a.s.c.SolrCore org.apache.solr.core.MockDirectoryFactory
   [junit4]   2> 1020264 INFO  (qtp1147319243-6601) [n:127.0.0.1:34411_solr c:testschemaapi s:shard1 r:core_node1 x:testschemaapi_shard1_replica1] o.a.s.c.SolrCore [[testschemaapi_shard1_replica1] ] Opening new SolrCore at [/home/jenkins/workspace/Lucene-Solr-5.5-Linux/solr/build/solr-core/test/J2/temp/solr.schema.TestManagedSchemaAPI_E26F4EFD00885B42-001/tempDir-001/node2/testschemaapi_shard1_replica1], dataDir=[/home/jenkins/workspace/Lucene-Solr-5.5-Linux/solr/build/solr-core/test/J2/temp/solr.schema.TestManagedSchemaAPI_E26F4EFD00885B42-001/tempDir-001/node2/./testschemaapi_shard1_replica1/data/]
   [junit4]   2> 1020264 INFO  (qtp1147319243-6601) [n:127.0.0.1:34411_solr c:testschemaapi s:shard1 r:core_node1 x:testschemaapi_shard1_replica1] o.a.s.c.SolrCore JMX monitoring not detected for core: testschemaapi_shard1_replica1
   [junit4]   2> 1020264 INFO  (qtp1147319243-6601) [n:127.0.0.1:34411_solr c:testschemaapi s:shard1 r:core_node1 x:testschemaapi_shard1_replica1] o.a.s.c.CachingDirectoryFactory return new directory for /home/jenkins/workspace/Lucene-Solr-5.5-Linux/solr/build/solr-core/test/J2/temp/solr.schema.TestManagedSchemaAPI_E26F4EFD00885B42-001/tempDir-001/node2/./testschemaapi_shard1_replica1/data
   [junit4]   2> 1020264 INFO  (qtp1147319243-6601) [n:127.0.0.1:34411_solr c:testschemaapi s:shard1 r:core_node1 x:testschemaapi_shard1_replica1] o.a.s.c.SolrCore New index directory detected: old=null new=/home/jenkins/workspace/Lucene-Solr-5.5-Linux/solr/build/solr-core/test/J2/temp/solr.schema.TestManagedSchemaAPI_E26F4EFD00885B42-001/tempDir-001/node2/./testschemaapi_shard1_replica1/data/index/
   [junit4]   2> 1020265 WARN  (qtp1147319243-6601) [n:127.0.0.1:34411_solr c:testschemaapi s:shard1 r:core_node1 x:testschemaapi_shard1_replica1] o.a.s.c.SolrCore [testschemaapi_shard1_replica1] Solr index directory '/home/jenkins/workspace/Lucene-Solr-5.5-Linux/solr/build/solr-core/test/J2/temp/solr.schema.TestManagedSchemaAPI_E26F4EFD00885B42-001/tempDir-001/node2/./testschemaapi_shard1_replica1/data/index' doesn't exist. Creating new index...
   [junit4]   2> 1020265 INFO  (qtp1147319243-6601) [n:127.0.0.1:34411_solr c:testschemaapi s:shard1 r:core_node1 x:testschemaapi_shard1_replica1] o.a.s.c.CachingDirectoryFactory return new directory for /home/jenkins/workspace/Lucene-Solr-5.5-Linux/solr/build/solr-core/test/J2/temp/solr.schema.TestManagedSchemaAPI_E26F4EFD00885B42-001/tempDir-001/node2/./testschemaapi_shard1_replica1/data/index
   [junit4]   2> 1020265 INFO  (qtp1775476444-6600) [n:127.0.0.1:38834_solr c:testschemaapi s:shard1  x:testschemaapi_shard1_replica2] o.a.s.s.IndexSchema unique key field: id
   [junit4]   2> 1020265 INFO  (qtp1147319243-6601) [n:127.0.0.1:34411_solr c:testschemaapi s:shard1 r:core_node1 x:testschemaapi_shard1_replica1] o.a.s.c.SolrDeletionPolicy SolrDeletionPolicy.onCommit: commits: num=1
   [junit4]   2> 	commit{dir=MockDirectoryWrapper(RAMDirectory@47511662 lockFactory=org.apache.lucene.store.SingleInstanceLockFactory@1c94a082),segFN=segments_1,generation=1}
   [junit4]   2> 1020265 INFO  (qtp1147319243-6601) [n:127.0.0.1:34411_solr c:testschemaapi s:shard1 r:core_node1 x:testschemaapi_shard1_replica1] o.a.s.c.SolrDeletionPolicy newest commit generation = 1
   [junit4]   2> 1020266 INFO  (qtp1775476444-6600) [n:127.0.0.1:38834_solr c:testschemaapi s:shard1  x:testschemaapi_shard1_replica2] o.a.s.c.ConfigSetProperties Did not find ConfigSet properties, assuming default properties: Can't find resource 'configsetprops.json' in classpath or '/configs/conf1', cwd=/home/jenkins/workspace/Lucene-Solr-5.5-Linux/solr/build/solr-core/test/J2
   [junit4]   2> 1020266 INFO  (qtp1775476444-6600) [n:127.0.0.1:38834_solr c:testschemaapi s:shard1  x:testschemaapi_shard1_replica2] o.a.s.c.CoreContainer Creating SolrCore 'testschemaapi_shard1_replica2' using configuration from collection testschemaapi
   [junit4]   2> 1020266 INFO  (OldIndexDirectoryCleanupThreadForCore-testschemaapi_shard1_replica1) [n:127.0.0.1:34411_solr c:testschemaapi s:shard1 r:core_node1 x:testschemaapi_shard1_replica1] o.a.s.c.SolrCore Looking for old index directories to cleanup for core testschemaapi_shard1_replica1 in /home/jenkins/workspace/Lucene-Solr-5.5-Linux/solr/build/solr-core/test/J2/temp/solr.schema.TestManagedSchemaAPI_E26F4EFD00885B42-001/tempDir-001/node2/./testschemaapi_shard1_replica1/data/
   [junit4]   2> 1020266 INFO  (qtp1775476444-6600) [n:127.0.0.1:38834_solr c:testschemaapi s:shard1 r:core_node2 x:testschemaapi_shard1_replica2] o.a.s.c.SolrCore org.apache.solr.core.MockDirectoryFactory
   [junit4]   2> 1020266 WARN  (OldIndexDirectoryCleanupThreadForCore-testschemaapi_shard1_replica1) [n:127.0.0.1:34411_solr c:testschemaapi s:shard1 r:core_node1 x:testschemaapi_shard1_replica1] o.a.s.c.DirectoryFactory /home/jenkins/workspace/Lucene-Solr-5.5-Linux/solr/build/solr-core/test/J2/temp/solr.schema.TestManagedSchemaAPI_E26F4EFD00885B42-001/tempDir-001/node2/./testschemaapi_shard1_replica1/data/ does not point to a valid data directory; skipping clean-up of old index directories.
   [junit4]   2> 1020266 INFO  (qtp1775476444-6600) [n:127.0.0.1:38834_solr c:testschemaapi s:shard1 r:core_node2 x:testschemaapi_shard1_replica2] o.a.s.c.SolrCore [[testschemaapi_shard1_replica2] ] Opening new SolrCore at [/home/jenkins/workspace/Lucene-Solr-5.5-Linux/solr/build/solr-core/test/J2/temp/solr.schema.TestManagedSchemaAPI_E26F4EFD00885B42-001/tempDir-001/node1/testschemaapi_shard1_replica2], dataDir=[/home/jenkins/workspace/Lucene-Solr-5.5-Linux/solr/build/solr-core/test/J2/temp/solr.schema.TestManagedSchemaAPI_E26F4EFD00885B42-001/tempDir-001/node1/./testschemaapi_shard1_replica2/data/]
   [junit4]   2> 1020266 INFO  (qtp1775476444-6600) [n:127.0.0.1:38834_solr c:testschemaapi s:shard1 r:core_node2 x:testschemaapi_shard1_replica2] o.a.s.c.SolrCore JMX monitoring not detected for core: testschemaapi_shard1_replica2
   [junit4]   2> 1020266 INFO  (qtp1775476444-6600) [n:127.0.0.1:38834_solr c:testschemaapi s:shard1 r:core_node2 x:testschemaapi_shard1_replica2] o.a.s.c.CachingDirectoryFactory return new directory for /home/jenkins/workspace/Lucene-Solr-5.5-Linux/solr/build/solr-core/test/J2/temp/solr.schema.TestManagedSchemaAPI_E26F4EFD00885B42-001/tempDir-001/node1/./testschemaapi_shard1_replica2/data
   [junit4]   2> 1020267 INFO  (qtp1775476444-6600) [n:127.0.0.1:38834_solr c:testschemaapi s:shard1 r:core_node2 x:testschemaapi_shard1_replica2] o.a.s.c.SolrCore New index directory detected: old=null new=/home/jenkins/workspace/Lucene-Solr-5.5-Linux/solr/build/solr-core/test/J2/temp/solr.schema.TestManagedSchemaAPI_E26F4EFD00885B42-001/tempDir-001/node1/./testschemaapi_shard1_replica2/data/index/
   [junit4]   2> 1020267 WARN  (qtp1775476444-6600) [n:127.0.0.1:38834_solr c:testschemaapi s:shard1 r:core_node2 x:testschemaapi_shard1_replica2] o.a.s.c.SolrCore [testschemaapi_shard1_replica2] Solr index directory '/home/jenkins/workspace/Lucene-Solr-5.5-Linux/solr/build/solr-core/test/J2/temp/solr.schema.TestManagedSchemaAPI_E26F4EFD00885B42-001/tempDir-001/node1/./testschemaapi_shard1_replica2/data/index' doesn't exist. Creating new index...
   [junit4]   2> 1020267 INFO  (qtp1775476444-6600) [n:127.0.0.1:38834_solr c:testschemaapi s:shard1 r:core_node2 x:testschemaapi_shard1_replica2] o.a.s.c.CachingDirectoryFactory return new directory for /home/jenkins/workspace/Lucene-Solr-5.5-Linux/solr/build/solr-core/test/J2/temp/solr.schema.TestManagedSchemaAPI_E26F4EFD00885B42-001/tempDir-001/node1/./testschemaapi_shard1_replica2/data/index
   [junit4]   2> 1020267 INFO  (qtp1147319243-6601) [n:127.0.0.1:34411_solr c:testschemaapi s:shard1 r:core_node1 x:testschemaapi_shard1_replica1] o.a.s.c.SolrCore no updateRequestProcessorChain defined as default, creating implicit default
   [junit4]   2> 1020267 INFO  (qtp1775476444-6600) [n:127.0.0.1:38834_solr c:testschemaapi s:shard1 r:core_node2 x:testschemaapi_shard1_replica2] o.a.s.c.SolrDeletionPolicy SolrDeletionPolicy.onCommit: commits: num=1
   [junit4]   2> 	commit{dir=MockDirectoryWrapper(RAMDirectory@2059dc48 lockFactory=org.apache.lucene.store.SingleInstanceLockFactory@6b8d0b8f),segFN=segments_1,generation=1}
   [junit4]   2> 1020267 INFO  (qtp1775476444-6600) [n:127.0.0.1:38834_solr c:testschemaapi s:shard1 r:core_node2 x:testschemaapi_shard1_replica2] o.a.s.c.SolrDeletionPolicy newest commit generation = 1
   [junit4]   2> 1020268 INFO  (OldIndexDirectoryCleanupThreadForCore-testschemaapi_shard1_replica2) [n:127.0.0.1:38834_solr c:testschemaapi s:shard1 r:core_node2 x:testschemaapi_shard1_replica2] o.a.s.c.SolrCore Looking for old index directories to cleanup for core testschemaapi_shard1_replica2 in /home/jenkins/workspace/Lucene-Solr-5.5-Linux/solr/build/solr-core/test/J2/temp/solr.schema.TestManagedSchemaAPI_E26F4EFD00885B42-001/tempDir-001/node1/./testschemaapi_shard1_replica2/data/
   [junit4]   2> 1020268 WARN  (OldIndexDirectoryCleanupThreadForCore-testschemaapi_shard1_replica2) [n:127.0.0.1:38834_solr c:testschemaapi s:shard1 r:core_node2 x:testschemaapi_shard1_replica2] o.a.s.c.DirectoryFactory /home/jenkins/workspace/Lucene-Solr-5.5-Linux/solr/build/solr-core/test/J2/temp/solr.schema.TestManagedSchemaAPI_E26F4EFD00885B42-001/tempDir-001/node1/./testschemaapi_shard1_replica2/data/ does not point to a valid data directory; skipping clean-up of old index directories.
   [junit4]   2> 1020269 INFO  (qtp1775476444-6600) [n:127.0.0.1:38834_solr c:testschemaapi s:shard1 r:core_node2 x:testschemaapi_shard1_replica2] o.a.s.c.SolrCore no updateRequestProcessorChain defined as default, creating implicit default
   [junit4]   2> 1020269 INFO  (qtp1147319243-6601) [n:127.0.0.1:34411_solr c:testschemaapi s:shard1 r:core_node1 x:testschemaapi_shard1_replica1] o.a.s.h.l.XMLLoader xsltCacheLifetimeSeconds=60
   [junit4]   2> 1020270 INFO  (qtp1775476444-6600) [n:127.0.0.1:38834_solr c:testschemaapi s:shard1 r:core_node2 x:testschemaapi_shard1_replica2] o.a.s.h.l.XMLLoader xsltCacheLifetimeSeconds=60
   [junit4]   2> 1020270 INFO  (qtp1147319243-6601) [n:127.0.0.1:34411_solr c:testschemaapi s:shard1 r:core_node1 x:testschemaapi_shard1_replica1] o.a.s.h.l.XMLLoader xsltCacheLifetimeSeconds=60
   [junit4]   2> 1020270 INFO  (qtp1775476444-6600) [n:127.0.0.1:38834_solr c:testschemaapi s:shard1 r:core_node2 x:testschemaapi_shard1_replica2] o.a.s.h.l.XMLLoader xsltCacheLifetimeSeconds=60
   [junit4]   2> 1020270 INFO  (qtp1147319243-6601) [n:127.0.0.1:34411_solr c:testschemaapi s:shard1 r:core_node1 x:testschemaapi_shard1_replica1] o.a.s.h.l.XMLLoader xsltCacheLifetimeSeconds=60
   [junit4]   2> 1020271 INFO  (qtp1147319243-6601) [n:127.0.0.1:34411_solr c:testschemaapi s:shard1 r:core_node1 x:testschemaapi_shard1_replica1] o.a.s.h.l.XMLLoader xsltCacheLifetimeSeconds=60
   [junit4]   2> 1020271 INFO  (qtp1775476444-6600) [n:127.0.0.1:38834_solr c:testschemaapi s:shard1 r:core_node2 x:testschemaapi_shard1_replica2] o.a.s.h.l.XMLLoader xsltCacheLifetimeSeconds=60
   [junit4]   2> 1020272 INFO  (qtp1147319243-6601) [n:127.0.0.1:34411_solr c:testschemaapi s:shard1 r:core_node1 x:testschemaapi_shard1_replica1] o.a.s.c.RequestHandlers Registered paths: /replication,/admin/ping,/admin/threads,/schema,/admin/system,/update,/admin/mbeans,/admin/luke,/admin/segments,/select,/get,/update/json/docs,/admin/logging,/update/csv,/admin/properties,/admin/plugins,/admin/file,/update/json,/config
   [junit4]   2> 1020272 INFO  (qtp1775476444-6600) [n:127.0.0.1:38834_solr c:testschemaapi s:shard1 r:core_node2 x:testschemaapi_shard1_replica2] o.a.s.h.l.XMLLoader xsltCacheLifetimeSeconds=60
   [junit4]   2> 1020273 INFO  (qtp1147319243-6601) [n:127.0.0.1:34411_solr c:testschemaapi s:shard1 r:core_node1 x:testschemaapi_shard1_replica1] o.a.s.c.SolrCore Using default statsCache cache: org.apache.solr.search.stats.LocalStatsCache
   [junit4]   2> 1020273 INFO  (qtp1147319243-6601) [n:127.0.0.1:34411_solr c:testschemaapi s:shard1 r:core_node1 x:testschemaapi_shard1_replica1] o.a.s.u.UpdateHandler Using UpdateLog implementation: org.apache.solr.update.UpdateLog
   [junit4]   2> 1020273 INFO  (qtp1147319243-6601) [n:127.0.0.1:34411_solr c:testschemaapi s:shard1 r:core_node1 x:testschemaapi_shard1_replica1] o.a.s.u.UpdateLog Initializing UpdateLog: dataDir=null defaultSyncLevel=FLUSH numRecordsToKeep=100 maxNumLogsToKeep=10 numVersionBuckets=65536
   [junit4]   2> 1020273 INFO  (qtp1775476444-6600) [n:127.0.0.1:38834_solr c:testschemaapi s:shard1 r:core_node2 x:testschemaapi_shard1_replica2] o.a.s.c.RequestHandlers Registered paths: /replication,/admin/ping,/admin/threads,/schema,/admin/system,/update,/admin/mbeans,/admin/luke,/admin/segments,/select,/get,/update/json/docs,/admin/logging,/update/csv,/admin/properties,/admin/plugins,/admin/file,/update/json,/config
   [junit4]   2> 1020274 INFO  (qtp1147319243-6601) [n:127.0.0.1:34411_solr c:testschemaapi s:shard1 r:core_node1 x:testschemaapi_shard1_replica1] o.a.s.u.CommitTracker Hard AutoCommit: disabled
   [junit4]   2> 1020274 INFO  (qtp1775476444-6600) [n:127.0.0.1:38834_solr c:testschemaapi s:shard1 r:core_node2 x:testschemaapi_shard1_replica2] o.a.s.c.SolrCore Using default statsCache cache: org.apache.solr.search.stats.LocalStatsCache
   [junit4]   2> 1020274 INFO  (qtp1147319243-6601) [n:127.0.0.1:34411_solr c:testschemaapi s:shard1 r:core_node1 x:testschemaapi_shard1_replica1] o.a.s.u.CommitTracker Soft AutoCommit: disabled
   [junit4]   2> 1020274 INFO  (qtp1775476444-6600) [n:127.0.0.1:38834_solr c:testschemaapi s:shard1 r:core_node2 x:testschemaapi_shard1_replica2] o.a.s.u.UpdateHandler Using UpdateLog implementation: org.apache.solr.update.UpdateLog
   [junit4]   2> 1020274 INFO  (qtp1775476444-6600) [n:127.0.0.1:38834_solr c:testschemaapi s:shard1 r:core_node2 x:testschemaapi_shard1_replica2] o.a.s.u.UpdateLog Initializing UpdateLog: dataDir=null defaultSyncLevel=FLUSH numRecordsToKeep=100 maxNumLogsToKeep=10 numVersionBuckets=65536
   [junit4]   2> 1020274 INFO  (qtp1147319243-6601) [n:127.0.0.1:34411_solr c:testschemaapi s:shard1 r:core_node1 x:testschemaapi_shard1_replica1] o.a.s.c.SolrDeletionPolicy SolrDeletionPolicy.onInit: commits: num=1
   [junit4]   2> 	commit{dir=MockDirectoryWrapper(RAMDirectory@47511662 lockFactory=org.apache.lucene.store.SingleInstanceLockFactory@1c94a082),segFN=segments_1,generation=1}
   [junit4]   2> 1020274 INFO  (qtp1147319243-6601) [n:127.0.0.1:34411_solr c:testschemaapi s:shard1 r:core_node1 x:testschemaapi_shard1_replica1] o.a.s.c.SolrDeletionPolicy newest commit generation = 1
   [junit4]   2> 1020274 INFO  (qtp1147319243-6601) [n:127.0.0.1:34411_solr c:testschemaapi s:shard1 r:core_node1 x:testschemaapi_shard1_replica1] o.a.s.s.SolrIndexSearcher Opening Searcher@48796431[testschemaapi_shard1_replica1] main
   [junit4]   2> 1020275 INFO  (qtp1147319243-6601) [n:127.0.0.1:34411_solr c:testschemaapi s:shard1 r:core_node1 x:testschemaapi_shard1_replica1] o.a.s.c.c.ZkStateReader Load collection config from: [/collections/testschemaapi]
   [junit4]   2> 1020276 INFO  (qtp1775476444-6600) [n:127.0.0.1:38834_solr c:testschemaapi s:shard1 r:core_node2 x:testschemaapi_shard1_replica2] o.a.s.u.CommitTracker Hard AutoCommit: disabled
   [junit4]   2> 1020276 INFO  (qtp1775476444-6600) [n:127.0.0.1:38834_solr c:testschemaapi s:shard1 r:core_node2 x:testschemaapi_shard1_replica2] o.a.s.u.CommitTracker Soft AutoCommit: disabled
   [junit4]   2> 1020276 INFO  (qtp1147319243-6601) [n:127.0.0.1:34411_solr c:testschemaapi s:shard1 r:core_node1 x:testschemaapi_shard1_replica1] o.a.s.c.c.ZkStateReader path=[/collections/testschemaapi] [configName]=[conf1] specified config exists in ZooKeeper
   [junit4]   2> 1020276 INFO  (qtp1147319243-6601) [n:127.0.0.1:34411_solr c:testschemaapi s:shard1 r:core_node1 x:testschemaapi_shard1_replica1] o.a.s.r.ManagedResourceStorage Setting up ZooKeeper-based storage for the RestManager with znodeBase: /configs/conf1
   [junit4]   2> 1020276 INFO  (qtp1775476444-6600) [n:127.0.0.1:38834_solr c:testschemaapi s:shard1 r:core_node2 x:testschemaapi_shard1_replica2] o.a.s.c.SolrDeletionPolicy SolrDeletionPolicy.onInit: commits: num=1
   [junit4]   2> 	commit{dir=MockDirectoryWrapper(RAMDirectory@2059dc48 lockFactory=org.apache.lucene.store.SingleInstanceLockFactory@6b8d0b8f),segFN=segments_1,generation=1}
   [junit4]   2> 1020276 INFO  (qtp1775476444-6600) [n:127.0.0.1:38834_solr c:testschemaapi s:shard1 r:core_node2 x:testschemaapi_shard1_replica2] o.a.s.c.SolrDeletionPolicy newest commit generation = 1
   [junit4]   2> 1020276 INFO  (qtp1147319243-6601) [n:127.0.0.1:34411_solr c:testschemaapi s:shard1 r:core_node1 x:testschemaapi_shard1_replica1] o.a.s.r.ManagedResourceStorage Configured ZooKeeperStorageIO with znodeBase: /configs/conf1
   [junit4]   2> 1020276 INFO  (qtp1147319243-6601) [n:127.0.0.1:34411_solr c:testschemaapi s:shard1 r:core_node1 x:testschemaapi_shard1_replica1] o.a.s.r.RestManager Initializing RestManager with initArgs: {}
   [junit4]   2> 1020276 INFO  (qtp1147319243-6601) [n:127.0.0.1:34411_solr c:testschemaapi s:shard1 r:core_node1 x:testschemaapi_shard1_replica1] o.a.s.r.ManagedResourceStorage Reading _rest_managed.json using ZooKeeperStorageIO:path=/configs/conf1
   [junit4]   2> 1020276 INFO  (qtp1775476444-6600) [n:127.0.0.1:38834_solr c:testschemaapi s:shard1 r:core_node2 x:testschemaapi_shard1_replica2] o.a.s.s.SolrIndexSearcher Opening Searcher@267f3ffb[testschemaapi_shard1_replica2] main
   [junit4]   2> 1020277 INFO  (qtp1775476444-6600) [n:127.0.0.1:38834_solr c:testschemaapi s:shard1 r:core_node2 x:testschemaapi_shard1_replica2] o.a.s.c.c.ZkStateReader Load collection config from: [/collections/testschemaapi]
   [junit4]   2> 1020277 INFO  (qtp1147319243-6601) [n:127.0.0.1:34411_solr c:testschemaapi s:shard1 r:core_node1 x:testschemaapi_shard1_replica1] o.a.s.r.ManagedResourceStorage No data found for znode /configs/conf1/_rest_managed.json
   [junit4]   2> 1020277 INFO  (qtp1147319243-6601) [n:127.0.0.1:34411_solr c:testschemaapi s:shard1 r:core_node1 x:testschemaapi_shard1_replica1] o.a.s.r.ManagedResourceStorage Loaded null at path _rest_managed.json using ZooKeeperStorageIO:path=/configs/conf1
   [junit4]   2> 1020277 INFO  (qtp1147319243-6601) [n:127.0.0.1:34411_solr c:testschemaapi s:shard1 r:core_node1 x:testschemaapi_shard1_replica1] o.a.s.r.RestManager Initializing 0 registered ManagedResources
   [junit4]   2> 1020277 INFO  (qtp1775476444-6600) [n:127.0.0.1:38834_solr c:testschemaapi s:shard1 r:core_node2 x:testschemaapi_shard1_replica2] o.a.s.c.c.ZkStateReader path=[/collections/testschemaapi] [configName]=[conf1] specified config exists in ZooKeeper
   [junit4]   2> 1020277 INFO  (qtp1775476444-6600) [n:127.0.0.1:38834_solr c:testschemaapi s:shard1 r:core_node2 x:testschemaapi_shard1_replica2] o.a.s.r.ManagedResourceStorage Setting up ZooKeeper-based storage for the RestManager with znodeBase: /configs/conf1
   [junit4]   2> 1020277 INFO  (qtp1775476444-6600) [n:127.0.0.1:38834_solr c:testschemaapi s:shard1 r:core_node2 x:testschemaapi_shard1_replica2] o.a.s.r.ManagedResourceStorage Configured ZooKeeperStorageIO with znodeBase: /configs/conf1
   [junit4]   2> 1020277 INFO  (qtp1775476444-6600) [n:127.0.0.1:38834_solr c:testschemaapi s:shard1 r:core_node2 x:testschemaapi_shard1_replica2] o.a.s.r.RestManager Initializing RestManager with initArgs: {}
   [junit4]   2> 1020277 INFO  (qtp1775476444-6600) [n:127.0.0.1:38834_solr c:testschemaapi s:shard1 r:core_node2 x:testschemaapi_shard1_replica2] o.a.s.r.ManagedResourceStorage Reading _rest_managed.json using ZooKeeperStorageIO:path=/configs/conf1
   [junit4]   2> 1020277 INFO  (qtp1775476444-6600) [n:127.0.0.1:38834_solr c:testschemaapi s:shard1 r:core_node2 x:testschemaapi_shard1_replica2] o.a.s.r.ManagedResourceStorage No data found for znode /configs/conf1/_rest_managed.json
   [junit4]   2> 1020277 INFO  (qtp1775476444-6600) [n:127.0.0.1:38834_solr c:testschemaapi s:shard1 r:core_node2 x:testschemaapi_shard1_replica2] o.a.s.r.ManagedResourceStorage Loaded null at path _rest_managed.json using ZooKeeperStorageIO:path=/configs/conf1
   [junit4]   2> 1020277 INFO  (qtp1775476444-6600) [n:127.0.0.1:38834_solr c:testschemaapi s:shard1 r:core_node2 x:testschemaapi_shard1_replica2] o.a.s.r.RestManager Initializing 0 registered ManagedResources
   [junit4]   2> 1020279 INFO  (qtp1775476444-6600) [n:127.0.0.1:38834_solr c:testschemaapi s:shard1 r:core_node2 x:testschemaapi_shard1_replica2] o.a.s.s.ZkIndexSchemaReader Creating ZooKeeper watch for the managed schema at /configs/conf1/managed-schema
   [junit4]   2> 1020279 INFO  (qtp1147319243-6601) [n:127.0.0.1:34411_solr c:testschemaapi s:shard1 r:core_node1 x:testschemaapi_shard1_replica1] o.a.s.s.ZkIndexSchemaReader Creating ZooKeeper watch for the managed schema at /configs/conf1/managed-schema
   [junit4]   2> 1020280 INFO  (qtp1775476444-6600) [n:127.0.0.1:38834_solr c:testschemaapi s:shard1 r:core_node2 x:testschemaapi_shard1_replica2] o.a.s.c.ZkController Added new OnReconnect listener ZkIndexSchemaReader: /configs/conf1/managed-schema, uniqueCoreId: testschemaapi_shard1_replica2:439455958862652
   [junit4]   2> 1020280 INFO  (qtp1147319243-6601) [n:127.0.0.1:34411_solr c:testschemaapi s:shard1 r:core_node1 x:testschemaapi_shard1_replica1] o.a.s.c.ZkController Added new OnReconnect listener ZkIndexSchemaReader: /configs/conf1/managed-schema, uniqueCoreId: testschemaapi_shard1_replica1:439455956725247
   [junit4]   2> 1020280 INFO  (qtp1775476444-6600) [n:127.0.0.1:38834_solr c:testschemaapi s:shard1 r:core_node2 x:testschemaapi_shard1_replica2] o.a.s.h.ReplicationHandler Commits will be reserved for  10000
   [junit4]   2> 1020280 INFO  (qtp1147319243-6601) [n:127.0.0.1:34411_solr c:testschemaapi s:shard1 r:core_node1 x:testschemaapi_shard1_replica1] o.a.s.h.ReplicationHandler Commits will be reserved for  10000
   [junit4]   2> 1020280 INFO  (searcherExecutor-3016-thread-1-processing-x:testschemaapi_shard1_replica2 s:shard1 n:127.0.0.1:38834_solr c:testschemaapi r:core_node2) [n:127.0.0.1:38834_solr c:testschemaapi s:shard1 r:core_node2 x:testschemaapi_shard1_replica2] o.a.s.c.SolrCore [testschemaapi_shard1_replica2] Registered new searcher Searcher@267f3ffb[testschemaapi_shard1_replica2] main{ExitableDirectoryReader(UninvertingDirectoryReader())}
   [junit4]   2> 1020281 INFO  (searcherExecutor-3015-thread-1-processing-x:testschemaapi_shard1_replica1 s:shard1 n:127.0.0.1:34411_solr c:testschemaapi r:core_node1) [n:127.0.0.1:34411_solr c:testschemaapi s:shard1 r:core_node1 x:testschemaapi_shard1_replica1] o.a.s.c.SolrCore [testschemaapi_shard1_replica1] Registered new searcher Searcher@48796431[testschemaapi_shard1_replica1] main{ExitableDirectoryReader(UninvertingDirectoryReader())}
   [junit4]   2> 1020281 INFO  (qtp1775476444-6600) [n:127.0.0.1:38834_solr c:testschemaapi s:shard1 r:core_node2 x:testschemaapi_shard1_replica2] o.a.s.u.UpdateLog Looking up max value of version field to seed version buckets
   [junit4]   2> 1020281 INFO  (qtp1147319243-6601) [n:127.0.0.1:34411_solr c:testschemaapi s:shard1 r:core_node1 x:testschemaapi_shard1_replica1] o.a.s.u.UpdateLog Looking up max value of version field to seed version buckets
   [junit4]   2> 1020281 INFO  (qtp1775476444-6600) [n:127.0.0.1:38834_solr c:testschemaapi s:shard1 r:core_node2 x:testschemaapi_shard1_replica2] o.a.s.u.VersionInfo Refreshing highest value of _version_ for 65536 version buckets from index
   [junit4]   2> 1020281 INFO  (qtp1147319243-6601) [n:127.0.0.1:34411_solr c:testschemaapi s:shard1 r:core_node1 x:testschemaapi_shard1_replica1] o.a.s.u.VersionInfo Refreshing highest value of _version_ for 65536 version buckets from index
   [junit4]   2> 1020281 INFO  (qtp1775476444-6600) [n:127.0.0.1:38834_solr c:testschemaapi s:shard1 r:core_node2 x:testschemaapi_shard1_replica2] o.a.s.u.VersionInfo No terms found for _version_, cannot seed version bucket highest value from index
   [junit4]   2> 1020281 INFO  (qtp1147319243-6601) [n:127.0.0.1:34411_solr c:testschemaapi s:shard1 r:core_node1 x:testschemaapi_shard1_replica1] o.a.s.u.VersionInfo No terms found for _version_, cannot seed version bucket highest value from index
   [junit4]   2> 1020281 INFO  (qtp1775476444-6600) [n:127.0.0.1:38834_solr c:testschemaapi s:shard1 r:core_node2 x:testschemaapi_shard1_replica2] o.a.s.u.UpdateLog Could not find max version in index or recent updates, using new clock 1545098007347724288
   [junit4]   2> 1020281 INFO  (qtp1147319243-6601) [n:127.0.0.1:34411_solr c:testschemaapi s:shard1 r:core_node1 x:testschemaapi_shard1_replica1] o.a.s.u.UpdateLog Could not find max version in index or recent updates, using new clock 1545098007347724288
   [junit4]   2> 1020282 INFO  (qtp1775476444-6600) [n:127.0.0.1:38834_solr c:testschemaapi s:shard1 r:core_node2 x:testschemaapi_shard1_replica2] o.a.s.u.UpdateLog Took 1.0ms to seed version buckets with highest version 1545098007347724288
   [junit4]   2> 1020282 INFO  (qtp1147319243-6601) [n:127.0.0.1:34411_solr c:testschemaapi s:shard1 r:core_node1 x:testschemaapi_shard1_replica1] o.a.s.u.UpdateLog Took 1.0ms to seed version buckets with highest version 1545098007347724288
   [junit4]   2> 1020283 INFO  (qtp1775476444-6600) [n:127.0.0.1:38834_solr c:testschemaapi s:shard1 r:core_node2 x:testschemaapi_shard1_replica2] o.a.s.c.ZkController watch zkdir /configs/conf1
   [junit4]   2> 1020283 INFO  (qtp1147319243-6601) [n:127.0.0.1:34411_solr c:testschemaapi s:shard1 r:core_node1 x:testschemaapi_shard1_replica1] o.a.s.c.ZkController watch zkdir /configs/conf1
   [junit4]   2> 1020283 INFO  (qtp1147319243-6601) [n:127.0.0.1:34411_solr c:testschemaapi s:shard1 r:core_node1 x:testschemaapi_shard1_replica1] o.a.s.c.CoreContainer registering core: testschemaapi_shard1_replica1
   [junit4]   2> 1020283 INFO  (qtp1775476444-6600) [n:127.0.0.1:38834_solr c:testschemaapi s:shard1 r:core_node2 x:testschemaapi_shard1_replica2] o.a.s.c.CoreContainer registering core: testschemaapi_shard1_replica2
   [junit4]   2> 1020283 INFO  (qtp1147319243-6601) [n:127.0.0.1:34411_solr c:testschemaapi s:shard1 r:core_node1 x:testschemaapi_shard1_replica1] o.a.s.c.ZkController Register replica - core:testschemaapi_shard1_replica1 address:http://127.0.0.1:34411/solr collection:testschemaapi shard:shard1
   [junit4]   2> 1020283 INFO  (qtp1775476444-6600) [n:127.0.0.1:38834_solr c:testschemaapi s:shard1 r:core_node2 x:testschemaapi_shard1_replica2] o.a.s.c.ZkController Register replica - core:testschemaapi_shard1_replica2 address:http://127.0.0.1:38834/solr collection:testschemaapi shard:shard1
   [junit4]   2> 1020283 INFO  (qtp1147319243-6601) [n:127.0.0.1:34411_solr c:testschemaapi s:shard1 r:core_node1 x:testschemaapi_shard1_replica1] o.a.s.c.c.SolrZkClient makePath: /collections/testschemaapi/leader_elect/shard1/election
   [junit4]   2> 1020283 INFO  (qtp1775476444-6600) [n:127.0.0.1:38834_solr c:testschemaapi s:shard1 r:core_node2 x:testschemaapi_shard1_replica2] o.a.s.c.c.SolrZkClient makePath: /collections/testschemaapi/leader_elect/shard1/election
   [junit4]   2> 1020285 INFO  (qtp1775476444-6600) [n:127.0.0.1:38834_solr c:testschemaapi s:shard1 r:core_node2 x:testschemaapi_shard1_replica2] o.a.s.c.LeaderElector Joined leadership election with path: /collections/testschemaapi/leader_elect/shard1/election/96568625370431493-core_node2-n_0000000000
   [junit4]   2> 1020285 INFO  (qtp1147319243-6601) [n:127.0.0.1:34411_solr c:testschemaapi s:shard1 r:core_node1 x:testschemaapi_shard1_replica1] o.a.s.c.LeaderElector Joined leadership election with path: /collections/testschemaapi/leader_elect/shard1/election/96568625370431494-core_node1-n_0000000001
   [junit4]   2> 1020285 INFO  (qtp1775476444-6600) [n:127.0.0.1:38834_solr c:testschemaapi s:shard1 r:core_node2 x:testschemaapi_shard1_replica2] o.a.s.c.ShardLeaderElectionContext Running the leader process for shard=shard1 and weAreReplacement=false and leaderVoteWait=10000
   [junit4]   2> 1020285 INFO  (qtp1147319243-6601) [n:127.0.0.1:34411_solr c:testschemaapi s:shard1 r:core_node1 x:testschemaapi_shard1_replica1] o.a.s.c.LeaderElector Watching path /collections/testschemaapi/leader_elect/shard1/election/96568625370431493-core_node2-n_0000000000 to know if I could be the leader
   [junit4]   2> 1020286 INFO  (qtp1775476444-6600) [n:127.0.0.1:38834_solr c:testschemaapi s:shard1 r:core_node2 x:testschemaapi_shard1_replica2] o.a.s.c.ShardLeaderElectionContext Enough replicas found to continue.
   [junit4]   2> 1020286 INFO  (qtp1775476444-6600) [n:127.0.0.1:38834_solr c:testschemaapi s:shard1 r:core_node2 x:testschemaapi_shard1_replica2] o.a.s.c.ShardLeaderElectionContext I may be the new leader - try and sync
   [junit4]   2> 1020286 INFO  (qtp1775476444-6600) [n:127.0.0.1:38834_solr c:testschemaapi s:shard1 r:core_node2 x:testschemaapi_shard1_replica2] o.a.s.c.SyncStrategy Sync replicas to http://127.0.0.1:38834/solr/testschemaapi_shard1_replica2/
   [junit4]   2> 1020286 INFO  (qtp1775476444-6600) [n:127.0.0.1:38834_solr c:testschemaapi s:shard1 r:core_node2 x:testschemaapi_shard1_replica2] o.a.s.u.PeerSync PeerSync: core=testschemaapi_shard1_replica2 url=http://127.0.0.1:38834/solr START replicas=[http://127.0.0.1:34411/solr/testschemaapi_shard1_replica1/] nUpdates=100
   [junit4]   2> 1020286 INFO  (OverseerStateUpdate-96568625370431494-127.0.0.1:34411_solr-n_0000000000) [n:127.0.0.1:34411_solr    ] o.a.s.c.Overseer processMessage: queueSize: 1, message = {
   [junit4]   2>   "operation":"leader",
   [junit4]   2>   "shard":"shard1",
   [junit4]   2>   "collection":"testschemaapi"} current state version: 0
   [junit4]   2> 1020286 INFO  (qtp1775476444-6600) [n:127.0.0.1:38834_solr c:testschemaapi s:shard1 r:core_node2 x:testschemaapi_shard1_replica2] o.a.s.u.PeerSync PeerSync: core=testschemaapi_shard1_replica2 url=http://127.0.0.1:38834/solr DONE.  We have no versions.  sync failed.
   [junit4]   2> 1020286 INFO  (qtp1775476444-6600) [n:127.0.0.1:38834_solr c:testschemaapi s:shard1 r:core_node2 x:testschemaapi_shard1_replica2] o.a.s.c.SyncStrategy Leader's attempt to sync with shard failed, moving to the next candidate
   [junit4]   2> 1020286 INFO  (qtp1775476444-6600) [n:127.0.0.1:38834_solr c:testschemaapi s:shard1 r:core_node2 x:testschemaapi_shard1_replica2] o.a.s.c.ShardLeaderElectionContext We failed sync, but we have no versions - we can't sync in that case - we were active before, so become leader anyway
   [junit4]   2> 1020287 INFO  (qtp1775476444-6600) [n:127.0.0.1:38834_solr c:testschemaapi s:shard1 r:core_node2 x:testschemaapi_shard1_replica2] o.a.s.c.c.SolrZkClient makePath: /collections/testschemaapi/leaders/shard1
   [junit4]   2> 1020288 INFO  (qtp1147319243-6603) [n:127.0.0.1:34411_solr c:testschemaapi s:shard1 r:core_node1 x:testschemaapi_shard1_replica1] o.a.s.c.S.Request [testschemaapi_shard1_replica1]  webapp=/solr path=/get params={distrib=false&getVersions=100&wt=javabin&version=2&fingerprint=false&qt=/get} status=0 QTime=0
   [junit4]   2> 1020289 INFO  (qtp1775476444-6600) [n:127.0.0.1:38834_solr c:testschemaapi s:shard1 r:core_node2 x:testschemaapi_shard1_replica2] o.a.s.c.ShardLeaderElectionContextBase Creating leader registration node /collections/testschemaapi/leaders/shard1/leader after winning as /collections/testschemaapi/leader_elect/shard1/election/96568625370431493-core_node2-n_0000000000
   [junit4]   2> 1020289 INFO  (qtp1775476444-6600) [n:127.0.0.1:38834_solr c:testschemaapi s:shard1 r:core_node2 x:testschemaapi_shard1_replica2] o.a.s.c.ShardLeaderElectionContext I am the new leader: http://127.0.0.1:38834/solr/testschemaapi_shard1_replica2/ shard1
   [junit4]   2> 1020290 INFO  (OverseerStateUpdate-96568625370431494-127.0.0.1:34411_solr-n_0000000000) [n:127.0.0.1:34411_solr    ] o.a.s.c.Overseer processMessage: queueSize: 1, message = {
   [junit4]   2>   "operation":"leader",
   [junit4]   2>   "shard":"shard1",
   [junit4]   2>   "collection":"testschemaapi",
   [junit4]   2>   "base_url":"http://127.0.0.1:38834/solr",
   [junit4]   2>   "core":"testschemaapi_shard1_replica2",
   [junit4]   2>   "state":"active"} current state version: 0
   [junit4]   2> 1020391 INFO  (OverseerStateUpdate-96568625370431494-127.0.0.1:34411_solr-n_0000000000) [n:127.0.0.1:34411_solr    ] o.a.s.c.o.ZkStateWriter going to update_collection /collections/testschemaapi/state.json version: 1
   [junit4]   2> 1020391 INFO  (zkCallback-919-thread-1-processing-n:127.0.0.1:34411_solr) [n:127.0.0.1:34411_solr    ] o.a.s.c.c.ZkStateReader A cluster state change: [WatchedEvent state:SyncConnected type:NodeDataChanged path:/collections/testschemaapi/state.json] for collection [testschemaapi] has occurred - updating... (live nodes size: [2])
   [junit4]   2> 1020391 INFO  (zkCallback-918-thread-1-processing-n:127.0.0.1:38834_solr) [n:127.0.0.1:38834_solr    ] o.a.s.c.c.ZkStateReader A cluster state change: [WatchedEvent state:SyncConnected type:NodeDataChanged path:/collections/testschemaapi/state.json] for collection [testschemaapi] has occurred - updating... (live nodes size: [2])
   [junit4]   2> 1020391 INFO  (zkCallback-918-thread-1-processing-n:127.0.0.1:38834_solr) [n:127.0.0.1:38834_solr    ] o.a.s.c.c.ZkStateReader Updating data for [testschemaapi] from [1] to [2]
   [junit4]   2> 1020391 INFO  (zkCallback-919-thread-1-processing-n:127.0.0.1:34411_solr) [n:127.0.0.1:34411_solr    ] o.a.s.c.c.ZkStateReader Updating data for [testschemaapi] from [1] to [2]
   [junit4]   2> 1020440 INFO  (qtp1775476444-6600) [n:127.0.0.1:38834_solr c:testschemaapi s:shard1 r:core_node2 x:testschemaapi_shard1_replica2] o.a.s.c.ZkController We are http://127.0.0.1:38834/solr/testschemaapi_shard1_replica2/ and leader is http://127.0.0.1:38834/solr/testschemaapi_shard1_replica2/
   [junit4]   2> 1020440 INFO  (qtp1775476444-6600) [n:127.0.0.1:38834_solr c:testschemaapi s:shard1 r:core_node2 x:testschemaapi_shard1_replica2] o.a.s.c.ZkController No LogReplay needed for core=testschemaapi_shard1_replica2 baseURL=http://127.0.0.1:38834/solr
   [junit4]   2> 1020440 INFO  (qtp1775476444-6600) [n:127.0.0.1:38834_solr c:testschemaapi s:shard1 r:core_node2 x:testschemaapi_shard1_replica2] o.a.s.c.ZkController I am the leader, no recovery necessary
   [junit4]   2> 1020440 INFO  (qtp1775476444-6600) [n:127.0.0.1:38834_solr c:testschemaapi s:shard1 r:core_node2 x:testschemaapi_shard1_replica2] o.a.s.c.ZkController publishing state=active
   [junit4]   2> 1020442 INFO  (OverseerStateUpdate-96568625370431494-127.0.0.1:34411_solr-n_0000000000) [n:127.0.0.1:34411_solr    ] o.a.s.c.Overseer processMessage: queueSize: 1, message = {
   [junit4]   2>   "core":"testschemaapi_shard1_replica2",
   [junit4]   2>   "core_node_name":"core_node2",
   [junit4]   2>   "shard":"shard1",
   [junit4]   2>   "node_name":"127.0.0.1:38834_solr",
   [junit4]   2>   "state":"active",
   [junit4]   2>   "roles":null,
   [junit4]   2>   "numShards":"1",
   [junit4]   2>   "base_url":"http://127.0.0.1:38834/solr",
   [junit4]   2>   "collection":"testschemaapi",
   [junit4]   2>   "operation":"state"} current state version: 0
   [junit4]   2> 1020443 INFO  (OverseerStateUpdate-96568625370431494-127.0.0.1:34411_solr-n_0000000000) [n:127.0.0.1:34411_solr    ] o.a.s.c.o.ReplicaMutator Update state numShards=1 message={
   [junit4]   2>   "core":"testschemaapi_shard1_replica2",
   [junit4]   2>   "core_node_name":"core_node2",
   [junit4]   2>   "shard":"shard1",
   [junit4]   2>   "node_name":"127.0.0.1:38834_solr",
   [junit4]   2>   "state":"active",
   [junit4]   2>   "roles":null,
   [junit4]   2>   "numShards":"1",
   [junit4]   2>   "base_url":"http://127.0.0.1:38834/solr",
   [junit4]   2>   "collection":"testschemaapi",
   [junit4]   2>   "operation":"state"}
   [junit4]   2> 1020444 INFO  (qtp1775476444-6600) [n:127.0.0.1:38834_solr c:testschemaapi s:shard1 r:core_node2 x:testschemaapi_shard1_replica2] o.a.s.s.HttpSolrCall [admin] webapp=null path=/admin/cores params={shard=shard1&action=CREATE&name=testschemaapi_shard1_replica2&numShards=1&collection=testschemaapi&collection.configName=conf1&wt=javabin&version=2&qt=/admin/cores} status=0 QTime=1231
   [junit4]   2> 1020545 INFO  (OverseerStateUpdate-96568625370431494-127.0.0.1:34411_solr-n_0000000000) [n:127.0.0.1:34411_solr    ] o.a.s.c.o.ZkStateWriter going to update_collection /collections/testschemaapi/state.json version: 2
   [junit4]   2> 1020545 INFO  (zkCallback-919-thread-2-processing-n:127.0.0.1:34411_solr) [n:127.0.0.1:34411_solr    ] o.a.s.c.c.ZkStateReader A cluster state change: [WatchedEvent state:SyncConnected type:NodeDataChanged path:/collections/testschemaapi/state.json] for collection [testschemaapi] has occurred - updating... (live nodes size: [2])
   [junit4]   2> 1020545 INFO  (zkCallback-918-thread-1-processing-n:127.0.0.1:38834_solr) [n:127.0.0.1:38834_solr    ] o.a.s.c.c.ZkStateReader A cluster state change: [WatchedEvent state:SyncConnected type:NodeDataChanged path:/collections/testschemaapi/state.json] for collection [testschemaapi] has occurred - updating... (live nodes size: [2])
   [junit4]   2> 1020545 INFO  (zkCallback-918-thread-1-processing-n:127.0.0.1:38834_solr) [n:127.0.0.1:38834_solr    ] o.a.s.c.c.ZkStateReader Updating data for [testschemaapi] from [2] to [3]
   [junit4]   2> 1020545 INFO  (zkCallback-919-thread-2-processing-n:127.0.0.1:34411_solr) [n:127.0.0.1:34411_solr    ] o.a.s.c.c.ZkStateReader Updating data for [testschemaapi] from [2] to [3]
   [junit4]   2> 1021286 INFO  (qtp1147319243-6601) [n:127.0.0.1:34411_solr c:testschemaapi s:shard1 r:core_node1 x:testschemaapi_shard1_replica1] o.a.s.c.ZkController We are http://127.0.0.1:34411/solr/testschemaapi_shard1_replica1/ and leader is http://127.0.0.1:38834/solr/testschemaapi_shard1_replica2/
   [junit4]   2> 1021286 INFO  (qtp1147319243-6601) [n:127.0.0.1:34411_solr c:testschemaapi s:shard1 r:core_node1 x:testschemaapi_shard1_replica1] o.a.

[...truncated too long message...]

olr.common.cloud.SolrZkClient$7.execute(SolrZkClient.java:342)
   [junit4]   2> 	at org.apache.solr.common.cloud.ZkCmdExecutor.retryOperation(ZkCmdExecutor.java:60)
   [junit4]   2> 	at org.apache.solr.common.cloud.SolrZkClient.getData(SolrZkClient.java:342)
   [junit4]   2> 	at org.apache.solr.schema.ManagedIndexSchemaFactory.create(ManagedIndexSchemaFactory.java:128)
   [junit4]   2> 	... 7 more
   [junit4]   2> 1032008 WARN  (zkCallback-918-thread-3-processing-n:127.0.0.1:38834_solr) [n:127.0.0.1:38834_solr    ] o.a.s.c.LeaderElector 
   [junit4]   2> org.apache.zookeeper.KeeperException$SessionExpiredException: KeeperErrorCode = Session expired for /overseer_elect
   [junit4]   2> 	at org.apache.zookeeper.KeeperException.create(KeeperException.java:127)
   [junit4]   2> 	at org.apache.zookeeper.KeeperException.create(KeeperException.java:51)
   [junit4]   2> 	at org.apache.zookeeper.ZooKeeper.exists(ZooKeeper.java:1045)
   [junit4]   2> 	at org.apache.solr.common.cloud.SolrZkClient$4.execute(SolrZkClient.java:294)
   [junit4]   2> 	at org.apache.solr.common.cloud.SolrZkClient$4.execute(SolrZkClient.java:291)
   [junit4]   2> 	at org.apache.solr.common.cloud.ZkCmdExecutor.retryOperation(ZkCmdExecutor.java:60)
   [junit4]   2> 	at org.apache.solr.common.cloud.SolrZkClient.exists(SolrZkClient.java:291)
   [junit4]   2> 	at org.apache.solr.common.cloud.SolrZkClient.makePath(SolrZkClient.java:486)
   [junit4]   2> 	at org.apache.solr.common.cloud.SolrZkClient.makePath(SolrZkClient.java:455)
   [junit4]   2> 	at org.apache.solr.common.cloud.SolrZkClient.makePath(SolrZkClient.java:442)
   [junit4]   2> 	at org.apache.solr.cloud.OverseerElectionContext.runLeaderProcess(ElectionContext.java:729)
   [junit4]   2> 	at org.apache.solr.cloud.LeaderElector.runIamLeaderProcess(LeaderElector.java:171)
   [junit4]   2> 	at org.apache.solr.cloud.LeaderElector.checkIfIamLeader(LeaderElector.java:136)
   [junit4]   2> 	at org.apache.solr.cloud.LeaderElector.access$200(LeaderElector.java:57)
   [junit4]   2> 	at org.apache.solr.cloud.LeaderElector$ElectionWatcher.process(LeaderElector.java:349)
   [junit4]   2> 	at org.apache.solr.common.cloud.SolrZkClient$3$1.run(SolrZkClient.java:264)
   [junit4]   2> 	at java.util.concurrent.Executors$RunnableAdapter.call(Executors.java:471)
   [junit4]   2> 	at java.util.concurrent.FutureTask.run(FutureTask.java:262)
   [junit4]   2> 	at org.apache.solr.common.util.ExecutorUtil$MDCAwareThreadPoolExecutor$1.run(ExecutorUtil.java:231)
   [junit4]   2> 	at java.util.concurrent.ThreadPoolExecutor.runWorker(ThreadPoolExecutor.java:1145)
   [junit4]   2> 	at java.util.concurrent.ThreadPoolExecutor$Worker.run(ThreadPoolExecutor.java:615)
   [junit4]   2> 	at java.lang.Thread.run(Thread.java:745)
   [junit4]   2> 1032009 INFO  (jetty-launcher-908-thread-2) [    ] o.e.j.s.h.ContextHandler Stopped o.e.j.s.ServletContextHandler@7b612542{/solr,null,UNAVAILABLE}
   [junit4]   2> 1032010 INFO  (TEST-TestManagedSchemaAPI.test-seed#[E26F4EFD00885B42]) [    ] o.a.s.c.ZkTestServer connecting to 127.0.0.1:39507 39507
   [junit4]   2> 1032120 INFO  (Thread-2232) [    ] o.a.s.c.ZkTestServer connecting to 127.0.0.1:39507 39507
   [junit4]   2> 1032120 WARN  (Thread-2232) [    ] o.a.s.c.ZkTestServer Watch limit violations: 
   [junit4]   2> Maximum concurrent create/delete watches above limit:
   [junit4]   2> 
   [junit4]   2> 	6	/solr/configs/conf1
   [junit4]   2> 	6	/solr/configs/conf1/managed-schema
   [junit4]   2> 	3	/solr/aliases.json
   [junit4]   2> 	2	/solr/security.json
   [junit4]   2> 
   [junit4]   2> Maximum concurrent data watches above limit:
   [junit4]   2> 
   [junit4]   2> 	3	/solr/clusterstate.json
   [junit4]   2> 	2	/solr/collections/testschemaapi/state.json
   [junit4]   2> 
   [junit4]   2> Maximum concurrent children watches above limit:
   [junit4]   2> 
   [junit4]   2> 	10	/solr/overseer/collection-queue-work
   [junit4]   2> 	8	/solr/overseer/queue
   [junit4]   2> 	3	/solr/collections
   [junit4]   2> 	3	/solr/live_nodes
   [junit4]   2> 	3	/solr/overseer/queue-work
   [junit4]   2> 
   [junit4]   2> 1032120 INFO  (TEST-TestManagedSchemaAPI.test-seed#[E26F4EFD00885B42]) [    ] o.a.s.SolrTestCaseJ4 ###Ending test
   [junit4]   2> NOTE: reproduce with: ant test  -Dtestcase=TestManagedSchemaAPI -Dtests.method=test -Dtests.seed=E26F4EFD00885B42 -Dtests.multiplier=3 -Dtests.slow=true -Dtests.locale=es-DO -Dtests.timezone=Asia/Kuching -Dtests.asserts=true -Dtests.file.encoding=UTF-8
   [junit4] ERROR   13.2s J2 | TestManagedSchemaAPI.test <<<
   [junit4]    > Throwable #1: org.apache.solr.client.solrj.impl.CloudSolrClient$RouteException: Error from server at http://127.0.0.1:38834/solr/testschemaapi_shard1_replica2: ERROR: [doc=2] unknown field 'myNewField1'
   [junit4]    > 	at __randomizedtesting.SeedInfo.seed([E26F4EFD00885B42:6A3B7127AE7436BA]:0)
   [junit4]    > 	at org.apache.solr.client.solrj.impl.CloudSolrClient.directUpdate(CloudSolrClient.java:653)
   [junit4]    > 	at org.apache.solr.client.solrj.impl.CloudSolrClient.sendRequest(CloudSolrClient.java:1002)
   [junit4]    > 	at org.apache.solr.client.solrj.impl.CloudSolrClient.requestWithRetryOnStaleState(CloudSolrClient.java:891)
   [junit4]    > 	at org.apache.solr.client.solrj.impl.CloudSolrClient.request(CloudSolrClient.java:827)
   [junit4]    > 	at org.apache.solr.schema.TestManagedSchemaAPI.testAddFieldAndDocument(TestManagedSchemaAPI.java:101)
   [junit4]    > 	at org.apache.solr.schema.TestManagedSchemaAPI.test(TestManagedSchemaAPI.java:69)
   [junit4]    > 	at java.lang.Thread.run(Thread.java:745)
   [junit4]    > Caused by: org.apache.solr.client.solrj.impl.HttpSolrClient$RemoteSolrException: Error from server at http://127.0.0.1:38834/solr/testschemaapi_shard1_replica2: ERROR: [doc=2] unknown field 'myNewField1'
   [junit4]    > 	at org.apache.solr.client.solrj.impl.HttpSolrClient.executeMethod(HttpSolrClient.java:577)
   [junit4]    > 	at org.apache.solr.client.solrj.impl.HttpSolrClient.request(HttpSolrClient.java:241)
   [junit4]    > 	at org.apache.solr.client.solrj.impl.HttpSolrClient.request(HttpSolrClient.java:230)
   [junit4]    > 	at org.apache.solr.client.solrj.impl.LBHttpSolrClient.doRequest(LBHttpSolrClient.java:372)
   [junit4]    > 	at org.apache.solr.client.solrj.impl.LBHttpSolrClient.request(LBHttpSolrClient.java:325)
   [junit4]    > 	at org.apache.solr.client.solrj.impl.CloudSolrClient$2.call(CloudSolrClient.java:628)
   [junit4]    > 	at org.apache.solr.client.solrj.impl.CloudSolrClient$2.call(CloudSolrClient.java:625)
   [junit4]    > 	at java.util.concurrent.FutureTask.run(FutureTask.java:262)
   [junit4]    > 	at org.apache.solr.common.util.ExecutorUtil$MDCAwareThreadPoolExecutor$1.run(ExecutorUtil.java:231)
   [junit4]    > 	at java.util.concurrent.ThreadPoolExecutor.runWorker(ThreadPoolExecutor.java:1145)
   [junit4]    > 	at java.util.concurrent.ThreadPoolExecutor$Worker.run(ThreadPoolExecutor.java:615)
   [junit4]    > 	... 1 more
   [junit4]   2> 1032123 INFO  (SUITE-TestManagedSchemaAPI-seed#[E26F4EFD00885B42]-worker) [    ] o.a.s.SolrTestCaseJ4 ###deleteCore
   [junit4]   2> NOTE: leaving temporary files on disk at: /home/jenkins/workspace/Lucene-Solr-5.5-Linux/solr/build/solr-core/test/J2/temp/solr.schema.TestManagedSchemaAPI_E26F4EFD00885B42-001
   [junit4]   2> Sep 10, 2016 3:11:37 PM com.carrotsearch.randomizedtesting.ThreadLeakControl checkThreadLeaks
   [junit4]   2> WARNING: Will linger awaiting termination of 1 leaked thread(s).
   [junit4]   2> NOTE: test params are: codec=Asserting(Lucene54): {id=Lucene50(blocksize=128), myNewField=PostingsFormat(name=LuceneVarGapFixedInterval), _version_=PostingsFormat(name=LuceneVarGapFixedInterval)}, docValues:{}, sim=DefaultSimilarity, locale=es-DO, timezone=Asia/Kuching
   [junit4]   2> NOTE: Linux 4.4.0-36-generic amd64/Oracle Corporation 1.7.0_80 (64-bit)/cpus=12,threads=1,free=199923648,total=507641856
   [junit4]   2> NOTE: All tests run in this JVM: [TestRandomRequestDistribution, CollectionsAPIAsyncDistributedZkTest, DistributedFacetPivotLongTailTest, JavabinLoaderTest, TestDynamicLoading, SolrCloudExampleTest, TestLRUStatsCache, TestUseDocValuesAsStored2, SortSpecParsingTest, CheckHdfsIndexTest, SimpleFacetsTest, SliceStateTest, TestConfigReload, TestCSVResponseWriter, TestSolrJ, PrimitiveFieldTypeTest, TestStressReorder, HdfsDirectoryFactoryTest, HdfsLockFactoryTest, DataDrivenBlockJoinTest, HttpPartitionTest, HdfsRestartWhileUpdatingTest, TestRequestForwarding, CollectionReloadTest, TestRecovery, QueryParsingTest, TestCoreDiscovery, TestSearcherReuse, AtomicUpdatesTest, TestObjectReleaseTracker, TestAuthorizationFramework, TestJettySolrRunner, TestFreeTextSuggestions, TestSort, TestPHPSerializedResponseWriter, PeerSyncReplicationTest, RegexBoostProcessorTest, DistribCursorPagingTest, TestSweetSpotSimilarityFactory, TestChildDocTransformer, TestIndexSearcher, TestSolrQueryParser, TestCollectionAPI, HardAutoCommitTest, TestClusterStateMutator, ConfigSetsAPITest, TestLeaderInitiatedRecoveryThread, ClusterStateTest, TestFieldSortValues, DeleteReplicaTest, TestTrieFacet, DirectUpdateHandlerOptimizeTest, AutoCommitTest, IgnoreCommitOptimizeUpdateProcessorFactoryTest, TestOverriddenPrefixQueryForCustomFieldType, TestMaxScoreQueryParser, TestRestoreCore, TestIndexingPerformance, CoreAdminCreateDiscoverTest, TestPerFieldSimilarity, SuggestComponentContextFilterQueryTest, TestInitParams, HdfsNNFailoverTest, UnloadDistributedZkTest, TestDefaultSearchFieldResource, TestDistribIDF, HdfsChaosMonkeyNothingIsSafeTest, TestReload, RequestHandlersTest, RecoveryZkTest, TestHdfsUpdateLog, DistributedFacetPivotWhiteBoxTest, TestXIncludeConfig, TestExpandComponent, TestRawTransformer, TestCollapseQParserPlugin, TestFieldCollectionResource, CursorMarkTest, TestManagedSchemaFieldTypeResource, TestExtendedDismaxParser, TestManagedSchemaAPI]
   [junit4] Completed [251/575 (1!)] on J2 in 13.46s, 1 test, 1 error <<< FAILURES!

[...truncated 57673 lines...]


Mime
View raw message