lucene-dev mailing list archives

Site index · List index
Message view « Date » · « Thread »
Top « Date » · « Thread »
From Apache Jenkins Server <jenk...@builds.apache.org>
Subject [JENKINS] Lucene-Solr-NightlyTests-5.5 - Build # 3 - Still Failing
Date Thu, 01 Sep 2016 21:30:26 GMT
Build: https://builds.apache.org/job/Lucene-Solr-NightlyTests-5.5/3/

5 tests failed.
FAILED:  org.apache.solr.cloud.hdfs.HdfsCollectionsAPIDistributedZkTest.test

Error Message:
Timeout occured while waiting response from server at: http://127.0.0.1:60618

Stack Trace:
org.apache.solr.client.solrj.SolrServerException: Timeout occured while waiting response from server at: http://127.0.0.1:60618
	at org.apache.solr.client.solrj.impl.HttpSolrClient.executeMethod(HttpSolrClient.java:586)
	at org.apache.solr.client.solrj.impl.HttpSolrClient.request(HttpSolrClient.java:241)
	at org.apache.solr.client.solrj.impl.HttpSolrClient.request(HttpSolrClient.java:230)
	at org.apache.solr.client.solrj.SolrClient.request(SolrClient.java:1219)
	at org.apache.solr.cloud.CollectionsAPIDistributedZkTest.makeRequest(CollectionsAPIDistributedZkTest.java:400)
	at org.apache.solr.cloud.CollectionsAPIDistributedZkTest.testErrorHandling(CollectionsAPIDistributedZkTest.java:516)
	at org.apache.solr.cloud.CollectionsAPIDistributedZkTest.test(CollectionsAPIDistributedZkTest.java:179)
	at sun.reflect.NativeMethodAccessorImpl.invoke0(Native Method)
	at sun.reflect.NativeMethodAccessorImpl.invoke(NativeMethodAccessorImpl.java:57)
	at sun.reflect.DelegatingMethodAccessorImpl.invoke(DelegatingMethodAccessorImpl.java:43)
	at java.lang.reflect.Method.invoke(Method.java:606)
	at com.carrotsearch.randomizedtesting.RandomizedRunner.invoke(RandomizedRunner.java:1764)
	at com.carrotsearch.randomizedtesting.RandomizedRunner$8.evaluate(RandomizedRunner.java:871)
	at com.carrotsearch.randomizedtesting.RandomizedRunner$9.evaluate(RandomizedRunner.java:907)
	at com.carrotsearch.randomizedtesting.RandomizedRunner$10.evaluate(RandomizedRunner.java:921)
	at org.apache.solr.BaseDistributedSearchTestCase$ShardsRepeatRule$ShardsFixedStatement.callStatement(BaseDistributedSearchTestCase.java:996)
	at org.apache.solr.BaseDistributedSearchTestCase$ShardsRepeatRule$ShardsStatement.evaluate(BaseDistributedSearchTestCase.java:971)
	at com.carrotsearch.randomizedtesting.rules.SystemPropertiesRestoreRule$1.evaluate(SystemPropertiesRestoreRule.java:57)
	at org.apache.lucene.util.TestRuleSetupTeardownChained$1.evaluate(TestRuleSetupTeardownChained.java:49)
	at org.apache.lucene.util.AbstractBeforeAfterRule$1.evaluate(AbstractBeforeAfterRule.java:45)
	at org.apache.lucene.util.TestRuleThreadAndTestName$1.evaluate(TestRuleThreadAndTestName.java:48)
	at org.apache.lucene.util.TestRuleIgnoreAfterMaxFailures$1.evaluate(TestRuleIgnoreAfterMaxFailures.java:64)
	at org.apache.lucene.util.TestRuleMarkFailure$1.evaluate(TestRuleMarkFailure.java:47)
	at com.carrotsearch.randomizedtesting.rules.StatementAdapter.evaluate(StatementAdapter.java:36)
	at com.carrotsearch.randomizedtesting.ThreadLeakControl$StatementRunner.run(ThreadLeakControl.java:367)
	at com.carrotsearch.randomizedtesting.ThreadLeakControl.forkTimeoutingTask(ThreadLeakControl.java:809)
	at com.carrotsearch.randomizedtesting.ThreadLeakControl$3.evaluate(ThreadLeakControl.java:460)
	at com.carrotsearch.randomizedtesting.RandomizedRunner.runSingleTest(RandomizedRunner.java:880)
	at com.carrotsearch.randomizedtesting.RandomizedRunner$5.evaluate(RandomizedRunner.java:781)
	at com.carrotsearch.randomizedtesting.RandomizedRunner$6.evaluate(RandomizedRunner.java:816)
	at com.carrotsearch.randomizedtesting.RandomizedRunner$7.evaluate(RandomizedRunner.java:827)
	at com.carrotsearch.randomizedtesting.rules.StatementAdapter.evaluate(StatementAdapter.java:36)
	at com.carrotsearch.randomizedtesting.rules.SystemPropertiesRestoreRule$1.evaluate(SystemPropertiesRestoreRule.java:57)
	at org.apache.lucene.util.AbstractBeforeAfterRule$1.evaluate(AbstractBeforeAfterRule.java:45)
	at com.carrotsearch.randomizedtesting.rules.StatementAdapter.evaluate(StatementAdapter.java:36)
	at org.apache.lucene.util.TestRuleStoreClassName$1.evaluate(TestRuleStoreClassName.java:41)
	at com.carrotsearch.randomizedtesting.rules.NoShadowingOrOverridesOnMethodsRule$1.evaluate(NoShadowingOrOverridesOnMethodsRule.java:40)
	at com.carrotsearch.randomizedtesting.rules.NoShadowingOrOverridesOnMethodsRule$1.evaluate(NoShadowingOrOverridesOnMethodsRule.java:40)
	at com.carrotsearch.randomizedtesting.rules.StatementAdapter.evaluate(StatementAdapter.java:36)
	at com.carrotsearch.randomizedtesting.rules.StatementAdapter.evaluate(StatementAdapter.java:36)
	at com.carrotsearch.randomizedtesting.rules.StatementAdapter.evaluate(StatementAdapter.java:36)
	at org.apache.lucene.util.TestRuleAssertionsRequired$1.evaluate(TestRuleAssertionsRequired.java:53)
	at org.apache.lucene.util.TestRuleMarkFailure$1.evaluate(TestRuleMarkFailure.java:47)
	at org.apache.lucene.util.TestRuleIgnoreAfterMaxFailures$1.evaluate(TestRuleIgnoreAfterMaxFailures.java:64)
	at org.apache.lucene.util.TestRuleIgnoreTestSuites$1.evaluate(TestRuleIgnoreTestSuites.java:54)
	at com.carrotsearch.randomizedtesting.rules.StatementAdapter.evaluate(StatementAdapter.java:36)
	at com.carrotsearch.randomizedtesting.ThreadLeakControl$StatementRunner.run(ThreadLeakControl.java:367)
	at java.lang.Thread.run(Thread.java:745)
Caused by: java.net.SocketTimeoutException: Read timed out
	at java.net.SocketInputStream.socketRead0(Native Method)
	at java.net.SocketInputStream.read(SocketInputStream.java:152)
	at java.net.SocketInputStream.read(SocketInputStream.java:122)
	at org.apache.http.impl.io.AbstractSessionInputBuffer.fillBuffer(AbstractSessionInputBuffer.java:160)
	at org.apache.http.impl.io.SocketInputBuffer.fillBuffer(SocketInputBuffer.java:84)
	at org.apache.http.impl.io.AbstractSessionInputBuffer.readLine(AbstractSessionInputBuffer.java:273)
	at org.apache.http.impl.conn.DefaultHttpResponseParser.parseHead(DefaultHttpResponseParser.java:140)
	at org.apache.http.impl.conn.DefaultHttpResponseParser.parseHead(DefaultHttpResponseParser.java:57)
	at org.apache.http.impl.io.AbstractMessageParser.parse(AbstractMessageParser.java:261)
	at org.apache.http.impl.AbstractHttpClientConnection.receiveResponseHeader(AbstractHttpClientConnection.java:283)
	at org.apache.http.impl.conn.DefaultClientConnection.receiveResponseHeader(DefaultClientConnection.java:251)
	at org.apache.http.impl.conn.ManagedClientConnectionImpl.receiveResponseHeader(ManagedClientConnectionImpl.java:197)
	at org.apache.http.protocol.HttpRequestExecutor.doReceiveResponse(HttpRequestExecutor.java:272)
	at org.apache.http.protocol.HttpRequestExecutor.execute(HttpRequestExecutor.java:124)
	at org.apache.http.impl.client.DefaultRequestDirector.tryExecute(DefaultRequestDirector.java:685)
	at org.apache.http.impl.client.DefaultRequestDirector.execute(DefaultRequestDirector.java:487)
	at org.apache.http.impl.client.AbstractHttpClient.doExecute(AbstractHttpClient.java:882)
	at org.apache.http.impl.client.CloseableHttpClient.execute(CloseableHttpClient.java:82)
	at org.apache.http.impl.client.CloseableHttpClient.execute(CloseableHttpClient.java:107)
	at org.apache.http.impl.client.CloseableHttpClient.execute(CloseableHttpClient.java:55)
	at org.apache.solr.client.solrj.impl.HttpSolrClient.executeMethod(HttpSolrClient.java:482)
	... 47 more


FAILED:  junit.framework.TestSuite.org.apache.solr.cloud.hdfs.HdfsCollectionsAPIDistributedZkTest

Error Message:
5 threads leaked from SUITE scope at org.apache.solr.cloud.hdfs.HdfsCollectionsAPIDistributedZkTest:     1) Thread[id=23781, name=searcherExecutor-5835-thread-1, state=WAITING, group=TGRP-HdfsCollectionsAPIDistributedZkTest]         at sun.misc.Unsafe.park(Native Method)         at java.util.concurrent.locks.LockSupport.park(LockSupport.java:186)         at java.util.concurrent.locks.AbstractQueuedSynchronizer$ConditionObject.await(AbstractQueuedSynchronizer.java:2043)         at java.util.concurrent.LinkedBlockingQueue.take(LinkedBlockingQueue.java:442)         at java.util.concurrent.ThreadPoolExecutor.getTask(ThreadPoolExecutor.java:1068)         at java.util.concurrent.ThreadPoolExecutor.runWorker(ThreadPoolExecutor.java:1130)         at java.util.concurrent.ThreadPoolExecutor$Worker.run(ThreadPoolExecutor.java:615)         at java.lang.Thread.run(Thread.java:745)    2) Thread[id=23817, name=searcherExecutor-5837-thread-1, state=WAITING, group=TGRP-HdfsCollectionsAPIDistributedZkTest]         at sun.misc.Unsafe.park(Native Method)         at java.util.concurrent.locks.LockSupport.park(LockSupport.java:186)         at java.util.concurrent.locks.AbstractQueuedSynchronizer$ConditionObject.await(AbstractQueuedSynchronizer.java:2043)         at java.util.concurrent.LinkedBlockingQueue.take(LinkedBlockingQueue.java:442)         at java.util.concurrent.ThreadPoolExecutor.getTask(ThreadPoolExecutor.java:1068)         at java.util.concurrent.ThreadPoolExecutor.runWorker(ThreadPoolExecutor.java:1130)         at java.util.concurrent.ThreadPoolExecutor$Worker.run(ThreadPoolExecutor.java:615)         at java.lang.Thread.run(Thread.java:745)    3) Thread[id=23823, name=searcherExecutor-5838-thread-1, state=WAITING, group=TGRP-HdfsCollectionsAPIDistributedZkTest]         at sun.misc.Unsafe.park(Native Method)         at java.util.concurrent.locks.LockSupport.park(LockSupport.java:186)         at java.util.concurrent.locks.AbstractQueuedSynchronizer$ConditionObject.await(AbstractQueuedSynchronizer.java:2043)         at java.util.concurrent.LinkedBlockingQueue.take(LinkedBlockingQueue.java:442)         at java.util.concurrent.ThreadPoolExecutor.getTask(ThreadPoolExecutor.java:1068)         at java.util.concurrent.ThreadPoolExecutor.runWorker(ThreadPoolExecutor.java:1130)         at java.util.concurrent.ThreadPoolExecutor$Worker.run(ThreadPoolExecutor.java:615)         at java.lang.Thread.run(Thread.java:745)    4) Thread[id=23754, name=searcherExecutor-5834-thread-1, state=WAITING, group=TGRP-HdfsCollectionsAPIDistributedZkTest]         at sun.misc.Unsafe.park(Native Method)         at java.util.concurrent.locks.LockSupport.park(LockSupport.java:186)         at java.util.concurrent.locks.AbstractQueuedSynchronizer$ConditionObject.await(AbstractQueuedSynchronizer.java:2043)         at java.util.concurrent.LinkedBlockingQueue.take(LinkedBlockingQueue.java:442)         at java.util.concurrent.ThreadPoolExecutor.getTask(ThreadPoolExecutor.java:1068)         at java.util.concurrent.ThreadPoolExecutor.runWorker(ThreadPoolExecutor.java:1130)         at java.util.concurrent.ThreadPoolExecutor$Worker.run(ThreadPoolExecutor.java:615)         at java.lang.Thread.run(Thread.java:745)    5) Thread[id=23824, name=searcherExecutor-5839-thread-1, state=WAITING, group=TGRP-HdfsCollectionsAPIDistributedZkTest]         at sun.misc.Unsafe.park(Native Method)         at java.util.concurrent.locks.LockSupport.park(LockSupport.java:186)         at java.util.concurrent.locks.AbstractQueuedSynchronizer$ConditionObject.await(AbstractQueuedSynchronizer.java:2043)         at java.util.concurrent.LinkedBlockingQueue.take(LinkedBlockingQueue.java:442)         at java.util.concurrent.ThreadPoolExecutor.getTask(ThreadPoolExecutor.java:1068)         at java.util.concurrent.ThreadPoolExecutor.runWorker(ThreadPoolExecutor.java:1130)         at java.util.concurrent.ThreadPoolExecutor$Worker.run(ThreadPoolExecutor.java:615)         at java.lang.Thread.run(Thread.java:745)

Stack Trace:
com.carrotsearch.randomizedtesting.ThreadLeakError: 5 threads leaked from SUITE scope at org.apache.solr.cloud.hdfs.HdfsCollectionsAPIDistributedZkTest: 
   1) Thread[id=23781, name=searcherExecutor-5835-thread-1, state=WAITING, group=TGRP-HdfsCollectionsAPIDistributedZkTest]
        at sun.misc.Unsafe.park(Native Method)
        at java.util.concurrent.locks.LockSupport.park(LockSupport.java:186)
        at java.util.concurrent.locks.AbstractQueuedSynchronizer$ConditionObject.await(AbstractQueuedSynchronizer.java:2043)
        at java.util.concurrent.LinkedBlockingQueue.take(LinkedBlockingQueue.java:442)
        at java.util.concurrent.ThreadPoolExecutor.getTask(ThreadPoolExecutor.java:1068)
        at java.util.concurrent.ThreadPoolExecutor.runWorker(ThreadPoolExecutor.java:1130)
        at java.util.concurrent.ThreadPoolExecutor$Worker.run(ThreadPoolExecutor.java:615)
        at java.lang.Thread.run(Thread.java:745)
   2) Thread[id=23817, name=searcherExecutor-5837-thread-1, state=WAITING, group=TGRP-HdfsCollectionsAPIDistributedZkTest]
        at sun.misc.Unsafe.park(Native Method)
        at java.util.concurrent.locks.LockSupport.park(LockSupport.java:186)
        at java.util.concurrent.locks.AbstractQueuedSynchronizer$ConditionObject.await(AbstractQueuedSynchronizer.java:2043)
        at java.util.concurrent.LinkedBlockingQueue.take(LinkedBlockingQueue.java:442)
        at java.util.concurrent.ThreadPoolExecutor.getTask(ThreadPoolExecutor.java:1068)
        at java.util.concurrent.ThreadPoolExecutor.runWorker(ThreadPoolExecutor.java:1130)
        at java.util.concurrent.ThreadPoolExecutor$Worker.run(ThreadPoolExecutor.java:615)
        at java.lang.Thread.run(Thread.java:745)
   3) Thread[id=23823, name=searcherExecutor-5838-thread-1, state=WAITING, group=TGRP-HdfsCollectionsAPIDistributedZkTest]
        at sun.misc.Unsafe.park(Native Method)
        at java.util.concurrent.locks.LockSupport.park(LockSupport.java:186)
        at java.util.concurrent.locks.AbstractQueuedSynchronizer$ConditionObject.await(AbstractQueuedSynchronizer.java:2043)
        at java.util.concurrent.LinkedBlockingQueue.take(LinkedBlockingQueue.java:442)
        at java.util.concurrent.ThreadPoolExecutor.getTask(ThreadPoolExecutor.java:1068)
        at java.util.concurrent.ThreadPoolExecutor.runWorker(ThreadPoolExecutor.java:1130)
        at java.util.concurrent.ThreadPoolExecutor$Worker.run(ThreadPoolExecutor.java:615)
        at java.lang.Thread.run(Thread.java:745)
   4) Thread[id=23754, name=searcherExecutor-5834-thread-1, state=WAITING, group=TGRP-HdfsCollectionsAPIDistributedZkTest]
        at sun.misc.Unsafe.park(Native Method)
        at java.util.concurrent.locks.LockSupport.park(LockSupport.java:186)
        at java.util.concurrent.locks.AbstractQueuedSynchronizer$ConditionObject.await(AbstractQueuedSynchronizer.java:2043)
        at java.util.concurrent.LinkedBlockingQueue.take(LinkedBlockingQueue.java:442)
        at java.util.concurrent.ThreadPoolExecutor.getTask(ThreadPoolExecutor.java:1068)
        at java.util.concurrent.ThreadPoolExecutor.runWorker(ThreadPoolExecutor.java:1130)
        at java.util.concurrent.ThreadPoolExecutor$Worker.run(ThreadPoolExecutor.java:615)
        at java.lang.Thread.run(Thread.java:745)
   5) Thread[id=23824, name=searcherExecutor-5839-thread-1, state=WAITING, group=TGRP-HdfsCollectionsAPIDistributedZkTest]
        at sun.misc.Unsafe.park(Native Method)
        at java.util.concurrent.locks.LockSupport.park(LockSupport.java:186)
        at java.util.concurrent.locks.AbstractQueuedSynchronizer$ConditionObject.await(AbstractQueuedSynchronizer.java:2043)
        at java.util.concurrent.LinkedBlockingQueue.take(LinkedBlockingQueue.java:442)
        at java.util.concurrent.ThreadPoolExecutor.getTask(ThreadPoolExecutor.java:1068)
        at java.util.concurrent.ThreadPoolExecutor.runWorker(ThreadPoolExecutor.java:1130)
        at java.util.concurrent.ThreadPoolExecutor$Worker.run(ThreadPoolExecutor.java:615)
        at java.lang.Thread.run(Thread.java:745)
	at __randomizedtesting.SeedInfo.seed([25107173F1D109D1]:0)


FAILED:  junit.framework.TestSuite.org.apache.solr.cloud.hdfs.HdfsCollectionsAPIDistributedZkTest

Error Message:
There are still zombie threads that couldn't be terminated:    1) Thread[id=23781, name=searcherExecutor-5835-thread-1, state=WAITING, group=TGRP-HdfsCollectionsAPIDistributedZkTest]         at sun.misc.Unsafe.park(Native Method)         at java.util.concurrent.locks.LockSupport.park(LockSupport.java:186)         at java.util.concurrent.locks.AbstractQueuedSynchronizer$ConditionObject.await(AbstractQueuedSynchronizer.java:2043)         at java.util.concurrent.LinkedBlockingQueue.take(LinkedBlockingQueue.java:442)         at java.util.concurrent.ThreadPoolExecutor.getTask(ThreadPoolExecutor.java:1068)         at java.util.concurrent.ThreadPoolExecutor.runWorker(ThreadPoolExecutor.java:1130)         at java.util.concurrent.ThreadPoolExecutor$Worker.run(ThreadPoolExecutor.java:615)         at java.lang.Thread.run(Thread.java:745)    2) Thread[id=23754, name=searcherExecutor-5834-thread-1, state=WAITING, group=TGRP-HdfsCollectionsAPIDistributedZkTest]         at sun.misc.Unsafe.park(Native Method)         at java.util.concurrent.locks.LockSupport.park(LockSupport.java:186)         at java.util.concurrent.locks.AbstractQueuedSynchronizer$ConditionObject.await(AbstractQueuedSynchronizer.java:2043)         at java.util.concurrent.LinkedBlockingQueue.take(LinkedBlockingQueue.java:442)         at java.util.concurrent.ThreadPoolExecutor.getTask(ThreadPoolExecutor.java:1068)         at java.util.concurrent.ThreadPoolExecutor.runWorker(ThreadPoolExecutor.java:1130)         at java.util.concurrent.ThreadPoolExecutor$Worker.run(ThreadPoolExecutor.java:615)         at java.lang.Thread.run(Thread.java:745)    3) Thread[id=23824, name=searcherExecutor-5839-thread-1, state=WAITING, group=TGRP-HdfsCollectionsAPIDistributedZkTest]         at sun.misc.Unsafe.park(Native Method)         at java.util.concurrent.locks.LockSupport.park(LockSupport.java:186)         at java.util.concurrent.locks.AbstractQueuedSynchronizer$ConditionObject.await(AbstractQueuedSynchronizer.java:2043)         at java.util.concurrent.LinkedBlockingQueue.take(LinkedBlockingQueue.java:442)         at java.util.concurrent.ThreadPoolExecutor.getTask(ThreadPoolExecutor.java:1068)         at java.util.concurrent.ThreadPoolExecutor.runWorker(ThreadPoolExecutor.java:1130)         at java.util.concurrent.ThreadPoolExecutor$Worker.run(ThreadPoolExecutor.java:615)         at java.lang.Thread.run(Thread.java:745)    4) Thread[id=23817, name=searcherExecutor-5837-thread-1, state=WAITING, group=TGRP-HdfsCollectionsAPIDistributedZkTest]         at sun.misc.Unsafe.park(Native Method)         at java.util.concurrent.locks.LockSupport.park(LockSupport.java:186)         at java.util.concurrent.locks.AbstractQueuedSynchronizer$ConditionObject.await(AbstractQueuedSynchronizer.java:2043)         at java.util.concurrent.LinkedBlockingQueue.take(LinkedBlockingQueue.java:442)         at java.util.concurrent.ThreadPoolExecutor.getTask(ThreadPoolExecutor.java:1068)         at java.util.concurrent.ThreadPoolExecutor.runWorker(ThreadPoolExecutor.java:1130)         at java.util.concurrent.ThreadPoolExecutor$Worker.run(ThreadPoolExecutor.java:615)         at java.lang.Thread.run(Thread.java:745)    5) Thread[id=23823, name=searcherExecutor-5838-thread-1, state=WAITING, group=TGRP-HdfsCollectionsAPIDistributedZkTest]         at sun.misc.Unsafe.park(Native Method)         at java.util.concurrent.locks.LockSupport.park(LockSupport.java:186)         at java.util.concurrent.locks.AbstractQueuedSynchronizer$ConditionObject.await(AbstractQueuedSynchronizer.java:2043)         at java.util.concurrent.LinkedBlockingQueue.take(LinkedBlockingQueue.java:442)         at java.util.concurrent.ThreadPoolExecutor.getTask(ThreadPoolExecutor.java:1068)         at java.util.concurrent.ThreadPoolExecutor.runWorker(ThreadPoolExecutor.java:1130)         at java.util.concurrent.ThreadPoolExecutor$Worker.run(ThreadPoolExecutor.java:615)         at java.lang.Thread.run(Thread.java:745)

Stack Trace:
com.carrotsearch.randomizedtesting.ThreadLeakError: There are still zombie threads that couldn't be terminated:
   1) Thread[id=23781, name=searcherExecutor-5835-thread-1, state=WAITING, group=TGRP-HdfsCollectionsAPIDistributedZkTest]
        at sun.misc.Unsafe.park(Native Method)
        at java.util.concurrent.locks.LockSupport.park(LockSupport.java:186)
        at java.util.concurrent.locks.AbstractQueuedSynchronizer$ConditionObject.await(AbstractQueuedSynchronizer.java:2043)
        at java.util.concurrent.LinkedBlockingQueue.take(LinkedBlockingQueue.java:442)
        at java.util.concurrent.ThreadPoolExecutor.getTask(ThreadPoolExecutor.java:1068)
        at java.util.concurrent.ThreadPoolExecutor.runWorker(ThreadPoolExecutor.java:1130)
        at java.util.concurrent.ThreadPoolExecutor$Worker.run(ThreadPoolExecutor.java:615)
        at java.lang.Thread.run(Thread.java:745)
   2) Thread[id=23754, name=searcherExecutor-5834-thread-1, state=WAITING, group=TGRP-HdfsCollectionsAPIDistributedZkTest]
        at sun.misc.Unsafe.park(Native Method)
        at java.util.concurrent.locks.LockSupport.park(LockSupport.java:186)
        at java.util.concurrent.locks.AbstractQueuedSynchronizer$ConditionObject.await(AbstractQueuedSynchronizer.java:2043)
        at java.util.concurrent.LinkedBlockingQueue.take(LinkedBlockingQueue.java:442)
        at java.util.concurrent.ThreadPoolExecutor.getTask(ThreadPoolExecutor.java:1068)
        at java.util.concurrent.ThreadPoolExecutor.runWorker(ThreadPoolExecutor.java:1130)
        at java.util.concurrent.ThreadPoolExecutor$Worker.run(ThreadPoolExecutor.java:615)
        at java.lang.Thread.run(Thread.java:745)
   3) Thread[id=23824, name=searcherExecutor-5839-thread-1, state=WAITING, group=TGRP-HdfsCollectionsAPIDistributedZkTest]
        at sun.misc.Unsafe.park(Native Method)
        at java.util.concurrent.locks.LockSupport.park(LockSupport.java:186)
        at java.util.concurrent.locks.AbstractQueuedSynchronizer$ConditionObject.await(AbstractQueuedSynchronizer.java:2043)
        at java.util.concurrent.LinkedBlockingQueue.take(LinkedBlockingQueue.java:442)
        at java.util.concurrent.ThreadPoolExecutor.getTask(ThreadPoolExecutor.java:1068)
        at java.util.concurrent.ThreadPoolExecutor.runWorker(ThreadPoolExecutor.java:1130)
        at java.util.concurrent.ThreadPoolExecutor$Worker.run(ThreadPoolExecutor.java:615)
        at java.lang.Thread.run(Thread.java:745)
   4) Thread[id=23817, name=searcherExecutor-5837-thread-1, state=WAITING, group=TGRP-HdfsCollectionsAPIDistributedZkTest]
        at sun.misc.Unsafe.park(Native Method)
        at java.util.concurrent.locks.LockSupport.park(LockSupport.java:186)
        at java.util.concurrent.locks.AbstractQueuedSynchronizer$ConditionObject.await(AbstractQueuedSynchronizer.java:2043)
        at java.util.concurrent.LinkedBlockingQueue.take(LinkedBlockingQueue.java:442)
        at java.util.concurrent.ThreadPoolExecutor.getTask(ThreadPoolExecutor.java:1068)
        at java.util.concurrent.ThreadPoolExecutor.runWorker(ThreadPoolExecutor.java:1130)
        at java.util.concurrent.ThreadPoolExecutor$Worker.run(ThreadPoolExecutor.java:615)
        at java.lang.Thread.run(Thread.java:745)
   5) Thread[id=23823, name=searcherExecutor-5838-thread-1, state=WAITING, group=TGRP-HdfsCollectionsAPIDistributedZkTest]
        at sun.misc.Unsafe.park(Native Method)
        at java.util.concurrent.locks.LockSupport.park(LockSupport.java:186)
        at java.util.concurrent.locks.AbstractQueuedSynchronizer$ConditionObject.await(AbstractQueuedSynchronizer.java:2043)
        at java.util.concurrent.LinkedBlockingQueue.take(LinkedBlockingQueue.java:442)
        at java.util.concurrent.ThreadPoolExecutor.getTask(ThreadPoolExecutor.java:1068)
        at java.util.concurrent.ThreadPoolExecutor.runWorker(ThreadPoolExecutor.java:1130)
        at java.util.concurrent.ThreadPoolExecutor$Worker.run(ThreadPoolExecutor.java:615)
        at java.lang.Thread.run(Thread.java:745)
	at __randomizedtesting.SeedInfo.seed([25107173F1D109D1]:0)


FAILED:  org.apache.solr.cloud.CollectionsAPIDistributedZkTest.test

Error Message:
Captured an uncaught exception in thread: Thread[id=3786, name=collection2, state=RUNNABLE, group=TGRP-CollectionsAPIDistributedZkTest]

Stack Trace:
com.carrotsearch.randomizedtesting.UncaughtExceptionError: Captured an uncaught exception in thread: Thread[id=3786, name=collection2, state=RUNNABLE, group=TGRP-CollectionsAPIDistributedZkTest]
Caused by: org.apache.solr.client.solrj.impl.HttpSolrClient$RemoteSolrException: Error from server at http://127.0.0.1:60660/hjibo/vr: Could not find collection : awholynewstresscollection_collection2_0
	at __randomizedtesting.SeedInfo.seed([25107173F1D109D1]:0)
	at org.apache.solr.client.solrj.impl.HttpSolrClient.executeMethod(HttpSolrClient.java:577)
	at org.apache.solr.client.solrj.impl.HttpSolrClient.request(HttpSolrClient.java:241)
	at org.apache.solr.client.solrj.impl.HttpSolrClient.request(HttpSolrClient.java:230)
	at org.apache.solr.client.solrj.impl.LBHttpSolrClient.doRequest(LBHttpSolrClient.java:372)
	at org.apache.solr.client.solrj.impl.LBHttpSolrClient.request(LBHttpSolrClient.java:325)
	at org.apache.solr.client.solrj.impl.CloudSolrClient.sendRequest(CloudSolrClient.java:1121)
	at org.apache.solr.client.solrj.impl.CloudSolrClient.requestWithRetryOnStaleState(CloudSolrClient.java:891)
	at org.apache.solr.client.solrj.impl.CloudSolrClient.request(CloudSolrClient.java:827)
	at org.apache.solr.client.solrj.SolrClient.request(SolrClient.java:1219)
	at org.apache.solr.cloud.CollectionsAPIDistributedZkTest$1CollectionThread.run(CollectionsAPIDistributedZkTest.java:991)


FAILED:  org.apache.solr.update.HardAutoCommitTest.testCommitWithin

Error Message:
Exception during query

Stack Trace:
java.lang.RuntimeException: Exception during query
	at __randomizedtesting.SeedInfo.seed([25107173F1D109D1:9FC21E0B72FFE7C4]:0)
	at org.apache.solr.SolrTestCaseJ4.assertQ(SolrTestCaseJ4.java:764)
	at org.apache.solr.update.HardAutoCommitTest.testCommitWithin(HardAutoCommitTest.java:99)
	at sun.reflect.NativeMethodAccessorImpl.invoke0(Native Method)
	at sun.reflect.NativeMethodAccessorImpl.invoke(NativeMethodAccessorImpl.java:57)
	at sun.reflect.DelegatingMethodAccessorImpl.invoke(DelegatingMethodAccessorImpl.java:43)
	at java.lang.reflect.Method.invoke(Method.java:606)
	at com.carrotsearch.randomizedtesting.RandomizedRunner.invoke(RandomizedRunner.java:1764)
	at com.carrotsearch.randomizedtesting.RandomizedRunner$8.evaluate(RandomizedRunner.java:871)
	at com.carrotsearch.randomizedtesting.RandomizedRunner$9.evaluate(RandomizedRunner.java:907)
	at com.carrotsearch.randomizedtesting.RandomizedRunner$10.evaluate(RandomizedRunner.java:921)
	at com.carrotsearch.randomizedtesting.rules.SystemPropertiesRestoreRule$1.evaluate(SystemPropertiesRestoreRule.java:57)
	at org.apache.lucene.util.TestRuleSetupTeardownChained$1.evaluate(TestRuleSetupTeardownChained.java:49)
	at org.apache.lucene.util.AbstractBeforeAfterRule$1.evaluate(AbstractBeforeAfterRule.java:45)
	at org.apache.lucene.util.TestRuleThreadAndTestName$1.evaluate(TestRuleThreadAndTestName.java:48)
	at org.apache.lucene.util.TestRuleIgnoreAfterMaxFailures$1.evaluate(TestRuleIgnoreAfterMaxFailures.java:64)
	at org.apache.lucene.util.TestRuleMarkFailure$1.evaluate(TestRuleMarkFailure.java:47)
	at com.carrotsearch.randomizedtesting.rules.StatementAdapter.evaluate(StatementAdapter.java:36)
	at com.carrotsearch.randomizedtesting.ThreadLeakControl$StatementRunner.run(ThreadLeakControl.java:367)
	at com.carrotsearch.randomizedtesting.ThreadLeakControl.forkTimeoutingTask(ThreadLeakControl.java:809)
	at com.carrotsearch.randomizedtesting.ThreadLeakControl$3.evaluate(ThreadLeakControl.java:460)
	at com.carrotsearch.randomizedtesting.RandomizedRunner.runSingleTest(RandomizedRunner.java:880)
	at com.carrotsearch.randomizedtesting.RandomizedRunner$5.evaluate(RandomizedRunner.java:781)
	at com.carrotsearch.randomizedtesting.RandomizedRunner$6.evaluate(RandomizedRunner.java:816)
	at com.carrotsearch.randomizedtesting.RandomizedRunner$7.evaluate(RandomizedRunner.java:827)
	at com.carrotsearch.randomizedtesting.rules.StatementAdapter.evaluate(StatementAdapter.java:36)
	at com.carrotsearch.randomizedtesting.rules.SystemPropertiesRestoreRule$1.evaluate(SystemPropertiesRestoreRule.java:57)
	at org.apache.lucene.util.AbstractBeforeAfterRule$1.evaluate(AbstractBeforeAfterRule.java:45)
	at com.carrotsearch.randomizedtesting.rules.StatementAdapter.evaluate(StatementAdapter.java:36)
	at org.apache.lucene.util.TestRuleStoreClassName$1.evaluate(TestRuleStoreClassName.java:41)
	at com.carrotsearch.randomizedtesting.rules.NoShadowingOrOverridesOnMethodsRule$1.evaluate(NoShadowingOrOverridesOnMethodsRule.java:40)
	at com.carrotsearch.randomizedtesting.rules.NoShadowingOrOverridesOnMethodsRule$1.evaluate(NoShadowingOrOverridesOnMethodsRule.java:40)
	at com.carrotsearch.randomizedtesting.rules.StatementAdapter.evaluate(StatementAdapter.java:36)
	at com.carrotsearch.randomizedtesting.rules.StatementAdapter.evaluate(StatementAdapter.java:36)
	at com.carrotsearch.randomizedtesting.rules.StatementAdapter.evaluate(StatementAdapter.java:36)
	at org.apache.lucene.util.TestRuleAssertionsRequired$1.evaluate(TestRuleAssertionsRequired.java:53)
	at org.apache.lucene.util.TestRuleMarkFailure$1.evaluate(TestRuleMarkFailure.java:47)
	at org.apache.lucene.util.TestRuleIgnoreAfterMaxFailures$1.evaluate(TestRuleIgnoreAfterMaxFailures.java:64)
	at org.apache.lucene.util.TestRuleIgnoreTestSuites$1.evaluate(TestRuleIgnoreTestSuites.java:54)
	at com.carrotsearch.randomizedtesting.rules.StatementAdapter.evaluate(StatementAdapter.java:36)
	at com.carrotsearch.randomizedtesting.ThreadLeakControl$StatementRunner.run(ThreadLeakControl.java:367)
	at java.lang.Thread.run(Thread.java:745)
Caused by: java.lang.RuntimeException: REQUEST FAILED: xpath=//result[@numFound=1]
	xml response was: <?xml version="1.0" encoding="UTF-8"?>
<response>
<lst name="responseHeader"><int name="status">0</int><int name="QTime">0</int></lst><result name="response" numFound="0" start="0"></result>
</response>

	request was:start=0&version=2.2&rows=20&q=id:529&qt=standard
	at org.apache.solr.SolrTestCaseJ4.assertQ(SolrTestCaseJ4.java:757)
	... 40 more




Build Log:
[...truncated 11238 lines...]
   [junit4] Suite: org.apache.solr.update.HardAutoCommitTest
   [junit4]   2> Creating dataDir: /x1/jenkins/jenkins-slave/workspace/Lucene-Solr-NightlyTests-5.5/checkout/solr/build/solr-core/test/J2/temp/solr.update.HardAutoCommitTest_25107173F1D109D1-001/init-core-data-001
   [junit4]   2> 438775 INFO  (SUITE-HardAutoCommitTest-seed#[25107173F1D109D1]-worker) [    ] o.a.s.SolrTestCaseJ4 Randomized ssl (false) and clientAuth (false)
   [junit4]   2> 438783 INFO  (SUITE-HardAutoCommitTest-seed#[25107173F1D109D1]-worker) [    ] o.a.s.SolrTestCaseJ4 ####initCore
   [junit4]   2> 438783 INFO  (SUITE-HardAutoCommitTest-seed#[25107173F1D109D1]-worker) [    ] o.a.s.c.SolrResourceLoader new SolrResourceLoader for directory: '/x1/jenkins/jenkins-slave/workspace/Lucene-Solr-NightlyTests-5.5/checkout/solr/core/src/test-files/solr/collection1'
   [junit4]   2> 438783 INFO  (SUITE-HardAutoCommitTest-seed#[25107173F1D109D1]-worker) [    ] o.a.s.c.SolrResourceLoader JNDI not configured for solr (NoInitialContextEx)
   [junit4]   2> 438783 INFO  (SUITE-HardAutoCommitTest-seed#[25107173F1D109D1]-worker) [    ] o.a.s.c.SolrResourceLoader using system property solr.solr.home: /x1/jenkins/jenkins-slave/workspace/Lucene-Solr-NightlyTests-5.5/checkout/solr/core/src/test-files/solr
   [junit4]   2> 438784 INFO  (SUITE-HardAutoCommitTest-seed#[25107173F1D109D1]-worker) [    ] o.a.s.c.SolrResourceLoader Adding 'file:/x1/jenkins/jenkins-slave/workspace/Lucene-Solr-NightlyTests-5.5/checkout/solr/core/src/test-files/solr/collection1/lib/classes/' to classloader
   [junit4]   2> 438784 INFO  (SUITE-HardAutoCommitTest-seed#[25107173F1D109D1]-worker) [    ] o.a.s.c.SolrResourceLoader Adding 'file:/x1/jenkins/jenkins-slave/workspace/Lucene-Solr-NightlyTests-5.5/checkout/solr/core/src/test-files/solr/collection1/lib/README' to classloader
   [junit4]   2> 438799 INFO  (SUITE-HardAutoCommitTest-seed#[25107173F1D109D1]-worker) [    ] o.a.s.c.SolrConfig current version of requestparams : -1
   [junit4]   2> 438842 WARN  (SUITE-HardAutoCommitTest-seed#[25107173F1D109D1]-worker) [    ] o.a.s.c.Config Beginning with Solr 5.5, <mergePolicy> is deprecated, use <mergePolicyFactory> instead.
   [junit4]   2> 438847 INFO  (SUITE-HardAutoCommitTest-seed#[25107173F1D109D1]-worker) [    ] o.a.s.c.SolrConfig Using Lucene MatchVersion: 5.5.3
   [junit4]   2> 438925 INFO  (SUITE-HardAutoCommitTest-seed#[25107173F1D109D1]-worker) [    ] o.a.s.c.SolrConfig Loaded SolrConfig: solrconfig.xml
   [junit4]   2> 438930 INFO  (SUITE-HardAutoCommitTest-seed#[25107173F1D109D1]-worker) [    ] o.a.s.s.IndexSchema [null] Schema name=test
   [junit4]   2> 439236 INFO  (SUITE-HardAutoCommitTest-seed#[25107173F1D109D1]-worker) [    ] o.a.s.s.OpenExchangeRatesOrgProvider Initialized with rates=open-exchange-rates.json, refreshInterval=1440.
   [junit4]   2> 439242 INFO  (SUITE-HardAutoCommitTest-seed#[25107173F1D109D1]-worker) [    ] o.a.s.s.IndexSchema default search field in schema is text
   [junit4]   2> 439244 INFO  (SUITE-HardAutoCommitTest-seed#[25107173F1D109D1]-worker) [    ] o.a.s.s.IndexSchema unique key field: id
   [junit4]   2> 439249 INFO  (SUITE-HardAutoCommitTest-seed#[25107173F1D109D1]-worker) [    ] o.a.s.s.FileExchangeRateProvider Reloading exchange rates from file currency.xml
   [junit4]   2> 439252 INFO  (SUITE-HardAutoCommitTest-seed#[25107173F1D109D1]-worker) [    ] o.a.s.s.FileExchangeRateProvider Reloading exchange rates from file currency.xml
   [junit4]   2> 439254 INFO  (SUITE-HardAutoCommitTest-seed#[25107173F1D109D1]-worker) [    ] o.a.s.s.OpenExchangeRatesOrgProvider Reloading exchange rates from open-exchange-rates.json
   [junit4]   2> 439254 INFO  (SUITE-HardAutoCommitTest-seed#[25107173F1D109D1]-worker) [    ] o.a.s.s.OpenExchangeRatesOrgProvider Reloading exchange rates from open-exchange-rates.json
   [junit4]   2> 439254 INFO  (SUITE-HardAutoCommitTest-seed#[25107173F1D109D1]-worker) [    ] o.a.s.c.SolrResourceLoader JNDI not configured for solr (NoInitialContextEx)
   [junit4]   2> 439254 INFO  (SUITE-HardAutoCommitTest-seed#[25107173F1D109D1]-worker) [    ] o.a.s.c.SolrResourceLoader using system property solr.solr.home: /x1/jenkins/jenkins-slave/workspace/Lucene-Solr-NightlyTests-5.5/checkout/solr/core/src/test-files/solr
   [junit4]   2> 439254 INFO  (SUITE-HardAutoCommitTest-seed#[25107173F1D109D1]-worker) [    ] o.a.s.c.SolrResourceLoader new SolrResourceLoader for directory: '/x1/jenkins/jenkins-slave/workspace/Lucene-Solr-NightlyTests-5.5/checkout/solr/core/src/test-files/solr'
   [junit4]   2> 439254 INFO  (SUITE-HardAutoCommitTest-seed#[25107173F1D109D1]-worker) [    ] o.a.s.c.SolrResourceLoader JNDI not configured for solr (NoInitialContextEx)
   [junit4]   2> 439254 INFO  (SUITE-HardAutoCommitTest-seed#[25107173F1D109D1]-worker) [    ] o.a.s.c.SolrResourceLoader using system property solr.solr.home: /x1/jenkins/jenkins-slave/workspace/Lucene-Solr-NightlyTests-5.5/checkout/solr/core/src/test-files/solr
   [junit4]   2> 439254 INFO  (SUITE-HardAutoCommitTest-seed#[25107173F1D109D1]-worker) [    ] o.a.s.c.CoreContainer New CoreContainer 429113839
   [junit4]   2> 439254 INFO  (SUITE-HardAutoCommitTest-seed#[25107173F1D109D1]-worker) [    ] o.a.s.c.CoreContainer Loading cores into CoreContainer [instanceDir=/x1/jenkins/jenkins-slave/workspace/Lucene-Solr-NightlyTests-5.5/checkout/solr/core/src/test-files/solr]
   [junit4]   2> 439254 WARN  (SUITE-HardAutoCommitTest-seed#[25107173F1D109D1]-worker) [    ] o.a.s.c.CoreContainer Couldn't add files from /x1/jenkins/jenkins-slave/workspace/Lucene-Solr-NightlyTests-5.5/checkout/solr/core/src/test-files/solr/lib to classpath: /x1/jenkins/jenkins-slave/workspace/Lucene-Solr-NightlyTests-5.5/checkout/solr/core/src/test-files/solr/lib
   [junit4]   2> 439254 INFO  (SUITE-HardAutoCommitTest-seed#[25107173F1D109D1]-worker) [    ] o.a.s.h.c.HttpShardHandlerFactory created with socketTimeout : 600000,connTimeout : 60000,maxConnectionsPerHost : 20,maxConnections : 10000,corePoolSize : 0,maximumPoolSize : 2147483647,maxThreadIdleTime : 5,sizeOfQueue : -1,fairnessPolicy : false,useRetries : false,connectionsEvictorSleepDelay : 5000,maxConnectionIdleTime : 40000,
   [junit4]   2> 439256 INFO  (SUITE-HardAutoCommitTest-seed#[25107173F1D109D1]-worker) [    ] o.a.s.u.UpdateShardHandler Creating UpdateShardHandler HTTP client with params: socketTimeout=30000&connTimeout=30000&retry=true
   [junit4]   2> 439257 INFO  (SUITE-HardAutoCommitTest-seed#[25107173F1D109D1]-worker) [    ] o.a.s.l.LogWatcher SLF4J impl is org.slf4j.impl.Log4jLoggerFactory
   [junit4]   2> 439257 INFO  (SUITE-HardAutoCommitTest-seed#[25107173F1D109D1]-worker) [    ] o.a.s.l.LogWatcher Registering Log Listener [Log4j (org.slf4j.impl.Log4jLoggerFactory)]
   [junit4]   2> 439257 INFO  (SUITE-HardAutoCommitTest-seed#[25107173F1D109D1]-worker) [    ] o.a.s.c.CoreContainer Security conf doesn't exist. Skipping setup for authorization module.
   [junit4]   2> 439257 INFO  (SUITE-HardAutoCommitTest-seed#[25107173F1D109D1]-worker) [    ] o.a.s.c.CoreContainer No authentication plugin used.
   [junit4]   2> 439258 INFO  (SUITE-HardAutoCommitTest-seed#[25107173F1D109D1]-worker) [    ] o.a.s.c.CoreDescriptor Created CoreDescriptor: {name=collection1, collection=collection1, loadOnStartup=true, transient=false, shard=shard1, config=solrconfig.xml, dataDir=/x1/jenkins/jenkins-slave/workspace/Lucene-Solr-NightlyTests-5.5/checkout/solr/build/solr-core/test/J2/temp/solr.update.HardAutoCommitTest_25107173F1D109D1-001/init-core-data-001, configSetProperties=configsetprops.json, schema=schema.xml}
   [junit4]   2> 439259 INFO  (coreLoadExecutor-898-thread-1) [    ] o.a.s.c.SolrResourceLoader new SolrResourceLoader for directory: '/x1/jenkins/jenkins-slave/workspace/Lucene-Solr-NightlyTests-5.5/checkout/solr/core/src/test-files/solr/collection1'
   [junit4]   2> 439266 INFO  (coreLoadExecutor-898-thread-1) [    ] o.a.s.c.SolrResourceLoader JNDI not configured for solr (NoInitialContextEx)
   [junit4]   2> 439266 INFO  (coreLoadExecutor-898-thread-1) [    ] o.a.s.c.SolrResourceLoader using system property solr.solr.home: /x1/jenkins/jenkins-slave/workspace/Lucene-Solr-NightlyTests-5.5/checkout/solr/core/src/test-files/solr
   [junit4]   2> 439266 INFO  (coreLoadExecutor-898-thread-1) [    ] o.a.s.c.SolrResourceLoader Adding 'file:/x1/jenkins/jenkins-slave/workspace/Lucene-Solr-NightlyTests-5.5/checkout/solr/core/src/test-files/solr/collection1/lib/classes/' to classloader
   [junit4]   2> 439266 INFO  (coreLoadExecutor-898-thread-1) [    ] o.a.s.c.SolrResourceLoader Adding 'file:/x1/jenkins/jenkins-slave/workspace/Lucene-Solr-NightlyTests-5.5/checkout/solr/core/src/test-files/solr/collection1/lib/README' to classloader
   [junit4]   2> 439283 INFO  (coreLoadExecutor-898-thread-1) [    ] o.a.s.c.SolrConfig current version of requestparams : -1
   [junit4]   2> 439298 WARN  (coreLoadExecutor-898-thread-1) [    ] o.a.s.c.Config Beginning with Solr 5.5, <mergePolicy> is deprecated, use <mergePolicyFactory> instead.
   [junit4]   2> 439302 INFO  (coreLoadExecutor-898-thread-1) [    ] o.a.s.c.SolrConfig Using Lucene MatchVersion: 5.5.3
   [junit4]   2> 439360 INFO  (coreLoadExecutor-898-thread-1) [    ] o.a.s.c.SolrConfig Loaded SolrConfig: solrconfig.xml
   [junit4]   2> 439369 INFO  (coreLoadExecutor-898-thread-1) [    ] o.a.s.s.IndexSchema [collection1] Schema name=test
   [junit4]   2> 439882 INFO  (coreLoadExecutor-898-thread-1) [    ] o.a.s.s.OpenExchangeRatesOrgProvider Initialized with rates=open-exchange-rates.json, refreshInterval=1440.
   [junit4]   2> 439905 INFO  (coreLoadExecutor-898-thread-1) [    ] o.a.s.s.IndexSchema default search field in schema is text
   [junit4]   2> 439907 INFO  (coreLoadExecutor-898-thread-1) [    ] o.a.s.s.IndexSchema unique key field: id
   [junit4]   2> 439945 INFO  (coreLoadExecutor-898-thread-1) [    ] o.a.s.s.FileExchangeRateProvider Reloading exchange rates from file currency.xml
   [junit4]   2> 439947 INFO  (coreLoadExecutor-898-thread-1) [    ] o.a.s.s.FileExchangeRateProvider Reloading exchange rates from file currency.xml
   [junit4]   2> 439949 INFO  (coreLoadExecutor-898-thread-1) [    ] o.a.s.s.OpenExchangeRatesOrgProvider Reloading exchange rates from open-exchange-rates.json
   [junit4]   2> 439949 INFO  (coreLoadExecutor-898-thread-1) [    ] o.a.s.s.OpenExchangeRatesOrgProvider Reloading exchange rates from open-exchange-rates.json
   [junit4]   2> 439949 INFO  (coreLoadExecutor-898-thread-1) [    ] o.a.s.c.ConfigSetProperties Did not find ConfigSet properties, assuming default properties: Can't find resource 'configsetprops.json' in classpath or '/x1/jenkins/jenkins-slave/workspace/Lucene-Solr-NightlyTests-5.5/checkout/solr/core/src/test-files/solr/collection1'
   [junit4]   2> 439949 INFO  (coreLoadExecutor-898-thread-1) [    ] o.a.s.c.CoreContainer Creating SolrCore 'collection1' using configuration from instancedir /x1/jenkins/jenkins-slave/workspace/Lucene-Solr-NightlyTests-5.5/checkout/solr/core/src/test-files/solr/collection1
   [junit4]   2> 439950 INFO  (coreLoadExecutor-898-thread-1) [    x:collection1] o.a.s.c.SolrCore org.apache.solr.core.MockDirectoryFactory
   [junit4]   2> 439950 INFO  (coreLoadExecutor-898-thread-1) [    x:collection1] o.a.s.c.SolrCore [[collection1] ] Opening new SolrCore at [/x1/jenkins/jenkins-slave/workspace/Lucene-Solr-NightlyTests-5.5/checkout/solr/core/src/test-files/solr/collection1], dataDir=[/x1/jenkins/jenkins-slave/workspace/Lucene-Solr-NightlyTests-5.5/checkout/solr/build/solr-core/test/J2/temp/solr.update.HardAutoCommitTest_25107173F1D109D1-001/init-core-data-001/]
   [junit4]   2> 439950 INFO  (coreLoadExecutor-898-thread-1) [    x:collection1] o.a.s.c.JmxMonitoredMap JMX monitoring is enabled. Adding Solr mbeans to JMX Server: com.sun.jmx.mbeanserver.JmxMBeanServer@75c5cfb
   [junit4]   2> 439951 INFO  (coreLoadExecutor-898-thread-1) [    x:collection1] o.a.s.c.CachingDirectoryFactory return new directory for /x1/jenkins/jenkins-slave/workspace/Lucene-Solr-NightlyTests-5.5/checkout/solr/build/solr-core/test/J2/temp/solr.update.HardAutoCommitTest_25107173F1D109D1-001/init-core-data-001
   [junit4]   2> 439957 INFO  (coreLoadExecutor-898-thread-1) [    x:collection1] o.a.s.c.SolrCore New index directory detected: old=null new=/x1/jenkins/jenkins-slave/workspace/Lucene-Solr-NightlyTests-5.5/checkout/solr/build/solr-core/test/J2/temp/solr.update.HardAutoCommitTest_25107173F1D109D1-001/init-core-data-001/index/
   [junit4]   2> 439957 WARN  (coreLoadExecutor-898-thread-1) [    x:collection1] o.a.s.c.SolrCore [collection1] Solr index directory '/x1/jenkins/jenkins-slave/workspace/Lucene-Solr-NightlyTests-5.5/checkout/solr/build/solr-core/test/J2/temp/solr.update.HardAutoCommitTest_25107173F1D109D1-001/init-core-data-001/index' doesn't exist. Creating new index...
   [junit4]   2> 439958 INFO  (coreLoadExecutor-898-thread-1) [    x:collection1] o.a.s.c.CachingDirectoryFactory return new directory for /x1/jenkins/jenkins-slave/workspace/Lucene-Solr-NightlyTests-5.5/checkout/solr/build/solr-core/test/J2/temp/solr.update.HardAutoCommitTest_25107173F1D109D1-001/init-core-data-001/index
   [junit4]   2> 439958 INFO  (coreLoadExecutor-898-thread-1) [    x:collection1] o.a.s.u.RandomMergePolicy RandomMergePolicy wrapping class org.apache.lucene.index.MockRandomMergePolicy: org.apache.lucene.index.MockRandomMergePolicy@4d0b2b32
   [junit4]   2> 439959 INFO  (coreLoadExecutor-898-thread-1) [    x:collection1] o.a.s.c.SolrDeletionPolicy SolrDeletionPolicy.onCommit: commits: num=1
   [junit4]   2> 	commit{dir=MockDirectoryWrapper(NIOFSDirectory@/x1/jenkins/jenkins-slave/workspace/Lucene-Solr-NightlyTests-5.5/checkout/solr/build/solr-core/test/J2/temp/solr.update.HardAutoCommitTest_25107173F1D109D1-001/index-NIOFSDirectory-001 lockFactory=org.apache.lucene.store.NativeFSLockFactory@5a15ccfc),segFN=segments_1,generation=1}
   [junit4]   2> 439959 INFO  (coreLoadExecutor-898-thread-1) [    x:collection1] o.a.s.c.SolrDeletionPolicy newest commit generation = 1
   [junit4]   2> 439962 INFO  (coreLoadExecutor-898-thread-1) [    x:collection1] o.a.s.u.p.UpdateRequestProcessorChain creating updateRequestProcessorChain "dedupe"
   [junit4]   2> 439962 INFO  (coreLoadExecutor-898-thread-1) [    x:collection1] o.a.s.u.p.UpdateRequestProcessorChain inserting DistributedUpdateProcessorFactory into updateRequestProcessorChain "dedupe"
   [junit4]   2> 439962 INFO  (coreLoadExecutor-898-thread-1) [    x:collection1] o.a.s.u.p.UpdateRequestProcessorChain creating updateRequestProcessorChain "dedupe-allfields"
   [junit4]   2> 439962 INFO  (coreLoadExecutor-898-thread-1) [    x:collection1] o.a.s.u.p.UpdateRequestProcessorChain inserting DistributedUpdateProcessorFactory into updateRequestProcessorChain "dedupe-allfields"
   [junit4]   2> 439962 INFO  (coreLoadExecutor-898-thread-1) [    x:collection1] o.a.s.u.p.UpdateRequestProcessorChain creating updateRequestProcessorChain "stored_sig"
   [junit4]   2> 439963 INFO  (coreLoadExecutor-898-thread-1) [    x:collection1] o.a.s.u.p.UpdateRequestProcessorChain inserting DistributedUpdateProcessorFactory into updateRequestProcessorChain "stored_sig"
   [junit4]   2> 439963 INFO  (coreLoadExecutor-898-thread-1) [    x:collection1] o.a.s.u.p.UpdateRequestProcessorChain creating updateRequestProcessorChain "uniq-fields"
   [junit4]   2> 439963 INFO  (coreLoadExecutor-898-thread-1) [    x:collection1] o.a.s.u.p.UpdateRequestProcessorChain inserting DistributedUpdateProcessorFactory into updateRequestProcessorChain "uniq-fields"
   [junit4]   2> 439963 INFO  (coreLoadExecutor-898-thread-1) [    x:collection1] o.a.s.u.p.UpdateRequestProcessorChain creating updateRequestProcessorChain "distrib-dup-test-chain-explicit"
   [junit4]   2> 439963 INFO  (coreLoadExecutor-898-thread-1) [    x:collection1] o.a.s.u.p.UpdateRequestProcessorChain creating updateRequestProcessorChain "distrib-dup-test-chain-implicit"
   [junit4]   2> 439963 INFO  (coreLoadExecutor-898-thread-1) [    x:collection1] o.a.s.u.p.UpdateRequestProcessorChain inserting DistributedUpdateProcessorFactory into updateRequestProcessorChain "distrib-dup-test-chain-implicit"
   [junit4]   2> 439963 INFO  (coreLoadExecutor-898-thread-1) [    x:collection1] o.a.s.c.SolrCore no updateRequestProcessorChain defined as default, creating implicit default
   [junit4]   2> 439964 INFO  (coreLoadExecutor-898-thread-1) [    x:collection1] o.a.s.h.l.XMLLoader xsltCacheLifetimeSeconds=60
   [junit4]   2> 439965 INFO  (coreLoadExecutor-898-thread-1) [    x:collection1] o.a.s.h.l.XMLLoader xsltCacheLifetimeSeconds=60
   [junit4]   2> 439966 INFO  (coreLoadExecutor-898-thread-1) [    x:collection1] o.a.s.h.l.XMLLoader xsltCacheLifetimeSeconds=60
   [junit4]   2> 439972 INFO  (coreLoadExecutor-898-thread-1) [    x:collection1] o.a.s.h.l.XMLLoader xsltCacheLifetimeSeconds=60
   [junit4]   2> 439976 INFO  (coreLoadExecutor-898-thread-1) [    x:collection1] o.a.s.c.PluginBag requestHandler : 'lazy' created with startup=lazy 
   [junit4]   2> 439977 INFO  (coreLoadExecutor-898-thread-1) [    x:collection1] o.a.s.c.RequestHandlers Registered paths: /admin/segments,lazy,defaults,/update/csv,spellCheckCompRH1,mltrh,/debug/dump,/search-facet-def,/admin/file,/update,tvrh,/terms,/admin/threads,spellCheckWithWordbreak_Direct,/admin/system,spellCheckCompRH_Direct,/mlt,/replication,/search-facet-invariants,/update/json,/config,/admin/plugins,/admin/properties,/get,standard,mock,spellCheckCompRH,/admin/ping,/admin/logging,/schema,spellCheckWithWordbreak,dismax,/admin/mbeans,/admin/luke,/update/json/docs
   [junit4]   2> 439978 WARN  (coreLoadExecutor-898-thread-1) [    x:collection1] o.a.s.c.SolrCore solrconfig.xml uses deprecated <admin/gettableFiles>, Please update your config to use the ShowFileRequestHandler.
   [junit4]   2> 439979 INFO  (coreLoadExecutor-898-thread-1) [    x:collection1] o.a.s.c.SolrCore Using default statsCache cache: org.apache.solr.search.stats.LocalStatsCache
   [junit4]   2> 439979 INFO  (OldIndexDirectoryCleanupThreadForCore-collection1) [    x:collection1] o.a.s.c.SolrCore Looking for old index directories to cleanup for core collection1 in /x1/jenkins/jenkins-slave/workspace/Lucene-Solr-NightlyTests-5.5/checkout/solr/build/solr-core/test/J2/temp/solr.update.HardAutoCommitTest_25107173F1D109D1-001/init-core-data-001/
   [junit4]   2> 439980 INFO  (coreLoadExecutor-898-thread-1) [    x:collection1] o.a.s.u.UpdateHandler Using UpdateLog implementation: org.apache.solr.update.UpdateLog
   [junit4]   2> 439980 INFO  (coreLoadExecutor-898-thread-1) [    x:collection1] o.a.s.u.UpdateLog Initializing UpdateLog: dataDir= defaultSyncLevel=FLUSH numRecordsToKeep=100 maxNumLogsToKeep=10 numVersionBuckets=65536
   [junit4]   2> 439980 INFO  (coreLoadExecutor-898-thread-1) [    x:collection1] o.a.s.u.CommitTracker Hard AutoCommit: disabled
   [junit4]   2> 439980 INFO  (coreLoadExecutor-898-thread-1) [    x:collection1] o.a.s.u.CommitTracker Soft AutoCommit: disabled
   [junit4]   2> 439981 INFO  (coreLoadExecutor-898-thread-1) [    x:collection1] o.a.s.u.RandomMergePolicy RandomMergePolicy wrapping class org.apache.lucene.index.TieredMergePolicy: [TieredMergePolicy: maxMergeAtOnce=42, maxMergeAtOnceExplicit=24, maxMergedSegmentMB=88.33203125, floorSegmentMB=0.2890625, forceMergeDeletesPctAllowed=0.8232403590394177, segmentsPerTier=25.0, maxCFSSegmentSizeMB=8.796093022207999E12, noCFSRatio=0.5391238227299805
   [junit4]   2> 439982 INFO  (coreLoadExecutor-898-thread-1) [    x:collection1] o.a.s.c.SolrDeletionPolicy SolrDeletionPolicy.onInit: commits: num=1
   [junit4]   2> 	commit{dir=MockDirectoryWrapper(NIOFSDirectory@/x1/jenkins/jenkins-slave/workspace/Lucene-Solr-NightlyTests-5.5/checkout/solr/build/solr-core/test/J2/temp/solr.update.HardAutoCommitTest_25107173F1D109D1-001/index-NIOFSDirectory-001 lockFactory=org.apache.lucene.store.NativeFSLockFactory@5a15ccfc),segFN=segments_1,generation=1}
   [junit4]   2> 439982 INFO  (coreLoadExecutor-898-thread-1) [    x:collection1] o.a.s.c.SolrDeletionPolicy newest commit generation = 1
   [junit4]   2> 439982 INFO  (coreLoadExecutor-898-thread-1) [    x:collection1] o.a.s.s.SolrIndexSearcher Opening Searcher@3ce2e325[collection1] main
   [junit4]   2> 439983 INFO  (coreLoadExecutor-898-thread-1) [    x:collection1] o.a.s.r.RestManager Initializing RestManager with initArgs: {storageIO=org.apache.solr.rest.ManagedResourceStorage$InMemoryStorageIO}
   [junit4]   2> 439983 INFO  (coreLoadExecutor-898-thread-1) [    x:collection1] o.a.s.r.ManagedResourceStorage Reading _rest_managed.json using InMemoryStorage
   [junit4]   2> 439983 INFO  (coreLoadExecutor-898-thread-1) [    x:collection1] o.a.s.r.RestManager Initializing 0 registered ManagedResources
   [junit4]   2> 439983 INFO  (coreLoadExecutor-898-thread-1) [    x:collection1] o.a.s.h.c.SpellCheckComponent Initializing spell checkers
   [junit4]   2> 439992 INFO  (coreLoadExecutor-898-thread-1) [    x:collection1] o.a.s.s.DirectSolrSpellChecker init: {name=direct,classname=DirectSolrSpellChecker,field=lowerfilt,minQueryLength=3}
   [junit4]   2> 440015 INFO  (coreLoadExecutor-898-thread-1) [    x:collection1] o.a.s.h.ReplicationHandler Commits will be reserved for  10000
   [junit4]   2> 440016 INFO  (searcherExecutor-899-thread-1-processing-x:collection1) [    x:collection1] o.a.s.h.c.SpellCheckComponent Loading spell index for spellchecker: default
   [junit4]   2> 440016 INFO  (searcherExecutor-899-thread-1-processing-x:collection1) [    x:collection1] o.a.s.h.c.SpellCheckComponent Loading spell index for spellchecker: direct
   [junit4]   2> 440016 INFO  (searcherExecutor-899-thread-1-processing-x:collection1) [    x:collection1] o.a.s.h.c.SpellCheckComponent Loading spell index for spellchecker: wordbreak
   [junit4]   2> 440016 INFO  (searcherExecutor-899-thread-1-processing-x:collection1) [    x:collection1] o.a.s.h.c.SpellCheckComponent Loading spell index for spellchecker: multipleFields
   [junit4]   2> 440016 INFO  (searcherExecutor-899-thread-1-processing-x:collection1) [    x:collection1] o.a.s.h.c.SpellCheckComponent Loading spell index for spellchecker: jarowinkler
   [junit4]   2> 440017 INFO  (searcherExecutor-899-thread-1-processing-x:collection1) [    x:collection1] o.a.s.h.c.SpellCheckComponent Loading spell index for spellchecker: external
   [junit4]   2> 440017 INFO  (searcherExecutor-899-thread-1-processing-x:collection1) [    x:collection1] o.a.s.h.c.SpellCheckComponent Loading spell index for spellchecker: freq
   [junit4]   2> 440017 INFO  (searcherExecutor-899-thread-1-processing-x:collection1) [    x:collection1] o.a.s.h.c.SpellCheckComponent Loading spell index for spellchecker: fqcn
   [junit4]   2> 440018 INFO  (searcherExecutor-899-thread-1-processing-x:collection1) [    x:collection1] o.a.s.h.c.SpellCheckComponent Loading spell index for spellchecker: perDict
   [junit4]   2> 440018 INFO  (searcherExecutor-899-thread-1-processing-x:collection1) [    x:collection1] o.a.s.c.SolrCore [collection1] Registered new searcher Searcher@3ce2e325[collection1] main{ExitableDirectoryReader(UninvertingDirectoryReader())}
   [junit4]   2> 440019 INFO  (coreLoadExecutor-898-thread-1) [    x:collection1] o.a.s.u.UpdateLog Looking up max value of version field to seed version buckets
   [junit4]   2> 440019 INFO  (coreLoadExecutor-898-thread-1) [    x:collection1] o.a.s.u.VersionInfo Refreshing highest value of _version_ for 65536 version buckets from index
   [junit4]   2> 440019 INFO  (coreLoadExecutor-898-thread-1) [    x:collection1] o.a.s.u.VersionInfo No terms found for _version_, cannot seed version bucket highest value from index
   [junit4]   2> 440019 INFO  (coreLoadExecutor-898-thread-1) [    x:collection1] o.a.s.u.UpdateLog Could not find max version in index or recent updates, using new clock 1544303420663398400
   [junit4]   2> 440021 INFO  (coreLoadExecutor-898-thread-1) [    x:collection1] o.a.s.u.UpdateLog Took 1.0ms to seed version buckets with highest version 1544303420663398400
   [junit4]   2> 440021 INFO  (coreLoadExecutor-898-thread-1) [    x:collection1] o.a.s.c.CoreContainer registering core: collection1
   [junit4]   2> 440022 INFO  (SUITE-HardAutoCommitTest-seed#[25107173F1D109D1]-worker) [    ] o.a.s.SolrTestCaseJ4 ####initCore end
   [junit4]   2> 440027 INFO  (TEST-HardAutoCommitTest.testCommitWithin-seed#[25107173F1D109D1]) [    ] o.a.s.SolrTestCaseJ4 ###Starting testCommitWithin
   [junit4]   2> 440029 INFO  (TEST-HardAutoCommitTest.testCommitWithin-seed#[25107173F1D109D1]) [    ] o.a.s.u.p.LogUpdateProcessorFactory [collection1]  webapp=null path=null params={}{deleteByQuery=*:* (-1544303420672835584)} 0 1
   [junit4]   2> 440031 INFO  (TEST-HardAutoCommitTest.testCommitWithin-seed#[25107173F1D109D1]) [    ] o.a.s.c.SolrResourceLoader new SolrResourceLoader for directory: '/x1/jenkins/jenkins-slave/workspace/Lucene-Solr-NightlyTests-5.5/checkout/solr/core/src/test-files/solr/collection1'
   [junit4]   2> 440032 INFO  (TEST-HardAutoCommitTest.testCommitWithin-seed#[25107173F1D109D1]) [    ] o.a.s.c.SolrResourceLoader JNDI not configured for solr (NoInitialContextEx)
   [junit4]   2> 440032 INFO  (TEST-HardAutoCommitTest.testCommitWithin-seed#[25107173F1D109D1]) [    ] o.a.s.c.SolrResourceLoader using system property solr.solr.home: /x1/jenkins/jenkins-slave/workspace/Lucene-Solr-NightlyTests-5.5/checkout/solr/core/src/test-files/solr
   [junit4]   2> 440032 INFO  (TEST-HardAutoCommitTest.testCommitWithin-seed#[25107173F1D109D1]) [    ] o.a.s.c.SolrResourceLoader Adding 'file:/x1/jenkins/jenkins-slave/workspace/Lucene-Solr-NightlyTests-5.5/checkout/solr/core/src/test-files/solr/collection1/lib/classes/' to classloader
   [junit4]   2> 440032 INFO  (TEST-HardAutoCommitTest.testCommitWithin-seed#[25107173F1D109D1]) [    ] o.a.s.c.SolrResourceLoader Adding 'file:/x1/jenkins/jenkins-slave/workspace/Lucene-Solr-NightlyTests-5.5/checkout/solr/core/src/test-files/solr/collection1/lib/README' to classloader
   [junit4]   2> 440080 INFO  (TEST-HardAutoCommitTest.testCommitWithin-seed#[25107173F1D109D1]) [    ] o.a.s.c.SolrConfig current version of requestparams : -1
   [junit4]   2> 440100 WARN  (TEST-HardAutoCommitTest.testCommitWithin-seed#[25107173F1D109D1]) [    ] o.a.s.c.Config Beginning with Solr 5.5, <mergePolicy> is deprecated, use <mergePolicyFactory> instead.
   [junit4]   2> 440104 INFO  (TEST-HardAutoCommitTest.testCommitWithin-seed#[25107173F1D109D1]) [    ] o.a.s.c.SolrConfig Using Lucene MatchVersion: 5.5.3
   [junit4]   2> 440144 INFO  (TEST-HardAutoCommitTest.testCommitWithin-seed#[25107173F1D109D1]) [    ] o.a.s.c.SolrConfig Loaded SolrConfig: solrconfig.xml
   [junit4]   2> 440149 INFO  (TEST-HardAutoCommitTest.testCommitWithin-seed#[25107173F1D109D1]) [    ] o.a.s.s.IndexSchema [collection1] Schema name=test
   [junit4]   2> 440478 INFO  (TEST-HardAutoCommitTest.testCommitWithin-seed#[25107173F1D109D1]) [    ] o.a.s.s.OpenExchangeRatesOrgProvider Initialized with rates=open-exchange-rates.json, refreshInterval=1440.
   [junit4]   2> 440496 INFO  (TEST-HardAutoCommitTest.testCommitWithin-seed#[25107173F1D109D1]) [    ] o.a.s.s.IndexSchema default search field in schema is text
   [junit4]   2> 440497 INFO  (TEST-HardAutoCommitTest.testCommitWithin-seed#[25107173F1D109D1]) [    ] o.a.s.s.IndexSchema unique key field: id
   [junit4]   2> 440503 INFO  (TEST-HardAutoCommitTest.testCommitWithin-seed#[25107173F1D109D1]) [    ] o.a.s.s.FileExchangeRateProvider Reloading exchange rates from file currency.xml
   [junit4]   2> 440505 INFO  (TEST-HardAutoCommitTest.testCommitWithin-seed#[25107173F1D109D1]) [    ] o.a.s.s.FileExchangeRateProvider Reloading exchange rates from file currency.xml
   [junit4]   2> 440507 INFO  (TEST-HardAutoCommitTest.testCommitWithin-seed#[25107173F1D109D1]) [    ] o.a.s.s.OpenExchangeRatesOrgProvider Reloading exchange rates from open-exchange-rates.json
   [junit4]   2> 440507 INFO  (TEST-HardAutoCommitTest.testCommitWithin-seed#[25107173F1D109D1]) [    ] o.a.s.s.OpenExchangeRatesOrgProvider Reloading exchange rates from open-exchange-rates.json
   [junit4]   2> 440508 INFO  (TEST-HardAutoCommitTest.testCommitWithin-seed#[25107173F1D109D1]) [    ] o.a.s.c.ConfigSetProperties Did not find ConfigSet properties, assuming default properties: Can't find resource 'configsetprops.json' in classpath or '/x1/jenkins/jenkins-slave/workspace/Lucene-Solr-NightlyTests-5.5/checkout/solr/core/src/test-files/solr/collection1'
   [junit4]   2> 440508 INFO  (TEST-HardAutoCommitTest.testCommitWithin-seed#[25107173F1D109D1]) [    ] o.a.s.c.CoreContainer Reloading SolrCore 'collection1' using configuration from instancedir /x1/jenkins/jenkins-slave/workspace/Lucene-Solr-NightlyTests-5.5/checkout/solr/core/src/test-files/solr/collection1
   [junit4]   2> 440509 INFO  (TEST-HardAutoCommitTest.testCommitWithin-seed#[25107173F1D109D1]) [    x:collection1] o.a.s.c.SolrCore [[collection1] ] Opening new SolrCore at [/x1/jenkins/jenkins-slave/workspace/Lucene-Solr-NightlyTests-5.5/checkout/solr/core/src/test-files/solr/collection1], dataDir=[/x1/jenkins/jenkins-slave/workspace/Lucene-Solr-NightlyTests-5.5/checkout/solr/build/solr-core/test/J2/temp/solr.update.HardAutoCommitTest_25107173F1D109D1-001/init-core-data-001/]
   [junit4]   2> 440509 INFO  (TEST-HardAutoCommitTest.testCommitWithin-seed#[25107173F1D109D1]) [    x:collection1] o.a.s.c.JmxMonitoredMap JMX monitoring is enabled. Adding Solr mbeans to JMX Server: com.sun.jmx.mbeanserver.JmxMBeanServer@75c5cfb
   [junit4]   2> 440510 INFO  (TEST-HardAutoCommitTest.testCommitWithin-seed#[25107173F1D109D1]) [    x:collection1] o.a.s.c.SolrCore New index directory detected: old=null new=/x1/jenkins/jenkins-slave/workspace/Lucene-Solr-NightlyTests-5.5/checkout/solr/build/solr-core/test/J2/temp/solr.update.HardAutoCommitTest_25107173F1D109D1-001/init-core-data-001/index/
   [junit4]   2> 440513 INFO  (TEST-HardAutoCommitTest.testCommitWithin-seed#[25107173F1D109D1]) [    x:collection1] o.a.s.u.p.UpdateRequestProcessorChain creating updateRequestProcessorChain "dedupe"
   [junit4]   2> 440513 INFO  (TEST-HardAutoCommitTest.testCommitWithin-seed#[25107173F1D109D1]) [    x:collection1] o.a.s.u.p.UpdateRequestProcessorChain inserting DistributedUpdateProcessorFactory into updateRequestProcessorChain "dedupe"
   [junit4]   2> 440513 INFO  (TEST-HardAutoCommitTest.testCommitWithin-seed#[25107173F1D109D1]) [    x:collection1] o.a.s.u.p.UpdateRequestProcessorChain creating updateRequestProcessorChain "dedupe-allfields"
   [junit4]   2> 440514 INFO  (TEST-HardAutoCommitTest.testCommitWithin-seed#[25107173F1D109D1]) [    x:collection1] o.a.s.u.p.UpdateRequestProcessorChain inserting DistributedUpdateProcessorFactory into updateRequestProcessorChain "dedupe-allfields"
   [junit4]   2> 440514 INFO  (TEST-HardAutoCommitTest.testCommitWithin-seed#[25107173F1D109D1]) [    x:collection1] o.a.s.u.p.UpdateRequestProcessorChain creating updateRequestProcessorChain "stored_sig"
   [junit4]   2> 440514 INFO  (TEST-HardAutoCommitTest.testCommitWithin-seed#[25107173F1D109D1]) [    x:collection1] o.a.s.u.p.UpdateRequestProcessorChain inserting DistributedUpdateProcessorFactory into updateRequestProcessorChain "stored_sig"
   [junit4]   2> 440514 INFO  (TEST-HardAutoCommitTest.testCommitWithin-seed#[25107173F1D109D1]) [    x:collection1] o.a.s.u.p.UpdateRequestProcessorChain creating updateRequestProcessorChain "uniq-fields"
   [junit4]   2> 440514 INFO  (TEST-HardAutoCommitTest.testCommitWithin-seed#[25107173F1D109D1]) [    x:collection1] o.a.s.u.p.UpdateRequestProcessorChain inserting DistributedUpdateProcessorFactory into updateRequestProcessorChain "uniq-fields"
   [junit4]   2> 440514 INFO  (TEST-HardAutoCommitTest.testCommitWithin-seed#[25107173F1D109D1]) [    x:collection1] o.a.s.u.p.UpdateRequestProcessorChain creating updateRequestProcessorChain "distrib-dup-test-chain-explicit"
   [junit4]   2> 440514 INFO  (TEST-HardAutoCommitTest.testCommitWithin-seed#[25107173F1D109D1]) [    x:collection1] o.a.s.u.p.UpdateRequestProcessorChain creating updateRequestProcessorChain "distrib-dup-test-chain-implicit"
   [junit4]   2> 440514 INFO  (TEST-HardAutoCommitTest.testCommitWithin-seed#[25107173F1D109D1]) [    x:collection1] o.a.s.u.p.UpdateRequestProcessorChain inserting DistributedUpdateProcessorFactory into updateRequestProcessorChain "distrib-dup-test-chain-implicit"
   [junit4]   2> 440514 INFO  (TEST-HardAutoCommitTest.testCommitWithin-seed#[25107173F1D109D1]) [    x:collection1] o.a.s.c.SolrCore no updateRequestProcessorChain defined as default, creating implicit default
   [junit4]   2> 440515 INFO  (TEST-HardAutoCommitTest.testCommitWithin-seed#[25107173F1D109D1]) [    x:collection1] o.a.s.h.l.XMLLoader xsltCacheLifetimeSeconds=60
   [junit4]   2> 440516 INFO  (TEST-HardAutoCommitTest.testCommitWithin-seed#[25107173F1D109D1]) [    x:collection1] o.a.s.h.l.XMLLoader xsltCacheLifetimeSeconds=60
   [junit4]   2> 440517 INFO  (TEST-HardAutoCommitTest.testCommitWithin-seed#[25107173F1D109D1]) [    x:collection1] o.a.s.h.l.XMLLoader xsltCacheLifetimeSeconds=60
   [junit4]   2> 440517 INFO  (OldIndexDirectoryCleanupThreadForCore-collection1) [    x:collection1] o.a.s.c.SolrCore Looking for old index directories to cleanup for core collection1 in /x1/jenkins/jenkins-slave/workspace/Lucene-Solr-NightlyTests-5.5/checkout/solr/build/solr-core/test/J2/temp/solr.update.HardAutoCommitTest_25107173F1D109D1-001/init-core-data-001/
   [junit4]   2> 440518 INFO  (TEST-HardAutoCommitTest.testCommitWithin-seed#[25107173F1D109D1]) [    x:collection1] o.a.s.h.l.XMLLoader xsltCacheLifetimeSeconds=60
   [junit4]   2> 440523 INFO  (TEST-HardAutoCommitTest.testCommitWithin-seed#[25107173F1D109D1]) [    x:collection1] o.a.s.c.PluginBag requestHandler : 'lazy' created with startup=lazy 
   [junit4]   2> 440529 INFO  (TEST-HardAutoCommitTest.testCommitWithin-seed#[25107173F1D109D1]) [    x:collection1] o.a.s.c.RequestHandlers Registered paths: /admin/segments,lazy,defaults,/update/csv,spellCheckCompRH1,mltrh,/debug/dump,/search-facet-def,/admin/file,/update,tvrh,/terms,/admin/threads,spellCheckWithWordbreak_Direct,/admin/system,spellCheckCompRH_Direct,/mlt,/replication,/search-facet-invariants,/update/json,/config,/admin/plugins,/admin/properties,/get,standard,mock,spellCheckCompRH,/admin/ping,/admin/logging,/schema,spellCheckWithWordbreak,dismax,/admin/mbeans,/admin/luke,/update/json/docs
   [junit4]   2> 440531 WARN  (TEST-HardAutoCommitTest.testCommitWithin-seed#[25107173F1D109D1]) [    x:collection1] o.a.s.c.SolrCore solrconfig.xml uses deprecated <admin/gettableFiles>, Please update your config to use the ShowFileRequestHandler.
   [junit4]   2> 440535 INFO  (TEST-HardAutoCommitTest.testCommitWithin-seed#[25107173F1D109D1]) [    x:collection1] o.a.s.c.SolrCore Using default statsCache cache: org.apache.solr.search.stats.LocalStatsCache
   [junit4]   2> 440536 INFO  (TEST-HardAutoCommitTest.testCommitWithin-seed#[25107173F1D109D1]) [    x:collection1] o.a.s.u.CommitTracker Hard AutoCommit: disabled
   [junit4]   2> 440536 INFO  (TEST-HardAutoCommitTest.testCommitWithin-seed#[25107173F1D109D1]) [    x:collection1] o.a.s.u.CommitTracker Soft AutoCommit: disabled
   [junit4]   2> 440537 INFO  (TEST-HardAutoCommitTest.testCommitWithin-seed#[25107173F1D109D1]) [    x:collection1] o.a.s.s.SolrIndexSearcher Opening Searcher@5859565a[collection1] main
   [junit4]   2> 440537 INFO  (TEST-HardAutoCommitTest.testCommitWithin-seed#[25107173F1D109D1]) [    x:collection1] o.a.s.r.RestManager Initializing RestManager with initArgs: {storageIO=org.apache.solr.rest.ManagedResourceStorage$InMemoryStorageIO}
   [junit4]   2> 440538 INFO  (TEST-HardAutoCommitTest.testCommitWithin-seed#[25107173F1D109D1]) [    x:collection1] o.a.s.r.ManagedResourceStorage Reading _rest_managed.json using InMemoryStorage
   [junit4]   2> 440538 INFO  (TEST-HardAutoCommitTest.testCommitWithin-seed#[25107173F1D109D1]) [    x:collection1] o.a.s.r.RestManager Initializing 0 registered ManagedResources
   [junit4]   2> 440538 INFO  (TEST-HardAutoCommitTest.testCommitWithin-seed#[25107173F1D109D1]) [    x:collection1] o.a.s.h.c.SpellCheckComponent Initializing spell checkers
   [junit4]   2> 440538 INFO  (TEST-HardAutoCommitTest.testCommitWithin-seed#[25107173F1D109D1]) [    x:collection1] o.a.s.s.DirectSolrSpellChecker init: {name=direct,classname=DirectSolrSpellChecker,field=lowerfilt,minQueryLength=3}
   [junit4]   2> 440541 INFO  (TEST-HardAutoCommitTest.testCommitWithin-seed#[25107173F1D109D1]) [    x:collection1] o.a.s.h.ReplicationHandler Commits will be reserved for  10000
   [junit4]   2> 440542 INFO  (TEST-HardAutoCommitTest.testCommitWithin-seed#[25107173F1D109D1]) [    x:collection1] o.a.s.u.UpdateLog Looking up max value of version field to seed version buckets
   [junit4]   2> 440542 INFO  (TEST-HardAutoCommitTest.testCommitWithin-seed#[25107173F1D109D1]) [    x:collection1] o.a.s.u.VersionInfo Refreshing highest value of _version_ for 65536 version buckets from index
   [junit4]   2> 440542 INFO  (TEST-HardAutoCommitTest.testCommitWithin-seed#[25107173F1D109D1]) [    x:collection1] o.a.s.u.VersionInfo No terms found for _version_, cannot seed version bucket highest value from index
   [junit4]   2> 440544 INFO  (TEST-HardAutoCommitTest.testCommitWithin-seed#[25107173F1D109D1]) [    x:collection1] o.a.s.u.UpdateLog Took 2.0ms to seed version buckets with highest version 1544303420672835584
   [junit4]   2> 440544 INFO  (TEST-HardAutoCommitTest.testCommitWithin-seed#[25107173F1D109D1]) [    x:collection1] o.a.s.u.DefaultSolrCoreState Closing old IndexWriter... core=collection1
   [junit4]   2> 440545 INFO  (searcherExecutor-904-thread-1-processing-x:collection1) [    x:collection1] o.a.s.h.c.SpellCheckComponent Loading spell index for spellchecker: default
   [junit4]   2> 440546 INFO  (searcherExecutor-904-thread-1-processing-x:collection1) [    x:collection1] o.a.s.h.c.SpellCheckComponent Loading spell index for spellchecker: direct
   [junit4]   2> 440546 INFO  (searcherExecutor-904-thread-1-processing-x:collection1) [    x:collection1] o.a.s.h.c.SpellCheckComponent Loading spell index for spellchecker: wordbreak
   [junit4]   2> 440546 INFO  (searcherExecutor-904-thread-1-processing-x:collection1) [    x:collection1] o.a.s.h.c.SpellCheckComponent Loading spell index for spellchecker: multipleFields
   [junit4]   2> 440546 INFO  (searcherExecutor-904-thread-1-processing-x:collection1) [    x:collection1] o.a.s.h.c.SpellCheckComponent Loading spell index for spellchecker: jarowinkler
   [junit4]   2> 440546 INFO  (searcherExecutor-904-thread-1-processing-x:collection1) [    x:collection1] o.a.s.h.c.SpellCheckComponent Loading spell index for spellchecker: external
   [junit4]   2> 440546 INFO  (searcherExecutor-904-thread-1-processing-x:collection1) [    x:collection1] o.a.s.h.c.SpellCheckComponent Loading spell index for spellchecker: freq
   [junit4]   2> 440551 INFO  (searcherExecutor-904-thread-1-processing-x:collection1) [    x:collection1] o.a.s.h.c.SpellCheckComponent Loading spell index for spellchecker: fqcn
   [junit4]   2> 440551 INFO  (searcherExecutor-904-thread-1-processing-x:collection1) [    x:collection1] o.a.s.h.c.SpellCheckComponent Loading spell index for spellchecker: perDict
   [junit4]   2> 440552 INFO  (searcherExecutor-904-thread-1-processing-x:collection1) [    x:collection1] o.a.s.c.SolrCore [collection1] Registered new searcher Searcher@5859565a[collection1] main{ExitableDirectoryReader(UninvertingDirectoryReader())}
   [junit4]   2> 440552 INFO  (TEST-HardAutoCommitTest.testCommitWithin-seed#[25107173F1D109D1]) [    x:collection1] o.a.s.u.RandomMergePolicy RandomMergePolicy wrapping class org.apache.lucene.index.MockRandomMergePolicy: org.apache.lucene.index.MockRandomMergePolicy@465faac2
   [junit4]   2> 440553 INFO  (TEST-HardAutoCommitTest.testCommitWithin-seed#[25107173F1D109D1]) [    x:collection1] o.a.s.c.SolrDeletionPolicy SolrDeletionPolicy.onInit: commits: num=1
   [junit4]   2> 	commit{dir=MockDirectoryWrapper(NIOFSDirectory@/x1/jenkins/jenkins-slave/workspace/Lucene-Solr-NightlyTests-5.5/checkout/solr/build/solr-core/test/J2/temp/solr.update.HardAutoCommitTest_25107173F1D109D1-001/index-NIOFSDirectory-001 lockFactory=org.apache.lucene.store.NativeFSLockFactory@5a15ccfc),segFN=segments_1,generation=1}
   [junit4]   2> 440553 INFO  (TEST-HardAutoCommitTest.testCommitWithin-seed#[25107173F1D109D1]) [    x:collection1] o.a.s.c.SolrDeletionPolicy newest commit generation = 1
   [junit4]   2> 440553 INFO  (TEST-HardAutoCommitTest.testCommitWithin-seed#[25107173F1D109D1]) [    x:collection1] o.a.s.u.DefaultSolrCoreState New IndexWriter is ready to be used.
   [junit4]   2> 440553 INFO  (TEST-HardAutoCommitTest.testCommitWithin-seed#[25107173F1D109D1]) [    x:collection1] o.a.s.s.SolrIndexSearcher Opening Searcher@284ecc4f[collection1] main
   [junit4]   2> 440554 INFO  (TEST-HardAutoCommitTest.testCommitWithin-seed#[25107173F1D109D1]) [    x:collection1] o.a.s.c.CoreContainer replacing core: collection1
   [junit4]   2> 440554 INFO  (TEST-HardAutoCommitTest.testCommitWithin-seed#[25107173F1D109D1]) [    x:collection1] o.a.s.c.SolrCore [collection1]  CLOSING SolrCore org.apache.solr.core.SolrCore@6a33202f
   [junit4]   2> 440554 INFO  (TEST-HardAutoCommitTest.testCommitWithin-seed#[25107173F1D109D1]) [    x:collection1] o.a.s.u.DirectUpdateHandler2 closing DirectUpdateHandler2{commits=0,autocommits=0,soft autocommits=0,optimizes=0,rollbacks=0,expungeDeletes=0,docsPending=0,adds=0,deletesById=0,deletesByQuery=1,errors=0,cumulative_adds=0,cumulative_deletesById=0,cumulative_deletesByQuery=1,cumulative_errors=0,transaction_logs_total_size=0,transaction_logs_total_number=0}
   [junit4]   2> 440554 INFO  (TEST-HardAutoCommitTest.testCommitWithin-seed#[25107173F1D109D1]) [    x:collection1] o.a.s.c.SolrCore [collection1] Closing main searcher on request.
   [junit4]   2> 440568 INFO  (searcherExecutor-904-thread-1-processing-x:collection1) [    x:collection1] o.a.s.c.SolrCore [collection1] Registered new searcher Searcher@284ecc4f[collection1] main{ExitableDirectoryReader(UninvertingDirectoryReader())}
   [junit4]   2> 440568 INFO  (TEST-HardAutoCommitTest.testCommitWithin-seed#[25107173F1D109D1]) [    x:collection1] o.a.s.u.p.LogUpdateProcessorFactory [collection1] {add=[529 (1544303421233823744)]} 0 11
   [junit4]   2> 440570 INFO  (TEST-HardAutoCommitTest.testCommitWithin-seed#[25107173F1D109D1]) [    x:collection1] o.a.s.c.S.Request [collection1]  webapp=null path=null params={start=0&version=2.2&rows=20&q=id:529&qt=standard} hits=0 status=0 QTime=1
   [junit4]   2> 440575 INFO  (TEST-HardAutoCommitTest.testCommitWithin-seed#[25107173F1D109D1]) [    x:collection1] o.a.s.u.p.LogUpdateProcessorFactory [collection1] {add=[530 (1544303421245358080)]} 0 18
   [junit4]   2> 440575 INFO  (TEST-HardAutoCommitTest.testCommitWithin-seed#[25107173F1D109D1]) [    x:collection1] o.a.s.c.S.Request [collection1]  webapp=null path=null params={start=0&version=2.2&rows=20&q=id:530&qt=standard} hits=0 status=0 QTime=0
   [junit4]   2> 440583 INFO  (TEST-HardAutoCommitTest.testCommitWithin-seed#[25107173F1D109D1]) [    x:collection1] o.a.s.u.p.LogUpdateProcessorFactory [collection1] {delete=[529 (-1544303421247455232)]} 0 26
   [junit4]   2> 440584 INFO  (TEST-HardAutoCommitTest.testCommitWithin-seed#[25107173F1D109D1]) [    x:collection1] o.a.s.c.S.Request [collection1]  webapp=null path=null params={start=0&version=2.2&rows=20&q=id:529&qt=standard} hits=0 status=0 QTime=0
   [junit4]   2> 440585 ERROR (TEST-HardAutoCommitTest.testCommitWithin-seed#[25107173F1D109D1]) [    x:collection1] o.a.s.SolrTestCaseJ4 REQUEST FAILED: xpath=//result[@numFound=1]
   [junit4]   2> 	xml response was: <?xml version="1.0" encoding="UTF-8"?>
   [junit4]   2> <response>
   [junit4]   2> <lst name="responseHeader"><int name="status">0</int><int name="QTime">0</int></lst><result name="response" numFound="0" start="0"></result>
   [junit4]   2> </response>
   [junit4]   2> 
   [junit4]   2> 	request was:start=0&version=2.2&rows=20&q=id:529&qt=standard
   [junit4]   2> 440585 ERROR (TEST-HardAutoCommitTest.testCommitWithin-seed#[25107173F1D109D1]) [    x:collection1] o.a.s.SolrTestCaseJ4 REQUEST FAILED: start=0&version=2.2&rows=20&q=id:529&qt=standard:java.lang.RuntimeException: REQUEST FAILED: xpath=//result[@numFound=1]
   [junit4]   2> 	xml response was: <?xml version="1.0" encoding="UTF-8"?>
   [junit4]   2> <response>
   [junit4]   2> <lst name="responseHeader"><int name="status">0</int><int name="QTime">0</int></lst><result name="response" numFound="0" start="0"></result>
   [junit4]   2> </response>
   [junit4]   2> 
   [junit4]   2> 	request was:start=0&version=2.2&rows=20&q=id:529&qt=standard
   [junit4]   2> 	at org.apache.solr.SolrTestCaseJ4.assertQ(SolrTestCaseJ4.java:757)
   [junit4]   2> 	at org.apache.solr.update.HardAutoCommitTest.testCommitWithin(HardAutoCommitTest.java:99)
   [junit4]   2> 	at sun.reflect.NativeMethodAccessorImpl.invoke0(Native Method)
   [junit4]   2> 	at sun.reflect.NativeMethodAccessorImpl.invoke(NativeMethodAccessorImpl.java:57)
   [junit4]   2> 	at sun.reflect.DelegatingMethodAccessorImpl.invoke(DelegatingMethodAccessorImpl.java:43)
   [junit4]   2> 	at java.lang.reflect.Method.invoke(Method.java:606)
   [junit4]   2> 	at com.carrotsearch.randomizedtesting.RandomizedRunner.invoke(RandomizedRunner.java:1764)
   [junit4]   2> 	at com.carrotsearch.randomizedtesting.RandomizedRunner$8.evaluate(RandomizedRunner.java:871)
   [junit4]   2> 	at com.carrotsearch.randomizedtesting.RandomizedRunner$9.evaluate(RandomizedRunner.java:907)
   [junit4]   2> 	at com.carrotsearch.randomizedtesting.RandomizedRunner$10.evaluate(RandomizedRunner.java:921)
   [junit4]   2> 	at com.carrotsearch.randomizedtesting.rules.SystemPropertiesRestoreRule$1.evaluate(SystemPropertiesRestoreRule.java:57)
   [junit4]   2> 	at org.apache.lucene.util.TestRuleSetupTeardownChained$1.evaluate(TestRuleSetupTeardownChained.java:49)
   [junit4]   2> 	at org.apache.lucene.util.AbstractBeforeAfterRule$1.evaluate(AbstractBeforeAfterRule.java:45)
   [junit4]   2> 	at org.apache.lucene.util.TestRuleThreadAndTestName$1.evaluate(TestRuleThreadAndTestName.java:48)
   [junit4]   2> 	at org.apache.lucene.util.TestRuleIgnoreAfterMaxFailures$1.evaluate(TestRuleIgnoreAfterMaxFailures.java:64)
   [junit4]   2> 	at org.apache.lucene.util.TestRuleMarkFailure$1.evaluate(TestRuleMarkFailure.java:47)
   [junit4]   2> 	at com.carrotsearch.randomizedtesting.rules.StatementAdapter.evaluate(StatementAdapter.java:36)
   [junit4]   2> 	at com.carrotsearch.randomizedtesting.ThreadLeakControl$StatementRunner.run(ThreadLeakControl.java:367)
   [junit4]   2> 	at com.carrotsearch.randomizedtesting.ThreadLeakControl.forkTimeoutingTask(ThreadLeakControl.java:809)
   [junit4]   2> 	at com.carrotsearch.randomizedtesting.ThreadLeakControl$3.evaluate(ThreadLeakControl.java:460)
   [junit4]   2> 	at com.carrotsearch.randomizedtesting.RandomizedRunner.runSingleTest(RandomizedRunner.java:880)
   [junit4]   2> 	at com.carrotsearch.randomizedtesting.RandomizedRunner$5.evaluate(RandomizedRunner.java:781)
   [junit4]   2> 	at com.carrotsearch.randomizedtesting.RandomizedRunner$6.evaluate(RandomizedRunner.java:816)
   [junit4]   2> 	at com.carrotsearch.randomizedtesting.RandomizedRunner$7.evaluate(RandomizedRunner.java:827)
   [junit4]   2> 	at com.carrotsearch.randomizedtesting.rules.StatementAdapter.evaluate(StatementAdapter.java:36)
   [junit4]   2> 	at com.carrotsearch.randomizedtesting.rules.SystemPropertiesRestoreRule$1.evaluate(SystemPropertiesRestoreRule.java:57)
   [junit4]   2> 	at org.apache.lucene.util.AbstractBeforeAfterRule$1.evaluate(AbstractBeforeAfterRule.java:45)
   [junit4]   2> 	at com.carrotsearch.randomizedtesting.rules.StatementAdapter.evaluate(StatementAdapter.java:36)
   [junit4]   2> 	at org.apache.lucene.util.TestRuleStoreClassName$1.evaluate(TestRuleStoreClassName.java:41)
   [junit4]   2> 	at com.carrotsearch.randomizedtesting.rules.NoShadowingOrOverridesOnMethodsRule$1.evaluate(NoShadowingOrOverridesOnMethodsRule.java:40)
   [junit4]   2> 	at com.carrotsearch.randomizedtesting.rules.NoShadowingOrOverridesOnMethodsRule$1.evaluate(NoShadowingOrOverridesOnMethodsRule.java:40)
   [junit4]   2> 	at com.carrotsearch.randomizedtesting.rules.StatementAdapter.evaluate(StatementAdapter.java:36)
   [junit4]   2> 	at com.carrotsearch.randomizedtesting.rules.StatementAdapter.evaluate(StatementAdapter.java:36)
   [junit4]   2> 	at com.carrotsearch.randomizedtesting.rules.StatementAdapter.evaluate(StatementAdapter.java:36)
   [junit4]   2> 	at org.apache.lucene.util.TestRuleAssertionsRequired$1.evaluate(TestRuleAssertionsRequired.java:53)
   [junit4]   2> 	at org.apache.lucene.util.TestRuleMarkFailure$1.evaluate(TestRuleMarkFailure.java:47)
   [junit4]   2> 	at org.apache.lucene.util.TestRuleIgnoreAfterMaxFailures$1.evaluate(TestRuleIgnoreAfterMaxFailures.java:64)
   [junit4]   2> 	at org.apache.lucene.util.TestRuleIgnoreTestSuites$1.evaluate(TestRuleIgnoreTestSuites.java:54)
   [junit4]   2> 	at com.carrotsearch.randomizedtesting.rules.StatementAdapter.evaluate(StatementAdapter.java:36)
   [junit4]   2> 	at com.carrotsearch.randomizedtesting.ThreadLeakControl$StatementRunner.run(ThreadLeakControl.java:367)
   [junit4]   2> 	at java.lang.Thread.run(Thread.java:745)
   [junit4]   2> 
   [junit4]   2> 440587 INFO  (TEST-HardAutoCommitTest.testCommitWithin-seed#[25107173F1D109D1]) [    x:collection1] o.a.s.SolrTestCaseJ4 ###Ending testCommitWithin
   [junit4]   2> NOTE: download the large Jenkins line-docs file by running 'ant get-jenkins-line-docs' in the lucene directory.
   [junit4]   2> NOTE: reproduce with: ant test  -Dtestcase=HardAutoCommitTest -Dtests.method=testCommitWithin -Dtests.seed=25107173F1D109D1 -Dtests.multiplier=2 -Dtests.nightly=true -Dtests.slow=true -Dtests.linedocsfile=/home/jenkins/jenkins-slave/workspace/Lucene-Solr-NightlyTests-5.5/test-data/enwiki.random.lines.txt -Dtests.locale=lv -Dtests.timezone=Etc/GMT-2 -Dtests.asserts=true -Dtests.file.encoding=UTF-8
   [junit4] ERROR   0.57s J2 | HardAutoCommitTest.testCommitWithin <<<
   [junit4]    > Throwable #1: java.lang.RuntimeException: Exception during query
   [junit4]    > 	at __randomizedtesting.SeedInfo.seed([25107173F1D109D1:9FC21E0B72FFE7C4]:0)
   [junit4]    > 	at org.apache.solr.SolrTestCaseJ4.assertQ(SolrTestCaseJ4.java:764)
   [junit4]    > 	at org.apache.solr.update.HardAutoCommitTest.testCommitWithin(HardAutoCommitTest.java:99)
   [junit4]    > 	at java.lang.Thread.run(Thread.java:745)
   [junit4]    > Caused by: java.lang.RuntimeException: REQUEST FAILED: xpath=//result[@numFound=1]
   [junit4]    > 	xml response was: <?xml version="1.0" encoding="UTF-8"?>
   [junit4]    > <response>
   [junit4]    > <lst name="responseHeader"><int name="status">0</int><int name="QTime">0</int></lst><result name="response" numFound="0" start="0"></result>
   [junit4]    > </response>
   [junit4]    > 	request was:start=0&version=2.2&rows=20&q=id:529&qt=standard
   [junit4]    > 	at org.apache.solr.SolrTestCaseJ4.assertQ(SolrTestCaseJ4.java:757)
   [junit4]    > 	... 40 more
   [junit4]   2> 440594 INFO  (SUITE-HardAutoCommitTest-seed#[25107173F1D109D1]-worker) [    x:collection1] o.a.s.SolrTestCaseJ4 ###deleteCore
   [junit4]   2> 440594 INFO  (SUITE-HardAutoCommitTest-seed#[25107173F1D109D1]-worker) [    x:collection1] o.a.s.c.CoreContainer Shutting down CoreContainer instance=429113839
   [junit4]   2> 440594 INFO  (coreCloseExecutor-908-thread-1-processing-x:collection1) [    x:collection1] o.a.s.c.SolrCore [collection1]  CLOSING SolrCore org.apache.solr.core.SolrCore@26d0daf3
   [junit4]   2> 440594 INFO  (coreCloseExecutor-908-thread-1-processing-x:collection1) [    x:collection1] o.a.s.u.DirectUpdateHandler2 closing DirectUpdateHandler2{commits=0,autocommits=0,soft autocommits=0,optimizes=0,rollbacks=0,expungeDeletes=0,docsPending=2,adds=2,deletesById=1,deletesByQuery=0,errors=0,cumulative_adds=2,cumulative_deletesById=1,cumulative_deletesByQuery=0,cumulative_errors=0,transaction_logs_total_size=0,transaction_logs_total_number=0}
   [junit4]   2> 440594 INFO  (coreCloseExecutor-908-thread-1-processing-x:collection1) [    x:collection1] o.a.s.u.SolrCoreState Closing SolrCoreState
   [junit4]   2> 440595 INFO  (coreCloseExecutor-908-thread-1-processing-x:collection1) [    x:collection1] o.a.s.u.DefaultSolrCoreState SolrCoreState ref count has reached 0 - closing IndexWriter
   [junit4]   2> 440595 INFO  (coreCloseExecutor-908-thread-1-processing-x:collection1) [    x:collection1] o.a.s.u.DefaultSolrCoreState closing IndexWriter with IndexWriterCloser
   [junit4]   2> 440595 INFO  (coreCloseExecutor-908-thread-1-processing-x:collection1) [    x:collection1] o.a.s.u.DirectUpdateHandler2 Committing on IndexWriter close.
   [junit4]   2> 440606 INFO  (coreCloseExecutor-908-thread-1-processing-x:collection1) [    x:collection1] o.a.s.c.SolrDeletionPolicy SolrDeletionPolicy.onCommit: commits: num=2
   [junit4]   2> 	commit{dir=MockDirectoryWrapper(NIOFSDirectory@/x1/jenkins/jenkins-slave/workspace/Lucene-Solr-NightlyTests-5.5/checkout/solr/build/solr-core/test/J2/temp/solr.update.HardAutoCommitTest_25107173F1D109D1-001/index-NIOFSDirectory-001 lockFactory=org.apache.lucene.store.NativeFSLockFactory@5a15ccfc),segFN=segments_1,generation=1}
   [junit4]   2> 	commit{dir=MockDirectoryWrapper(NIOFSDirectory@/x1/jenkins/jenkins-slave/workspace/Lucene-Solr-NightlyTests-5.5/checkout/solr/build/solr-core/test/J2/temp/solr.update.HardAutoCommitTest_25107173F1D109D1-001/index-NIOFSDirectory-001 lockFactory=org.apache.lucene.store.NativeFSLockFactory@5a15ccfc),segFN=segments_2,generation=2}
   [junit4]   2> 440606 INFO  (coreCloseExecutor-908-thread-1-processing-x:collection1) [    x:collection1] o.a.s.c.SolrDeletionPolicy newest commit generation = 2
   [junit4]   2> 440607 INFO  (coreCloseExecutor-908-thread-1-processing-x:collection1) [    x:collection1] o.a.s.c.SolrCore [collection1] Closing main searcher on request.
   [junit4]   2> 440609 INFO  (coreCloseExecutor-908-thread-1-processing-x:collection1) [    x:collection1] o.a.s.c.CachingDirectoryFactory Closing MockDirectoryFactory - 2 directories currently being tracked
   [junit4]   2> 440609 INFO  (coreCloseExecutor-908-thread-1-processing-x:collection1) [    x:collection1] o.a.s.c.CachingDirectoryFactory looking to close /x1/jenkins/jenkins-slave/workspace/Lucene-Solr-NightlyTests-5.5/checkout/solr/build/solr-core/test/J2/temp/solr.update.HardAutoCommitTest_25107173F1D109D1-001/init-core-data-001 [CachedDir<<refCount=0;path=/x1/jenkins/jenkins-slave/workspace/Lucene-Solr-NightlyTests-5.5/checkout/solr/build/solr-core/test/J2/temp/solr.update.HardAutoCommitTest_25107173F1D109D1-001/init-core-data-001;done=false>>]
   [junit4]   2> 440609 INFO  (coreCloseExecutor-908-thread-1-processing-x:collection1) [    x:collection1] o.a.s.c.CachingDirectoryFactory Closing directory: /x1/jenkins/jenkins-slave/workspace/Lucene-Solr-NightlyTests-5.5/checkout/solr/build/solr-core/test/J2/temp/solr.update.HardAutoCommitTest_25107173F1D109D1-001/init-core-data-001
   [junit4]   2> 440609 INFO  (coreCloseExecutor-908-thread-1-processing-x:collection1) [    x:collection1] o.a.s.c.CachingDirectoryFactory looking to close /x1/jenkins/jenkins-slave/workspace/Lucene-Solr-NightlyTests-5.5/checkout/solr/build/solr-core/test/J2/temp/solr.update.HardAutoCommitTest_25107173F1D109D1-001/init-core-data-001/index [CachedDir<<refCount=0;path=/x1/jenkins/jenkins-slave/workspace/Lucene-Solr-NightlyTests-5.5/checkout/solr/build/solr-core/test/J2/temp/solr.update.HardAutoCommitTest_25107173F1D109D1-001/init-core-data-001/index;done=false>>]
   [junit4]   2> 440609 INFO  (coreCloseExecutor-908-thread-1-processing-x:collection1) [    x:collection1] o.a.s.c.CachingDirectoryFactory Closing directory: /x1/jenkins/jenkins-slave/workspace/Lucene-Solr-NightlyTests-5.5/checkout/solr/build/solr-core/test/J2/temp/solr.update.HardAutoCommitTest_25107173F1D109D1-001/init-core-data-001/index
   [junit4]   2> NOTE: leaving temporary files on disk at: /x1/jenkins/jenkins-slave/workspace/Lucene-Solr-NightlyTests-5.5/checkout/solr/build/solr-core/test/J2/temp/solr.update.HardAutoCommitTest_25107173F1D109D1-001
   [junit4]   2> NOTE: test params are: codec=Asserting(Lucene54): {_version_=PostingsFormat(name=Direct), range_facet_l_dv=Lucene50(blocksize=128), multiDefault=PostingsFormat(name=Memory doPackFST= false), intDefault=PostingsFormat(name=Direct), id=Lucene50(blocksize=128), text=Lucene50(blocksize=128), range_facet_l=PostingsFormat(name=Direct), field_t=Lucene50(blocksize=128), range_facet_i_dv=PostingsFormat(name=Direct), subject=PostingsFormat(name=Memory doPackFST= false), timestamp=PostingsFormat(name=Direct)}, docValues:{range_facet_l_dv=DocValuesFormat(name=Lucene54), range_facet_i_dv=DocValuesFormat(name=Asserting), timestamp=DocValuesFormat(name=Asserting)}, sim=RandomSimilarity(queryNorm=false,coord=no): {}, locale=lv, timezone=Etc/GMT-2
   [junit4]   2> NOTE: Linux 3.13.0-85-generic amd64/Oracle Corporation 1.7.0_80 (64-bit)/cpus=4,threads=1,free=156723152,total=490209280
   [junit4]   2> NOTE: All tests run in this JVM: [TestJsonRequest, XmlUpdateRequestHandlerTest, TestShardHandlerFactory, SliceStateTest, DeleteReplicaTest, TestSweetSpotSimilarityFactory, TestTolerantSearch, TestExpandComponent, TestClassicSimilarityFactory, HdfsRestartWhileUpdatingTest, TermVectorComponentDistributedTest, TestPerFieldSimilarityWithDefaultOverride, CustomCollectionTest, IgnoreCommitOptimizeUpdateProcessorFactoryTest, TestFieldTypeResource, HardAutoCommitTest]
   [junit4] Completed [49/575 (1!)] on J2 in 1.87s, 1 test, 1 error <<< FAILURES!

[...truncated 292 lines...]
   [junit4] Suite: org.apache.solr.cloud.CollectionsAPIDistributedZkTest
   [junit4]   2> Creating dataDir: /x1/jenkins/jenkins-slave/workspace/Lucene-Solr-NightlyTests-5.5/checkout/solr/build/solr-core/test/J1/temp/solr.cloud.CollectionsAPIDistributedZkTest_25107173F1D109D1-001/init-core-data-001
   [junit4]   2> 812082 INFO  (SUITE-CollectionsAPIDistributedZkTest-seed#[25107173F1D109D1]-worker) [    ] o.a.s.SolrTestCaseJ4 Randomized ssl (false) and clientAuth (false)
   [junit4]   2> 812082 INFO  (SUITE-CollectionsAPIDistributedZkTest-seed#[25107173F1D109D1]-worker) [    ] o.a.s.BaseDistributedSearchTestCase Setting hostContext system property: /hjibo/vr
   [junit4]   2> 812087 INFO  (TEST-CollectionsAPIDistributedZkTest.test-seed#[25107173F1D109D1]) [    ] o.a.s.c.ZkTestServer STARTING ZK TEST SERVER
   [junit4]   2> 812087 INFO  (Thread-1145) [    ] o.a.s.c.ZkTestServer client port:0.0.0.0/0.0.0.0:0
   [junit4]   2> 812087 INFO  (Thread-1145) [    ] o.a.s.c.ZkTestServer Starting server
   [junit4]   2> 812187 INFO  (TEST-CollectionsAPIDistributedZkTest.test-seed#[25107173F1D109D1]) [    ] o.a.s.c.ZkTestServer start zk server on port:34449
   [junit4]   2> 812187 INFO  (TEST-CollectionsAPIDistributedZkTest.test-seed#[25107173F1D109D1]) [    ] o.a.s.c.c.SolrZkClient Using default ZkCredentialsProvider
   [junit4]   2> 812188 INFO  (TEST-CollectionsAPIDistributedZkTest.test-seed#[25107173F1D109D1]) [    ] o.a.s.c.c.ConnectionManager Waiting for client to connect to ZooKeeper
   [junit4]   2> 812190 INFO  (zkCallback-355-thread-1) [    ] o.a.s.c.c.ConnectionManager Watcher org.apache.solr.common.cloud.ConnectionManager@648ff04e name:ZooKeeperConnection Watcher:127.0.0.1:34449 got event WatchedEvent state:SyncConnected type:None path:null path:null type:None
   [junit4]   2> 812190 INFO  (TEST-CollectionsAPIDistributedZkTest.test-seed#[25107173F1D109D1]) [    ] o.a.s.c.c.ConnectionManager Client is connected to ZooKeeper
   [junit4]   2> 812190 INFO  (TEST-CollectionsAPIDistributedZkTest.test-seed#[25107173F1D109D1]) [    ] o.a.s.c.c.SolrZkClient Using default ZkACLProvider
   [junit4]   2> 812190 INFO  (TEST-CollectionsAPIDistributedZkTest.test-seed#[25107173F1D109D1]) [    ] o.a.s.c.c.SolrZkClient makePath: /s

[...truncated too long message...]

ava.util.concurrent.locks.LockSupport.park(LockSupport.java:186)
   [junit4]    >         at java.util.concurrent.locks.AbstractQueuedSynchronizer$ConditionObject.await(AbstractQueuedSynchronizer.java:2043)
   [junit4]    >         at java.util.concurrent.LinkedBlockingQueue.take(LinkedBlockingQueue.java:442)
   [junit4]    >         at java.util.concurrent.ThreadPoolExecutor.getTask(ThreadPoolExecutor.java:1068)
   [junit4]    >         at java.util.concurrent.ThreadPoolExecutor.runWorker(ThreadPoolExecutor.java:1130)
   [junit4]    >         at java.util.concurrent.ThreadPoolExecutor$Worker.run(ThreadPoolExecutor.java:615)
   [junit4]    >         at java.lang.Thread.run(Thread.java:745)
   [junit4]    >    3) Thread[id=23823, name=searcherExecutor-5838-thread-1, state=WAITING, group=TGRP-HdfsCollectionsAPIDistributedZkTest]
   [junit4]    >         at sun.misc.Unsafe.park(Native Method)
   [junit4]    >         at java.util.concurrent.locks.LockSupport.park(LockSupport.java:186)
   [junit4]    >         at java.util.concurrent.locks.AbstractQueuedSynchronizer$ConditionObject.await(AbstractQueuedSynchronizer.java:2043)
   [junit4]    >         at java.util.concurrent.LinkedBlockingQueue.take(LinkedBlockingQueue.java:442)
   [junit4]    >         at java.util.concurrent.ThreadPoolExecutor.getTask(ThreadPoolExecutor.java:1068)
   [junit4]    >         at java.util.concurrent.ThreadPoolExecutor.runWorker(ThreadPoolExecutor.java:1130)
   [junit4]    >         at java.util.concurrent.ThreadPoolExecutor$Worker.run(ThreadPoolExecutor.java:615)
   [junit4]    >         at java.lang.Thread.run(Thread.java:745)
   [junit4]    >    4) Thread[id=23754, name=searcherExecutor-5834-thread-1, state=WAITING, group=TGRP-HdfsCollectionsAPIDistributedZkTest]
   [junit4]    >         at sun.misc.Unsafe.park(Native Method)
   [junit4]    >         at java.util.concurrent.locks.LockSupport.park(LockSupport.java:186)
   [junit4]    >         at java.util.concurrent.locks.AbstractQueuedSynchronizer$ConditionObject.await(AbstractQueuedSynchronizer.java:2043)
   [junit4]    >         at java.util.concurrent.LinkedBlockingQueue.take(LinkedBlockingQueue.java:442)
   [junit4]    >         at java.util.concurrent.ThreadPoolExecutor.getTask(ThreadPoolExecutor.java:1068)
   [junit4]    >         at java.util.concurrent.ThreadPoolExecutor.runWorker(ThreadPoolExecutor.java:1130)
   [junit4]    >         at java.util.concurrent.ThreadPoolExecutor$Worker.run(ThreadPoolExecutor.java:615)
   [junit4]    >         at java.lang.Thread.run(Thread.java:745)
   [junit4]    >    5) Thread[id=23824, name=searcherExecutor-5839-thread-1, state=WAITING, group=TGRP-HdfsCollectionsAPIDistributedZkTest]
   [junit4]    >         at sun.misc.Unsafe.park(Native Method)
   [junit4]    >         at java.util.concurrent.locks.LockSupport.park(LockSupport.java:186)
   [junit4]    >         at java.util.concurrent.locks.AbstractQueuedSynchronizer$ConditionObject.await(AbstractQueuedSynchronizer.java:2043)
   [junit4]    >         at java.util.concurrent.LinkedBlockingQueue.take(LinkedBlockingQueue.java:442)
   [junit4]    >         at java.util.concurrent.ThreadPoolExecutor.getTask(ThreadPoolExecutor.java:1068)
   [junit4]    >         at java.util.concurrent.ThreadPoolExecutor.runWorker(ThreadPoolExecutor.java:1130)
   [junit4]    >         at java.util.concurrent.ThreadPoolExecutor$Worker.run(ThreadPoolExecutor.java:615)
   [junit4]    >         at java.lang.Thread.run(Thread.java:745)
   [junit4]    > 	at __randomizedtesting.SeedInfo.seed([25107173F1D109D1]:0)Throwable #2: com.carrotsearch.randomizedtesting.ThreadLeakError: There are still zombie threads that couldn't be terminated:
   [junit4]    >    1) Thread[id=23781, name=searcherExecutor-5835-thread-1, state=WAITING, group=TGRP-HdfsCollectionsAPIDistributedZkTest]
   [junit4]    >         at sun.misc.Unsafe.park(Native Method)
   [junit4]    >         at java.util.concurrent.locks.LockSupport.park(LockSupport.java:186)
   [junit4]    >         at java.util.concurrent.locks.AbstractQueuedSynchronizer$ConditionObject.await(AbstractQueuedSynchronizer.java:2043)
   [junit4]    >         at java.util.concurrent.LinkedBlockingQueue.take(LinkedBlockingQueue.java:442)
   [junit4]    >         at java.util.concurrent.ThreadPoolExecutor.getTask(ThreadPoolExecutor.java:1068)
   [junit4]    >         at java.util.concurrent.ThreadPoolExecutor.runWorker(ThreadPoolExecutor.java:1130)
   [junit4]    >         at java.util.concurrent.ThreadPoolExecutor$Worker.run(ThreadPoolExecutor.java:615)
   [junit4]    >         at java.lang.Thread.run(Thread.java:745)
   [junit4]    >    2) Thread[id=23754, name=searcherExecutor-5834-thread-1, state=WAITING, group=TGRP-HdfsCollectionsAPIDistributedZkTest]
   [junit4]    >         at sun.misc.Unsafe.park(Native Method)
   [junit4]    >         at java.util.concurrent.locks.LockSupport.park(LockSupport.java:186)
   [junit4]    >         at java.util.concurrent.locks.AbstractQueuedSynchronizer$ConditionObject.await(AbstractQueuedSynchronizer.java:2043)
   [junit4]    >         at java.util.concurrent.LinkedBlockingQueue.take(LinkedBlockingQueue.java:442)
   [junit4]    >         at java.util.concurrent.ThreadPoolExecutor.getTask(ThreadPoolExecutor.java:1068)
   [junit4]    >         at java.util.concurrent.ThreadPoolExecutor.runWorker(ThreadPoolExecutor.java:1130)
   [junit4]    >         at java.util.concurrent.ThreadPoolExecutor$Worker.run(ThreadPoolExecutor.java:615)
   [junit4]    >         at java.lang.Thread.run(Thread.java:745)
   [junit4]    >    3) Thread[id=23824, name=searcherExecutor-5839-thread-1, state=WAITING, group=TGRP-HdfsCollectionsAPIDistributedZkTest]
   [junit4]    >         at sun.misc.Unsafe.park(Native Method)
   [junit4]    >         at java.util.concurrent.locks.LockSupport.park(LockSupport.java:186)
   [junit4]    >         at java.util.concurrent.locks.AbstractQueuedSynchronizer$ConditionObject.await(AbstractQueuedSynchronizer.java:2043)
   [junit4]    >         at java.util.concurrent.LinkedBlockingQueue.take(LinkedBlockingQueue.java:442)
   [junit4]    >         at java.util.concurrent.ThreadPoolExecutor.getTask(ThreadPoolExecutor.java:1068)
   [junit4]    >         at java.util.concurrent.ThreadPoolExecutor.runWorker(ThreadPoolExecutor.java:1130)
   [junit4]    >         at java.util.concurrent.ThreadPoolExecutor$Worker.run(ThreadPoolExecutor.java:615)
   [junit4]    >         at java.lang.Thread.run(Thread.java:745)
   [junit4]    >    4) Thread[id=23817, name=searcherExecutor-5837-thread-1, state=WAITING, group=TGRP-HdfsCollectionsAPIDistributedZkTest]
   [junit4]    >         at sun.misc.Unsafe.park(Native Method)
   [junit4]    >         at java.util.concurrent.locks.LockSupport.park(LockSupport.java:186)
   [junit4]    >         at java.util.concurrent.locks.AbstractQueuedSynchronizer$ConditionObject.await(AbstractQueuedSynchronizer.java:2043)
   [junit4]    >         at java.util.concurrent.LinkedBlockingQueue.take(LinkedBlockingQueue.java:442)
   [junit4]    >         at java.util.concurrent.ThreadPoolExecutor.getTask(ThreadPoolExecutor.java:1068)
   [junit4]    >         at java.util.concurrent.ThreadPoolExecutor.runWorker(ThreadPoolExecutor.java:1130)
   [junit4]    >         at java.util.concurrent.ThreadPoolExecutor$Worker.run(ThreadPoolExecutor.java:615)
   [junit4]    >         at java.lang.Thread.run(Thread.java:745)
   [junit4]    >    5) Thread[id=23823, name=searcherExecutor-5838-thread-1, state=WAITING, group=TGRP-HdfsCollectionsAPIDistributedZkTest]
   [junit4]    >         at sun.misc.Unsafe.park(Native Method)
   [junit4]    >         at java.util.concurrent.locks.LockSupport.park(LockSupport.java:186)
   [junit4]    >         at java.util.concurrent.locks.AbstractQueuedSynchronizer$ConditionObject.await(AbstractQueuedSynchronizer.java:2043)
   [junit4]    >         at java.util.concurrent.LinkedBlockingQueue.take(LinkedBlockingQueue.java:442)
   [junit4]    >         at java.util.concurrent.ThreadPoolExecutor.getTask(ThreadPoolExecutor.java:1068)
   [junit4]    >         at java.util.concurrent.ThreadPoolExecutor.runWorker(ThreadPoolExecutor.java:1130)
   [junit4]    >         at java.util.concurrent.ThreadPoolExecutor$Worker.run(ThreadPoolExecutor.java:615)
   [junit4]    >         at java.lang.Thread.run(Thread.java:745)
   [junit4]    > 	at __randomizedtesting.SeedInfo.seed([25107173F1D109D1]:0)
   [junit4] Completed [258/575 (3!)] on J1 in 620.51s, 1 test, 3 errors <<< FAILURES!

[...truncated 969 lines...]
BUILD FAILED
/x1/jenkins/jenkins-slave/workspace/Lucene-Solr-NightlyTests-5.5/checkout/build.xml:757: The following error occurred while executing this line:
/x1/jenkins/jenkins-slave/workspace/Lucene-Solr-NightlyTests-5.5/checkout/build.xml:694: The following error occurred while executing this line:
/x1/jenkins/jenkins-slave/workspace/Lucene-Solr-NightlyTests-5.5/checkout/build.xml:59: The following error occurred while executing this line:
/x1/jenkins/jenkins-slave/workspace/Lucene-Solr-NightlyTests-5.5/checkout/solr/build.xml:233: The following error occurred while executing this line:
/x1/jenkins/jenkins-slave/workspace/Lucene-Solr-NightlyTests-5.5/checkout/solr/common-build.xml:534: The following error occurred while executing this line:
/x1/jenkins/jenkins-slave/workspace/Lucene-Solr-NightlyTests-5.5/checkout/lucene/common-build.xml:1477: The following error occurred while executing this line:
/x1/jenkins/jenkins-slave/workspace/Lucene-Solr-NightlyTests-5.5/checkout/lucene/common-build.xml:1033: There were test failures: 575 suites (7 ignored), 2322 tests, 2 suite-level errors, 3 errors, 1110 ignored (19 assumptions) [seed: 25107173F1D109D1]

Total time: 225 minutes 24 seconds
Build step 'Invoke Ant' marked build as failure
Archiving artifacts
No prior successful build to compare, so performing full copy of artifacts
Recording test results
Email was triggered for: Failure - Any
Sending email for trigger: Failure - Any




Mime
View raw message