lucene-dev mailing list archives

Site index · List index
Message view « Date » · « Thread »
Top « Date » · « Thread »
From Policeman Jenkins Server <jenk...@thetaphi.de>
Subject [JENKINS] Lucene-Solr-5.5-Linux (64bit/jdk1.8.0_102) - Build # 362 - Still Unstable!
Date Thu, 01 Sep 2016 11:43:17 GMT
Build: http://jenkins.thetaphi.de/job/Lucene-Solr-5.5-Linux/362/
Java: 64bit/jdk1.8.0_102 -XX:-UseCompressedOops -XX:+UseConcMarkSweepGC

3 tests failed.
FAILED:  junit.framework.TestSuite.org.apache.solr.core.TestCoreDiscovery

Error Message:
ObjectTracker found 4 object(s) that were not released!!! [SolrCore, MockDirectoryWrapper, MockDirectoryWrapper, MDCAwareThreadPoolExecutor]

Stack Trace:
java.lang.AssertionError: ObjectTracker found 4 object(s) that were not released!!! [SolrCore, MockDirectoryWrapper, MockDirectoryWrapper, MDCAwareThreadPoolExecutor]
	at __randomizedtesting.SeedInfo.seed([53813ED6E4942F74]:0)
	at org.junit.Assert.fail(Assert.java:93)
	at org.junit.Assert.assertTrue(Assert.java:43)
	at org.junit.Assert.assertNull(Assert.java:551)
	at org.apache.solr.SolrTestCaseJ4.afterClass(SolrTestCaseJ4.java:238)
	at sun.reflect.GeneratedMethodAccessor24.invoke(Unknown Source)
	at sun.reflect.DelegatingMethodAccessorImpl.invoke(DelegatingMethodAccessorImpl.java:43)
	at java.lang.reflect.Method.invoke(Method.java:498)
	at com.carrotsearch.randomizedtesting.RandomizedRunner.invoke(RandomizedRunner.java:1764)
	at com.carrotsearch.randomizedtesting.RandomizedRunner$7.evaluate(RandomizedRunner.java:834)
	at com.carrotsearch.randomizedtesting.rules.StatementAdapter.evaluate(StatementAdapter.java:36)
	at com.carrotsearch.randomizedtesting.rules.SystemPropertiesRestoreRule$1.evaluate(SystemPropertiesRestoreRule.java:57)
	at org.apache.lucene.util.AbstractBeforeAfterRule$1.evaluate(AbstractBeforeAfterRule.java:45)
	at com.carrotsearch.randomizedtesting.rules.StatementAdapter.evaluate(StatementAdapter.java:36)
	at org.apache.lucene.util.TestRuleStoreClassName$1.evaluate(TestRuleStoreClassName.java:41)
	at com.carrotsearch.randomizedtesting.rules.NoShadowingOrOverridesOnMethodsRule$1.evaluate(NoShadowingOrOverridesOnMethodsRule.java:40)
	at com.carrotsearch.randomizedtesting.rules.NoShadowingOrOverridesOnMethodsRule$1.evaluate(NoShadowingOrOverridesOnMethodsRule.java:40)
	at com.carrotsearch.randomizedtesting.rules.StatementAdapter.evaluate(StatementAdapter.java:36)
	at com.carrotsearch.randomizedtesting.rules.StatementAdapter.evaluate(StatementAdapter.java:36)
	at com.carrotsearch.randomizedtesting.rules.StatementAdapter.evaluate(StatementAdapter.java:36)
	at org.apache.lucene.util.TestRuleAssertionsRequired$1.evaluate(TestRuleAssertionsRequired.java:53)
	at org.apache.lucene.util.TestRuleMarkFailure$1.evaluate(TestRuleMarkFailure.java:47)
	at org.apache.lucene.util.TestRuleIgnoreAfterMaxFailures$1.evaluate(TestRuleIgnoreAfterMaxFailures.java:64)
	at org.apache.lucene.util.TestRuleIgnoreTestSuites$1.evaluate(TestRuleIgnoreTestSuites.java:54)
	at com.carrotsearch.randomizedtesting.rules.StatementAdapter.evaluate(StatementAdapter.java:36)
	at com.carrotsearch.randomizedtesting.ThreadLeakControl$StatementRunner.run(ThreadLeakControl.java:367)
	at java.lang.Thread.run(Thread.java:745)


FAILED:  junit.framework.TestSuite.org.apache.solr.core.TestCoreDiscovery

Error Message:
1 thread leaked from SUITE scope at org.apache.solr.core.TestCoreDiscovery:     1) Thread[id=79120, name=searcherExecutor-8492-thread-1, state=WAITING, group=TGRP-TestCoreDiscovery]         at sun.misc.Unsafe.park(Native Method)         at java.util.concurrent.locks.LockSupport.park(LockSupport.java:175)         at java.util.concurrent.locks.AbstractQueuedSynchronizer$ConditionObject.await(AbstractQueuedSynchronizer.java:2039)         at java.util.concurrent.LinkedBlockingQueue.take(LinkedBlockingQueue.java:442)         at java.util.concurrent.ThreadPoolExecutor.getTask(ThreadPoolExecutor.java:1067)         at java.util.concurrent.ThreadPoolExecutor.runWorker(ThreadPoolExecutor.java:1127)         at java.util.concurrent.ThreadPoolExecutor$Worker.run(ThreadPoolExecutor.java:617)         at java.lang.Thread.run(Thread.java:745)

Stack Trace:
com.carrotsearch.randomizedtesting.ThreadLeakError: 1 thread leaked from SUITE scope at org.apache.solr.core.TestCoreDiscovery: 
   1) Thread[id=79120, name=searcherExecutor-8492-thread-1, state=WAITING, group=TGRP-TestCoreDiscovery]
        at sun.misc.Unsafe.park(Native Method)
        at java.util.concurrent.locks.LockSupport.park(LockSupport.java:175)
        at java.util.concurrent.locks.AbstractQueuedSynchronizer$ConditionObject.await(AbstractQueuedSynchronizer.java:2039)
        at java.util.concurrent.LinkedBlockingQueue.take(LinkedBlockingQueue.java:442)
        at java.util.concurrent.ThreadPoolExecutor.getTask(ThreadPoolExecutor.java:1067)
        at java.util.concurrent.ThreadPoolExecutor.runWorker(ThreadPoolExecutor.java:1127)
        at java.util.concurrent.ThreadPoolExecutor$Worker.run(ThreadPoolExecutor.java:617)
        at java.lang.Thread.run(Thread.java:745)
	at __randomizedtesting.SeedInfo.seed([53813ED6E4942F74]:0)


FAILED:  junit.framework.TestSuite.org.apache.solr.core.TestCoreDiscovery

Error Message:
There are still zombie threads that couldn't be terminated:    1) Thread[id=79120, name=searcherExecutor-8492-thread-1, state=WAITING, group=TGRP-TestCoreDiscovery]         at sun.misc.Unsafe.park(Native Method)         at java.util.concurrent.locks.LockSupport.park(LockSupport.java:175)         at java.util.concurrent.locks.AbstractQueuedSynchronizer$ConditionObject.await(AbstractQueuedSynchronizer.java:2039)         at java.util.concurrent.LinkedBlockingQueue.take(LinkedBlockingQueue.java:442)         at java.util.concurrent.ThreadPoolExecutor.getTask(ThreadPoolExecutor.java:1067)         at java.util.concurrent.ThreadPoolExecutor.runWorker(ThreadPoolExecutor.java:1127)         at java.util.concurrent.ThreadPoolExecutor$Worker.run(ThreadPoolExecutor.java:617)         at java.lang.Thread.run(Thread.java:745)

Stack Trace:
com.carrotsearch.randomizedtesting.ThreadLeakError: There are still zombie threads that couldn't be terminated:
   1) Thread[id=79120, name=searcherExecutor-8492-thread-1, state=WAITING, group=TGRP-TestCoreDiscovery]
        at sun.misc.Unsafe.park(Native Method)
        at java.util.concurrent.locks.LockSupport.park(LockSupport.java:175)
        at java.util.concurrent.locks.AbstractQueuedSynchronizer$ConditionObject.await(AbstractQueuedSynchronizer.java:2039)
        at java.util.concurrent.LinkedBlockingQueue.take(LinkedBlockingQueue.java:442)
        at java.util.concurrent.ThreadPoolExecutor.getTask(ThreadPoolExecutor.java:1067)
        at java.util.concurrent.ThreadPoolExecutor.runWorker(ThreadPoolExecutor.java:1127)
        at java.util.concurrent.ThreadPoolExecutor$Worker.run(ThreadPoolExecutor.java:617)
        at java.lang.Thread.run(Thread.java:745)
	at __randomizedtesting.SeedInfo.seed([53813ED6E4942F74]:0)




Build Log:
[...truncated 11934 lines...]
   [junit4] Suite: org.apache.solr.core.TestCoreDiscovery
   [junit4]   2> Creating dataDir: /home/jenkins/workspace/Lucene-Solr-5.5-Linux/solr/build/solr-core/test/J0/temp/solr.core.TestCoreDiscovery_53813ED6E4942F74-001/init-core-data-001
   [junit4]   2> 1194932 INFO  (SUITE-TestCoreDiscovery-seed#[53813ED6E4942F74]-worker) [    ] o.a.s.SolrTestCaseJ4 Randomized ssl (true) and clientAuth (false)
   [junit4]   2> 1194932 INFO  (SUITE-TestCoreDiscovery-seed#[53813ED6E4942F74]-worker) [    ] o.a.s.SolrTestCaseJ4 ####initCore
   [junit4]   2> 1194932 INFO  (SUITE-TestCoreDiscovery-seed#[53813ED6E4942F74]-worker) [    ] o.a.s.SolrTestCaseJ4 ####initCore end
   [junit4]   2> 1194933 INFO  (TEST-TestCoreDiscovery.testDiscovery-seed#[53813ED6E4942F74]) [    ] o.a.s.SolrTestCaseJ4 ###Starting testDiscovery
   [junit4]   2> 1194937 INFO  (TEST-TestCoreDiscovery.testDiscovery-seed#[53813ED6E4942F74]) [    ] o.a.s.c.SolrResourceLoader JNDI not configured for solr (NoInitialContextEx)
   [junit4]   2> 1194937 INFO  (TEST-TestCoreDiscovery.testDiscovery-seed#[53813ED6E4942F74]) [    ] o.a.s.c.SolrResourceLoader using system property solr.solr.home: /home/jenkins/workspace/Lucene-Solr-5.5-Linux/solr/build/solr-core/test/J0/temp/solr.core.TestCoreDiscovery_53813ED6E4942F74-001/tempDir-001
   [junit4]   2> 1194937 INFO  (TEST-TestCoreDiscovery.testDiscovery-seed#[53813ED6E4942F74]) [    ] o.a.s.c.SolrResourceLoader new SolrResourceLoader for directory: '/home/jenkins/workspace/Lucene-Solr-5.5-Linux/solr/build/solr-core/test/J0/temp/solr.core.TestCoreDiscovery_53813ED6E4942F74-001/tempDir-001'
   [junit4]   2> 1194937 INFO  (TEST-TestCoreDiscovery.testDiscovery-seed#[53813ED6E4942F74]) [    ] o.a.s.c.SolrResourceLoader JNDI not configured for solr (NoInitialContextEx)
   [junit4]   2> 1194937 INFO  (TEST-TestCoreDiscovery.testDiscovery-seed#[53813ED6E4942F74]) [    ] o.a.s.c.SolrResourceLoader using system property solr.solr.home: /home/jenkins/workspace/Lucene-Solr-5.5-Linux/solr/build/solr-core/test/J0/temp/solr.core.TestCoreDiscovery_53813ED6E4942F74-001/tempDir-001
   [junit4]   2> 1194937 INFO  (TEST-TestCoreDiscovery.testDiscovery-seed#[53813ED6E4942F74]) [    ] o.a.s.c.SolrXmlConfig Loading container configuration from /home/jenkins/workspace/Lucene-Solr-5.5-Linux/solr/build/solr-core/test/J0/temp/solr.core.TestCoreDiscovery_53813ED6E4942F74-001/tempDir-001/solr.xml
   [junit4]   2> 1194940 INFO  (TEST-TestCoreDiscovery.testDiscovery-seed#[53813ED6E4942F74]) [    ] o.a.s.c.CorePropertiesLocator Config-defined core root directory: /home/jenkins/workspace/Lucene-Solr-5.5-Linux/solr/build/solr-core/test/J0/temp/solr.core.TestCoreDiscovery_53813ED6E4942F74-001/tempDir-001
   [junit4]   2> 1194940 INFO  (TEST-TestCoreDiscovery.testDiscovery-seed#[53813ED6E4942F74]) [    ] o.a.s.c.CoreContainer New CoreContainer 1326822047
   [junit4]   2> 1194940 INFO  (TEST-TestCoreDiscovery.testDiscovery-seed#[53813ED6E4942F74]) [    ] o.a.s.c.CoreContainer Loading cores into CoreContainer [instanceDir=/home/jenkins/workspace/Lucene-Solr-5.5-Linux/solr/build/solr-core/test/J0/temp/solr.core.TestCoreDiscovery_53813ED6E4942F74-001/tempDir-001]
   [junit4]   2> 1194940 WARN  (TEST-TestCoreDiscovery.testDiscovery-seed#[53813ED6E4942F74]) [    ] o.a.s.c.CoreContainer Couldn't add files from /home/jenkins/workspace/Lucene-Solr-5.5-Linux/solr/build/solr-core/test/J0/temp/solr.core.TestCoreDiscovery_53813ED6E4942F74-001/tempDir-001/lib to classpath: /home/jenkins/workspace/Lucene-Solr-5.5-Linux/solr/build/solr-core/test/J0/temp/solr.core.TestCoreDiscovery_53813ED6E4942F74-001/tempDir-001/lib
   [junit4]   2> 1194941 INFO  (TEST-TestCoreDiscovery.testDiscovery-seed#[53813ED6E4942F74]) [    ] o.a.s.h.c.HttpShardHandlerFactory created with socketTimeout : 600000,connTimeout : 60000,maxConnectionsPerHost : 20,maxConnections : 10000,corePoolSize : 0,maximumPoolSize : 2147483647,maxThreadIdleTime : 5,sizeOfQueue : -1,fairnessPolicy : false,useRetries : false,connectionsEvictorSleepDelay : 5000,maxConnectionIdleTime : 40000,
   [junit4]   2> 1194943 INFO  (TEST-TestCoreDiscovery.testDiscovery-seed#[53813ED6E4942F74]) [    ] o.a.s.u.UpdateShardHandler Creating UpdateShardHandler HTTP client with params: socketTimeout=600000&connTimeout=60000&retry=true
   [junit4]   2> 1194944 INFO  (TEST-TestCoreDiscovery.testDiscovery-seed#[53813ED6E4942F74]) [    ] o.a.s.c.SolrCores Allocating transient cache for 2 transient cores
   [junit4]   2> 1194944 INFO  (TEST-TestCoreDiscovery.testDiscovery-seed#[53813ED6E4942F74]) [    ] o.a.s.l.LogWatcher SLF4J impl is org.slf4j.impl.Log4jLoggerFactory
   [junit4]   2> 1194944 INFO  (TEST-TestCoreDiscovery.testDiscovery-seed#[53813ED6E4942F74]) [    ] o.a.s.l.LogWatcher Registering Log Listener [Log4j (org.slf4j.impl.Log4jLoggerFactory)]
   [junit4]   2> 1194944 INFO  (TEST-TestCoreDiscovery.testDiscovery-seed#[53813ED6E4942F74]) [    ] o.a.s.c.CoreContainer Security conf doesn't exist. Skipping setup for authorization module.
   [junit4]   2> 1194944 INFO  (TEST-TestCoreDiscovery.testDiscovery-seed#[53813ED6E4942F74]) [    ] o.a.s.c.CoreContainer No authentication plugin used.
   [junit4]   2> 1194945 INFO  (TEST-TestCoreDiscovery.testDiscovery-seed#[53813ED6E4942F74]) [    ] o.a.s.c.CorePropertiesLocator Looking for core definitions underneath /home/jenkins/workspace/Lucene-Solr-5.5-Linux/solr/build/solr-core/test/J0/temp/solr.core.TestCoreDiscovery_53813ED6E4942F74-001/tempDir-001
   [junit4]   2> 1194945 INFO  (TEST-TestCoreDiscovery.testDiscovery-seed#[53813ED6E4942F74]) [    ] o.a.s.c.CoreDescriptor Created CoreDescriptor: {name=core2, config=solrconfig-minimal.xml, loadOnStartup=false, schema=schema-tiny.xml, configSetProperties=configsetprops.json, transient=false, dataDir=core2}
   [junit4]   2> 1194945 INFO  (TEST-TestCoreDiscovery.testDiscovery-seed#[53813ED6E4942F74]) [    ] o.a.s.c.CorePropertiesLocator Found core core2 in /home/jenkins/workspace/Lucene-Solr-5.5-Linux/solr/build/solr-core/test/J0/temp/solr.core.TestCoreDiscovery_53813ED6E4942F74-001/tempDir-001/core2
   [junit4]   2> 1194946 INFO  (TEST-TestCoreDiscovery.testDiscovery-seed#[53813ED6E4942F74]) [    ] o.a.s.c.CoreDescriptor Created CoreDescriptor: {name=core1, config=solrconfig-minimal.xml, loadOnStartup=true, schema=schema-tiny.xml, configSetProperties=configsetprops.json, transient=false, dataDir=core1}
   [junit4]   2> 1194946 INFO  (TEST-TestCoreDiscovery.testDiscovery-seed#[53813ED6E4942F74]) [    ] o.a.s.c.CorePropertiesLocator Found core core1 in /home/jenkins/workspace/Lucene-Solr-5.5-Linux/solr/build/solr-core/test/J0/temp/solr.core.TestCoreDiscovery_53813ED6E4942F74-001/tempDir-001/core1
   [junit4]   2> 1194946 INFO  (TEST-TestCoreDiscovery.testDiscovery-seed#[53813ED6E4942F74]) [    ] o.a.s.c.CoreDescriptor Created CoreDescriptor: {name=lazy1, config=solrconfig-minimal.xml, loadOnStartup=false, schema=schema-tiny.xml, configSetProperties=configsetprops.json, transient=true, dataDir=lazy1}
   [junit4]   2> 1194946 INFO  (TEST-TestCoreDiscovery.testDiscovery-seed#[53813ED6E4942F74]) [    ] o.a.s.c.CorePropertiesLocator Found core lazy1 in /home/jenkins/workspace/Lucene-Solr-5.5-Linux/solr/build/solr-core/test/J0/temp/solr.core.TestCoreDiscovery_53813ED6E4942F74-001/tempDir-001/lazy1
   [junit4]   2> 1194946 INFO  (TEST-TestCoreDiscovery.testDiscovery-seed#[53813ED6E4942F74]) [    ] o.a.s.c.CorePropertiesLocator Found 3 core definitions
   [junit4]   2> 1194946 INFO  (coreLoadExecutor-8325-thread-1) [    ] o.a.s.c.SolrResourceLoader new SolrResourceLoader for directory: '/home/jenkins/workspace/Lucene-Solr-5.5-Linux/solr/build/solr-core/test/J0/temp/solr.core.TestCoreDiscovery_53813ED6E4942F74-001/tempDir-001/core1'
   [junit4]   2> 1194946 INFO  (coreLoadExecutor-8325-thread-1) [    ] o.a.s.c.SolrResourceLoader JNDI not configured for solr (NoInitialContextEx)
   [junit4]   2> 1194947 INFO  (coreLoadExecutor-8325-thread-1) [    ] o.a.s.c.SolrResourceLoader using system property solr.solr.home: /home/jenkins/workspace/Lucene-Solr-5.5-Linux/solr/build/solr-core/test/J0/temp/solr.core.TestCoreDiscovery_53813ED6E4942F74-001/tempDir-001
   [junit4]   2> 1194956 INFO  (coreLoadExecutor-8325-thread-1) [    ] o.a.s.c.SolrConfig current version of requestparams : -1
   [junit4]   2> 1194959 INFO  (coreLoadExecutor-8325-thread-1) [    ] o.a.s.c.SolrConfig Using Lucene MatchVersion: 5.5.3
   [junit4]   2> 1194973 INFO  (coreLoadExecutor-8325-thread-1) [    ] o.a.s.c.SolrConfig Loaded SolrConfig: solrconfig-minimal.xml
   [junit4]   2> 1194975 INFO  (coreLoadExecutor-8325-thread-1) [    ] o.a.s.s.IndexSchema [core1] Schema name=tiny
   [junit4]   2> 1194977 INFO  (coreLoadExecutor-8325-thread-1) [    ] o.a.s.s.IndexSchema unique key field: id
   [junit4]   2> 1194979 INFO  (coreLoadExecutor-8325-thread-1) [    ] o.a.s.c.ConfigSetProperties Did not find ConfigSet properties, assuming default properties: Can't find resource 'configsetprops.json' in classpath or '/home/jenkins/workspace/Lucene-Solr-5.5-Linux/solr/build/solr-core/test/J0/temp/solr.core.TestCoreDiscovery_53813ED6E4942F74-001/tempDir-001/core1'
   [junit4]   2> 1194979 INFO  (coreLoadExecutor-8325-thread-1) [    ] o.a.s.c.CoreContainer Creating SolrCore 'core1' using configuration from instancedir /home/jenkins/workspace/Lucene-Solr-5.5-Linux/solr/build/solr-core/test/J0/temp/solr.core.TestCoreDiscovery_53813ED6E4942F74-001/tempDir-001/core1
   [junit4]   2> 1194979 INFO  (coreLoadExecutor-8325-thread-1) [    x:core1] o.a.s.c.SolrCore org.apache.solr.core.MockDirectoryFactory
   [junit4]   2> 1194979 INFO  (coreLoadExecutor-8325-thread-1) [    x:core1] o.a.s.c.SolrCore [[core1] ] Opening new SolrCore at [/home/jenkins/workspace/Lucene-Solr-5.5-Linux/solr/build/solr-core/test/J0/temp/solr.core.TestCoreDiscovery_53813ED6E4942F74-001/tempDir-001/core1], dataDir=[/home/jenkins/workspace/Lucene-Solr-5.5-Linux/solr/build/solr-core/test/J0/temp/solr.core.TestCoreDiscovery_53813ED6E4942F74-001/tempDir-001/core1/core1/]
   [junit4]   2> 1194979 INFO  (coreLoadExecutor-8325-thread-1) [    x:core1] o.a.s.c.SolrCore JMX monitoring not detected for core: core1
   [junit4]   2> 1194980 INFO  (coreLoadExecutor-8325-thread-1) [    x:core1] o.a.s.c.CachingDirectoryFactory return new directory for /home/jenkins/workspace/Lucene-Solr-5.5-Linux/solr/build/solr-core/test/J0/temp/solr.core.TestCoreDiscovery_53813ED6E4942F74-001/tempDir-001/core1/core1
   [junit4]   2> 1194980 INFO  (coreLoadExecutor-8325-thread-1) [    x:core1] o.a.s.c.SolrCore New index directory detected: old=null new=/home/jenkins/workspace/Lucene-Solr-5.5-Linux/solr/build/solr-core/test/J0/temp/solr.core.TestCoreDiscovery_53813ED6E4942F74-001/tempDir-001/core1/core1/index/
   [junit4]   2> 1194980 WARN  (coreLoadExecutor-8325-thread-1) [    x:core1] o.a.s.c.SolrCore [core1] Solr index directory '/home/jenkins/workspace/Lucene-Solr-5.5-Linux/solr/build/solr-core/test/J0/temp/solr.core.TestCoreDiscovery_53813ED6E4942F74-001/tempDir-001/core1/core1/index' doesn't exist. Creating new index...
   [junit4]   2> 1194980 INFO  (coreLoadExecutor-8325-thread-1) [    x:core1] o.a.s.c.CachingDirectoryFactory return new directory for /home/jenkins/workspace/Lucene-Solr-5.5-Linux/solr/build/solr-core/test/J0/temp/solr.core.TestCoreDiscovery_53813ED6E4942F74-001/tempDir-001/core1/core1/index
   [junit4]   2> 1194980 INFO  (coreLoadExecutor-8325-thread-1) [    x:core1] o.a.s.u.RandomMergePolicy RandomMergePolicy wrapping class org.apache.lucene.index.TieredMergePolicy: [TieredMergePolicy: maxMergeAtOnce=25, maxMergeAtOnceExplicit=31, maxMergedSegmentMB=89.6484375, floorSegmentMB=1.734375, forceMergeDeletesPctAllowed=3.7929944864184675, segmentsPerTier=32.0, maxCFSSegmentSizeMB=8.796093022207999E12, noCFSRatio=0.0
   [junit4]   2> 1194980 INFO  (coreLoadExecutor-8325-thread-1) [    x:core1] o.a.s.c.SolrDeletionPolicy SolrDeletionPolicy.onCommit: commits: num=1
   [junit4]   2> 	commit{dir=MockDirectoryWrapper(RAMDirectory@1f80d5f lockFactory=org.apache.lucene.store.SingleInstanceLockFactory@5d163176),segFN=segments_1,generation=1}
   [junit4]   2> 1194980 INFO  (coreLoadExecutor-8325-thread-1) [    x:core1] o.a.s.c.SolrDeletionPolicy newest commit generation = 1
   [junit4]   2> 1194980 INFO  (OldIndexDirectoryCleanupThreadForCore-core1) [    x:core1] o.a.s.c.SolrCore Looking for old index directories to cleanup for core core1 in /home/jenkins/workspace/Lucene-Solr-5.5-Linux/solr/build/solr-core/test/J0/temp/solr.core.TestCoreDiscovery_53813ED6E4942F74-001/tempDir-001/core1/core1/
   [junit4]   2> 1194981 WARN  (OldIndexDirectoryCleanupThreadForCore-core1) [    x:core1] o.a.s.c.DirectoryFactory /home/jenkins/workspace/Lucene-Solr-5.5-Linux/solr/build/solr-core/test/J0/temp/solr.core.TestCoreDiscovery_53813ED6E4942F74-001/tempDir-001/core1/core1/ does not point to a valid data directory; skipping clean-up of old index directories.
   [junit4]   2> 1194981 INFO  (coreLoadExecutor-8325-thread-1) [    x:core1] o.a.s.c.SolrCore no updateRequestProcessorChain defined as default, creating implicit default
   [junit4]   2> 1194982 INFO  (coreLoadExecutor-8325-thread-1) [    x:core1] o.a.s.h.l.XMLLoader xsltCacheLifetimeSeconds=60
   [junit4]   2> 1194983 INFO  (coreLoadExecutor-8325-thread-1) [    x:core1] o.a.s.h.l.XMLLoader xsltCacheLifetimeSeconds=60
   [junit4]   2> 1194983 INFO  (coreLoadExecutor-8325-thread-1) [    x:core1] o.a.s.h.l.XMLLoader xsltCacheLifetimeSeconds=60
   [junit4]   2> 1194984 INFO  (coreLoadExecutor-8325-thread-1) [    x:core1] o.a.s.h.l.XMLLoader xsltCacheLifetimeSeconds=60
   [junit4]   2> 1194984 INFO  (coreLoadExecutor-8325-thread-1) [    x:core1] o.a.s.c.RequestHandlers Registered paths: /admin/mbeans,/update/csv,/update/json/docs,/admin/luke,/select,/admin/segments,/get,/admin/system,/replication,/admin/properties,/config,/schema,/admin/plugins,/admin/logging,/update/json,/admin/threads,/admin/ping,/update,/admin/file
   [junit4]   2> 1194984 INFO  (coreLoadExecutor-8325-thread-1) [    x:core1] o.a.s.c.SolrCore Using default statsCache cache: org.apache.solr.search.stats.LocalStatsCache
   [junit4]   2> 1194985 INFO  (coreLoadExecutor-8325-thread-1) [    x:core1] o.a.s.u.CommitTracker Hard AutoCommit: disabled
   [junit4]   2> 1194985 INFO  (coreLoadExecutor-8325-thread-1) [    x:core1] o.a.s.u.CommitTracker Soft AutoCommit: disabled
   [junit4]   2> 1194985 INFO  (coreLoadExecutor-8325-thread-1) [    x:core1] o.a.s.u.RandomMergePolicy RandomMergePolicy wrapping class org.apache.lucene.index.TieredMergePolicy: [TieredMergePolicy: maxMergeAtOnce=37, maxMergeAtOnceExplicit=50, maxMergedSegmentMB=52.169921875, floorSegmentMB=0.4140625, forceMergeDeletesPctAllowed=12.508997628604728, segmentsPerTier=13.0, maxCFSSegmentSizeMB=8.796093022207999E12, noCFSRatio=0.7499510211001037
   [junit4]   2> 1194985 INFO  (coreLoadExecutor-8325-thread-1) [    x:core1] o.a.s.c.SolrDeletionPolicy SolrDeletionPolicy.onInit: commits: num=1
   [junit4]   2> 	commit{dir=MockDirectoryWrapper(RAMDirectory@1f80d5f lockFactory=org.apache.lucene.store.SingleInstanceLockFactory@5d163176),segFN=segments_1,generation=1}
   [junit4]   2> 1194985 INFO  (coreLoadExecutor-8325-thread-1) [    x:core1] o.a.s.c.SolrDeletionPolicy newest commit generation = 1
   [junit4]   2> 1194985 INFO  (coreLoadExecutor-8325-thread-1) [    x:core1] o.a.s.s.SolrIndexSearcher Opening Searcher@98b7d4e[core1] main
   [junit4]   2> 1194985 INFO  (coreLoadExecutor-8325-thread-1) [    x:core1] o.a.s.r.ManagedResourceStorage File-based storage initialized to use dir: /home/jenkins/workspace/Lucene-Solr-5.5-Linux/solr/build/solr-core/test/J0/temp/solr.core.TestCoreDiscovery_53813ED6E4942F74-001/tempDir-001/core1/conf
   [junit4]   2> 1194985 INFO  (coreLoadExecutor-8325-thread-1) [    x:core1] o.a.s.r.RestManager Initializing RestManager with initArgs: {storageDir=/home/jenkins/workspace/Lucene-Solr-5.5-Linux/solr/build/solr-core/test/J0/temp/solr.core.TestCoreDiscovery_53813ED6E4942F74-001/tempDir-001/core1/conf}
   [junit4]   2> 1194985 INFO  (coreLoadExecutor-8325-thread-1) [    x:core1] o.a.s.r.ManagedResourceStorage Reading _rest_managed.json using file:dir=/home/jenkins/workspace/Lucene-Solr-5.5-Linux/solr/build/solr-core/test/J0/temp/solr.core.TestCoreDiscovery_53813ED6E4942F74-001/tempDir-001/core1/conf
   [junit4]   2> 1194985 INFO  (coreLoadExecutor-8325-thread-1) [    x:core1] o.a.s.r.RestManager Initializing 0 registered ManagedResources
   [junit4]   2> 1194986 INFO  (coreLoadExecutor-8325-thread-1) [    x:core1] o.a.s.h.ReplicationHandler Commits will be reserved for  10000
   [junit4]   2> 1194986 INFO  (searcherExecutor-8326-thread-1-processing-x:core1) [    x:core1] o.a.s.c.SolrCore [core1] Registered new searcher Searcher@98b7d4e[core1] main{ExitableDirectoryReader(UninvertingDirectoryReader())}
   [junit4]   2> 1194986 INFO  (coreLoadExecutor-8325-thread-1) [    x:core1] o.a.s.c.CoreContainer registering core: core1
   [junit4]   2> 1194986 INFO  (TEST-TestCoreDiscovery.testDiscovery-seed#[53813ED6E4942F74]) [    ] o.a.s.c.SolrResourceLoader new SolrResourceLoader for directory: '/home/jenkins/workspace/Lucene-Solr-5.5-Linux/solr/build/solr-core/test/J0/temp/solr.core.TestCoreDiscovery_53813ED6E4942F74-001/tempDir-001/core2'
   [junit4]   2> 1194986 INFO  (TEST-TestCoreDiscovery.testDiscovery-seed#[53813ED6E4942F74]) [    ] o.a.s.c.SolrResourceLoader JNDI not configured for solr (NoInitialContextEx)
   [junit4]   2> 1194986 INFO  (TEST-TestCoreDiscovery.testDiscovery-seed#[53813ED6E4942F74]) [    ] o.a.s.c.SolrResourceLoader using system property solr.solr.home: /home/jenkins/workspace/Lucene-Solr-5.5-Linux/solr/build/solr-core/test/J0/temp/solr.core.TestCoreDiscovery_53813ED6E4942F74-001/tempDir-001
   [junit4]   2> 1194989 INFO  (TEST-TestCoreDiscovery.testDiscovery-seed#[53813ED6E4942F74]) [    ] o.a.s.c.SolrConfig current version of requestparams : -1
   [junit4]   2> 1194992 INFO  (TEST-TestCoreDiscovery.testDiscovery-seed#[53813ED6E4942F74]) [    ] o.a.s.c.SolrConfig Using Lucene MatchVersion: 5.5.3
   [junit4]   2> 1194995 INFO  (TEST-TestCoreDiscovery.testDiscovery-seed#[53813ED6E4942F74]) [    ] o.a.s.c.SolrConfig Loaded SolrConfig: solrconfig-minimal.xml
   [junit4]   2> 1194997 INFO  (TEST-TestCoreDiscovery.testDiscovery-seed#[53813ED6E4942F74]) [    ] o.a.s.s.IndexSchema [core2] Schema name=tiny
   [junit4]   2> 1194999 INFO  (TEST-TestCoreDiscovery.testDiscovery-seed#[53813ED6E4942F74]) [    ] o.a.s.s.IndexSchema unique key field: id
   [junit4]   2> 1195000 INFO  (TEST-TestCoreDiscovery.testDiscovery-seed#[53813ED6E4942F74]) [    ] o.a.s.c.ConfigSetProperties Did not find ConfigSet properties, assuming default properties: Can't find resource 'configsetprops.json' in classpath or '/home/jenkins/workspace/Lucene-Solr-5.5-Linux/solr/build/solr-core/test/J0/temp/solr.core.TestCoreDiscovery_53813ED6E4942F74-001/tempDir-001/core2'
   [junit4]   2> 1195000 INFO  (TEST-TestCoreDiscovery.testDiscovery-seed#[53813ED6E4942F74]) [    ] o.a.s.c.CoreContainer Creating SolrCore 'core2' using configuration from instancedir /home/jenkins/workspace/Lucene-Solr-5.5-Linux/solr/build/solr-core/test/J0/temp/solr.core.TestCoreDiscovery_53813ED6E4942F74-001/tempDir-001/core2
   [junit4]   2> 1195000 INFO  (TEST-TestCoreDiscovery.testDiscovery-seed#[53813ED6E4942F74]) [    x:core2] o.a.s.c.SolrCore org.apache.solr.core.MockDirectoryFactory
   [junit4]   2> 1195000 INFO  (TEST-TestCoreDiscovery.testDiscovery-seed#[53813ED6E4942F74]) [    x:core2] o.a.s.c.SolrCore [[core2] ] Opening new SolrCore at [/home/jenkins/workspace/Lucene-Solr-5.5-Linux/solr/build/solr-core/test/J0/temp/solr.core.TestCoreDiscovery_53813ED6E4942F74-001/tempDir-001/core2], dataDir=[/home/jenkins/workspace/Lucene-Solr-5.5-Linux/solr/build/solr-core/test/J0/temp/solr.core.TestCoreDiscovery_53813ED6E4942F74-001/tempDir-001/core2/core2/]
   [junit4]   2> 1195000 INFO  (TEST-TestCoreDiscovery.testDiscovery-seed#[53813ED6E4942F74]) [    x:core2] o.a.s.c.SolrCore JMX monitoring not detected for core: core2
   [junit4]   2> 1195000 INFO  (TEST-TestCoreDiscovery.testDiscovery-seed#[53813ED6E4942F74]) [    x:core2] o.a.s.c.CachingDirectoryFactory return new directory for /home/jenkins/workspace/Lucene-Solr-5.5-Linux/solr/build/solr-core/test/J0/temp/solr.core.TestCoreDiscovery_53813ED6E4942F74-001/tempDir-001/core2/core2
   [junit4]   2> 1195001 INFO  (TEST-TestCoreDiscovery.testDiscovery-seed#[53813ED6E4942F74]) [    x:core2] o.a.s.c.SolrCore New index directory detected: old=null new=/home/jenkins/workspace/Lucene-Solr-5.5-Linux/solr/build/solr-core/test/J0/temp/solr.core.TestCoreDiscovery_53813ED6E4942F74-001/tempDir-001/core2/core2/index/
   [junit4]   2> 1195001 WARN  (TEST-TestCoreDiscovery.testDiscovery-seed#[53813ED6E4942F74]) [    x:core2] o.a.s.c.SolrCore [core2] Solr index directory '/home/jenkins/workspace/Lucene-Solr-5.5-Linux/solr/build/solr-core/test/J0/temp/solr.core.TestCoreDiscovery_53813ED6E4942F74-001/tempDir-001/core2/core2/index' doesn't exist. Creating new index...
   [junit4]   2> 1195001 INFO  (TEST-TestCoreDiscovery.testDiscovery-seed#[53813ED6E4942F74]) [    x:core2] o.a.s.c.CachingDirectoryFactory return new directory for /home/jenkins/workspace/Lucene-Solr-5.5-Linux/solr/build/solr-core/test/J0/temp/solr.core.TestCoreDiscovery_53813ED6E4942F74-001/tempDir-001/core2/core2/index
   [junit4]   2> 1195001 INFO  (TEST-TestCoreDiscovery.testDiscovery-seed#[53813ED6E4942F74]) [    x:core2] o.a.s.u.RandomMergePolicy RandomMergePolicy wrapping class org.apache.lucene.index.AlcoholicMergePolicy: [AlcoholicMergePolicy: minMergeSize=0, mergeFactor=10, maxMergeSize=1889049950, maxMergeSizeForForcedMerge=9223372036854775807, calibrateSizeByDeletes=true, maxMergeDocs=2147483647, maxCFSSegmentSizeMB=8.796093022207999E12, noCFSRatio=0.1]
   [junit4]   2> 1195001 INFO  (TEST-TestCoreDiscovery.testDiscovery-seed#[53813ED6E4942F74]) [    x:core2] o.a.s.c.SolrDeletionPolicy SolrDeletionPolicy.onCommit: commits: num=1
   [junit4]   2> 	commit{dir=MockDirectoryWrapper(RAMDirectory@a01c1a7 lockFactory=org.apache.lucene.store.SingleInstanceLockFactory@110d7395),segFN=segments_1,generation=1}
   [junit4]   2> 1195001 INFO  (TEST-TestCoreDiscovery.testDiscovery-seed#[53813ED6E4942F74]) [    x:core2] o.a.s.c.SolrDeletionPolicy newest commit generation = 1
   [junit4]   2> 1195002 INFO  (OldIndexDirectoryCleanupThreadForCore-core2) [    x:core2] o.a.s.c.SolrCore Looking for old index directories to cleanup for core core2 in /home/jenkins/workspace/Lucene-Solr-5.5-Linux/solr/build/solr-core/test/J0/temp/solr.core.TestCoreDiscovery_53813ED6E4942F74-001/tempDir-001/core2/core2/
   [junit4]   2> 1195002 WARN  (OldIndexDirectoryCleanupThreadForCore-core2) [    x:core2] o.a.s.c.DirectoryFactory /home/jenkins/workspace/Lucene-Solr-5.5-Linux/solr/build/solr-core/test/J0/temp/solr.core.TestCoreDiscovery_53813ED6E4942F74-001/tempDir-001/core2/core2/ does not point to a valid data directory; skipping clean-up of old index directories.
   [junit4]   2> 1195003 INFO  (TEST-TestCoreDiscovery.testDiscovery-seed#[53813ED6E4942F74]) [    x:core2] o.a.s.c.SolrCore no updateRequestProcessorChain defined as default, creating implicit default
   [junit4]   2> 1195004 INFO  (TEST-TestCoreDiscovery.testDiscovery-seed#[53813ED6E4942F74]) [    x:core2] o.a.s.h.l.XMLLoader xsltCacheLifetimeSeconds=60
   [junit4]   2> 1195004 INFO  (TEST-TestCoreDiscovery.testDiscovery-seed#[53813ED6E4942F74]) [    x:core2] o.a.s.h.l.XMLLoader xsltCacheLifetimeSeconds=60
   [junit4]   2> 1195004 INFO  (TEST-TestCoreDiscovery.testDiscovery-seed#[53813ED6E4942F74]) [    x:core2] o.a.s.h.l.XMLLoader xsltCacheLifetimeSeconds=60
   [junit4]   2> 1195005 INFO  (TEST-TestCoreDiscovery.testDiscovery-seed#[53813ED6E4942F74]) [    x:core2] o.a.s.h.l.XMLLoader xsltCacheLifetimeSeconds=60
   [junit4]   2> 1195005 INFO  (TEST-TestCoreDiscovery.testDiscovery-seed#[53813ED6E4942F74]) [    x:core2] o.a.s.c.RequestHandlers Registered paths: /admin/mbeans,/update/csv,/update/json/docs,/admin/luke,/select,/admin/segments,/get,/admin/system,/replication,/admin/properties,/config,/schema,/admin/plugins,/admin/logging,/update/json,/admin/threads,/admin/ping,/update,/admin/file
   [junit4]   2> 1195005 INFO  (TEST-TestCoreDiscovery.testDiscovery-seed#[53813ED6E4942F74]) [    x:core2] o.a.s.c.SolrCore Using default statsCache cache: org.apache.solr.search.stats.LocalStatsCache
   [junit4]   2> 1195006 INFO  (TEST-TestCoreDiscovery.testDiscovery-seed#[53813ED6E4942F74]) [    x:core2] o.a.s.u.CommitTracker Hard AutoCommit: disabled
   [junit4]   2> 1195006 INFO  (TEST-TestCoreDiscovery.testDiscovery-seed#[53813ED6E4942F74]) [    x:core2] o.a.s.u.CommitTracker Soft AutoCommit: disabled
   [junit4]   2> 1195006 INFO  (TEST-TestCoreDiscovery.testDiscovery-seed#[53813ED6E4942F74]) [    x:core2] o.a.s.u.RandomMergePolicy RandomMergePolicy wrapping class org.apache.lucene.index.AlcoholicMergePolicy: [AlcoholicMergePolicy: minMergeSize=0, mergeFactor=10, maxMergeSize=1285051903, maxMergeSizeForForcedMerge=9223372036854775807, calibrateSizeByDeletes=true, maxMergeDocs=2147483647, maxCFSSegmentSizeMB=8.796093022207999E12, noCFSRatio=0.1]
   [junit4]   2> 1195006 INFO  (TEST-TestCoreDiscovery.testDiscovery-seed#[53813ED6E4942F74]) [    x:core2] o.a.s.c.SolrDeletionPolicy SolrDeletionPolicy.onInit: commits: num=1
   [junit4]   2> 	commit{dir=MockDirectoryWrapper(RAMDirectory@a01c1a7 lockFactory=org.apache.lucene.store.SingleInstanceLockFactory@110d7395),segFN=segments_1,generation=1}
   [junit4]   2> 1195006 INFO  (TEST-TestCoreDiscovery.testDiscovery-seed#[53813ED6E4942F74]) [    x:core2] o.a.s.c.SolrDeletionPolicy newest commit generation = 1
   [junit4]   2> 1195006 INFO  (TEST-TestCoreDiscovery.testDiscovery-seed#[53813ED6E4942F74]) [    x:core2] o.a.s.s.SolrIndexSearcher Opening Searcher@69a62023[core2] main
   [junit4]   2> 1195006 INFO  (TEST-TestCoreDiscovery.testDiscovery-seed#[53813ED6E4942F74]) [    x:core2] o.a.s.r.ManagedResourceStorage File-based storage initialized to use dir: /home/jenkins/workspace/Lucene-Solr-5.5-Linux/solr/build/solr-core/test/J0/temp/solr.core.TestCoreDiscovery_53813ED6E4942F74-001/tempDir-001/core2/conf
   [junit4]   2> 1195006 INFO  (TEST-TestCoreDiscovery.testDiscovery-seed#[53813ED6E4942F74]) [    x:core2] o.a.s.r.RestManager Initializing RestManager with initArgs: {storageDir=/home/jenkins/workspace/Lucene-Solr-5.5-Linux/solr/build/solr-core/test/J0/temp/solr.core.TestCoreDiscovery_53813ED6E4942F74-001/tempDir-001/core2/conf}
   [junit4]   2> 1195007 INFO  (TEST-TestCoreDiscovery.testDiscovery-seed#[53813ED6E4942F74]) [    x:core2] o.a.s.r.ManagedResourceStorage Reading _rest_managed.json using file:dir=/home/jenkins/workspace/Lucene-Solr-5.5-Linux/solr/build/solr-core/test/J0/temp/solr.core.TestCoreDiscovery_53813ED6E4942F74-001/tempDir-001/core2/conf
   [junit4]   2> 1195007 INFO  (TEST-TestCoreDiscovery.testDiscovery-seed#[53813ED6E4942F74]) [    x:core2] o.a.s.r.RestManager Initializing 0 registered ManagedResources
   [junit4]   2> 1195007 INFO  (TEST-TestCoreDiscovery.testDiscovery-seed#[53813ED6E4942F74]) [    x:core2] o.a.s.h.ReplicationHandler Commits will be reserved for  10000
   [junit4]   2> 1195007 INFO  (searcherExecutor-8330-thread-1-processing-x:core2) [    x:core2] o.a.s.c.SolrCore [core2] Registered new searcher Searcher@69a62023[core2] main{ExitableDirectoryReader(UninvertingDirectoryReader())}
   [junit4]   2> 1195007 INFO  (TEST-TestCoreDiscovery.testDiscovery-seed#[53813ED6E4942F74]) [    x:core2] o.a.s.c.CoreContainer registering core: core2
   [junit4]   2> 1195007 INFO  (TEST-TestCoreDiscovery.testDiscovery-seed#[53813ED6E4942F74]) [    x:core2] o.a.s.c.SolrResourceLoader new SolrResourceLoader for directory: '/home/jenkins/workspace/Lucene-Solr-5.5-Linux/solr/build/solr-core/test/J0/temp/solr.core.TestCoreDiscovery_53813ED6E4942F74-001/tempDir-001/lazy1'
   [junit4]   2> 1195007 INFO  (TEST-TestCoreDiscovery.testDiscovery-seed#[53813ED6E4942F74]) [    x:core2] o.a.s.c.SolrResourceLoader JNDI not configured for solr (NoInitialContextEx)
   [junit4]   2> 1195007 INFO  (TEST-TestCoreDiscovery.testDiscovery-seed#[53813ED6E4942F74]) [    x:core2] o.a.s.c.SolrResourceLoader using system property solr.solr.home: /home/jenkins/workspace/Lucene-Solr-5.5-Linux/solr/build/solr-core/test/J0/temp/solr.core.TestCoreDiscovery_53813ED6E4942F74-001/tempDir-001
   [junit4]   2> 1195010 INFO  (TEST-TestCoreDiscovery.testDiscovery-seed#[53813ED6E4942F74]) [    x:core2] o.a.s.c.SolrConfig current version of requestparams : -1
   [junit4]   2> 1195012 INFO  (TEST-TestCoreDiscovery.testDiscovery-seed#[53813ED6E4942F74]) [    x:core2] o.a.s.c.SolrConfig Using Lucene MatchVersion: 5.5.3
   [junit4]   2> 1195016 INFO  (TEST-TestCoreDiscovery.testDiscovery-seed#[53813ED6E4942F74]) [    x:core2] o.a.s.c.SolrConfig Loaded SolrConfig: solrconfig-minimal.xml
   [junit4]   2> 1195019 INFO  (TEST-TestCoreDiscovery.testDiscovery-seed#[53813ED6E4942F74]) [    x:core2] o.a.s.s.IndexSchema [lazy1] Schema name=tiny
   [junit4]   2> 1195021 INFO  (TEST-TestCoreDiscovery.testDiscovery-seed#[53813ED6E4942F74]) [    x:core2] o.a.s.s.IndexSchema unique key field: id
   [junit4]   2> 1195023 INFO  (TEST-TestCoreDiscovery.testDiscovery-seed#[53813ED6E4942F74]) [    x:core2] o.a.s.c.ConfigSetProperties Did not find ConfigSet properties, assuming default properties: Can't find resource 'configsetprops.json' in classpath or '/home/jenkins/workspace/Lucene-Solr-5.5-Linux/solr/build/solr-core/test/J0/temp/solr.core.TestCoreDiscovery_53813ED6E4942F74-001/tempDir-001/lazy1'
   [junit4]   2> 1195023 INFO  (TEST-TestCoreDiscovery.testDiscovery-seed#[53813ED6E4942F74]) [    x:core2] o.a.s.c.CoreContainer Creating SolrCore 'lazy1' using configuration from instancedir /home/jenkins/workspace/Lucene-Solr-5.5-Linux/solr/build/solr-core/test/J0/temp/solr.core.TestCoreDiscovery_53813ED6E4942F74-001/tempDir-001/lazy1
   [junit4]   2> 1195023 INFO  (TEST-TestCoreDiscovery.testDiscovery-seed#[53813ED6E4942F74]) [    x:lazy1] o.a.s.c.SolrCore org.apache.solr.core.MockDirectoryFactory
   [junit4]   2> 1195024 INFO  (TEST-TestCoreDiscovery.testDiscovery-seed#[53813ED6E4942F74]) [    x:lazy1] o.a.s.c.SolrCore [[lazy1] ] Opening new SolrCore at [/home/jenkins/workspace/Lucene-Solr-5.5-Linux/solr/build/solr-core/test/J0/temp/solr.core.TestCoreDiscovery_53813ED6E4942F74-001/tempDir-001/lazy1], dataDir=[/home/jenkins/workspace/Lucene-Solr-5.5-Linux/solr/build/solr-core/test/J0/temp/solr.core.TestCoreDiscovery_53813ED6E4942F74-001/tempDir-001/lazy1/lazy1/]
   [junit4]   2> 1195024 INFO  (TEST-TestCoreDiscovery.testDiscovery-seed#[53813ED6E4942F74]) [    x:lazy1] o.a.s.c.SolrCore JMX monitoring not detected for core: lazy1
   [junit4]   2> 1195024 INFO  (TEST-TestCoreDiscovery.testDiscovery-seed#[53813ED6E4942F74]) [    x:lazy1] o.a.s.c.CachingDirectoryFactory return new directory for /home/jenkins/workspace/Lucene-Solr-5.5-Linux/solr/build/solr-core/test/J0/temp/solr.core.TestCoreDiscovery_53813ED6E4942F74-001/tempDir-001/lazy1/lazy1
   [junit4]   2> 1195024 INFO  (TEST-TestCoreDiscovery.testDiscovery-seed#[53813ED6E4942F74]) [    x:lazy1] o.a.s.c.SolrCore New index directory detected: old=null new=/home/jenkins/workspace/Lucene-Solr-5.5-Linux/solr/build/solr-core/test/J0/temp/solr.core.TestCoreDiscovery_53813ED6E4942F74-001/tempDir-001/lazy1/lazy1/index/
   [junit4]   2> 1195025 WARN  (TEST-TestCoreDiscovery.testDiscovery-seed#[53813ED6E4942F74]) [    x:lazy1] o.a.s.c.SolrCore [lazy1] Solr index directory '/home/jenkins/workspace/Lucene-Solr-5.5-Linux/solr/build/solr-core/test/J0/temp/solr.core.TestCoreDiscovery_53813ED6E4942F74-001/tempDir-001/lazy1/lazy1/index' doesn't exist. Creating new index...
   [junit4]   2> 1195025 INFO  (TEST-TestCoreDiscovery.testDiscovery-seed#[53813ED6E4942F74]) [    x:lazy1] o.a.s.c.CachingDirectoryFactory return new directory for /home/jenkins/workspace/Lucene-Solr-5.5-Linux/solr/build/solr-core/test/J0/temp/solr.core.TestCoreDiscovery_53813ED6E4942F74-001/tempDir-001/lazy1/lazy1/index
   [junit4]   2> 1195025 INFO  (TEST-TestCoreDiscovery.testDiscovery-seed#[53813ED6E4942F74]) [    x:lazy1] o.a.s.u.RandomMergePolicy RandomMergePolicy wrapping class org.apache.lucene.index.LogDocMergePolicy: [LogDocMergePolicy: minMergeSize=1000, mergeFactor=18, maxMergeSize=9223372036854775807, maxMergeSizeForForcedMerge=9223372036854775807, calibrateSizeByDeletes=true, maxMergeDocs=2147483647, maxCFSSegmentSizeMB=8.796093022207999E12, noCFSRatio=0.5544675771809466]
   [junit4]   2> 1195026 INFO  (TEST-TestCoreDiscovery.testDiscovery-seed#[53813ED6E4942F74]) [    x:lazy1] o.a.s.c.SolrDeletionPolicy SolrDeletionPolicy.onCommit: commits: num=1
   [junit4]   2> 	commit{dir=MockDirectoryWrapper(NRTCachingDirectory(RAMDirectory@8db2ccb lockFactory=org.apache.lucene.store.SingleInstanceLockFactory@b1d6b5e; maxCacheMB=0.27734375 maxMergeSizeMB=0.0703125)),segFN=segments_1,generation=1}
   [junit4]   2> 1195026 INFO  (TEST-TestCoreDiscovery.testDiscovery-seed#[53813ED6E4942F74]) [    x:lazy1] o.a.s.c.SolrDeletionPolicy newest commit generation = 1
   [junit4]   2> 1195026 INFO  (OldIndexDirectoryCleanupThreadForCore-lazy1) [    x:lazy1] o.a.s.c.SolrCore Looking for old index directories to cleanup for core lazy1 in /home/jenkins/workspace/Lucene-Solr-5.5-Linux/solr/build/solr-core/test/J0/temp/solr.core.TestCoreDiscovery_53813ED6E4942F74-001/tempDir-001/lazy1/lazy1/
   [junit4]   2> 1195027 WARN  (OldIndexDirectoryCleanupThreadForCore-lazy1) [    x:lazy1] o.a.s.c.DirectoryFactory /home/jenkins/workspace/Lucene-Solr-5.5-Linux/solr/build/solr-core/test/J0/temp/solr.core.TestCoreDiscovery_53813ED6E4942F74-001/tempDir-001/lazy1/lazy1/ does not point to a valid data directory; skipping clean-up of old index directories.
   [junit4]   2> 1195028 INFO  (TEST-TestCoreDiscovery.testDiscovery-seed#[53813ED6E4942F74]) [    x:lazy1] o.a.s.c.SolrCore no updateRequestProcessorChain defined as default, creating implicit default
   [junit4]   2> 1195029 INFO  (TEST-TestCoreDiscovery.testDiscovery-seed#[53813ED6E4942F74]) [    x:lazy1] o.a.s.h.l.XMLLoader xsltCacheLifetimeSeconds=60
   [junit4]   2> 1195029 INFO  (TEST-TestCoreDiscovery.testDiscovery-seed#[53813ED6E4942F74]) [    x:lazy1] o.a.s.h.l.XMLLoader xsltCacheLifetimeSeconds=60
   [junit4]   2> 1195030 INFO  (TEST-TestCoreDiscovery.testDiscovery-seed#[53813ED6E4942F74]) [    x:lazy1] o.a.s.h.l.XMLLoader xsltCacheLifetimeSeconds=60
   [junit4]   2> 1195031 INFO  (TEST-TestCoreDiscovery.testDiscovery-seed#[53813ED6E4942F74]) [    x:lazy1] o.a.s.h.l.XMLLoader xsltCacheLifetimeSeconds=60
   [junit4]   2> 1195032 INFO  (TEST-TestCoreDiscovery.testDiscovery-seed#[53813ED6E4942F74]) [    x:lazy1] o.a.s.c.RequestHandlers Registered paths: /admin/mbeans,/update/csv,/update/json/docs,/admin/luke,/select,/admin/segments,/get,/admin/system,/replication,/admin/properties,/config,/schema,/admin/plugins,/admin/logging,/update/json,/admin/threads,/admin/ping,/update,/admin/file
   [junit4]   2> 1195035 INFO  (TEST-TestCoreDiscovery.testDiscovery-seed#[53813ED6E4942F74]) [    x:lazy1] o.a.s.c.SolrCore Using default statsCache cache: org.apache.solr.search.stats.LocalStatsCache
   [junit4]   2> 1195035 INFO  (TEST-TestCoreDiscovery.testDiscovery-seed#[53813ED6E4942F74]) [    x:lazy1] o.a.s.u.CommitTracker Hard AutoCommit: disabled
   [junit4]   2> 1195035 INFO  (TEST-TestCoreDiscovery.testDiscovery-seed#[53813ED6E4942F74]) [    x:lazy1] o.a.s.u.CommitTracker Soft AutoCommit: disabled
   [junit4]   2> 1195035 INFO  (TEST-TestCoreDiscovery.testDiscovery-seed#[53813ED6E4942F74]) [    x:lazy1] o.a.s.u.RandomMergePolicy RandomMergePolicy wrapping class org.apache.lucene.index.LogDocMergePolicy: [LogDocMergePolicy: minMergeSize=1000, mergeFactor=22, maxMergeSize=9223372036854775807, maxMergeSizeForForcedMerge=9223372036854775807, calibrateSizeByDeletes=true, maxMergeDocs=2147483647, maxCFSSegmentSizeMB=8.796093022207999E12, noCFSRatio=0.7727258824287745]
   [junit4]   2> 1195035 INFO  (TEST-TestCoreDiscovery.testDiscovery-seed#[53813ED6E4942F74]) [    x:lazy1] o.a.s.c.SolrDeletionPolicy SolrDeletionPolicy.onInit: commits: num=1
   [junit4]   2> 	commit{dir=MockDirectoryWrapper(NRTCachingDirectory(RAMDirectory@8db2ccb lockFactory=org.apache.lucene.store.SingleInstanceLockFactory@b1d6b5e; maxCacheMB=0.27734375 maxMergeSizeMB=0.0703125)),segFN=segments_1,generation=1}
   [junit4]   2> 1195035 INFO  (TEST-TestCoreDiscovery.testDiscovery-seed#[53813ED6E4942F74]) [    x:lazy1] o.a.s.c.SolrDeletionPolicy newest commit generation = 1
   [junit4]   2> 1195035 INFO  (TEST-TestCoreDiscovery.testDiscovery-seed#[53813ED6E4942F74]) [    x:lazy1] o.a.s.s.SolrIndexSearcher Opening Searcher@2f46053c[lazy1] main
   [junit4]   2> 1195036 INFO  (TEST-TestCoreDiscovery.testDiscovery-seed#[53813ED6E4942F74]) [    x:lazy1] o.a.s.r.ManagedResourceStorage File-based storage initialized to use dir: /home/jenkins/workspace/Lucene-Solr-5.5-Linux/solr/build/solr-core/test/J0/temp/solr.core.TestCoreDiscovery_53813ED6E4942F74-001/tempDir-001/lazy1/conf
   [junit4]   2> 1195036 INFO  (TEST-TestCoreDiscovery.testDiscovery-seed#[53813ED6E4942F74]) [    x:lazy1] o.a.s.r.RestManager Initializing RestManager with initArgs: {storageDir=/home/jenkins/workspace/Lucene-Solr-5.5-Linux/solr/build/solr-core/test/J0/temp/solr.core.TestCoreDiscovery_53813ED6E4942F74-001/tempDir-001/lazy1/conf}
   [junit4]   2> 1195036 INFO  (TEST-TestCoreDiscovery.testDiscovery-seed#[53813ED6E4942F74]) [    x:lazy1] o.a.s.r.ManagedResourceStorage Reading _rest_managed.json using file:dir=/home/jenkins/workspace/Lucene-Solr-5.5-Linux/solr/build/solr-core/test/J0/temp/solr.core.TestCoreDiscovery_53813ED6E4942F74-001/tempDir-001/lazy1/conf
   [junit4]   2> 1195036 INFO  (TEST-TestCoreDiscovery.testDiscovery-seed#[53813ED6E4942F74]) [    x:lazy1] o.a.s.r.RestManager Initializing 0 registered ManagedResources
   [junit4]   2> 1195036 INFO  (TEST-TestCoreDiscovery.testDiscovery-seed#[53813ED6E4942F74]) [    x:lazy1] o.a.s.h.ReplicationHandler Commits will be reserved for  10000
   [junit4]   2> 1195036 INFO  (searcherExecutor-8334-thread-1-processing-x:lazy1) [    x:lazy1] o.a.s.c.SolrCore [lazy1] Registered new searcher Searcher@2f46053c[lazy1] main{ExitableDirectoryReader(UninvertingDirectoryReader())}
   [junit4]   2> 1195036 INFO  (TEST-TestCoreDiscovery.testDiscovery-seed#[53813ED6E4942F74]) [    x:lazy1] o.a.s.c.SolrCores Opening transient core lazy1
   [junit4]   2> 1195036 INFO  (TEST-TestCoreDiscovery.testDiscovery-seed#[53813ED6E4942F74]) [    x:lazy1] o.a.s.c.CoreContainer registering core: lazy1
   [junit4]   2> 1195036 INFO  (TEST-TestCoreDiscovery.testDiscovery-seed#[53813ED6E4942F74]) [    x:lazy1] o.a.s.c.CoreContainer Shutting down CoreContainer instance=1326822047
   [junit4]   2> 1195037 INFO  (coreCloseExecutor-8338-thread-1-processing-x:lazy1) [    x:core1] o.a.s.c.SolrCore [core1]  CLOSING SolrCore org.apache.solr.core.SolrCore@591a6e12
   [junit4]   2> 1195037 INFO  (coreCloseExecutor-8338-thread-2-processing-x:lazy1) [    x:core2] o.a.s.c.SolrCore [core2]  CLOSING SolrCore org.apache.solr.core.SolrCore@4872e07f
   [junit4]   2> 1195037 INFO  (coreCloseExecutor-8338-thread-1-processing-x:lazy1) [    x:core1] o.a.s.u.DirectUpdateHandler2 closing DirectUpdateHandler2{commits=0,autocommits=0,soft autocommits=0,optimizes=0,rollbacks=0,expungeDeletes=0,docsPending=0,adds=0,deletesById=0,deletesByQuery=0,errors=0,cumulative_adds=0,cumulative_deletesById=0,cumulative_deletesByQuery=0,cumulative_errors=0}
   [junit4]   2> 1195037 INFO  (coreCloseExecutor-8338-thread-2-processing-x:lazy1) [    x:core2] o.a.s.u.DirectUpdateHandler2 closing DirectUpdateHandler2{commits=0,autocommits=0,soft autocommits=0,optimizes=0,rollbacks=0,expungeDeletes=0,docsPending=0,adds=0,deletesById=0,deletesByQuery=0,errors=0,cumulative_adds=0,cumulative_deletesById=0,cumulative_deletesByQuery=0,cumulative_errors=0}
   [junit4]   2> 1195037 INFO  (coreCloseExecutor-8338-thread-1-processing-x:lazy1) [    x:core1] o.a.s.u.SolrCoreState Closing SolrCoreState
   [junit4]   2> 1195037 INFO  (coreCloseExecutor-8338-thread-2-processing-x:lazy1) [    x:core2] o.a.s.u.SolrCoreState Closing SolrCoreState
   [junit4]   2> 1195037 INFO  (coreCloseExecutor-8338-thread-1-processing-x:lazy1) [    x:core1] o.a.s.u.DefaultSolrCoreState SolrCoreState ref count has reached 0 - closing IndexWriter
   [junit4]   2> 1195037 INFO  (coreCloseExecutor-8338-thread-2-processing-x:lazy1) [    x:core2] o.a.s.u.DefaultSolrCoreState SolrCoreState ref count has reached 0 - closing IndexWriter
   [junit4]   2> 1195037 INFO  (coreCloseExecutor-8338-thread-1-processing-x:lazy1) [    x:core1] o.a.s.u.DefaultSolrCoreState closing IndexWriter with IndexWriterCloser
   [junit4]   2> 1195037 INFO  (coreCloseExecutor-8338-thread-2-processing-x:lazy1) [    x:core2] o.a.s.u.DefaultSolrCoreState closing IndexWriter with IndexWriterCloser
   [junit4]   2> 1195037 INFO  (coreCloseExecutor-8338-thread-3-processing-x:lazy1) [    x:lazy1] o.a.s.c.SolrCore [lazy1]  CLOSING SolrCore org.apache.solr.core.SolrCore@47092692
   [junit4]   2> 1195037 INFO  (coreCloseExecutor-8338-thread-2-processing-x:lazy1) [    x:core2] o.a.s.c.SolrCore [core2] Closing main searcher on request.
   [junit4]   2> 1195037 INFO  (coreCloseExecutor-8338-thread-3-processing-x:lazy1) [    x:lazy1] o.a.s.u.DirectUpdateHandler2 closing DirectUpdateHandler2{commits=0,autocommits=0,soft autocommits=0,optimizes=0,rollbacks=0,expungeDeletes=0,docsPending=0,adds=0,deletesById=0,deletesByQuery=0,errors=0,cumulative_adds=0,cumulative_deletesById=0,cumulative_deletesByQuery=0,cumulative_errors=0}
   [junit4]   2> 1195037 INFO  (coreCloseExecutor-8338-thread-2-processing-x:lazy1) [    x:core2] o.a.s.c.CachingDirectoryFactory Closing MockDirectoryFactory - 2 directories currently being tracked
   [junit4]   2> 1195037 INFO  (coreCloseExecutor-8338-thread-3-processing-x:lazy1) [    x:lazy1] o.a.s.u.SolrCoreState Closing SolrCoreState
   [junit4]   2> 1195037 INFO  (coreCloseExecutor-8338-thread-2-processing-x:lazy1) [    x:core2] o.a.s.c.CachingDirectoryFactory looking to close /home/jenkins/workspace/Lucene-Solr-5.5-Linux/solr/build/solr-core/test/J0/temp/solr.core.TestCoreDiscovery_53813ED6E4942F74-001/tempDir-001/core2/core2 [CachedDir<<refCount=0;path=/home/jenkins/workspace/Lucene-Solr-5.5-Linux/solr/build/solr-core/test/J0/temp/solr.core.TestCoreDiscovery_53813ED6E4942F74-001/tempDir-001/core2/core2;done=false>>]
   [junit4]   2> 1195037 INFO  (coreCloseExecutor-8338-thread-3-processing-x:lazy1) [    x:lazy1] o.a.s.u.DefaultSolrCoreState SolrCoreState ref count has reached 0 - closing IndexWriter
   [junit4]   2> 1195037 INFO  (coreCloseExecutor-8338-thread-2-processing-x:lazy1) [    x:core2] o.a.s.c.CachingDirectoryFactory Closing directory: /home/jenkins/workspace/Lucene-Solr-5.5-Linux/solr/build/solr-core/test/J0/temp/solr.core.TestCoreDiscovery_53813ED6E4942F74-001/tempDir-001/core2/core2
   [junit4]   2> 1195037 INFO  (coreCloseExecutor-8338-thread-3-processing-x:lazy1) [    x:lazy1] o.a.s.u.DefaultSolrCoreState closing IndexWriter with IndexWriterCloser
   [junit4]   2> 1195037 INFO  (coreCloseExecutor-8338-thread-2-processing-x:lazy1) [    x:core2] o.a.s.c.CachingDirectoryFactory looking to close /home/jenkins/workspace/Lucene-Solr-5.5-Linux/solr/build/solr-core/test/J0/temp/solr.core.TestCoreDiscovery_53813ED6E4942F74-001/tempDir-001/core2/core2/index [CachedDir<<refCount=0;path=/home/jenkins/workspace/Lucene-Solr-5.5-Linux/solr/build/solr-core/test/J0/temp/solr.core.TestCoreDiscovery_53813ED6E4942F74-001/tempDir-001/core2/core2/index;done=false>>]
   [junit4]   2> 1195037 INFO  (coreCloseExecutor-8338-thread-2-processing-x:lazy1) [    x:core2] o.a.s.c.CachingDirectoryFactory Closing directory: /home/jenkins/workspace/Lucene-Solr-5.5-Linux/solr/build/solr-core/test/J0/temp/solr.core.TestCoreDiscovery_53813ED6E4942F74-001/tempDir-001/core2/core2/index
   [junit4]   2> 1195037 INFO  (coreCloseExecutor-8338-thread-1-processing-x:lazy1) [    x:core1] o.a.s.c.SolrCore [core1] Closing main searcher on request.
   [junit4]   2> 1195039 INFO  (coreCloseExecutor-8338-thread-1-processing-x:lazy1) [    x:core1] o.a.s.c.CachingDirectoryFactory Closing MockDirectoryFactory - 2 directories currently being tracked
   [junit4]   2> 1195039 INFO  (coreCloseExecutor-8338-thread-3-processing-x:lazy1) [    x:lazy1] o.a.s.c.SolrCore [lazy1] Closing main searcher on request.
   [junit4]   2> 1195039 INFO  (coreCloseExecutor-8338-thread-1-processing-x:lazy1) [    x:core1] o.a.s.c.CachingDirectoryFactory looking to close /home/jenkins/workspace/Lucene-Solr-5.5-Linux/solr/build/solr-core/test/J0/temp/solr.core.TestCoreDiscovery_53813ED6E4942F74-001/tempDir-001/core1/core1/index [CachedDir<<refCount=0;path=/home/jenkins/workspace/Lucene-Solr-5.5-Linux/solr/build/solr-core/test/J0/temp/solr.core.TestCoreDiscovery_53813ED6E4942F74-001/tempDir-001/core1/core1/index;done=false>>]
   [junit4]   2> 1195039 INFO  (coreCloseExecutor-8338-thread-1-processing-x:lazy1) [    x:core1] o.a.s.c.CachingDirectoryFactory Closing directory: /home/jenkins/workspace/Lucene-Solr-5.5-Linux/solr/build/solr-core/test/J0/temp/solr.core.TestCoreDiscovery_53813ED6E4942F74-001/tempDir-001/core1/core1/index
   [junit4]   2> 1195039 INFO  (coreCloseExecutor-8338-thread-3-processing-x:lazy1) [    x:lazy1] o.a.s.c.CachingDirectoryFactory Closing MockDirectoryFactory - 2 directories currently being tracked
   [junit4]   2> 1195039 INFO  (coreCloseExecutor-8338-thread-1-processing-x:lazy1) [    x:core1] o.a.s.c.CachingDirectoryFactory looking to close /home/jenkins/workspace/Lucene-Solr-5.5-Linux/solr/build/solr-core/test/J0/temp/solr.core.TestCoreDiscovery_53813ED6E4942F74-001/tempDir-001/core1/core1 [CachedDir<<refCount=0;path=/home/jenkins/workspace/Lucene-Solr-5.5-Linux/solr/build/solr-core/test/J0/temp/solr.core.TestCoreDiscovery_53813ED6E4942F74-001/tempDir-001/core1/core1;done=false>>]
   [junit4]   2> 1195039 INFO  (coreCloseExecutor-8338-thread-1-processing-x:lazy1) [    x:core1] o.a.s.c.CachingDirectoryFactory Closing directory: /home/jenkins/workspace/Lucene-Solr-5.5-Linux/solr/build/solr-core/test/J0/temp/solr.core.TestCoreDiscovery_53813ED6E4942F74-001/tempDir-001/core1/core1
   [junit4]   2> 1195039 INFO  (coreCloseExecutor-8338-thread-3-processing-x:lazy1) [    x:lazy1] o.a.s.c.CachingDirectoryFactory looking to close /home/jenkins/workspace/Lucene-Solr-5.5-Linux/solr/build/solr-core/test/J0/temp/solr.core.TestCoreDiscovery_53813ED6E4942F74-001/tempDir-001/lazy1/lazy1 [CachedDir<<refCount=0;path=/home/jenkins/workspace/Lucene-Solr-5.5-Linux/solr/build/solr-core/test/J0/temp/solr.core.TestCoreDiscovery_53813ED6E4942F74-001/tempDir-001/lazy1/lazy1;done=false>>]
   [junit4]   2> 1195039 INFO  (coreCloseExecutor-8338-thread-3-processing-x:lazy1) [    x:lazy1] o.a.s.c.CachingDirectoryFactory Closing directory: /home/jenkins/workspace/Lucene-Solr-5.5-Linux/solr/build/solr-core/test/J0/temp/solr.core.TestCoreDiscovery_53813ED6E4942F74-001/tempDir-001/lazy1/lazy1
   [junit4]   2> 1195039 INFO  (coreCloseExecutor-8338-thread-3-processing-x:lazy1) [    x:lazy1] o.a.s.c.CachingDirectoryFactory looking to close /home/jenkins/workspace/Lucene-Solr-5.5-Linux/solr/build/solr-core/test/J0/temp/solr.core.TestCoreDiscovery_53813ED6E4942F74-001/tempDir-001/lazy1/lazy1/index [CachedDir<<refCount=0;path=/home/jenkins/workspace/Lucene-Solr-5.5-Linux/solr/build/solr-core/test/J0/temp/solr.core.TestCoreDiscovery_53813ED6E4942F74-001/tempDir-001/lazy1/lazy1/index;done=false>>]
   [junit4]   2> 1195039 INFO  (coreCloseExecutor-8338-thread-3-processing-x:lazy1) [    x:lazy1] o.a.s.c.CachingDirectoryFactory Closing directory: /home/jenkins/workspace/Lucene-Solr-5.5-Linux/solr/build/solr-core/test/J0/temp/solr.core.TestCoreDiscovery_53813ED6E4942F74-001/tempDir-001/lazy1/lazy1/index
   [junit4]   2> 1195039 INFO  (TEST-TestCoreDiscovery.testDiscovery-seed#[53813ED6E4942F74]) [    x:lazy1] o.a.s.SolrTestCaseJ4 ###Ending testDiscovery
   [junit4]   2> 1195041 INFO  (TEST-TestCoreDiscovery.testDuplicateNames-seed#[53813ED6E4942F74]) [    x:lazy1] o.a.s.SolrTestCaseJ4 ###Starting testDuplicateNames
   [junit4]   2> 1195043 INFO  (TEST-TestCoreDiscovery.testDuplicateNames-seed#[53813ED6E4942F74]) [    x:lazy1] o.a.s.c.SolrResourceLoader JNDI not configured for solr (NoInitialContextEx)
   [junit4]   2> 1195043 INFO  (TEST-TestCoreDiscovery.testDuplicateNames-seed#[53813ED6E4942F74]) [    x:lazy1] o.a.s.c.SolrResourceLoader using system property solr.solr.home: /home/jenkins/workspace/Lucene-Solr-5.5-Linux/solr/build/solr-core/test/J0/temp/solr.core.TestCoreDiscovery_53813ED6E4942F74-001/tempDir-002
   [junit4]   2> 1195043 INFO  (TEST-TestCoreDiscovery.testDuplicateNames-seed#[53813ED6E4942F74]) [    x:lazy1] o.a.s.c.SolrResourceLoader new SolrResourceLoader for directory: '/home/jenkins/workspace/Lucene-Solr-5.5-Linux/solr/build/solr-core/test/J0/temp/solr.core.TestCoreDiscovery_53813ED6E4942F74-001/tempDir-002'
   [junit4]   2> 1195043 INFO  (TEST-TestCoreDiscovery.testDuplicateNames-seed#[53813ED6E4942F74]) [    x:lazy1] o.a.s.c.SolrResourceLoader JNDI not configured for solr (NoInitialContextEx)
   [junit4]   2> 1195043 INFO  (TEST-TestCoreDiscovery.testDuplicateNames-seed#[53813ED6E4942F74]) [    x:lazy1] o.a.s.c.SolrResourceLoader using system property solr.solr.home: /home/jenkins/workspace/Lucene-Solr-5.5-Linux/solr/build/solr-core/test/J0/temp/solr.core.TestCoreDiscovery_53813ED6E4942F74-001/tempDir-002
   [junit4]   2> 1195043 INFO  (TEST-TestCoreDiscovery.testDuplicateNames-seed#[53813ED6E4942F74]) [    x:lazy1] o.a.s.c.SolrXmlConfig Loading container configuration from /home/jenkins/workspace/Lucene-Solr-5.5-Linux/solr/build/solr-core/test/J0/temp/solr.core.TestCoreDiscovery_53813ED6E4942F74-001/tempDir-002/solr.xml
   [junit4]   2> 1195046 INFO  (TEST-TestCoreDiscovery.testDuplicateNames-seed#[53813ED6E4942F74]) [    x:lazy1] o.a.s.c.CorePropertiesLocator Config-defined core root directory: /home/jenkins/workspace/Lucene-Solr-5.5-Linux/solr/build/solr-core/test/J0/temp/solr.core.TestCoreDiscovery_53813ED6E4942F74-001/tempDir-002
   [junit4]   2> 1195046 INFO  (TEST-TestCoreDiscovery.testDuplicateNames-seed#[53813ED6E4942F74]) [    x:lazy1] o.a.s.c.CoreContainer New CoreContainer 1227884125
   [junit4]   2> 1195046 INFO  (TEST-TestCoreDiscovery.testDuplicateNames-seed#[53813ED6E4942F74]) [    x:lazy1] o.a.s.c.CoreContainer Loading cores into CoreContainer [instanceDir=/home/jenkins/workspace/Lucene-Solr-5.5-Linux/solr/build/solr-core/test/J0/temp/solr.core.TestCoreDiscovery_53813ED6E4942F74-001/tempDir-002]
   [junit4]   2> 1195046 WARN  (TEST-TestCoreDiscovery.testDuplicateNames-seed#[53813ED6E4942F74]) [    x:lazy1] o.a.s.c.CoreContainer Couldn't add files from /home/jenkins/workspace/Lucene-Solr-5.5-Linux/solr/build/solr-core/test/J0/temp/solr.core.TestCoreDiscovery_53813ED6E4942F74-001/tempDir-002/lib to classpath: /home/jenkins/workspace/Lucene-Solr-5.5-Linux/solr/build/solr-core/test/J0/temp/solr.core.TestCoreDiscovery_53813ED6E4942F74-001/tempDir-002/lib
   [junit4]   2> 1195047 INFO  (TEST-TestCoreDiscovery.testDuplicateNames-seed#[53813ED6E4942F74]) [    x:lazy1] o.a.s.h.c.HttpShardHandlerFactory created with socketTimeout : 600000,connTimeout : 60000,maxConnectionsPerHost : 20,maxConnections : 10000,corePoolSize : 0,maximumPoolSize : 2147483647,maxThreadIdleTime : 5,sizeOfQueue : -1,fairnessPolicy : false,useRetries : false,connectionsEvictorSleepDelay : 5000,maxConnectionIdleTime : 40000,
   [junit4]   2> 1195048 INFO  (TEST-TestCoreDiscovery.testDuplicateNames-seed#[53813ED6E4942F74]) [    x:lazy1] o.a.s.u.UpdateShardHandler Creating UpdateShardHandler HTTP client with params: socketTimeout=600000&connTimeout=60000&retry=true
   [junit4]   2> 1195049 INFO  (TEST-TestCoreDiscovery.testDuplicateNames-seed#[53813ED6E4942F74]) [    x:lazy1] o.a.s.c.SolrCores Allocating transient cache for 2 transient cores
   [junit4]   2> 1195049 INFO  (TEST-TestCoreDiscovery.testDuplicateNames-seed#[53813ED6E4942F74]) [    x:lazy1] o.a.s.l.LogWatcher SLF4J impl is org.slf4j.impl.Log4jLoggerFactory
   [junit4]   2> 1195049 INFO  (TEST-TestCoreDiscovery.testDuplicateNames-seed#[53813ED6E4942F74]) [    x:lazy1] o.a.s.l.LogWatcher Registering Log Listener [Log4j (org.slf4j.impl.Log4jLoggerFactory)]
   [junit4]   2> 1195049 INFO  (TEST-TestCoreDiscovery.testDuplicateNames-seed#[53813ED6E4942F74]) [    x:lazy1] o.a.s.c.CoreContainer Security conf doesn't exist. Skipping setup for authorization module.
   [junit4]   2> 1195049 INFO  (TEST-TestCoreDiscovery.testDuplicateNames-seed#[53813ED6E4942F74]) [    x:lazy1] o.a.s.c.CoreContainer No authentication plugin used.
   [junit4]   2> 1195049 INFO  (TEST-TestCoreDiscovery.testDuplicateNames-seed#[53813ED6E4942F74]) [    x:lazy1] o.a.s.c.CorePropertiesLocator Looking for core definitions underneath /home/jenkins/workspace/Lucene-Solr-5.5-Linux/solr/build/solr-core/test/J0/temp/solr.core.TestCoreDiscovery_53813ED6E4942F74-001/tempDir-002
   [junit4]   2> 1195051 INFO  (TEST-TestCoreDiscovery.testDuplicateNames-seed#[53813ED6E4942F74]) [    x:lazy1] o.a.s.c.CoreDescriptor Created CoreDescriptor: {name=core1, config=solrconfig-minimal.xml, loadOnStartup=false, schema=schema-tiny.xml, configSetProperties=configsetprops.json, transient=false, dataDir=stuffandnonsense}
   [junit4]   2> 1195051 INFO  (TEST-TestCoreDiscovery.testDuplicateNames-seed#[53813ED6E4942F74]) [    x:lazy1] o.a.s.c.CorePropertiesLocator Found core core1 in /home/jenkins/workspace/Lucene-Solr-5.5-Linux/solr/build/solr-core/test/J0/temp/solr.core.TestCoreDiscovery_53813ED6E4942F74-001/tempDir-002/core2
   [junit4]   2> 1195051 INFO  (TEST-TestCoreDiscovery.testDuplicateNames-seed#[53813ED6E4942F74]) [    x:lazy1] o.a.s.c.CoreDescriptor Created CoreDescriptor: {name=core1, config=solrconfig-minimal.xml, loadOnStartup=true, schema=schema-tiny.xml, configSetProperties=configsetprops.json, transient=false, dataDir=stuffandnonsense}
   [junit4]   2> 1195051 INFO  (TEST-TestCoreDiscovery.testDuplicateNames-seed#[53813ED6E4942F74]) [    x:lazy1] o.a.s.c.CorePropertiesLocator Found core core1 in /home/jenkins/workspace/Lucene-Solr-5.5-Linux/solr/build/solr-core/test/J0/temp/solr.core.TestCoreDiscovery_53813ED6E4942F74-001/tempDir-002/core1
   [junit4]   2> 1195051 INFO  (TEST-TestCoreDiscovery.testDuplicateNames-seed#[53813ED6E4942F74]) [    x:lazy1] o.a.s.c.CorePropertiesLocator Found 2 core definitions
   [junit4]   2> 1195051 INFO  (TEST-TestCoreDiscovery.testDuplicateNames-seed#[53813ED6E4942F74]) [    x:lazy1] o.a.s.c.CoreContainer Shutting down CoreContainer instance=1227884125
   [junit4]   2> 1195051 INFO  (TEST-TestCoreDiscovery.testDuplicateNames-seed#[53813ED6E4942F74]) [    x:lazy1] o.a.s.SolrTestCaseJ4 ###Ending testDuplicateNames
   [junit4]   2> 1195053 INFO  (TEST-TestCoreDiscovery.testAlternateRelativeCoreDir-seed#[53813ED6E4942F74]) [    x:lazy1] o.a.s.SolrTestCaseJ4 ###Starting testAlternateRelativeCoreDir
   [junit4]   2> 1195056 INFO  (TEST-TestCoreDiscovery.testAlternateRelativeCoreDir-seed#[53813ED6E4942F74]) [    x:lazy1] o.a.s.c.SolrResourceLoader JNDI not configured for solr (NoInitialContextEx)
   [junit4]   2> 1195056 INFO  (TEST-TestCoreDiscovery.testAlternateRelativeCoreDir-seed#[53813ED6E4942F74]) [    x:lazy1] o.a.s.c.SolrResourceLoader using system property solr.solr.home: /home/jenkins/workspace/Lucene-Solr-5.5-Linux/solr/build/solr-core/test/J0/temp/solr.core.TestCoreDiscovery_53813ED6E4942F74-001/tempDir-003
   [junit4]   2> 1195056 INFO  (TEST-TestCoreDiscovery.testAlternateRelativeCoreDir-seed#[53813ED6E4942F74]) [    x:lazy1] o.a.s.c.SolrResourceLoader new SolrResourceLoader for directory: '/home/jenkins/workspace/Lucene-Solr-5.5-Linux/solr/build/solr-core/test/J0/temp/solr.core.TestCoreDiscovery_53813ED6E4942F74-001/tempDir-003'
   [junit4]   2> 1195056 INFO  (TEST-TestCoreDiscovery.testAlternateRelativeCoreDir-seed#[53813ED6E4942F74]) [    x:lazy1] o.a.s.c.SolrResourceLoader JNDI not configured for solr (NoInitialContextEx)
   [junit4]   2> 1195056 INFO  (TEST-TestCoreDiscovery.testAlternateRelativeCoreDir-seed#[53813ED6E4942F74]) [    x:lazy1] o.a.s.c.SolrResourceLoader using system property solr.solr.home: /home/jenkins/workspace/Lucene-Solr-5.5-Linux/solr/build/solr-core/test/J0/temp/solr.core.TestCoreDiscovery_53813ED6E4942F74-001/tempDir-003
   [junit4]   2> 1195056 INFO  (TEST-TestCoreDiscovery.testAlternateRelativeCoreDir-seed#[53813ED6E4942F74]) [    x:lazy1] o.a.s.c.SolrXmlConfig Loading container configuration from /home/jenkins/workspace/Lucene-Solr-5.5-Linux/solr/build/solr-core/test/J0/temp/solr.core.TestCoreDiscovery_53813ED6E4942F74-001/tempDir-003/solr.xml
   [junit4]   2> 1195059 INFO  (TEST-TestCoreDiscovery.testAlternateRelativeCoreDir-seed#[53813ED6E4942F74]) [    x:lazy1] o.a.s.c.CorePropertiesLocator Config-defined core root directory: /home/jenkins/workspace/Lucene-Solr-5.5-Linux/solr/build/solr-core/test/J0/temp/solr.core.TestCoreDiscovery_53813ED6E4942F74-001/tempDir-003/relativeCoreDir
   [junit4]   2> 1195059 INFO  (TEST-TestCoreDiscovery.testAlternateRelativeCoreDir-seed#[53813ED6E4942F74]) [    x:lazy1] o.a.s.c.CoreContainer New CoreContainer 679972081
   [junit4]   2> 1195059 INFO  (TEST-TestCoreDiscovery.testAlternateRelativeCoreDir-seed#[53813ED6E4942F74]) [    x:lazy1] o.a.s.c.CoreContainer Loading cores into CoreContainer [instanceDir=/home/jenkins/workspace/Lucene-Solr-5.5-Linux/solr/build/solr-core/test/J0/temp/solr.core.TestCoreDiscovery_53813ED6E4942F74-001/tempDir-003]
   [junit4]   2> 1195059 WARN  (TEST-TestCoreDiscovery.testAlternateRelativeCoreDir-seed#[53813ED6E4942F74]) [    x:lazy1] o.a.s.c.CoreContainer Couldn't add files from /home/jenkins/workspace/Lucene-Solr-5.5-Linux/solr/build/solr-core/test/J0/temp/solr.core.TestCoreDiscovery_53813ED6E4942F74-001/tempDir-003/lib to classpath: /home/jenkins/workspace/Lucene-Solr-5.5-Linux/solr/build/solr-core/test/J0/temp/solr.core.TestCoreDiscovery_53813ED6E4942F74-001/tempDir-003/lib
   [junit4]   2> 1195059 INFO  (TEST-TestCoreDiscovery.testAlternateRelativeCoreDir-seed#[53813ED6E4942F74]) [    x:lazy1] o.a.s.h.c.HttpShardHandlerFactory created with socketTimeout : 600000,connTimeout : 60000,maxConnectionsPerHost : 20,maxConnections : 10000,corePoolSize : 0,maximumPoolSize : 2147483647,maxThreadIdleTime : 5,sizeOfQueue : -1,fairnessPolicy : false,useRetries : false,connectionsEvictorSleepDelay : 5000,maxConnectionIdleTime : 40000,
   [junit4]   2> 1195061 INFO  (TEST-TestCoreDiscovery.testAlternateRelativeCoreDir-seed#[53813ED6E4942F74]) [    x:lazy1] o.a.s.u.UpdateShardHandler Creating UpdateShardHandler HTTP client with params: socketTimeout=600000&connTimeout=60000&retry=true
   [junit4]   2> 1195061 INFO  (TEST-TestCoreDiscovery.testAlternateRelativeCoreDir-seed#[53813ED6E4942F74]) [    x:lazy1] o.a.s.c.SolrCores Allocating transient cache for 2 transient cores
   [junit4]   2> 1195061 INFO  (TEST-TestCoreDiscovery.testAlternateRelativeCoreDir-seed#[53813ED6E4942F74]) [    x:lazy1] o.a.s.l.LogWatcher SLF4J impl is org.slf4j.impl.Log4jLoggerFactory
   [junit4]   2> 1195061 INFO  (TEST-TestCoreDiscovery.testAlternateRelativeCoreDir-seed#[53813ED6E4942F74]) [    x:lazy1] o.a.s.l.LogWatcher Registering Log Listener [Log4j (org.slf4j.impl.Log4jLoggerFactory)]
   [junit4]   2> 1195061 INFO  (TEST-TestCoreDiscovery.testAlternateRelativeCoreDir-seed#[53813ED6E4942F74]) [    x:lazy1] o.a.s.c.CoreContainer Security conf doesn't exist. Skipping setup for authorization module.
   [junit4]   2> 1195061 INFO  (TEST-TestCoreDiscovery.testAlternateRelativeCoreDir-seed#[53813ED6E4942F74]) [    x:lazy1] o.a.s.c.CoreContainer No authentication plugin used.
   [junit4]   2> 1195062 INFO  (TEST-TestCoreDiscovery.testAlternateRelativeCoreDir-seed#[53813ED6E4942F74]) [    x:lazy1] o.a.s.c.CorePropertiesLocator Looking for core definitions underneath /home/jenkins/workspace/Lucene-Solr-5.5-Linux/solr/build/solr-core/test/J0/temp/solr.core.TestCoreDiscovery_53813ED6E4942F74-001/tempDir-003/relativeCoreDir
   [junit4]   2> 1195063 INFO  (TEST-TestCoreDiscovery.testAlternateRelativeCoreDir-seed#[53813ED6E4942F74]) [    x:lazy1] o.a.s.c.CoreDescriptor Created CoreDescriptor: {name=core2, config=solrconfig-minimal.xml, loadOnStartup=false, schema=schema-tiny.xml, configSetProperties=configsetprops.json, transient=false, dataDir=core2}
   [junit4]   2> 1195063 INFO  (TEST-TestCoreDiscovery.testAlternateRelativeCoreDir-seed#[53813ED6E4942F74]) [    x:lazy1] o.a.s.c.CorePropertiesLocator Found core core2 in /home/jenkins/workspace/Lucene-Solr-5.5-Linux/solr/build/solr-core/test/J0/temp/solr.core.TestCoreDiscovery_53813ED6E4942F74-001/tempDir-003/relativeCoreDir/core2
   [junit4]   2> 1195063 INFO  (TEST-TestCoreDiscovery.testAlternateRelativeCoreDir-seed#[53813ED6E4942F74]) [    x:lazy1] o.a.s.c.CoreDescriptor Created CoreDescriptor: {name=core1, config=solrconfig-minimal.xml, loadOnStartup=true, schema=schema-tiny.xml, configSetProperties=configsetprops.json, transient=false, dataDir=core1}
   [junit4]   2> 1195063 INFO  (TEST-TestCoreDiscovery.testAlternateRelativeCoreDir-seed#[53813ED6E4942F74]) [    x:lazy1] o.a.s.c.CorePropertiesLocator Found core core1 in /home/jenkins/workspace/Lucene-Solr-5.5-Linux/solr/build/solr-core/test/J0/temp/solr.core.TestCoreDiscovery_53813ED6E4942F74-001/tempDir-003/relativeCoreDir/core1
   [junit4]   2> 1195063 INFO  (TEST-TestCoreDiscovery.testAlternateRelativeCoreDir-seed#[53813ED6E4942F74]) [    x:lazy1] o.a.s.c.CorePropertiesLocator Found 2 core definitions
   [junit4]   2> 1195064 INFO  (coreLoadExecutor-8352-thread-1-processing-x:lazy1) [    x:lazy1] o.a.s.c.SolrResourceLoader new SolrResourceLoader for directory: '/home/jenkins/workspace/Lucene-Solr-5.5-Linux/solr/build/solr-core/test/J0/temp/solr.core.TestCoreDiscovery_53813ED6E4942F74-001/tempDir-003/relativeCoreDir/core1'
   [junit4]   2> 1195064 INFO  (coreLoadExecutor-8352-thread-1-processing-x:lazy1) [    x:lazy1] o.a.s.c.SolrResourceLoader JNDI not configured for solr (NoInitialContextEx)
   [junit4]   2> 1195064 INFO  (coreLoadExecutor-8352-thread-1-processing-x:lazy1) [    x:lazy1] o.a.s.c.SolrResourceLoader using system property solr.solr.home: /home/jenkins/workspace/Lucene-Solr-5.5-Linux/solr/build/solr-core/test/J0/temp/solr.core.TestCoreDiscovery_53813ED6E4942F74-001/tempDir-003
   [junit4]   2> 1195067 INFO  (coreLoadExecutor-8352-thread-1-processing-x:lazy1) [    x:lazy1] o.a.s.c.SolrConfig current version of requestparams : -1
   [junit4]   2> 1195069 INFO  (coreLoadExecutor-8352-thread-1-processing-x:lazy1) [    x:lazy1] o.a.s.c.SolrConfig Using Lucene MatchVersion: 5.5.3
   [junit4]   2> 1195073 INFO  (coreLoadExecutor-8352-thread-1-processing-x:lazy1) [    x:lazy1] o.a.s.c.SolrConfig Loaded SolrConfig: solrconfig-minimal.xml
   [junit4]   2> 1195076 INFO  (coreLoadExecutor-8352-thread-1-processing-x:lazy1) [    x:lazy1] o.a.s.s.IndexSchema [core1] Schema name=tiny
   [junit4]   2> 1195079 INFO  (coreLoadExecutor-8352-thread-1-processing-x:lazy1) [    x:lazy1] o.a.s.s.IndexSchema unique key field: id
   [junit4]   2> 1195081 INFO  (coreLoadExecutor-8352-thread-1-processing-x:lazy1) [    x:lazy1] o.a.s.c.ConfigSetProperties Did not find ConfigSet properties, assuming default properties: Can't find resource 'configsetprops.json' in classpath or '/home/jenkins/workspace/Lucene-Solr-5.5-Linux/solr/build/solr-core/test/J0/temp/solr.core.TestCoreDiscovery_53813ED6E4942F74-001/tempDir-003/relativeCoreDir/core1'
   [junit4]   2> 1195081 INFO  (coreLoadExecutor-8352-thread-1-processing-x:lazy1) [    x:lazy1] o.a.s.c.CoreContainer Creating SolrCore 'core1' using configuration from instancedir /home/jenkins/workspace/Lucene-Solr-5.5-Linux/solr/build/solr-core/test/J0/temp/solr.core.TestCoreDiscovery_53813ED6E4942F74-001/tempDir-003/relativeCoreDir/core1
   [junit4]   2> 1195081 INFO  (coreLoadExecutor-8352-thread-1-processing-x:lazy1) [    x:core1] o.a.s.c.SolrCore org.apache.solr.core.MockDirectoryFactory
   [junit4]   2> 1195081 INFO  (coreLoadExecutor-8352-thread-1-processing-x:lazy1) [    x:core1] o.a.s.c.SolrCore [[core1] ] Opening new SolrCore at [/home/jenkins/workspace/Lucene-Solr-5.5-Linux/solr/build/solr-core/test/J0/temp/solr.core.TestCoreDiscovery_53813ED6E4942F74-001/tempDir-003/relativeCoreDir/core1], dataDir=[/home/jenkins/workspace/Lucene-Solr-5.5-Linux/solr/build/solr-core/test/J0/temp/solr.core.TestCoreDiscovery_53813ED6E4942F74-001/tempDir-003/relativeCoreDir/core1/core1/]
   [junit4]   2> 1195081 INFO  (coreLoadExecutor-8352-thread-1-processing-x:lazy1) [    x:core1] o.a.s.c.SolrCore JMX monitoring not detected for core: core1
   [junit4]   2> 1195082 INFO  (coreLoadExecutor-8352-thread-1-processing-x:lazy1) [    x:core1] o.a.s.c.CachingDirectoryFactory return new directory for /home/jenkins/workspace/Lucene-Solr-5.5-Linux/solr/build/solr-core/test/J0/temp/solr.core.TestCoreDiscovery_53813ED6E4942F74-001/tempDir-003/relativeCoreDir/core1/core1
   [junit4]   2> 1195082 INFO  (coreLoadExecutor-8352-thread-1-processing-x:lazy1) [    x:core1] o.a.s.c.SolrCore New index directory detected: old=null new=/home/jenkins/workspace/Lucene-Solr-5.5-Linux/solr/build/solr-core/test/J0/temp/solr.core.TestCoreDiscovery_53813ED6E4942F74-001/tempDir-003/relativeCoreDir/core1/core1/index/
   [junit4]   2> 1195082 WARN  (coreLoadExecutor-8352-thread-1-processing-x:lazy1) [    x:core1] o.a.s.c.SolrCore [core1] Solr index directory '/home/jenkins/workspace/Lucene-Solr-5.5-Linux/solr/build/solr-core/test/J0/temp/solr.core.TestCoreDiscovery_53813ED6E4942F74-001/tempDir-003/relativeCoreDir/core1/core1/index' doesn't exist. Creating new index...
   [junit4]   2> 1195082 INFO  (coreLoadExecutor-8352-thread-1-processing-x:lazy1) [    x:core1] o.a.s.c.CachingDirectoryFactory return new directory for /home/jenkins/workspace/Lucene-Solr-5.5-Linux/solr/build/solr-core/test/J0/temp/solr.core.TestCoreDiscovery_53813ED6E4942F74-001/tempDir-003/relativeCoreDir/core1/core1/index
   [junit4]   2> 1195082 INFO  (coreLoadExecutor-8352-thread-1-processing-x:lazy1) [    x:core1] o.a.s.u.RandomMergePolicy RandomMergePolicy wrapping class org.apache.lucene.index.TieredMergePolicy: [TieredMergePolicy: maxMergeAtOnce=25, maxMergeAtOnceExplicit=31, maxMergedSegmentMB=89.6484375, floorSegmentMB=1.734375, forceMergeDeletesPctAllowed=3.7929944864184675, segmentsPerTier=32.0, maxCFSSegmentSizeMB=8.796093022207999E12, noCFSRatio=0.0
   [junit4]   2> 1195083 INFO  (coreLoadExecutor-8352-thread-1-processing-x:lazy1) [    x:core1] o.a.s.c.SolrDeletionPolicy SolrDeletionPolicy.onCommit: commits: num=1
   [junit4]   2> 	commit{dir=MockDirectoryWrapper(RAMDirectory@1f9f6188 lockFactory=org.apache.lucene.store.SingleInstanceLockFactory@3de0048e),segFN=segments_1,generation=1}
   [junit4]   2> 1195083 INFO  (coreLoadExecutor-8352-thread-1-processing-x:lazy1) [    x:core1] o.a.s.c.SolrDeletionPolicy newest commit generation = 1
   [junit4]   2> 1195090 INFO  (OldIndexDirectoryCleanupThreadForCore-core1) [    x:core1] o.a.s.c.SolrCore Looking for old index directories to cleanup for core core1 in /home/jenkins/workspace/Lucene-Solr-5.5-Linux/solr/build/solr-core/test/J0/temp/solr.core.TestCoreDiscovery_53813ED6E4942F74-001/tempDir-003/relativeCoreDir/core1/core1/
   [junit4]   2> 1195090 WARN  (OldIndexDirectoryCleanupThreadForCore-core1) [    x:core1] o.a.s.c.DirectoryFactory /home/jenkins/workspace/Lucene-Solr-5.5-Linux/solr/build/solr-core/test/J0/temp/solr.core.TestCoreDiscovery_53813ED6E4942F74-001/tempDir-003/relativeCoreDir/core1/core1/ does not point to a valid data directory; skipping clean-up of old index directories.
   [junit4]   2> 1195091 INFO  (coreLoadExecutor-8352-thread-1-processing-x:lazy1) [    x:core1] o.a.s.c.SolrCore no updateRequestProcessorChain defined as default, creating implicit default
   [junit4]   2> 1195091 INFO  (coreLoadExecutor-8352-thread-1-processing-x:lazy1) [    x:core1] o.a.s.h.l.XMLLoader xsltCacheLifetimeSeconds=60
   [junit4]   2> 1195092 INFO  (coreLoadExecutor-8352-thread-1-processing-x:lazy1) [    x:core1] o.a.s.h.l.XMLLoader xsltCacheLifetimeSeconds=60
   [junit4]   2> 1195092 INFO  (coreLoadExecutor-8352-thread-1-processing-x:lazy1) [    x:core1] o.a.s.h.l.XMLLoader xsltCacheLifetimeSeconds=60
   [junit4]   2> 1195093 INFO  (coreLoadExecutor-8352-thread-1-processing-x:lazy1) [    x:core1] o.a.s.h.l.XMLLoader xsltCacheLifetimeSeconds=60
   [junit4]   2> 1195093 INFO  (coreLoadExecutor-8352-thread-1-processing-x:lazy1) [    x:core1] o.a.s.c.RequestHandlers Registered paths: /admin/mbeans,/update/csv,/update/json/docs,/admin/luke,/select,/admin/segments,/get,/admin/system,/replication,/admin/properties,/config,/schema,/admin/plugins,/admin/logging,/update/json,/admin/threads,/admin/ping,/update,/admin/file
   [junit4]   2> 1195093 INFO  (coreLoadExecutor-8352-thread-1-processing-x:lazy1) [    x:core1] o.a.s.c.SolrCore Using default statsCache cache: org.apache.solr.search.stats.LocalStatsCache
   [junit4]   2> 1195094 INFO  (coreLoadExecutor-8352-thread-1-processing-x:lazy1) [    x:core1] o.a.s.u.CommitTracker Hard AutoCommit: disabled
   [junit4]   2> 1195094 INFO  (coreLoadExecutor-8352-thread-1-processing-x:lazy1) [    x:core1] o.a.s.u.CommitTracker Soft AutoCommit: disabled
   [junit4]   2> 1195094 INFO  (coreLoadExecutor-8352-thread-1-processing-x:lazy1) [    x:core1] o.a.s.u.RandomMergePolicy RandomMergePolicy wrapping class org.apache.lucene.index.TieredMergePolicy: [TieredMergePolicy: maxMergeAtOnce=37, maxMergeAtOnceExplicit=50, maxMergedSegmentMB=52.169921875, floorSegmentMB=0.4140625, forceMergeDeletesPctAllowed=12.508997628604728, segmentsPerTier=13.0, maxCFSSegmentSizeMB=8.796093022207999E12, noCFSRatio=0.7499510211001037
   [junit4]   2> 1195094 INFO  (coreLoadExecutor-8352-thread-1-processing-x:lazy1) [    x:core1] o.a.s.c.SolrDeletionPolicy SolrDeletionPolicy.onInit: commits: num=1
   [junit4]   2> 	commit{dir=MockDirectoryWrapper(RAMDirectory@1f9f6188 lockFactory=org.apache.lucene.store.SingleInstanceLockFactory@3de0048e),segFN=segments_1,generation=1}
   [junit4]   2> 1195094 INFO  (coreLoadExecutor-8352-thread-1-processing-x:lazy1) [    x:core1] o.a.s.c.SolrDeletionPolicy newest commit generation = 1
   [junit4]   2> 1195094 INFO  (coreLoadExecutor-8352-thread-1-processing-x:lazy1) [    x:core1] o.a.s.s.SolrIndexSearcher Opening Searcher@5bb7d66e[core1] main
   [junit4]   2> 1195094 INFO  (coreLoadExecutor-8352-thread-1-processing-x:lazy1) [    x:core1] o.a.s.r.ManagedResourceStorage File-based storage initialized to use dir: /home/jenkins/workspace/Lucene-Solr-5.5-Linux/solr/build/solr-core/test/J0/temp/solr.core.TestCoreDiscovery_53813ED6E4942F74-001/tempDir-003/relativeCoreDir/core1/conf
   [junit4]   2> 1195094 INFO  (coreLoadExecutor-8352-thread-1-processing-x:lazy1) [    x:core1] o.a.s.r.RestManager Initializing RestManager with initArgs: {storageDir=/home/jenkins/workspace/Lucene-Solr-5.5-Linux/solr/build/solr-core/test/J0/temp/solr.core.TestCoreDiscovery_53813ED6E4942F74-001/tempDir-003/relativeCoreDir/core1/conf}
   [junit4]   2> 1195094 INFO  (coreLoadExecutor-8352-thread-1-processing-x:lazy1) [    x:core1] o.a.s.r.ManagedResourceStorage Reading _rest_managed.json using file:dir=/home/jenkins/workspace/Lucene-Solr-5.5-Linux/solr/build/solr-core/test/J0/temp/solr.core.TestCoreDiscovery_53813ED6E4942F74-001/tempDir-003/relativeCoreDir/core1/conf
   [junit4]   2> 1195094 INFO  (coreLoadExecutor-8352-thread-1-processing-x:lazy1) [    x:core1] o.a.s.r.RestManager Initializing 0 registered ManagedResources
   [junit4]   2> 1195095 INFO  (coreLoadExecutor-8352-thread-1-processing-x:lazy1) [    x:core1] o.a.s.h.ReplicationHandler Commits will be reserved for  10000
   [junit4]   2> 1195095 INFO  (searcherExecutor-8353-thread-1-processing-x:core1) [    x:core1] o.a.s.c.SolrCore [core1] Registered new searcher Searcher@5bb7d66e[core1] main{ExitableDirectoryReader(UninvertingDirectoryReader())}
   [junit4]   2> 1195095 INFO  (coreLoadExecutor-8352-thread-1-processing-x:lazy1) [    x:core1] o.a.s.c.CoreContainer registering core: core1
   [junit4]   2> 1195095 INFO  (TEST-TestCoreDiscovery.testAlternateRelativeCoreDir-seed#[53813ED6E4942F74]) [    x:lazy1] o.a.s.c.SolrResourceLoader new SolrResourceLoader for directory: '/home/jenkins/workspace/Lucene-Solr-5.5-Linux/solr/build/solr-core/test/J0/temp/solr.core.TestCoreDiscovery_53813ED6E4942F74-001/tempDir-003/relativeCoreDir/core2'
   [junit4]   2> 1195095 INFO  (TEST-TestCoreDiscovery.testAlternateRelativeCoreDir-seed#[53813ED6E4942F74]) [    x:lazy1] o.a.s.c.SolrResourceLoader JNDI not configured for solr (NoInitialContextEx)
   [junit4]   2> 1195095 INFO  (TEST-TestCoreDiscovery.testAlternateRelativeCoreDir-seed#[53813ED6E4942F74]) [    x:lazy1] o.a.s.c.SolrResourceLoader using system property solr.solr.home: /home/jenkins/workspace/Lucene-Solr-5.5-Linux/solr/build/solr-core/test/J0/temp/solr.core.TestCoreDiscovery_53813ED6E4942F74-001/tempDir-003
   [junit4]   2> 1195099 INFO  (TEST-TestCoreDiscovery.testAlternateRelativeCoreDir-seed#[53813ED6E4942F74]) [    x:lazy1] o.a.s.c.SolrConfig current version of requestparams : -1
   [junit4]   2> 1195101 INFO  (TEST-TestCoreDiscovery.testAlternateRelativeCoreDir-seed#[53813ED6E4942F74]) [    x:lazy1] o.a.s.c.SolrConfig Using Lucene MatchVersion: 5.5.3
   [junit4]   2> 1195105 INFO  (TEST-TestCoreDiscovery.testAlternateRelativeCoreDir-seed#[53813ED6E4942F74]) [    x:lazy1] o.a.s.c.SolrConfig Loaded SolrConfig: solrconfig-minimal.xml
   [junit4]   2> 1195107 INFO  (TEST-TestCoreDiscovery.testAlternateRelativeCoreDir-seed#[53813ED6E4942F74]) [    x:lazy1] o.a.s.s.IndexSchema [core2] Schema name=tiny
   [junit4]   2> 1195108 INFO  (TEST-TestCoreDiscovery.testAlternateRelativeCoreDir-seed#[53813ED6E4942F74]) [    x:lazy1] o.a.s.s.IndexSchema unique key field: id
   [junit4]   2> 1195109 INFO  (TEST-TestCoreDiscovery.testAlternateRelativeCoreDir-seed#[53813ED6E4942F74]) [    x:lazy1] o.a.s.c.ConfigSetProperties Did not find ConfigSet properties, assuming default properties: Can't find resource 'configsetprops.json' in classpath or '/home/jenkins/workspace/Lucene-Solr-5.5-Linux/solr/build/solr-core/test/J0/temp/solr.core.TestCoreDiscovery_53813ED6E4942F74-001/tempDir-003/relativeCoreDir/core2'
   [junit4]   2> 1195109 INFO  (TEST-TestCoreDiscovery.testAlternateRelativeCoreDir-seed#[53813ED6E4942F74]) [    x:lazy1] o.a.s.c.CoreContainer Creating SolrCore 'core2' using configuration from instancedir /home/jenkins/workspace/Lucene-Solr-5.5-Linux/solr/build/solr-core/test/J0/temp/solr.core.TestCoreDiscovery_53813ED6E4942F74-001/tempDir-003/relativeCoreDir/core2
   [junit4]   2> 1195110 INFO  (TEST-TestCoreDiscovery.testAlternateRelativeCoreDir-seed#[53813ED6E4942F74]) [    x:core2] o.a.s.c.SolrCore org.apache.solr.core.MockDirectoryFactory
   [junit4]   2> 1195110 INFO  (TEST-TestCoreDiscovery.testAlternateRelativeCoreDir-seed#[53813ED6E4942F74]) [    x:core2] o.a.s.c.SolrCore [[core2] ] Opening new SolrCore at [/home/jenkins/workspace/Lucene-Solr-5.5-Linux/solr/build/solr-core/test/J0/temp/solr.core.TestCoreDiscovery_53813ED6E4942F74-001/tempDir-003/relativeCoreDir/core2], dataDir=[/home/jenkins/workspace/Lucene-Solr-5.5-Linux/solr/build/solr-core/test/J0/temp/solr.core.TestCoreDiscovery_53813ED6E4942F74-001/tempDir-003/relativeCoreDir/core2/core2/]
   [junit4]   2> 1195110 INFO  (TEST-TestCoreDiscovery.testAlternateRelativeCoreDir-seed#[53813ED6E4942F74]) [    x:core2] o.a.s.c.SolrCore JMX monitoring not detected for core: core2
   [junit4]   2> 1195111 INFO  (TEST-TestCoreDiscovery.testAlternateRelativeCoreDir-seed#[53813ED6E4942F74]) [    x:core2] o.a.s.c.CachingDirectoryFactory return new directory for /home/jenkins/workspace/Lucene-Solr-5.5-Linux/solr/build/solr-core/test/J0/temp/solr.core.TestCoreDiscovery_53813ED6E4942F74-001/tempDir-003/relativeCoreDir/core2/core2
   [junit4]   2> 1195111 INFO  (TEST-TestCoreDiscovery.testAlternateRelativeCoreDir-seed#[53813ED6E4942F74]) [    x:core2] o.a.s.c.SolrCore New index directory detected: old=null new=/home/jenkins/workspace/Lucene-Solr-5.5-Linux/solr/build/solr-core/test/J0/temp/solr.core.TestCoreDiscovery_53813ED6E4942F74-001/tempDir-003/relativeCoreDir/core2/core2/index/
   [junit4]   2> 1195111 WARN  (TEST-TestCoreDiscovery.testAlternateRelativeCoreDir-seed#[53813ED6E4942F74]) [    x:core2] o.a.s.c.SolrCore [core2] Solr index directory '/home/jenkins/workspace/Lucene-Solr-5.5-Linux/solr/build/solr-core/test/J0/temp/solr.core.TestCoreDiscovery_53813ED6E4942F74-001/tempDir-003/relativeCoreDir/core2/core2/index' doesn't exist. Creating new index...
   [junit4]   2> 1195111 INFO  (TEST-TestCoreDiscovery.testAlternateRelativeCoreDir-seed#[53813ED6E4942F74]) [    x:core2] o.a.s.c.CachingDirectoryFactory return new directory for /home/jenkins/workspace/Lucene-Solr-5.5-Linux/solr/build/solr-core/test/J0/temp/solr.core.TestCoreDiscovery_53813ED6E4942F74-001/tempDir-003/relativeCoreDir/core2/core2/index
   [junit4]   2> 1195111 INFO  (TEST-TestCoreDiscovery.testAlternateRelativeCoreDir-seed#[53813ED6E4942F74]) [    x:core2] o.a.s.u.RandomMergePolicy RandomMergePolicy wrapping class org.apache.lucene.index.AlcoholicMergePolicy: [AlcoholicMergePolicy: minMergeSize=0, mergeFactor=10, maxMergeSize=2027772948, maxMergeSizeForForcedMerge=9223372036854775807, calibrateSizeByDeletes=true, maxMergeDocs=2147483647, maxCFSSegmentSizeMB=8.796093022207999E12, noCFSRatio=0.1]
   [junit4]   2> 1195112 INFO  (TEST-TestCoreDiscovery.testAlternateRelativeCoreDir-seed#[53813ED6E4942F74]) [    x:core2] o.a.s.c.SolrDeletionPolicy SolrDeletionPolicy.onCommit: commits: num=1
   [junit4]   2> 	commit{dir=MockDirectoryWrapper(RAMDirectory@4b88d16f lockFactory=org.apache.lucene.store.SingleInstanceLockFactory@8de2517),segFN=segments_1,generation=1}
   [junit4]   2> 1195112 INFO  (TEST-TestCoreDiscovery.testAlternateRelativeCoreDir-seed#[53813ED6E4942F74]) [    x:core2] o.a.s.c.SolrDeletionPolicy newest commit generation = 1
   [junit4]   2> 1195112 INFO  (OldIndexDirectoryCleanupThreadForCore-core2) [    x:core2] o.a.s.c.SolrCore Looking for old index directories to cleanup for core core2 in /home/jenkins/workspace/Lucene-Solr-5.5-Linux/solr/build/solr-core/test/J0/temp/solr.core.TestCoreDiscovery_53813ED6E4942F74-001/tempDir-003/relativeCoreDir/core2/core2/
   [junit4]   2> 1195112 WARN  (OldIndexDirectoryCleanupThreadForCore-core2) [    x:core2] o.a.s.c.DirectoryFactory /home/jenkins/workspace/Lucene-Solr-5.5-Linux/solr/build/solr-core/test/J0/temp/solr.core.TestCoreDiscovery_53813ED6E4942F74-001/tempDir-003/relativeCoreDir/core2/core2/ does not point to a valid data directory; skipping clean-up of old index directories.
   [junit4]   2> 1195113 INFO  (TEST-TestCoreDiscovery.testAlternateRelativeCoreDir-seed#[53813ED6E4942F74]) [    x:core2] o.a.s.c.SolrCore no updateRequestProcessorChain defined as default, creating implicit default
   [junit4]   2> 1195114 INFO  (TEST-TestCoreDiscovery.testAlternateRelativeCoreDir-seed#[53813ED6E4942F74]) [    x:core2] o.a.s.h.l.XMLLoader xsltCacheLifetimeSeconds=60
   [junit4]   2> 1195114 INFO  (TEST-TestCoreDiscovery.testAlternateRelativeCoreDir-seed#[53813ED6E4942F74]) [    x:core2] o.a.s.h.l.XMLLoader xsltCacheLifetimeSeconds=60
   [junit4]   2> 1195114 INFO  (TEST-TestCoreDiscovery.testAlternateRelativeCoreDir-seed#[53813ED6E4942F74]) [    x:core2] o.a.s.h.l.XMLLoader xsltCacheLifetimeSeconds=60
   [junit4]   2> 1195115 INFO  (TEST-TestCoreDiscovery.testAlternateRelativeCoreDir-seed#[53813ED6E4942F74]) [    x:core2] o.a.s.h.l.XMLLoader xsltCacheLifetimeSeconds=60
   [junit4]   2> 1195115 INFO  (TEST-TestCoreDiscovery.testAlternateRelativeCoreDir-seed#[53813ED6E4942F74]) [    x:core2] o.a.s.c.RequestHandlers Registered paths: /admin/mbeans,/update/csv,/update/json/docs,/admin/luke,/select,/admin/segments,/get,/admin/system,/replication,/admin/properties,/config,/schema,/admin/plugins,/admin/logging,/update/json,/admin/threads,/admin/ping,/update,/admin/file
   [junit4]   2> 1195116 INFO  (TEST-TestCoreDiscovery.testAlternateRelativeCoreDir-seed#[53813ED6E4942F74]) [    x:core2] o.a.s.c.SolrCore Using default statsCache cache: org.apache.solr.search.stats.LocalStatsCache
   [junit4]   2> 1195116 INFO  (TEST-TestCoreDiscovery.testAlternateRelativeCoreDir-seed#[53813ED6E4942F74]) [    x:core2] o.a.s.u.CommitTracker Hard AutoCommit: disabled
   [junit4]   2> 1195116 INFO  (TEST-TestCoreDiscovery.testAlternateRelativeCoreDir-seed#[53813ED6E4942F74]) [    x:core2] o.a.s.u.CommitTracker Soft AutoCommit: disabled
   [junit4]   2> 1195116 INFO  (TEST-TestCoreDiscovery.testAlternateRelativeCoreDir-seed#[53813ED6E4942F74]) [    x:core2] o.a.s.u.RandomMergePolicy RandomMergePolicy wrapping class org.apache.lucene.index.LogByteSizeMergePolicy: [LogByteSizeMergePolicy: minMergeSize=1677721, mergeFactor=44, maxMergeSize=2147483648, maxMergeSizeForForcedMerge=9223372036854775807, calibrateSizeByDeletes=true, maxMergeDocs=2147483647, maxCFSSegmentSizeMB=8.796093022207999E12, noCFSRatio=1.0]
   [junit4]   2> 1195116 INFO  (TEST-TestCoreDiscovery.testAlternateRelativeCoreDir-seed#[53813ED6E4942F74]) [    x:core2] o.a.s.c.SolrDeletionPolicy SolrDeletionPolicy.onInit: commits: num=1
   [junit4]   2> 	commit{dir=MockDirectoryWrapper(RAMDirectory@4b88d16f lockFactory=org.apache.lucene.store.SingleInstanceLockFactory@8de2517),segFN=segments_1,generation=1}
   [junit4]   2> 1195116 INFO  (TEST-TestCoreDiscovery.testAlternateRelativeCoreDir-seed#[53813ED6E4942F74]) [    x:core2] o.a.s.c.SolrDeletionPolicy newest commit generation = 1
   [junit4]   2> 1195116 INFO  (TEST-TestCoreDiscovery.testAlternateRelativeCoreDir-seed#[53813ED6E4942F74]) [    x:core2] o.a.s.s.SolrIndexSearcher Opening Searcher@41f19e8c[core2] main
   [junit4]   2> 1195116 INFO  (TEST-TestCoreDiscovery.testAlternateRelativeCoreDir-seed#[53813ED6E4942F74]) [    x:core2] o.a.s.r.ManagedResourceStorage File-based storage initialized to use dir: /home/jenkins/workspace/Lucene-Solr-5.5-Linux/solr/build/solr-core/test/J0/temp/solr.core.TestCoreDiscovery_53813ED6E4942F74-001/tempDir-003/relativeCoreDir/core2/conf
   [junit4]   2> 1195117 INFO  (TEST-TestCoreDiscovery.testAlternateRelativeCoreDir-seed#[53813ED6E4942F74]) [    x:core2] o.a.s.r.RestManager Initializing RestManager with initArgs: {storageDir=/home/jenkins/workspace/Lucene-Solr-5.5-Linux/solr/build/solr-core/test/J0/temp/solr.core.TestCoreDiscovery_53813ED6E4942F74-001/tempDir-003/relativeCoreDir/core2/conf}
   [junit4]   2> 1195117 INFO  (TEST-TestCoreDiscovery.testAlternateRelativeCoreDir-seed#[53813ED6E4942F74]) [    x:core2] o.a.s.r.ManagedResourceStorage Reading _rest_managed.json using file:dir=/home/jenkins/workspace/Lucene-Solr-5.5-Linux/solr/build/solr-core/test/J0/temp/solr.core.TestCoreDiscovery_53813ED6E4942F74-001/tempDir-003/relativeCoreDir/core2/conf
   [junit4]   2> 1195117 INFO  (TEST-TestCoreDiscovery.testAlternateRelativeCoreDir-seed#[53813ED6E4942F74

[...truncated too long message...]

otsearch.randomizedtesting.rules.NoShadowingOrOverridesOnMethodsRule$1.evaluate(NoShadowingOrOverridesOnMethodsRule.java:40)
   [junit4]   2> 	at com.carrotsearch.randomizedtesting.rules.StatementAdapter.evaluate(StatementAdapter.java:36)
   [junit4]   2> 	at com.carrotsearch.randomizedtesting.rules.StatementAdapter.evaluate(StatementAdapter.java:36)
   [junit4]   2> 	at com.carrotsearch.randomizedtesting.rules.StatementAdapter.evaluate(StatementAdapter.java:36)
   [junit4]   2> 	at org.apache.lucene.util.TestRuleAssertionsRequired$1.evaluate(TestRuleAssertionsRequired.java:53)
   [junit4]   2> 	at org.apache.lucene.util.TestRuleMarkFailure$1.evaluate(TestRuleMarkFailure.java:47)
   [junit4]   2> 	at org.apache.lucene.util.TestRuleIgnoreAfterMaxFailures$1.evaluate(TestRuleIgnoreAfterMaxFailures.java:64)
   [junit4]   2> 	at org.apache.lucene.util.TestRuleIgnoreTestSuites$1.evaluate(TestRuleIgnoreTestSuites.java:54)
   [junit4]   2> 	at com.carrotsearch.randomizedtesting.rules.StatementAdapter.evaluate(StatementAdapter.java:36)
   [junit4]   2> 	at com.carrotsearch.randomizedtesting.ThreadLeakControl$StatementRunner.run(ThreadLeakControl.java:367)
   [junit4]   2> 	at java.lang.Thread.run(Thread.java:745)
   [junit4]   2> 
   [junit4]   2> Sep 01, 2016 11:30:02 AM com.carrotsearch.randomizedtesting.ThreadLeakControl checkThreadLeaks
   [junit4]   2> WARNING: Will linger awaiting termination of 1 leaked thread(s).
   [junit4]   2> Sep 01, 2016 11:30:22 AM com.carrotsearch.randomizedtesting.ThreadLeakControl checkThreadLeaks
   [junit4]   2> SEVERE: 1 thread leaked from SUITE scope at org.apache.solr.core.TestCoreDiscovery: 
   [junit4]   2>    1) Thread[id=79120, name=searcherExecutor-8492-thread-1, state=WAITING, group=TGRP-TestCoreDiscovery]
   [junit4]   2>         at sun.misc.Unsafe.park(Native Method)
   [junit4]   2>         at java.util.concurrent.locks.LockSupport.park(LockSupport.java:175)
   [junit4]   2>         at java.util.concurrent.locks.AbstractQueuedSynchronizer$ConditionObject.await(AbstractQueuedSynchronizer.java:2039)
   [junit4]   2>         at java.util.concurrent.LinkedBlockingQueue.take(LinkedBlockingQueue.java:442)
   [junit4]   2>         at java.util.concurrent.ThreadPoolExecutor.getTask(ThreadPoolExecutor.java:1067)
   [junit4]   2>         at java.util.concurrent.ThreadPoolExecutor.runWorker(ThreadPoolExecutor.java:1127)
   [junit4]   2>         at java.util.concurrent.ThreadPoolExecutor$Worker.run(ThreadPoolExecutor.java:617)
   [junit4]   2>         at java.lang.Thread.run(Thread.java:745)
   [junit4]   2> Sep 01, 2016 11:30:22 AM com.carrotsearch.randomizedtesting.ThreadLeakControl tryToInterruptAll
   [junit4]   2> INFO: Starting to interrupt leaked threads:
   [junit4]   2>    1) Thread[id=79120, name=searcherExecutor-8492-thread-1, state=WAITING, group=TGRP-TestCoreDiscovery]
   [junit4]   2> Sep 01, 2016 11:30:25 AM com.carrotsearch.randomizedtesting.ThreadLeakControl tryToInterruptAll
   [junit4]   2> SEVERE: There are still zombie threads that couldn't be terminated:
   [junit4]   2>    1) Thread[id=79120, name=searcherExecutor-8492-thread-1, state=WAITING, group=TGRP-TestCoreDiscovery]
   [junit4]   2>         at sun.misc.Unsafe.park(Native Method)
   [junit4]   2>         at java.util.concurrent.locks.LockSupport.park(LockSupport.java:175)
   [junit4]   2>         at java.util.concurrent.locks.AbstractQueuedSynchronizer$ConditionObject.await(AbstractQueuedSynchronizer.java:2039)
   [junit4]   2>         at java.util.concurrent.LinkedBlockingQueue.take(LinkedBlockingQueue.java:442)
   [junit4]   2>         at java.util.concurrent.ThreadPoolExecutor.getTask(ThreadPoolExecutor.java:1067)
   [junit4]   2>         at java.util.concurrent.ThreadPoolExecutor.runWorker(ThreadPoolExecutor.java:1127)
   [junit4]   2>         at java.util.concurrent.ThreadPoolExecutor$Worker.run(ThreadPoolExecutor.java:617)
   [junit4]   2>         at java.lang.Thread.run(Thread.java:745)
   [junit4]   2> NOTE: test params are: codec=CheapBastard, sim=RandomSimilarity(queryNorm=true,coord=yes): {}, locale=pl-PL, timezone=Asia/Tomsk
   [junit4]   2> NOTE: Linux 4.4.0-31-generic amd64/Oracle Corporation 1.8.0_102 (64-bit)/cpus=12,threads=2,free=212266160,total=518979584
   [junit4]   2> NOTE: All tests run in this JVM: [ExplicitHLLTest, TestArbitraryIndexDir, TestConfigSetProperties, StandardRequestHandlerTest, HLLUtilTest, TestRemoteStreaming, TestMergePolicyConfig, TestPKIAuthenticationPlugin, RulesTest, DirectoryFactoryTest, QueryElevationComponentTest, BufferStoreTest, JSONWriterTest, TestJoin, VersionInfoTest, TestSolr4Spatial, CollectionStateFormat2Test, TestRTimerTree, BasicZkTest, CacheHeaderTest, TestDistributedSearch, ZkStateReaderTest, ExternalFileFieldSortTest, DistribDocExpirationUpdateProcessorTest, LeaderFailoverAfterPartitionTest, CloudMLTQParserTest, TestPivotHelperCode, TestRandomFaceting, TestReplicationHandlerBackup, TestSchemaManager, PathHierarchyTokenizerFactoryTest, AnalysisAfterCoreReloadTest, TestFunctionQuery, TestCryptoKeys, TestComponentsName, BasicAuthIntegrationTest, TestFieldResource, TestLMDirichletSimilarityFactory, TestConfigSetsAPI, SolrRequestParserTest, TestAtomicUpdateErrorCases, IndexSchemaTest, AlternateDirectoryTest, OverriddenZkACLAndCredentialsProvidersTest, PingRequestHandlerTest, ResponseLogComponentTest, RestartWhileUpdatingTest, TestManagedResourceStorage, TestPseudoReturnFields, TestMiniSolrCloudCluster, CollectionsAPISolrJTest, TestRTGBase, AddBlockUpdateTest, SynonymTokenizerTest, TestHighlightDedupGrouping, AnalyticsMergeStrategyTest, TestCrossCoreJoin, TestCloudInspectUtil, ChangedSchemaMergeTest, RAMDirectoryFactoryTest, PrimUtilsTest, TestSimpleQParserPlugin, CoreAdminRequestStatusTest, DistributedQueryElevationComponentTest, DistributedFacetPivotSmallAdvancedTest, FileBasedSpellCheckerTest, TestRemoveLastDynamicCopyField, ParsingFieldUpdateProcessorsTest, TestHighFrequencyDictionaryFactory, DocumentAnalysisRequestHandlerTest, TestComplexPhraseQParserPlugin, HdfsWriteToMultipleCollectionsTest, AsyncCallRequestStatusResponseTest, HdfsSyncSliceTest, SolrCoreTest, TestStressLiveNodes, BasicDistributedZkTest, ReturnFieldsTest, UUIDUpdateProcessorFallbackTest, TestOrdValues, TestFaceting, TestAddFieldRealTimeGet, SecurityConfHandlerTest, TestImplicitCoreProperties, CloneFieldUpdateProcessorFactoryTest, PolyFieldTest, RequiredFieldsTest, SyncSliceTest, TestFastOutputStream, URLClassifyProcessorTest, TestValueSourceCache, TestRandomCollapseQParserPlugin, SystemInfoHandlerTest, OpenCloseCoreStressTest, LeaderElectionIntegrationTest, TestReplicationHandler, ShardRoutingCustomTest, TermVectorComponentDistributedTest, DistributedTermsComponentTest, SolrCmdDistributorTest, PeerSyncTest, ConvertedLegacyTest, TestLazyCores, DirectUpdateHandlerTest, HighlighterTest, CurrencyFieldOpenExchangeTest, TestCoreDiscovery]
   [junit4]   2> NOTE: reproduce with: ant test  -Dtestcase=TestCoreDiscovery -Dtests.seed=53813ED6E4942F74 -Dtests.multiplier=3 -Dtests.slow=true -Dtests.locale=pl-PL -Dtests.timezone=Asia/Tomsk -Dtests.asserts=true -Dtests.file.encoding=UTF-8
   [junit4] ERROR   0.00s J0 | TestCoreDiscovery (suite) <<<
   [junit4]    > Throwable #1: java.lang.AssertionError: ObjectTracker found 4 object(s) that were not released!!! [SolrCore, MockDirectoryWrapper, MockDirectoryWrapper, MDCAwareThreadPoolExecutor]
   [junit4]    > 	at __randomizedtesting.SeedInfo.seed([53813ED6E4942F74]:0)
   [junit4]    > 	at org.apache.solr.SolrTestCaseJ4.afterClass(SolrTestCaseJ4.java:238)
   [junit4]    > 	at java.lang.Thread.run(Thread.java:745)Throwable #2: com.carrotsearch.randomizedtesting.ThreadLeakError: 1 thread leaked from SUITE scope at org.apache.solr.core.TestCoreDiscovery: 
   [junit4]    >    1) Thread[id=79120, name=searcherExecutor-8492-thread-1, state=WAITING, group=TGRP-TestCoreDiscovery]
   [junit4]    >         at sun.misc.Unsafe.park(Native Method)
   [junit4]    >         at java.util.concurrent.locks.LockSupport.park(LockSupport.java:175)
   [junit4]    >         at java.util.concurrent.locks.AbstractQueuedSynchronizer$ConditionObject.await(AbstractQueuedSynchronizer.java:2039)
   [junit4]    >         at java.util.concurrent.LinkedBlockingQueue.take(LinkedBlockingQueue.java:442)
   [junit4]    >         at java.util.concurrent.ThreadPoolExecutor.getTask(ThreadPoolExecutor.java:1067)
   [junit4]    >         at java.util.concurrent.ThreadPoolExecutor.runWorker(ThreadPoolExecutor.java:1127)
   [junit4]    >         at java.util.concurrent.ThreadPoolExecutor$Worker.run(ThreadPoolExecutor.java:617)
   [junit4]    >         at java.lang.Thread.run(Thread.java:745)
   [junit4]    > 	at __randomizedtesting.SeedInfo.seed([53813ED6E4942F74]:0)Throwable #3: com.carrotsearch.randomizedtesting.ThreadLeakError: There are still zombie threads that couldn't be terminated:
   [junit4]    >    1) Thread[id=79120, name=searcherExecutor-8492-thread-1, state=WAITING, group=TGRP-TestCoreDiscovery]
   [junit4]    >         at sun.misc.Unsafe.park(Native Method)
   [junit4]    >         at java.util.concurrent.locks.LockSupport.park(LockSupport.java:175)
   [junit4]    >         at java.util.concurrent.locks.AbstractQueuedSynchronizer$ConditionObject.await(AbstractQueuedSynchronizer.java:2039)
   [junit4]    >         at java.util.concurrent.LinkedBlockingQueue.take(LinkedBlockingQueue.java:442)
   [junit4]    >         at java.util.concurrent.ThreadPoolExecutor.getTask(ThreadPoolExecutor.java:1067)
   [junit4]    >         at java.util.concurrent.ThreadPoolExecutor.runWorker(ThreadPoolExecutor.java:1127)
   [junit4]    >         at java.util.concurrent.ThreadPoolExecutor$Worker.run(ThreadPoolExecutor.java:617)
   [junit4]    >         at java.lang.Thread.run(Thread.java:745)
   [junit4]    > 	at __randomizedtesting.SeedInfo.seed([53813ED6E4942F74]:0)
   [junit4] Completed [419/575 (1!)] on J0 in 144.96s, 12 tests, 1 failure, 2 errors <<< FAILURES!

[...truncated 57174 lines...]


Mime
View raw message