lucene-dev mailing list archives

Site index · List index
Message view « Date » · « Thread »
Top « Date » · « Thread »
From Apache Jenkins Server <jenk...@builds.apache.org>
Subject [JENKINS] Lucene-Solr-NightlyTests-master - Build # 1114 - Still unstable
Date Sun, 11 Sep 2016 22:31:12 GMT
Build: https://builds.apache.org/job/Lucene-Solr-NightlyTests-master/1114/

9 tests failed.
FAILED:  org.apache.lucene.analysis.core.TestRandomChains.testRandomChainsWithLargeStrings

Error Message:


Stack Trace:
java.util.NoSuchElementException
	at __randomizedtesting.SeedInfo.seed([B9ED0ECBBD7CADDD:D3B6B1DAE4328D2E]:0)
	at java.util.TreeMap.key(TreeMap.java:1327)
	at java.util.TreeMap.lastKey(TreeMap.java:297)
	at java.util.TreeSet.last(TreeSet.java:401)
	at org.apache.lucene.analysis.minhash.MinHashFilter$FixedSizeTreeSet.add(MinHashFilter.java:325)
	at org.apache.lucene.analysis.minhash.MinHashFilter.incrementToken(MinHashFilter.java:159)
	at org.apache.lucene.analysis.ValidatingTokenFilter.incrementToken(ValidatingTokenFilter.java:67)
	at org.apache.lucene.analysis.util.ElisionFilter.incrementToken(ElisionFilter.java:52)
	at org.apache.lucene.analysis.ValidatingTokenFilter.incrementToken(ValidatingTokenFilter.java:67)
	at org.apache.lucene.analysis.miscellaneous.ASCIIFoldingFilter.incrementToken(ASCIIFoldingFilter.java:102)
	at org.apache.lucene.analysis.ValidatingTokenFilter.incrementToken(ValidatingTokenFilter.java:67)
	at org.apache.lucene.analysis.FilteringTokenFilter.incrementToken(FilteringTokenFilter.java:51)
	at org.apache.lucene.analysis.ngram.NGramTokenFilter.incrementToken(NGramTokenFilter.java:98)
	at org.apache.lucene.analysis.ValidatingTokenFilter.incrementToken(ValidatingTokenFilter.java:67)
	at org.apache.lucene.analysis.BaseTokenStreamTestCase.checkResetException(BaseTokenStreamTestCase.java:405)
	at org.apache.lucene.analysis.BaseTokenStreamTestCase.checkRandomData(BaseTokenStreamTestCase.java:510)
	at org.apache.lucene.analysis.core.TestRandomChains.testRandomChainsWithLargeStrings(TestRandomChains.java:959)
	at sun.reflect.NativeMethodAccessorImpl.invoke0(Native Method)
	at sun.reflect.NativeMethodAccessorImpl.invoke(NativeMethodAccessorImpl.java:62)
	at sun.reflect.DelegatingMethodAccessorImpl.invoke(DelegatingMethodAccessorImpl.java:43)
	at java.lang.reflect.Method.invoke(Method.java:498)
	at com.carrotsearch.randomizedtesting.RandomizedRunner.invoke(RandomizedRunner.java:1764)
	at com.carrotsearch.randomizedtesting.RandomizedRunner$8.evaluate(RandomizedRunner.java:871)
	at com.carrotsearch.randomizedtesting.RandomizedRunner$9.evaluate(RandomizedRunner.java:907)
	at com.carrotsearch.randomizedtesting.RandomizedRunner$10.evaluate(RandomizedRunner.java:921)
	at org.apache.lucene.util.TestRuleSetupTeardownChained$1.evaluate(TestRuleSetupTeardownChained.java:49)
	at org.apache.lucene.util.AbstractBeforeAfterRule$1.evaluate(AbstractBeforeAfterRule.java:45)
	at org.apache.lucene.util.TestRuleThreadAndTestName$1.evaluate(TestRuleThreadAndTestName.java:48)
	at org.apache.lucene.util.TestRuleIgnoreAfterMaxFailures$1.evaluate(TestRuleIgnoreAfterMaxFailures.java:64)
	at org.apache.lucene.util.TestRuleMarkFailure$1.evaluate(TestRuleMarkFailure.java:47)
	at com.carrotsearch.randomizedtesting.rules.StatementAdapter.evaluate(StatementAdapter.java:36)
	at com.carrotsearch.randomizedtesting.ThreadLeakControl$StatementRunner.run(ThreadLeakControl.java:367)
	at com.carrotsearch.randomizedtesting.ThreadLeakControl.forkTimeoutingTask(ThreadLeakControl.java:809)
	at com.carrotsearch.randomizedtesting.ThreadLeakControl$3.evaluate(ThreadLeakControl.java:460)
	at com.carrotsearch.randomizedtesting.RandomizedRunner.runSingleTest(RandomizedRunner.java:880)
	at com.carrotsearch.randomizedtesting.RandomizedRunner$5.evaluate(RandomizedRunner.java:781)
	at com.carrotsearch.randomizedtesting.RandomizedRunner$6.evaluate(RandomizedRunner.java:816)
	at com.carrotsearch.randomizedtesting.RandomizedRunner$7.evaluate(RandomizedRunner.java:827)
	at org.apache.lucene.util.AbstractBeforeAfterRule$1.evaluate(AbstractBeforeAfterRule.java:45)
	at com.carrotsearch.randomizedtesting.rules.StatementAdapter.evaluate(StatementAdapter.java:36)
	at org.apache.lucene.util.TestRuleStoreClassName$1.evaluate(TestRuleStoreClassName.java:41)
	at com.carrotsearch.randomizedtesting.rules.NoShadowingOrOverridesOnMethodsRule$1.evaluate(NoShadowingOrOverridesOnMethodsRule.java:40)
	at com.carrotsearch.randomizedtesting.rules.NoShadowingOrOverridesOnMethodsRule$1.evaluate(NoShadowingOrOverridesOnMethodsRule.java:40)
	at com.carrotsearch.randomizedtesting.rules.StatementAdapter.evaluate(StatementAdapter.java:36)
	at com.carrotsearch.randomizedtesting.rules.StatementAdapter.evaluate(StatementAdapter.java:36)
	at com.carrotsearch.randomizedtesting.rules.StatementAdapter.evaluate(StatementAdapter.java:36)
	at org.apache.lucene.util.TestRuleAssertionsRequired$1.evaluate(TestRuleAssertionsRequired.java:53)
	at org.apache.lucene.util.TestRuleMarkFailure$1.evaluate(TestRuleMarkFailure.java:47)
	at org.apache.lucene.util.TestRuleIgnoreAfterMaxFailures$1.evaluate(TestRuleIgnoreAfterMaxFailures.java:64)
	at org.apache.lucene.util.TestRuleIgnoreTestSuites$1.evaluate(TestRuleIgnoreTestSuites.java:54)
	at com.carrotsearch.randomizedtesting.rules.StatementAdapter.evaluate(StatementAdapter.java:36)
	at com.carrotsearch.randomizedtesting.ThreadLeakControl$StatementRunner.run(ThreadLeakControl.java:367)
	at java.lang.Thread.run(Thread.java:745)


FAILED:  org.apache.solr.cloud.CdcrReplicationDistributedZkTest.testReplicationStartStop

Error Message:
Timeout waiting for CDCR replication to complete @source_collection:shard2

Stack Trace:
java.lang.RuntimeException: Timeout waiting for CDCR replication to complete @source_collection:shard2
	at __randomizedtesting.SeedInfo.seed([69C7C3B4D964326A:EA041D27CDBCB9E3]:0)
	at org.apache.solr.cloud.BaseCdcrDistributedZkTest.waitForReplicationToComplete(BaseCdcrDistributedZkTest.java:794)
	at org.apache.solr.cloud.CdcrReplicationDistributedZkTest.testReplicationStartStop(CdcrReplicationDistributedZkTest.java:168)
	at sun.reflect.NativeMethodAccessorImpl.invoke0(Native Method)
	at sun.reflect.NativeMethodAccessorImpl.invoke(NativeMethodAccessorImpl.java:62)
	at sun.reflect.DelegatingMethodAccessorImpl.invoke(DelegatingMethodAccessorImpl.java:43)
	at java.lang.reflect.Method.invoke(Method.java:498)
	at com.carrotsearch.randomizedtesting.RandomizedRunner.invoke(RandomizedRunner.java:1764)
	at com.carrotsearch.randomizedtesting.RandomizedRunner$8.evaluate(RandomizedRunner.java:871)
	at com.carrotsearch.randomizedtesting.RandomizedRunner$9.evaluate(RandomizedRunner.java:907)
	at com.carrotsearch.randomizedtesting.RandomizedRunner$10.evaluate(RandomizedRunner.java:921)
	at org.apache.solr.BaseDistributedSearchTestCase$ShardsRepeatRule$ShardsFixedStatement.callStatement(BaseDistributedSearchTestCase.java:985)
	at org.apache.solr.BaseDistributedSearchTestCase$ShardsRepeatRule$ShardsStatement.evaluate(BaseDistributedSearchTestCase.java:960)
	at com.carrotsearch.randomizedtesting.rules.SystemPropertiesRestoreRule$1.evaluate(SystemPropertiesRestoreRule.java:57)
	at org.apache.lucene.util.TestRuleSetupTeardownChained$1.evaluate(TestRuleSetupTeardownChained.java:49)
	at org.apache.lucene.util.AbstractBeforeAfterRule$1.evaluate(AbstractBeforeAfterRule.java:45)
	at org.apache.lucene.util.TestRuleThreadAndTestName$1.evaluate(TestRuleThreadAndTestName.java:48)
	at org.apache.lucene.util.TestRuleIgnoreAfterMaxFailures$1.evaluate(TestRuleIgnoreAfterMaxFailures.java:64)
	at org.apache.lucene.util.TestRuleMarkFailure$1.evaluate(TestRuleMarkFailure.java:47)
	at com.carrotsearch.randomizedtesting.rules.StatementAdapter.evaluate(StatementAdapter.java:36)
	at com.carrotsearch.randomizedtesting.ThreadLeakControl$StatementRunner.run(ThreadLeakControl.java:367)
	at com.carrotsearch.randomizedtesting.ThreadLeakControl.forkTimeoutingTask(ThreadLeakControl.java:809)
	at com.carrotsearch.randomizedtesting.ThreadLeakControl$3.evaluate(ThreadLeakControl.java:460)
	at com.carrotsearch.randomizedtesting.RandomizedRunner.runSingleTest(RandomizedRunner.java:880)
	at com.carrotsearch.randomizedtesting.RandomizedRunner$5.evaluate(RandomizedRunner.java:781)
	at com.carrotsearch.randomizedtesting.RandomizedRunner$6.evaluate(RandomizedRunner.java:816)
	at com.carrotsearch.randomizedtesting.RandomizedRunner$7.evaluate(RandomizedRunner.java:827)
	at com.carrotsearch.randomizedtesting.rules.StatementAdapter.evaluate(StatementAdapter.java:36)
	at com.carrotsearch.randomizedtesting.rules.SystemPropertiesRestoreRule$1.evaluate(SystemPropertiesRestoreRule.java:57)
	at org.apache.lucene.util.AbstractBeforeAfterRule$1.evaluate(AbstractBeforeAfterRule.java:45)
	at com.carrotsearch.randomizedtesting.rules.StatementAdapter.evaluate(StatementAdapter.java:36)
	at org.apache.lucene.util.TestRuleStoreClassName$1.evaluate(TestRuleStoreClassName.java:41)
	at com.carrotsearch.randomizedtesting.rules.NoShadowingOrOverridesOnMethodsRule$1.evaluate(NoShadowingOrOverridesOnMethodsRule.java:40)
	at com.carrotsearch.randomizedtesting.rules.NoShadowingOrOverridesOnMethodsRule$1.evaluate(NoShadowingOrOverridesOnMethodsRule.java:40)
	at com.carrotsearch.randomizedtesting.rules.StatementAdapter.evaluate(StatementAdapter.java:36)
	at com.carrotsearch.randomizedtesting.rules.StatementAdapter.evaluate(StatementAdapter.java:36)
	at com.carrotsearch.randomizedtesting.rules.StatementAdapter.evaluate(StatementAdapter.java:36)
	at org.apache.lucene.util.TestRuleAssertionsRequired$1.evaluate(TestRuleAssertionsRequired.java:53)
	at org.apache.lucene.util.TestRuleMarkFailure$1.evaluate(TestRuleMarkFailure.java:47)
	at org.apache.lucene.util.TestRuleIgnoreAfterMaxFailures$1.evaluate(TestRuleIgnoreAfterMaxFailures.java:64)
	at org.apache.lucene.util.TestRuleIgnoreTestSuites$1.evaluate(TestRuleIgnoreTestSuites.java:54)
	at com.carrotsearch.randomizedtesting.rules.StatementAdapter.evaluate(StatementAdapter.java:36)
	at com.carrotsearch.randomizedtesting.ThreadLeakControl$StatementRunner.run(ThreadLeakControl.java:367)
	at java.lang.Thread.run(Thread.java:745)


FAILED:  org.apache.solr.core.HdfsDirectoryFactoryTest.testInitArgsOrSysPropConfig

Error Message:
The max direct memory is likely too low.  Either increase it (by adding -XX:MaxDirectMemorySize=<size>g -XX:+UseLargePages to your containers startup args) or disable direct allocation using solr.hdfs.blockcache.direct.memory.allocation=false in solrconfig.xml. If you are putting the block cache on the heap, your java heap size might not be large enough. Failed allocating ~134.217728 MB.

Stack Trace:
java.lang.RuntimeException: The max direct memory is likely too low.  Either increase it (by adding -XX:MaxDirectMemorySize=<size>g -XX:+UseLargePages to your containers startup args) or disable direct allocation using solr.hdfs.blockcache.direct.memory.allocation=false in solrconfig.xml. If you are putting the block cache on the heap, your java heap size might not be large enough. Failed allocating ~134.217728 MB.
	at __randomizedtesting.SeedInfo.seed([69C7C3B4D964326A:9E680A9F24EDD841]:0)
	at org.apache.solr.core.HdfsDirectoryFactory.createBlockCache(HdfsDirectoryFactory.java:304)
	at org.apache.solr.core.HdfsDirectoryFactory.getBlockDirectoryCache(HdfsDirectoryFactory.java:286)
	at org.apache.solr.core.HdfsDirectoryFactory.create(HdfsDirectoryFactory.java:220)
	at org.apache.solr.core.HdfsDirectoryFactoryTest.testInitArgsOrSysPropConfig(HdfsDirectoryFactoryTest.java:108)
	at sun.reflect.NativeMethodAccessorImpl.invoke0(Native Method)
	at sun.reflect.NativeMethodAccessorImpl.invoke(NativeMethodAccessorImpl.java:62)
	at sun.reflect.DelegatingMethodAccessorImpl.invoke(DelegatingMethodAccessorImpl.java:43)
	at java.lang.reflect.Method.invoke(Method.java:498)
	at com.carrotsearch.randomizedtesting.RandomizedRunner.invoke(RandomizedRunner.java:1764)
	at com.carrotsearch.randomizedtesting.RandomizedRunner$8.evaluate(RandomizedRunner.java:871)
	at com.carrotsearch.randomizedtesting.RandomizedRunner$9.evaluate(RandomizedRunner.java:907)
	at com.carrotsearch.randomizedtesting.RandomizedRunner$10.evaluate(RandomizedRunner.java:921)
	at com.carrotsearch.randomizedtesting.rules.SystemPropertiesRestoreRule$1.evaluate(SystemPropertiesRestoreRule.java:57)
	at org.apache.lucene.util.TestRuleSetupTeardownChained$1.evaluate(TestRuleSetupTeardownChained.java:49)
	at org.apache.lucene.util.AbstractBeforeAfterRule$1.evaluate(AbstractBeforeAfterRule.java:45)
	at org.apache.lucene.util.TestRuleThreadAndTestName$1.evaluate(TestRuleThreadAndTestName.java:48)
	at org.apache.lucene.util.TestRuleIgnoreAfterMaxFailures$1.evaluate(TestRuleIgnoreAfterMaxFailures.java:64)
	at org.apache.lucene.util.TestRuleMarkFailure$1.evaluate(TestRuleMarkFailure.java:47)
	at com.carrotsearch.randomizedtesting.rules.StatementAdapter.evaluate(StatementAdapter.java:36)
	at com.carrotsearch.randomizedtesting.ThreadLeakControl$StatementRunner.run(ThreadLeakControl.java:367)
	at com.carrotsearch.randomizedtesting.ThreadLeakControl.forkTimeoutingTask(ThreadLeakControl.java:809)
	at com.carrotsearch.randomizedtesting.ThreadLeakControl$3.evaluate(ThreadLeakControl.java:460)
	at com.carrotsearch.randomizedtesting.RandomizedRunner.runSingleTest(RandomizedRunner.java:880)
	at com.carrotsearch.randomizedtesting.RandomizedRunner$5.evaluate(RandomizedRunner.java:781)
	at com.carrotsearch.randomizedtesting.RandomizedRunner$6.evaluate(RandomizedRunner.java:816)
	at com.carrotsearch.randomizedtesting.RandomizedRunner$7.evaluate(RandomizedRunner.java:827)
	at com.carrotsearch.randomizedtesting.rules.StatementAdapter.evaluate(StatementAdapter.java:36)
	at com.carrotsearch.randomizedtesting.rules.SystemPropertiesRestoreRule$1.evaluate(SystemPropertiesRestoreRule.java:57)
	at org.apache.lucene.util.AbstractBeforeAfterRule$1.evaluate(AbstractBeforeAfterRule.java:45)
	at com.carrotsearch.randomizedtesting.rules.StatementAdapter.evaluate(StatementAdapter.java:36)
	at org.apache.lucene.util.TestRuleStoreClassName$1.evaluate(TestRuleStoreClassName.java:41)
	at com.carrotsearch.randomizedtesting.rules.NoShadowingOrOverridesOnMethodsRule$1.evaluate(NoShadowingOrOverridesOnMethodsRule.java:40)
	at com.carrotsearch.randomizedtesting.rules.NoShadowingOrOverridesOnMethodsRule$1.evaluate(NoShadowingOrOverridesOnMethodsRule.java:40)
	at com.carrotsearch.randomizedtesting.rules.StatementAdapter.evaluate(StatementAdapter.java:36)
	at com.carrotsearch.randomizedtesting.rules.StatementAdapter.evaluate(StatementAdapter.java:36)
	at com.carrotsearch.randomizedtesting.rules.StatementAdapter.evaluate(StatementAdapter.java:36)
	at org.apache.lucene.util.TestRuleAssertionsRequired$1.evaluate(TestRuleAssertionsRequired.java:53)
	at org.apache.lucene.util.TestRuleMarkFailure$1.evaluate(TestRuleMarkFailure.java:47)
	at org.apache.lucene.util.TestRuleIgnoreAfterMaxFailures$1.evaluate(TestRuleIgnoreAfterMaxFailures.java:64)
	at org.apache.lucene.util.TestRuleIgnoreTestSuites$1.evaluate(TestRuleIgnoreTestSuites.java:54)
	at com.carrotsearch.randomizedtesting.rules.StatementAdapter.evaluate(StatementAdapter.java:36)
	at com.carrotsearch.randomizedtesting.ThreadLeakControl$StatementRunner.run(ThreadLeakControl.java:367)
	at java.lang.Thread.run(Thread.java:745)
Caused by: java.lang.OutOfMemoryError: Direct buffer memory
	at java.nio.Bits.reserveMemory(Bits.java:693)
	at java.nio.DirectByteBuffer.<init>(DirectByteBuffer.java:123)
	at java.nio.ByteBuffer.allocateDirect(ByteBuffer.java:311)
	at org.apache.solr.store.blockcache.BlockCache.<init>(BlockCache.java:63)
	at org.apache.solr.core.HdfsDirectoryFactory.createBlockCache(HdfsDirectoryFactory.java:302)
	... 42 more


FAILED:  org.apache.solr.cloud.CdcrReplicationDistributedZkTest.testReplicationAfterRestart

Error Message:
Timeout waiting for CDCR replication to complete @source_collection:shard2

Stack Trace:
java.lang.RuntimeException: Timeout waiting for CDCR replication to complete @source_collection:shard2
	at __randomizedtesting.SeedInfo.seed([69C7C3B4D964326A:35DA24351744865C]:0)
	at org.apache.solr.cloud.BaseCdcrDistributedZkTest.waitForReplicationToComplete(BaseCdcrDistributedZkTest.java:794)
	at org.apache.solr.cloud.CdcrReplicationDistributedZkTest.testReplicationAfterRestart(CdcrReplicationDistributedZkTest.java:236)
	at sun.reflect.NativeMethodAccessorImpl.invoke0(Native Method)
	at sun.reflect.NativeMethodAccessorImpl.invoke(NativeMethodAccessorImpl.java:62)
	at sun.reflect.DelegatingMethodAccessorImpl.invoke(DelegatingMethodAccessorImpl.java:43)
	at java.lang.reflect.Method.invoke(Method.java:498)
	at com.carrotsearch.randomizedtesting.RandomizedRunner.invoke(RandomizedRunner.java:1764)
	at com.carrotsearch.randomizedtesting.RandomizedRunner$8.evaluate(RandomizedRunner.java:871)
	at com.carrotsearch.randomizedtesting.RandomizedRunner$9.evaluate(RandomizedRunner.java:907)
	at com.carrotsearch.randomizedtesting.RandomizedRunner$10.evaluate(RandomizedRunner.java:921)
	at org.apache.solr.BaseDistributedSearchTestCase$ShardsRepeatRule$ShardsFixedStatement.callStatement(BaseDistributedSearchTestCase.java:985)
	at org.apache.solr.BaseDistributedSearchTestCase$ShardsRepeatRule$ShardsStatement.evaluate(BaseDistributedSearchTestCase.java:960)
	at com.carrotsearch.randomizedtesting.rules.SystemPropertiesRestoreRule$1.evaluate(SystemPropertiesRestoreRule.java:57)
	at org.apache.lucene.util.TestRuleSetupTeardownChained$1.evaluate(TestRuleSetupTeardownChained.java:49)
	at org.apache.lucene.util.AbstractBeforeAfterRule$1.evaluate(AbstractBeforeAfterRule.java:45)
	at org.apache.lucene.util.TestRuleThreadAndTestName$1.evaluate(TestRuleThreadAndTestName.java:48)
	at org.apache.lucene.util.TestRuleIgnoreAfterMaxFailures$1.evaluate(TestRuleIgnoreAfterMaxFailures.java:64)
	at org.apache.lucene.util.TestRuleMarkFailure$1.evaluate(TestRuleMarkFailure.java:47)
	at com.carrotsearch.randomizedtesting.rules.StatementAdapter.evaluate(StatementAdapter.java:36)
	at com.carrotsearch.randomizedtesting.ThreadLeakControl$StatementRunner.run(ThreadLeakControl.java:367)
	at com.carrotsearch.randomizedtesting.ThreadLeakControl.forkTimeoutingTask(ThreadLeakControl.java:809)
	at com.carrotsearch.randomizedtesting.ThreadLeakControl$3.evaluate(ThreadLeakControl.java:460)
	at com.carrotsearch.randomizedtesting.RandomizedRunner.runSingleTest(RandomizedRunner.java:880)
	at com.carrotsearch.randomizedtesting.RandomizedRunner$5.evaluate(RandomizedRunner.java:781)
	at com.carrotsearch.randomizedtesting.RandomizedRunner$6.evaluate(RandomizedRunner.java:816)
	at com.carrotsearch.randomizedtesting.RandomizedRunner$7.evaluate(RandomizedRunner.java:827)
	at com.carrotsearch.randomizedtesting.rules.StatementAdapter.evaluate(StatementAdapter.java:36)
	at com.carrotsearch.randomizedtesting.rules.SystemPropertiesRestoreRule$1.evaluate(SystemPropertiesRestoreRule.java:57)
	at org.apache.lucene.util.AbstractBeforeAfterRule$1.evaluate(AbstractBeforeAfterRule.java:45)
	at com.carrotsearch.randomizedtesting.rules.StatementAdapter.evaluate(StatementAdapter.java:36)
	at org.apache.lucene.util.TestRuleStoreClassName$1.evaluate(TestRuleStoreClassName.java:41)
	at com.carrotsearch.randomizedtesting.rules.NoShadowingOrOverridesOnMethodsRule$1.evaluate(NoShadowingOrOverridesOnMethodsRule.java:40)
	at com.carrotsearch.randomizedtesting.rules.NoShadowingOrOverridesOnMethodsRule$1.evaluate(NoShadowingOrOverridesOnMethodsRule.java:40)
	at com.carrotsearch.randomizedtesting.rules.StatementAdapter.evaluate(StatementAdapter.java:36)
	at com.carrotsearch.randomizedtesting.rules.StatementAdapter.evaluate(StatementAdapter.java:36)
	at com.carrotsearch.randomizedtesting.rules.StatementAdapter.evaluate(StatementAdapter.java:36)
	at org.apache.lucene.util.TestRuleAssertionsRequired$1.evaluate(TestRuleAssertionsRequired.java:53)
	at org.apache.lucene.util.TestRuleMarkFailure$1.evaluate(TestRuleMarkFailure.java:47)
	at org.apache.lucene.util.TestRuleIgnoreAfterMaxFailures$1.evaluate(TestRuleIgnoreAfterMaxFailures.java:64)
	at org.apache.lucene.util.TestRuleIgnoreTestSuites$1.evaluate(TestRuleIgnoreTestSuites.java:54)
	at com.carrotsearch.randomizedtesting.rules.StatementAdapter.evaluate(StatementAdapter.java:36)
	at com.carrotsearch.randomizedtesting.ThreadLeakControl$StatementRunner.run(ThreadLeakControl.java:367)
	at java.lang.Thread.run(Thread.java:745)


FAILED:  junit.framework.TestSuite.org.apache.solr.handler.TestSolrConfigHandlerCloud

Error Message:
ObjectTracker found 8 object(s) that were not released!!! [MDCAwareThreadPoolExecutor, MockDirectoryWrapper, SolrCore, MockDirectoryWrapper, MDCAwareThreadPoolExecutor, SolrCore, MDCAwareThreadPoolExecutor, MockDirectoryWrapper]

Stack Trace:
java.lang.AssertionError: ObjectTracker found 8 object(s) that were not released!!! [MDCAwareThreadPoolExecutor, MockDirectoryWrapper, SolrCore, MockDirectoryWrapper, MDCAwareThreadPoolExecutor, SolrCore, MDCAwareThreadPoolExecutor, MockDirectoryWrapper]
	at __randomizedtesting.SeedInfo.seed([69C7C3B4D964326A]:0)
	at org.junit.Assert.fail(Assert.java:93)
	at org.junit.Assert.assertTrue(Assert.java:43)
	at org.junit.Assert.assertNull(Assert.java:551)
	at org.apache.solr.SolrTestCaseJ4.teardownTestCases(SolrTestCaseJ4.java:257)
	at sun.reflect.NativeMethodAccessorImpl.invoke0(Native Method)
	at sun.reflect.NativeMethodAccessorImpl.invoke(NativeMethodAccessorImpl.java:62)
	at sun.reflect.DelegatingMethodAccessorImpl.invoke(DelegatingMethodAccessorImpl.java:43)
	at java.lang.reflect.Method.invoke(Method.java:498)
	at com.carrotsearch.randomizedtesting.RandomizedRunner.invoke(RandomizedRunner.java:1764)
	at com.carrotsearch.randomizedtesting.RandomizedRunner$7.evaluate(RandomizedRunner.java:834)
	at com.carrotsearch.randomizedtesting.rules.StatementAdapter.evaluate(StatementAdapter.java:36)
	at com.carrotsearch.randomizedtesting.rules.SystemPropertiesRestoreRule$1.evaluate(SystemPropertiesRestoreRule.java:57)
	at org.apache.lucene.util.AbstractBeforeAfterRule$1.evaluate(AbstractBeforeAfterRule.java:45)
	at com.carrotsearch.randomizedtesting.rules.StatementAdapter.evaluate(StatementAdapter.java:36)
	at org.apache.lucene.util.TestRuleStoreClassName$1.evaluate(TestRuleStoreClassName.java:41)
	at com.carrotsearch.randomizedtesting.rules.NoShadowingOrOverridesOnMethodsRule$1.evaluate(NoShadowingOrOverridesOnMethodsRule.java:40)
	at com.carrotsearch.randomizedtesting.rules.NoShadowingOrOverridesOnMethodsRule$1.evaluate(NoShadowingOrOverridesOnMethodsRule.java:40)
	at com.carrotsearch.randomizedtesting.rules.StatementAdapter.evaluate(StatementAdapter.java:36)
	at com.carrotsearch.randomizedtesting.rules.StatementAdapter.evaluate(StatementAdapter.java:36)
	at com.carrotsearch.randomizedtesting.rules.StatementAdapter.evaluate(StatementAdapter.java:36)
	at org.apache.lucene.util.TestRuleAssertionsRequired$1.evaluate(TestRuleAssertionsRequired.java:53)
	at org.apache.lucene.util.TestRuleMarkFailure$1.evaluate(TestRuleMarkFailure.java:47)
	at org.apache.lucene.util.TestRuleIgnoreAfterMaxFailures$1.evaluate(TestRuleIgnoreAfterMaxFailures.java:64)
	at org.apache.lucene.util.TestRuleIgnoreTestSuites$1.evaluate(TestRuleIgnoreTestSuites.java:54)
	at com.carrotsearch.randomizedtesting.rules.StatementAdapter.evaluate(StatementAdapter.java:36)
	at com.carrotsearch.randomizedtesting.ThreadLeakControl$StatementRunner.run(ThreadLeakControl.java:367)
	at java.lang.Thread.run(Thread.java:745)


FAILED:  org.apache.solr.cloud.hdfs.HdfsUnloadDistributedZkTest.test

Error Message:
Captured an uncaught exception in thread: Thread[id=17331, name=testExecutor-3503-thread-6, state=RUNNABLE, group=TGRP-HdfsUnloadDistributedZkTest]

Stack Trace:
com.carrotsearch.randomizedtesting.UncaughtExceptionError: Captured an uncaught exception in thread: Thread[id=17331, name=testExecutor-3503-thread-6, state=RUNNABLE, group=TGRP-HdfsUnloadDistributedZkTest]
Caused by: org.apache.solr.client.solrj.impl.HttpSolrClient$RemoteSolrException: Error from server at http://127.0.0.1:49991: Error CREATEing SolrCore 'multiunload5': Unable to create core [multiunload5] Caused by: Direct buffer memory
	at __randomizedtesting.SeedInfo.seed([69C7C3B4D964326A]:0)
	at org.apache.solr.client.solrj.impl.HttpSolrClient.executeMethod(HttpSolrClient.java:608)
	at org.apache.solr.client.solrj.impl.HttpSolrClient.request(HttpSolrClient.java:261)
	at org.apache.solr.client.solrj.impl.HttpSolrClient.request(HttpSolrClient.java:250)
	at org.apache.solr.client.solrj.SolrClient.request(SolrClient.java:1219)
	at org.apache.solr.cloud.BasicDistributedZkTest.lambda$createCores$0(BasicDistributedZkTest.java:582)
	at org.apache.solr.common.util.ExecutorUtil$MDCAwareThreadPoolExecutor.lambda$execute$0(ExecutorUtil.java:229)
	at java.util.concurrent.ThreadPoolExecutor.runWorker(ThreadPoolExecutor.java:1142)
	at java.util.concurrent.ThreadPoolExecutor$Worker.run(ThreadPoolExecutor.java:617)
	at java.lang.Thread.run(Thread.java:745)


FAILED:  org.apache.solr.cloud.CollectionsAPIDistributedZkTest.test

Error Message:
Timeout occured while waiting response from server at: http://127.0.0.1:45599

Stack Trace:
org.apache.solr.client.solrj.SolrServerException: Timeout occured while waiting response from server at: http://127.0.0.1:45599
	at org.apache.solr.client.solrj.impl.HttpSolrClient.executeMethod(HttpSolrClient.java:619)
	at org.apache.solr.client.solrj.impl.HttpSolrClient.request(HttpSolrClient.java:261)
	at org.apache.solr.client.solrj.impl.HttpSolrClient.request(HttpSolrClient.java:250)
	at org.apache.solr.client.solrj.SolrClient.request(SolrClient.java:1219)
	at org.apache.solr.cloud.CollectionsAPIDistributedZkTest.makeRequest(CollectionsAPIDistributedZkTest.java:400)
	at org.apache.solr.cloud.CollectionsAPIDistributedZkTest.testErrorHandling(CollectionsAPIDistributedZkTest.java:516)
	at org.apache.solr.cloud.CollectionsAPIDistributedZkTest.test(CollectionsAPIDistributedZkTest.java:180)
	at sun.reflect.NativeMethodAccessorImpl.invoke0(Native Method)
	at sun.reflect.NativeMethodAccessorImpl.invoke(NativeMethodAccessorImpl.java:62)
	at sun.reflect.DelegatingMethodAccessorImpl.invoke(DelegatingMethodAccessorImpl.java:43)
	at java.lang.reflect.Method.invoke(Method.java:498)
	at com.carrotsearch.randomizedtesting.RandomizedRunner.invoke(RandomizedRunner.java:1764)
	at com.carrotsearch.randomizedtesting.RandomizedRunner$8.evaluate(RandomizedRunner.java:871)
	at com.carrotsearch.randomizedtesting.RandomizedRunner$9.evaluate(RandomizedRunner.java:907)
	at com.carrotsearch.randomizedtesting.RandomizedRunner$10.evaluate(RandomizedRunner.java:921)
	at org.apache.solr.BaseDistributedSearchTestCase$ShardsRepeatRule$ShardsFixedStatement.callStatement(BaseDistributedSearchTestCase.java:985)
	at org.apache.solr.BaseDistributedSearchTestCase$ShardsRepeatRule$ShardsStatement.evaluate(BaseDistributedSearchTestCase.java:960)
	at com.carrotsearch.randomizedtesting.rules.SystemPropertiesRestoreRule$1.evaluate(SystemPropertiesRestoreRule.java:57)
	at org.apache.lucene.util.TestRuleSetupTeardownChained$1.evaluate(TestRuleSetupTeardownChained.java:49)
	at org.apache.lucene.util.AbstractBeforeAfterRule$1.evaluate(AbstractBeforeAfterRule.java:45)
	at org.apache.lucene.util.TestRuleThreadAndTestName$1.evaluate(TestRuleThreadAndTestName.java:48)
	at org.apache.lucene.util.TestRuleIgnoreAfterMaxFailures$1.evaluate(TestRuleIgnoreAfterMaxFailures.java:64)
	at org.apache.lucene.util.TestRuleMarkFailure$1.evaluate(TestRuleMarkFailure.java:47)
	at com.carrotsearch.randomizedtesting.rules.StatementAdapter.evaluate(StatementAdapter.java:36)
	at com.carrotsearch.randomizedtesting.ThreadLeakControl$StatementRunner.run(ThreadLeakControl.java:367)
	at com.carrotsearch.randomizedtesting.ThreadLeakControl.forkTimeoutingTask(ThreadLeakControl.java:809)
	at com.carrotsearch.randomizedtesting.ThreadLeakControl$3.evaluate(ThreadLeakControl.java:460)
	at com.carrotsearch.randomizedtesting.RandomizedRunner.runSingleTest(RandomizedRunner.java:880)
	at com.carrotsearch.randomizedtesting.RandomizedRunner$5.evaluate(RandomizedRunner.java:781)
	at com.carrotsearch.randomizedtesting.RandomizedRunner$6.evaluate(RandomizedRunner.java:816)
	at com.carrotsearch.randomizedtesting.RandomizedRunner$7.evaluate(RandomizedRunner.java:827)
	at com.carrotsearch.randomizedtesting.rules.StatementAdapter.evaluate(StatementAdapter.java:36)
	at com.carrotsearch.randomizedtesting.rules.SystemPropertiesRestoreRule$1.evaluate(SystemPropertiesRestoreRule.java:57)
	at org.apache.lucene.util.AbstractBeforeAfterRule$1.evaluate(AbstractBeforeAfterRule.java:45)
	at com.carrotsearch.randomizedtesting.rules.StatementAdapter.evaluate(StatementAdapter.java:36)
	at org.apache.lucene.util.TestRuleStoreClassName$1.evaluate(TestRuleStoreClassName.java:41)
	at com.carrotsearch.randomizedtesting.rules.NoShadowingOrOverridesOnMethodsRule$1.evaluate(NoShadowingOrOverridesOnMethodsRule.java:40)
	at com.carrotsearch.randomizedtesting.rules.NoShadowingOrOverridesOnMethodsRule$1.evaluate(NoShadowingOrOverridesOnMethodsRule.java:40)
	at com.carrotsearch.randomizedtesting.rules.StatementAdapter.evaluate(StatementAdapter.java:36)
	at com.carrotsearch.randomizedtesting.rules.StatementAdapter.evaluate(StatementAdapter.java:36)
	at com.carrotsearch.randomizedtesting.rules.StatementAdapter.evaluate(StatementAdapter.java:36)
	at org.apache.lucene.util.TestRuleAssertionsRequired$1.evaluate(TestRuleAssertionsRequired.java:53)
	at org.apache.lucene.util.TestRuleMarkFailure$1.evaluate(TestRuleMarkFailure.java:47)
	at org.apache.lucene.util.TestRuleIgnoreAfterMaxFailures$1.evaluate(TestRuleIgnoreAfterMaxFailures.java:64)
	at org.apache.lucene.util.TestRuleIgnoreTestSuites$1.evaluate(TestRuleIgnoreTestSuites.java:54)
	at com.carrotsearch.randomizedtesting.rules.StatementAdapter.evaluate(StatementAdapter.java:36)
	at com.carrotsearch.randomizedtesting.ThreadLeakControl$StatementRunner.run(ThreadLeakControl.java:367)
	at java.lang.Thread.run(Thread.java:745)
Caused by: java.net.SocketTimeoutException: Read timed out
	at java.net.SocketInputStream.socketRead0(Native Method)
	at java.net.SocketInputStream.socketRead(SocketInputStream.java:116)
	at java.net.SocketInputStream.read(SocketInputStream.java:170)
	at java.net.SocketInputStream.read(SocketInputStream.java:141)
	at org.apache.http.impl.io.SessionInputBufferImpl.streamRead(SessionInputBufferImpl.java:139)
	at org.apache.http.impl.io.SessionInputBufferImpl.fillBuffer(SessionInputBufferImpl.java:155)
	at org.apache.http.impl.io.SessionInputBufferImpl.readLine(SessionInputBufferImpl.java:284)
	at org.apache.http.impl.conn.DefaultHttpResponseParser.parseHead(DefaultHttpResponseParser.java:140)
	at org.apache.http.impl.conn.DefaultHttpResponseParser.parseHead(DefaultHttpResponseParser.java:57)
	at org.apache.http.impl.io.AbstractMessageParser.parse(AbstractMessageParser.java:261)
	at org.apache.http.impl.DefaultBHttpClientConnection.receiveResponseHeader(DefaultBHttpClientConnection.java:165)
	at org.apache.http.impl.conn.CPoolProxy.receiveResponseHeader(CPoolProxy.java:167)
	at org.apache.http.protocol.HttpRequestExecutor.doReceiveResponse(HttpRequestExecutor.java:272)
	at org.apache.http.protocol.HttpRequestExecutor.execute(HttpRequestExecutor.java:124)
	at org.apache.http.impl.execchain.MainClientExec.execute(MainClientExec.java:271)
	at org.apache.http.impl.execchain.ProtocolExec.execute(ProtocolExec.java:184)
	at org.apache.http.impl.execchain.RetryExec.execute(RetryExec.java:88)
	at org.apache.http.impl.execchain.RedirectExec.execute(RedirectExec.java:110)
	at org.apache.http.impl.client.InternalHttpClient.doExecute(InternalHttpClient.java:184)
	at org.apache.http.impl.client.CloseableHttpClient.execute(CloseableHttpClient.java:82)
	at org.apache.http.impl.client.CloseableHttpClient.execute(CloseableHttpClient.java:55)
	at org.apache.solr.client.solrj.impl.HttpSolrClient.executeMethod(HttpSolrClient.java:513)
	... 47 more


FAILED:  junit.framework.TestSuite.org.apache.solr.cloud.ConcurrentDeleteAndCreateCollectionTest

Error Message:
ObjectTracker found 10 object(s) that were not released!!! [InternalHttpClient, InternalHttpClient, InternalHttpClient, InternalHttpClient, InternalHttpClient, InternalHttpClient, InternalHttpClient, InternalHttpClient, InternalHttpClient, InternalHttpClient]

Stack Trace:
java.lang.AssertionError: ObjectTracker found 10 object(s) that were not released!!! [InternalHttpClient, InternalHttpClient, InternalHttpClient, InternalHttpClient, InternalHttpClient, InternalHttpClient, InternalHttpClient, InternalHttpClient, InternalHttpClient, InternalHttpClient]
	at __randomizedtesting.SeedInfo.seed([69C7C3B4D964326A]:0)
	at org.junit.Assert.fail(Assert.java:93)
	at org.junit.Assert.assertTrue(Assert.java:43)
	at org.junit.Assert.assertNull(Assert.java:551)
	at org.apache.solr.SolrTestCaseJ4.teardownTestCases(SolrTestCaseJ4.java:257)
	at sun.reflect.GeneratedMethodAccessor18.invoke(Unknown Source)
	at sun.reflect.DelegatingMethodAccessorImpl.invoke(DelegatingMethodAccessorImpl.java:43)
	at java.lang.reflect.Method.invoke(Method.java:498)
	at com.carrotsearch.randomizedtesting.RandomizedRunner.invoke(RandomizedRunner.java:1764)
	at com.carrotsearch.randomizedtesting.RandomizedRunner$7.evaluate(RandomizedRunner.java:834)
	at com.carrotsearch.randomizedtesting.rules.StatementAdapter.evaluate(StatementAdapter.java:36)
	at com.carrotsearch.randomizedtesting.rules.SystemPropertiesRestoreRule$1.evaluate(SystemPropertiesRestoreRule.java:57)
	at org.apache.lucene.util.AbstractBeforeAfterRule$1.evaluate(AbstractBeforeAfterRule.java:45)
	at com.carrotsearch.randomizedtesting.rules.StatementAdapter.evaluate(StatementAdapter.java:36)
	at org.apache.lucene.util.TestRuleStoreClassName$1.evaluate(TestRuleStoreClassName.java:41)
	at com.carrotsearch.randomizedtesting.rules.NoShadowingOrOverridesOnMethodsRule$1.evaluate(NoShadowingOrOverridesOnMethodsRule.java:40)
	at com.carrotsearch.randomizedtesting.rules.NoShadowingOrOverridesOnMethodsRule$1.evaluate(NoShadowingOrOverridesOnMethodsRule.java:40)
	at com.carrotsearch.randomizedtesting.rules.StatementAdapter.evaluate(StatementAdapter.java:36)
	at com.carrotsearch.randomizedtesting.rules.StatementAdapter.evaluate(StatementAdapter.java:36)
	at com.carrotsearch.randomizedtesting.rules.StatementAdapter.evaluate(StatementAdapter.java:36)
	at org.apache.lucene.util.TestRuleAssertionsRequired$1.evaluate(TestRuleAssertionsRequired.java:53)
	at org.apache.lucene.util.TestRuleMarkFailure$1.evaluate(TestRuleMarkFailure.java:47)
	at org.apache.lucene.util.TestRuleIgnoreAfterMaxFailures$1.evaluate(TestRuleIgnoreAfterMaxFailures.java:64)
	at org.apache.lucene.util.TestRuleIgnoreTestSuites$1.evaluate(TestRuleIgnoreTestSuites.java:54)
	at com.carrotsearch.randomizedtesting.rules.StatementAdapter.evaluate(StatementAdapter.java:36)
	at com.carrotsearch.randomizedtesting.ThreadLeakControl$StatementRunner.run(ThreadLeakControl.java:367)
	at java.lang.Thread.run(Thread.java:745)


FAILED:  junit.framework.TestSuite.org.apache.solr.cloud.ConcurrentDeleteAndCreateCollectionTest

Error Message:
10 threads leaked from SUITE scope at org.apache.solr.cloud.ConcurrentDeleteAndCreateCollectionTest:     1) Thread[id=3578, name=Connection evictor, state=TIMED_WAITING, group=TGRP-ConcurrentDeleteAndCreateCollectionTest]         at java.lang.Thread.sleep(Native Method)         at org.apache.http.impl.client.IdleConnectionEvictor$1.run(IdleConnectionEvictor.java:66)         at java.lang.Thread.run(Thread.java:745)    2) Thread[id=3583, name=Connection evictor, state=TIMED_WAITING, group=TGRP-ConcurrentDeleteAndCreateCollectionTest]         at java.lang.Thread.sleep(Native Method)         at org.apache.http.impl.client.IdleConnectionEvictor$1.run(IdleConnectionEvictor.java:66)         at java.lang.Thread.run(Thread.java:745)    3) Thread[id=3598, name=Connection evictor, state=TIMED_WAITING, group=TGRP-ConcurrentDeleteAndCreateCollectionTest]         at java.lang.Thread.sleep(Native Method)         at org.apache.http.impl.client.IdleConnectionEvictor$1.run(IdleConnectionEvictor.java:66)         at java.lang.Thread.run(Thread.java:745)    4) Thread[id=3588, name=Connection evictor, state=TIMED_WAITING, group=TGRP-ConcurrentDeleteAndCreateCollectionTest]         at java.lang.Thread.sleep(Native Method)         at org.apache.http.impl.client.IdleConnectionEvictor$1.run(IdleConnectionEvictor.java:66)         at java.lang.Thread.run(Thread.java:745)    5) Thread[id=3593, name=Connection evictor, state=TIMED_WAITING, group=TGRP-ConcurrentDeleteAndCreateCollectionTest]         at java.lang.Thread.sleep(Native Method)         at org.apache.http.impl.client.IdleConnectionEvictor$1.run(IdleConnectionEvictor.java:66)         at java.lang.Thread.run(Thread.java:745)    6) Thread[id=3558, name=Connection evictor, state=TIMED_WAITING, group=TGRP-ConcurrentDeleteAndCreateCollectionTest]         at java.lang.Thread.sleep(Native Method)         at org.apache.http.impl.client.IdleConnectionEvictor$1.run(IdleConnectionEvictor.java:66)         at java.lang.Thread.run(Thread.java:745)    7) Thread[id=3563, name=Connection evictor, state=TIMED_WAITING, group=TGRP-ConcurrentDeleteAndCreateCollectionTest]         at java.lang.Thread.sleep(Native Method)         at org.apache.http.impl.client.IdleConnectionEvictor$1.run(IdleConnectionEvictor.java:66)         at java.lang.Thread.run(Thread.java:745)    8) Thread[id=3603, name=Connection evictor, state=TIMED_WAITING, group=TGRP-ConcurrentDeleteAndCreateCollectionTest]         at java.lang.Thread.sleep(Native Method)         at org.apache.http.impl.client.IdleConnectionEvictor$1.run(IdleConnectionEvictor.java:66)         at java.lang.Thread.run(Thread.java:745)    9) Thread[id=3573, name=Connection evictor, state=TIMED_WAITING, group=TGRP-ConcurrentDeleteAndCreateCollectionTest]         at java.lang.Thread.sleep(Native Method)         at org.apache.http.impl.client.IdleConnectionEvictor$1.run(IdleConnectionEvictor.java:66)         at java.lang.Thread.run(Thread.java:745)   10) Thread[id=3568, name=Connection evictor, state=TIMED_WAITING, group=TGRP-ConcurrentDeleteAndCreateCollectionTest]         at java.lang.Thread.sleep(Native Method)         at org.apache.http.impl.client.IdleConnectionEvictor$1.run(IdleConnectionEvictor.java:66)         at java.lang.Thread.run(Thread.java:745)

Stack Trace:
com.carrotsearch.randomizedtesting.ThreadLeakError: 10 threads leaked from SUITE scope at org.apache.solr.cloud.ConcurrentDeleteAndCreateCollectionTest: 
   1) Thread[id=3578, name=Connection evictor, state=TIMED_WAITING, group=TGRP-ConcurrentDeleteAndCreateCollectionTest]
        at java.lang.Thread.sleep(Native Method)
        at org.apache.http.impl.client.IdleConnectionEvictor$1.run(IdleConnectionEvictor.java:66)
        at java.lang.Thread.run(Thread.java:745)
   2) Thread[id=3583, name=Connection evictor, state=TIMED_WAITING, group=TGRP-ConcurrentDeleteAndCreateCollectionTest]
        at java.lang.Thread.sleep(Native Method)
        at org.apache.http.impl.client.IdleConnectionEvictor$1.run(IdleConnectionEvictor.java:66)
        at java.lang.Thread.run(Thread.java:745)
   3) Thread[id=3598, name=Connection evictor, state=TIMED_WAITING, group=TGRP-ConcurrentDeleteAndCreateCollectionTest]
        at java.lang.Thread.sleep(Native Method)
        at org.apache.http.impl.client.IdleConnectionEvictor$1.run(IdleConnectionEvictor.java:66)
        at java.lang.Thread.run(Thread.java:745)
   4) Thread[id=3588, name=Connection evictor, state=TIMED_WAITING, group=TGRP-ConcurrentDeleteAndCreateCollectionTest]
        at java.lang.Thread.sleep(Native Method)
        at org.apache.http.impl.client.IdleConnectionEvictor$1.run(IdleConnectionEvictor.java:66)
        at java.lang.Thread.run(Thread.java:745)
   5) Thread[id=3593, name=Connection evictor, state=TIMED_WAITING, group=TGRP-ConcurrentDeleteAndCreateCollectionTest]
        at java.lang.Thread.sleep(Native Method)
        at org.apache.http.impl.client.IdleConnectionEvictor$1.run(IdleConnectionEvictor.java:66)
        at java.lang.Thread.run(Thread.java:745)
   6) Thread[id=3558, name=Connection evictor, state=TIMED_WAITING, group=TGRP-ConcurrentDeleteAndCreateCollectionTest]
        at java.lang.Thread.sleep(Native Method)
        at org.apache.http.impl.client.IdleConnectionEvictor$1.run(IdleConnectionEvictor.java:66)
        at java.lang.Thread.run(Thread.java:745)
   7) Thread[id=3563, name=Connection evictor, state=TIMED_WAITING, group=TGRP-ConcurrentDeleteAndCreateCollectionTest]
        at java.lang.Thread.sleep(Native Method)
        at org.apache.http.impl.client.IdleConnectionEvictor$1.run(IdleConnectionEvictor.java:66)
        at java.lang.Thread.run(Thread.java:745)
   8) Thread[id=3603, name=Connection evictor, state=TIMED_WAITING, group=TGRP-ConcurrentDeleteAndCreateCollectionTest]
        at java.lang.Thread.sleep(Native Method)
        at org.apache.http.impl.client.IdleConnectionEvictor$1.run(IdleConnectionEvictor.java:66)
        at java.lang.Thread.run(Thread.java:745)
   9) Thread[id=3573, name=Connection evictor, state=TIMED_WAITING, group=TGRP-ConcurrentDeleteAndCreateCollectionTest]
        at java.lang.Thread.sleep(Native Method)
        at org.apache.http.impl.client.IdleConnectionEvictor$1.run(IdleConnectionEvictor.java:66)
        at java.lang.Thread.run(Thread.java:745)
  10) Thread[id=3568, name=Connection evictor, state=TIMED_WAITING, group=TGRP-ConcurrentDeleteAndCreateCollectionTest]
        at java.lang.Thread.sleep(Native Method)
        at org.apache.http.impl.client.IdleConnectionEvictor$1.run(IdleConnectionEvictor.java:66)
        at java.lang.Thread.run(Thread.java:745)
	at __randomizedtesting.SeedInfo.seed([69C7C3B4D964326A]:0)




Build Log:
[...truncated 3051 lines...]
   [junit4] Suite: org.apache.lucene.analysis.core.TestRandomChains
   [junit4]   2> Exception from random analyzer: 
   [junit4]   2> charfilters=
   [junit4]   2> tokenizer=
   [junit4]   2>   org.apache.lucene.analysis.core.LetterTokenizer()
   [junit4]   2> filters=
   [junit4]   2>   org.apache.lucene.analysis.minhash.MinHashFilter(ValidatingTokenFilter@1255a487 term=,bytes=[],startOffset=0,endOffset=0,positionIncrement=1,positionLength=1,type=word, 3, 48, -35, true)
   [junit4]   2>   org.apache.lucene.analysis.util.ElisionFilter(ValidatingTokenFilter@7a0b7f3c term=,bytes=[],startOffset=0,endOffset=0,positionIncrement=1,positionLength=1,type=word, [klglj])
   [junit4]   2>   org.apache.lucene.analysis.miscellaneous.ASCIIFoldingFilter(ValidatingTokenFilter@8ed0d9d term=,bytes=[],startOffset=0,endOffset=0,positionIncrement=1,positionLength=1,type=word, true)
   [junit4]   2>   org.apache.lucene.analysis.ngram.NGramTokenFilter(ValidatingTokenFilter@43c891a term=,bytes=[],startOffset=0,endOffset=0,positionIncrement=1,positionLength=1,type=word)
   [junit4]   2> offsetsAreCorrect=true
   [junit4]   2> NOTE: download the large Jenkins line-docs file by running 'ant get-jenkins-line-docs' in the lucene directory.
   [junit4]   2> NOTE: reproduce with: ant test  -Dtestcase=TestRandomChains -Dtests.method=testRandomChainsWithLargeStrings -Dtests.seed=B9ED0ECBBD7CADDD -Dtests.multiplier=2 -Dtests.nightly=true -Dtests.slow=true -Dtests.linedocsfile=/home/jenkins/jenkins-slave/workspace/Lucene-Solr-NightlyTests-master/test-data/enwiki.random.lines.txt -Dtests.locale=ru -Dtests.timezone=Africa/Monrovia -Dtests.asserts=true -Dtests.file.encoding=US-ASCII
   [junit4] ERROR   25.1s J0 | TestRandomChains.testRandomChainsWithLargeStrings <<<
   [junit4]    > Throwable #1: java.util.NoSuchElementException
   [junit4]    > 	at __randomizedtesting.SeedInfo.seed([B9ED0ECBBD7CADDD:D3B6B1DAE4328D2E]:0)
   [junit4]    > 	at java.util.TreeMap.key(TreeMap.java:1327)
   [junit4]    > 	at java.util.TreeMap.lastKey(TreeMap.java:297)
   [junit4]    > 	at java.util.TreeSet.last(TreeSet.java:401)
   [junit4]    > 	at org.apache.lucene.analysis.minhash.MinHashFilter$FixedSizeTreeSet.add(MinHashFilter.java:325)
   [junit4]    > 	at org.apache.lucene.analysis.minhash.MinHashFilter.incrementToken(MinHashFilter.java:159)
   [junit4]    > 	at org.apache.lucene.analysis.ValidatingTokenFilter.incrementToken(ValidatingTokenFilter.java:67)
   [junit4]    > 	at org.apache.lucene.analysis.util.ElisionFilter.incrementToken(ElisionFilter.java:52)
   [junit4]    > 	at org.apache.lucene.analysis.ValidatingTokenFilter.incrementToken(ValidatingTokenFilter.java:67)
   [junit4]    > 	at org.apache.lucene.analysis.miscellaneous.ASCIIFoldingFilter.incrementToken(ASCIIFoldingFilter.java:102)
   [junit4]    > 	at org.apache.lucene.analysis.ValidatingTokenFilter.incrementToken(ValidatingTokenFilter.java:67)
   [junit4]    > 	at org.apache.lucene.analysis.FilteringTokenFilter.incrementToken(FilteringTokenFilter.java:51)
   [junit4]    > 	at org.apache.lucene.analysis.ngram.NGramTokenFilter.incrementToken(NGramTokenFilter.java:98)
   [junit4]    > 	at org.apache.lucene.analysis.ValidatingTokenFilter.incrementToken(ValidatingTokenFilter.java:67)
   [junit4]    > 	at org.apache.lucene.analysis.BaseTokenStreamTestCase.checkResetException(BaseTokenStreamTestCase.java:405)
   [junit4]    > 	at org.apache.lucene.analysis.BaseTokenStreamTestCase.checkRandomData(BaseTokenStreamTestCase.java:510)
   [junit4]    > 	at org.apache.lucene.analysis.core.TestRandomChains.testRandomChainsWithLargeStrings(TestRandomChains.java:959)
   [junit4]    > 	at java.lang.Thread.run(Thread.java:745)
   [junit4]   2> NOTE: leaving temporary files on disk at: /x1/jenkins/jenkins-slave/workspace/Lucene-Solr-NightlyTests-master/checkout/lucene/build/analysis/common/test/J0/temp/lucene.analysis.core.TestRandomChains_B9ED0ECBBD7CADDD-001
   [junit4]   2> NOTE: test params are: codec=DummyCompressingStoredFields(storedFieldsFormat=CompressingStoredFieldsFormat(compressionMode=DUMMY, chunkSize=8, maxDocsPerChunk=6, blockSize=176), termVectorsFormat=CompressingTermVectorsFormat(compressionMode=DUMMY, chunkSize=8, blockSize=176)), sim=RandomSimilarity(queryNorm=false): {dummy=IB SPL-L3(800.0)}, locale=ru, timezone=Africa/Monrovia
   [junit4]   2> NOTE: Linux 3.13.0-85-generic amd64/Oracle Corporation 1.8.0_102 (64-bit)/cpus=4,threads=1,free=93458712,total=296222720
   [junit4]   2> NOTE: All tests run in this JVM: [TestFrenchLightStemFilterFactory, TestDictionaryCompoundWordTokenFilterFactory, TestLimitTokenOffsetFilterFactory, TestHindiFilters, TestStemmer, TestPathHierarchyTokenizer, TestSpanishAnalyzer, TestFinnishLightStemFilterFactory, TestFullStrip, TestLengthFilter, TestCustomAnalyzer, TestGalicianStemFilterFactory, TestSwedishAnalyzer, TestDependencies, TestIgnore, TestTurkishAnalyzer, TestApostropheFilter, TestScandinavianFoldingFilter, TestHungarianLightStemFilterFactory, TestIndonesianStemmer, TestSpanishLightStemFilterFactory, TestElisionFilterFactory, WikipediaTokenizerTest, TestCollationKeyAnalyzer, TestGermanMinimalStemFilterFactory, TestTrimFilterFactory, TestIndonesianStemFilterFactory, TestNorwegianLightStemFilter, TestPorterStemFilter, TestRussianLightStemFilterFactory, TestCapitalizationFilter, TestArabicFilters, TestBasqueAnalyzer, TestCaseSensitive, TestCollationDocValuesField, QueryAutoStopWordAnalyzerTest, NGramTokenizerTest, TestGermanMinimalStemFilter, TestSoraniNormalizationFilterFactory, TestEnglishAnalyzer, TestPersianNormalizationFilter, TestNorwegianAnalyzer, TestCJKWidthFilter, TestDecimalDigitFilter, TestKeywordRepeatFilter, TestFactories, TestRandomChains]
   [junit4] Completed [122/272 (1!)] on J0 in 117.86s, 2 tests, 1 error <<< FAILURES!

[...truncated 8348 lines...]
   [junit4] Suite: org.apache.solr.cloud.ConcurrentDeleteAndCreateCollectionTest
   [junit4]   2> Creating dataDir: /x1/jenkins/jenkins-slave/workspace/Lucene-Solr-NightlyTests-master/checkout/solr/build/solr-core/test/J1/temp/solr.cloud.ConcurrentDeleteAndCreateCollectionTest_69C7C3B4D964326A-001/init-core-data-001
   [junit4]   2> 841040 INFO  (SUITE-ConcurrentDeleteAndCreateCollectionTest-seed#[69C7C3B4D964326A]-worker) [    ] o.a.s.SolrTestCaseJ4 Randomized ssl (true) and clientAuth (false) via: @org.apache.solr.util.RandomizeSSL(reason=, ssl=NaN, value=NaN, clientAuth=NaN)
   [junit4]   2> 841043 INFO  (TEST-ConcurrentDeleteAndCreateCollectionTest.testConcurrentCreateAndDeleteOverTheSameConfig-seed#[69C7C3B4D964326A]) [    ] o.a.s.SolrTestCaseJ4 ###Starting testConcurrentCreateAndDeleteOverTheSameConfig
   [junit4]   2> 841044 INFO  (TEST-ConcurrentDeleteAndCreateCollectionTest.testConcurrentCreateAndDeleteOverTheSameConfig-seed#[69C7C3B4D964326A]) [    ] o.a.s.c.ZkTestServer STARTING ZK TEST SERVER
   [junit4]   2> 841080 INFO  (Thread-953) [    ] o.a.s.c.ZkTestServer client port:0.0.0.0/0.0.0.0:0
   [junit4]   2> 841080 INFO  (Thread-953) [    ] o.a.s.c.ZkTestServer Starting server
   [junit4]   2> 841173 INFO  (TEST-ConcurrentDeleteAndCreateCollectionTest.testConcurrentCreateAndDeleteOverTheSameConfig-seed#[69C7C3B4D964326A]) [    ] o.a.s.c.ZkTestServer start zk server on port:52340
   [junit4]   2> 841173 INFO  (TEST-ConcurrentDeleteAndCreateCollectionTest.testConcurrentCreateAndDeleteOverTheSameConfig-seed#[69C7C3B4D964326A]) [    ] o.a.s.c.c.SolrZkClient Using default ZkCredentialsProvider
   [junit4]   2> 841225 INFO  (TEST-ConcurrentDeleteAndCreateCollectionTest.testConcurrentCreateAndDeleteOverTheSameConfig-seed#[69C7C3B4D964326A]) [    ] o.a.s.c.c.ConnectionManager Waiting for client to connect to ZooKeeper
   [junit4]   2> 841245 INFO  (zkCallback-503-thread-1) [    ] o.a.s.c.c.ConnectionManager Watcher org.apache.solr.common.cloud.ConnectionManager@1e554cc8 name:ZooKeeperConnection Watcher:127.0.0.1:52340 got event WatchedEvent state:SyncConnected type:None path:null path:null type:None
   [junit4]   2> 841245 INFO  (TEST-ConcurrentDeleteAndCreateCollectionTest.testConcurrentCreateAndDeleteOverTheSameConfig-seed#[69C7C3B4D964326A]) [    ] o.a.s.c.c.ConnectionManager Client is connected to ZooKeeper
   [junit4]   2> 841245 INFO  (TEST-ConcurrentDeleteAndCreateCollectionTest.testConcurrentCreateAndDeleteOverTheSameConfig-seed#[69C7C3B4D964326A]) [    ] o.a.s.c.c.SolrZkClient Using default ZkACLProvider
   [junit4]   2> 841245 INFO  (TEST-ConcurrentDeleteAndCreateCollectionTest.testConcurrentCreateAndDeleteOverTheSameConfig-seed#[69C7C3B4D964326A]) [    ] o.a.s.c.c.SolrZkClient makePath: /solr/solr.xml
   [junit4]   2> 841247 INFO  (TEST-ConcurrentDeleteAndCreateCollectionTest.testConcurrentCreateAndDeleteOverTheSameConfig-seed#[69C7C3B4D964326A]) [    ] o.a.s.c.c.SolrZkClient makePath: /solr/clusterprops.json
   [junit4]   2> 841255 INFO  (jetty-launcher-502-thread-1) [    ] o.e.j.s.Server jetty-9.3.8.v20160314
   [junit4]   2> 841266 INFO  (jetty-launcher-502-thread-1) [    ] o.e.j.s.h.ContextHandler Started o.e.j.s.ServletContextHandler@1a88dbc2{/solr,null,AVAILABLE}
   [junit4]   2> 841269 INFO  (jetty-launcher-502-thread-1) [    ] o.e.j.s.ServerConnector Started ServerConnector@1923033d{SSL,[ssl, http/1.1]}{127.0.0.1:44324}
   [junit4]   2> 841269 INFO  (jetty-launcher-502-thread-1) [    ] o.e.j.s.Server Started @849329ms
   [junit4]   2> 841269 INFO  (jetty-launcher-502-thread-1) [    ] o.a.s.c.s.e.JettySolrRunner Jetty properties: {hostContext=/solr, hostPort=44324}
   [junit4]   2> 841293 INFO  (jetty-launcher-502-thread-1) [    ] o.a.s.s.SolrDispatchFilter SolrDispatchFilter.init(): sun.misc.Launcher$AppClassLoader@73d16e93
   [junit4]   2> 841293 INFO  (jetty-launcher-502-thread-1) [    ] o.a.s.c.SolrResourceLoader new SolrResourceLoader for directory: '/x1/jenkins/jenkins-slave/workspace/Lucene-Solr-NightlyTests-master/checkout/solr/build/solr-core/test/J1/temp/solr.cloud.ConcurrentDeleteAndCreateCollectionTest_69C7C3B4D964326A-001/tempDir-001/node1'
   [junit4]   2> 841294 INFO  (jetty-launcher-502-thread-1) [    ] o.a.s.c.SolrResourceLoader JNDI not configured for solr (NoInitialContextEx)
   [junit4]   2> 841294 INFO  (jetty-launcher-502-thread-1) [    ] o.a.s.c.SolrResourceLoader solr home defaulted to 'solr/' (could not find system property or JNDI)
   [junit4]   2> 841294 INFO  (jetty-launcher-502-thread-1) [    ] o.a.s.c.c.SolrZkClient Using default ZkCredentialsProvider
   [junit4]   2> 841309 INFO  (jetty-launcher-502-thread-1) [    ] o.a.s.c.c.ConnectionManager Waiting for client to connect to ZooKeeper
   [junit4]   2> 841353 INFO  (zkCallback-504-thread-1) [    ] o.a.s.c.c.ConnectionManager Watcher org.apache.solr.common.cloud.ConnectionManager@c016771 name:ZooKeeperConnection Watcher:127.0.0.1:52340/solr got event WatchedEvent state:SyncConnected type:None path:null path:null type:None
   [junit4]   2> 841355 INFO  (jetty-launcher-502-thread-1) [    ] o.a.s.c.c.ConnectionManager Client is connected to ZooKeeper
   [junit4]   2> 841355 INFO  (jetty-launcher-502-thread-1) [    ] o.a.s.c.c.SolrZkClient Using default ZkACLProvider
   [junit4]   2> 841355 INFO  (jetty-launcher-502-thread-1) [    ] o.a.s.s.SolrDispatchFilter solr.xml found in ZooKeeper. Loading...
   [junit4]   2> 841369 INFO  (jetty-launcher-502-thread-1) [    ] o.a.s.c.CorePropertiesLocator Config-defined core root directory: /x1/jenkins/jenkins-slave/workspace/Lucene-Solr-NightlyTests-master/checkout/solr/build/solr-core/test/J1/temp/solr.cloud.ConcurrentDeleteAndCreateCollectionTest_69C7C3B4D964326A-001/tempDir-001/node1/.
   [junit4]   2> 841369 INFO  (jetty-launcher-502-thread-1) [    ] o.a.s.c.CoreContainer New CoreContainer 866240293
   [junit4]   2> 841369 INFO  (jetty-launcher-502-thread-1) [    ] o.a.s.c.CoreContainer Loading cores into CoreContainer [instanceDir=/x1/jenkins/jenkins-slave/workspace/Lucene-Solr-NightlyTests-master/checkout/solr/build/solr-core/test/J1/temp/solr.cloud.ConcurrentDeleteAndCreateCollectionTest_69C7C3B4D964326A-001/tempDir-001/node1]
   [junit4]   2> 841369 WARN  (jetty-launcher-502-thread-1) [    ] o.a.s.c.CoreContainer Couldn't add files from /x1/jenkins/jenkins-slave/workspace/Lucene-Solr-NightlyTests-master/checkout/solr/build/solr-core/test/J1/temp/solr.cloud.ConcurrentDeleteAndCreateCollectionTest_69C7C3B4D964326A-001/tempDir-001/node1/lib to classpath: /x1/jenkins/jenkins-slave/workspace/Lucene-Solr-NightlyTests-master/checkout/solr/build/solr-core/test/J1/temp/solr.cloud.ConcurrentDeleteAndCreateCollectionTest_69C7C3B4D964326A-001/tempDir-001/node1/lib
   [junit4]   2> 841390 INFO  (jetty-launcher-502-thread-1) [    ] o.a.s.h.c.HttpShardHandlerFactory created with socketTimeout : 90000,urlScheme : https,connTimeout : 15000,maxConnectionsPerHost : 20,maxConnections : 10000,corePoolSize : 0,maximumPoolSize : 2147483647,maxThreadIdleTime : 5,sizeOfQueue : -1,fairnessPolicy : false,
   [junit4]   2> 841414 INFO  (jetty-launcher-502-thread-1) [    ] o.a.s.u.UpdateShardHandler Created UpdateShardHandler HTTP client with params: socketTimeout=340000&connTimeout=45000&maxConnections=100000&maxConnectionsPerHost=100000
   [junit4]   2> 841414 INFO  (jetty-launcher-502-thread-1) [    ] o.a.s.l.LogWatcher SLF4J impl is org.slf4j.impl.Log4jLoggerFactory
   [junit4]   2> 841414 INFO  (jetty-launcher-502-thread-1) [    ] o.a.s.l.LogWatcher Registering Log Listener [Log4j (org.slf4j.impl.Log4jLoggerFactory)]
   [junit4]   2> 841414 INFO  (jetty-launcher-502-thread-1) [    ] o.a.s.c.ZkContainer Zookeeper client=127.0.0.1:52340/solr
   [junit4]   2> 841414 INFO  (jetty-launcher-502-thread-1) [    ] o.a.s.c.ZkController zkHost includes chroot
   [junit4]   2> 841414 INFO  (jetty-launcher-502-thread-1) [    ] o.a.s.c.c.SolrZkClient Using default ZkCredentialsProvider
   [junit4]   2> 841437 INFO  (jetty-launcher-502-thread-1) [    ] o.a.s.c.c.ConnectionManager Waiting for client to connect to ZooKeeper
   [junit4]   2> 841452 INFO  (zkCallback-507-thread-1) [    ] o.a.s.c.c.ConnectionManager Watcher org.apache.solr.common.cloud.ConnectionManager@6695662e name:ZooKeeperConnection Watcher:127.0.0.1:52340 got event WatchedEvent state:SyncConnected type:None path:null path:null type:None
   [junit4]   2> 841452 INFO  (jetty-launcher-502-thread-1) [    ] o.a.s.c.c.ConnectionManager Client is connected to ZooKeeper
   [junit4]   2> 841452 INFO  (jetty-launcher-502-thread-1) [    ] o.a.s.c.c.SolrZkClient Using default ZkACLProvider
   [junit4]   2> 841453 INFO  (jetty-launcher-502-thread-1) [n:127.0.0.1:44324_solr    ] o.a.s.c.ZkController Added new OnReconnect listener org.apache.solr.cloud.ZkController$$Lambda$83/793159416@191f8e5d
   [junit4]   2> 841501 INFO  (jetty-launcher-502-thread-1) [n:127.0.0.1:44324_solr    ] o.a.s.c.c.ConnectionManager Waiting for client to connect to ZooKeeper
   [junit4]   2> 841517 INFO  (zkCallback-508-thread-1-processing-n:127.0.0.1:44324_solr) [n:127.0.0.1:44324_solr    ] o.a.s.c.c.ConnectionManager Watcher org.apache.solr.common.cloud.ConnectionManager@513e6957 name:ZooKeeperConnection Watcher:127.0.0.1:52340/solr got event WatchedEvent state:SyncConnected type:None path:null path:null type:None
   [junit4]   2> 841517 INFO  (jetty-launcher-502-thread-1) [n:127.0.0.1:44324_solr    ] o.a.s.c.c.ConnectionManager Client is connected to ZooKeeper
   [junit4]   2> 841518 INFO  (jetty-launcher-502-thread-1) [n:127.0.0.1:44324_solr    ] o.a.s.c.c.SolrZkClient makePath: /overseer/queue
   [junit4]   2> 841520 INFO  (jetty-launcher-502-thread-1) [n:127.0.0.1:44324_solr    ] o.a.s.c.c.SolrZkClient makePath: /overseer/collection-queue-work
   [junit4]   2> 841523 INFO  (jetty-launcher-502-thread-1) [n:127.0.0.1:44324_solr    ] o.a.s.c.c.SolrZkClient makePath: /overseer/collection-map-running
   [junit4]   2> 841524 INFO  (jetty-launcher-502-thread-1) [n:127.0.0.1:44324_solr    ] o.a.s.c.c.SolrZkClient makePath: /overseer/collection-map-completed
   [junit4]   2> 841526 INFO  (jetty-launcher-502-thread-1) [n:127.0.0.1:44324_solr    ] o.a.s.c.c.SolrZkClient makePath: /overseer/collection-map-failure
   [junit4]   2> 841527 INFO  (jetty-launcher-502-thread-1) [n:127.0.0.1:44324_solr    ] o.a.s.c.c.SolrZkClient makePath: /live_nodes
   [junit4]   2> 841528 INFO  (jetty-launcher-502-thread-1) [n:127.0.0.1:44324_solr    ] o.a.s.c.c.SolrZkClient makePath: /collections
   [junit4]   2> 841529 INFO  (jetty-launcher-502-thread-1) [n:127.0.0.1:44324_solr    ] o.a.s.c.c.SolrZkClient makePath: /aliases.json
   [junit4]   2> 841530 INFO  (jetty-launcher-502-thread-1) [n:127.0.0.1:44324_solr    ] o.a.s.c.c.SolrZkClient makePath: /clusterstate.json
   [junit4]   2> 841531 INFO  (jetty-launcher-502-thread-1) [n:127.0.0.1:44324_solr    ] o.a.s.c.c.SolrZkClient makePath: /security.json
   [junit4]   2> 841532 INFO  (jetty-launcher-502-thread-1) [n:127.0.0.1:44324_solr    ] o.a.s.c.c.ZkStateReader Updating cluster state from ZooKeeper... 
   [junit4]   2> 841532 INFO  (jetty-launcher-502-thread-1) [n:127.0.0.1:44324_solr    ] o.a.s.c.c.ZkStateReader Loaded cluster properties: {urlScheme=https}
   [junit4]   2> 841533 INFO  (jetty-launcher-502-thread-1) [n:127.0.0.1:44324_solr    ] o.a.s.c.c.ZkStateReader Updated live nodes from ZooKeeper... (0) -> (0)
   [junit4]   2> 841535 INFO  (jetty-launcher-502-thread-1) [n:127.0.0.1:44324_solr    ] o.a.s.c.c.SolrZkClient makePath: /overseer_elect
   [junit4]   2> 841536 INFO  (jetty-launcher-502-thread-1) [n:127.0.0.1:44324_solr    ] o.a.s.c.c.SolrZkClient makePath: /overseer_elect/election
   [junit4]   2> 841537 INFO  (jetty-launcher-502-thread-1) [n:127.0.0.1:44324_solr    ] o.a.s.c.Overseer Overseer (id=null) closing
   [junit4]   2> 841538 INFO  (jetty-launcher-502-thread-1) [n:127.0.0.1:44324_solr    ] o.a.s.c.LeaderElector Joined leadership election with path: /overseer_elect/election/96575435014995971-127.0.0.1:44324_solr-n_0000000000
   [junit4]   2> 841538 INFO  (jetty-launcher-502-thread-1) [n:127.0.0.1:44324_solr    ] o.a.s.c.OverseerElectionContext I am going to be the leader 127.0.0.1:44324_solr
   [junit4]   2> 841538 INFO  (jetty-launcher-502-thread-1) [n:127.0.0.1:44324_solr    ] o.a.s.c.c.SolrZkClient makePath: /overseer_elect/leader
   [junit4]   2> 841539 INFO  (jetty-launcher-502-thread-1) [n:127.0.0.1:44324_solr    ] o.a.s.c.Overseer Overseer (id=96575435014995971-127.0.0.1:44324_solr-n_0000000000) starting
   [junit4]   2> 841541 INFO  (jetty-launcher-502-thread-1) [n:127.0.0.1:44324_solr    ] o.a.s.c.c.SolrZkClient makePath: /overseer/queue-work
   [junit4]   2> 841546 INFO  (jetty-launcher-502-thread-1) [n:127.0.0.1:44324_solr    ] o.a.s.c.OverseerAutoReplicaFailoverThread Starting OverseerAutoReplicaFailoverThread autoReplicaFailoverWorkLoopDelay=10000 autoReplicaFailoverWaitAfterExpiration=30000 autoReplicaFailoverBadNodeExpiration=60000
   [junit4]   2> 841561 INFO  (OverseerStateUpdate-96575435014995971-127.0.0.1:44324_solr-n_0000000000) [n:127.0.0.1:44324_solr    ] o.a.s.c.Overseer Starting to work on the main queue
   [junit4]   2> 841562 INFO  (OverseerCollectionConfigSetProcessor-96575435014995971-127.0.0.1:44324_solr-n_0000000000) [n:127.0.0.1:44324_solr    ] o.a.s.c.OverseerTaskProcessor Process current queue of overseer operations
   [junit4]   2> 842034 INFO  (OverseerStateUpdate-96575435014995971-127.0.0.1:44324_solr-n_0000000000) [n:127.0.0.1:44324_solr    ] o.a.s.c.c.ZkStateReader Updated live nodes from ZooKeeper... (0) -> (0)
   [junit4]   2> 842035 INFO  (jetty-launcher-502-thread-1) [n:127.0.0.1:44324_solr    ] o.a.s.c.ZkController Register node as live in ZooKeeper:/live_nodes/127.0.0.1:44324_solr
   [junit4]   2> 842035 INFO  (jetty-launcher-502-thread-1) [n:127.0.0.1:44324_solr    ] o.a.s.c.c.SolrZkClient makePath: /live_nodes/127.0.0.1:44324_solr
   [junit4]   2> 842037 INFO  (zkCallback-508-thread-1-processing-n:127.0.0.1:44324_solr) [n:127.0.0.1:44324_solr    ] o.a.s.c.c.ZkStateReader A live node change: [WatchedEvent state:SyncConnected type:NodeChildrenChanged path:/live_nodes], has occurred - updating... (live nodes size: [0])
   [junit4]   2> 842037 INFO  (zkCallback-508-thread-1-processing-n:127.0.0.1:44324_solr) [n:127.0.0.1:44324_solr    ] o.a.s.c.c.ZkStateReader Updated live nodes from ZooKeeper... (0) -> (1)
   [junit4]   2> 842200 INFO  (jetty-launcher-502-thread-1) [n:127.0.0.1:44324_solr    ] o.a.s.c.CoreContainer Security conf doesn't exist. Skipping setup for authorization module.
   [junit4]   2> 842200 INFO  (jetty-launcher-502-thread-1) [n:127.0.0.1:44324_solr    ] o.a.s.c.CoreContainer No authentication plugin used.
   [junit4]   2> 842225 INFO  (jetty-launcher-502-thread-1) [n:127.0.0.1:44324_solr    ] o.a.s.c.CorePropertiesLocator Looking for core definitions underneath /x1/jenkins/jenkins-slave/workspace/Lucene-Solr-NightlyTests-master/checkout/solr/build/solr-core/test/J1/temp/solr.cloud.ConcurrentDeleteAndCreateCollectionTest_69C7C3B4D964326A-001/tempDir-001/node1/.
   [junit4]   2> 842226 INFO  (jetty-launcher-502-thread-1) [n:127.0.0.1:44324_solr    ] o.a.s.c.CorePropertiesLocator Found 0 core definitions
   [junit4]   2> 842233 INFO  (jetty-launcher-502-thread-1) [n:127.0.0.1:44324_solr    ] o.a.s.s.SolrDispatchFilter user.dir=/x1/jenkins/jenkins-slave/workspace/Lucene-Solr-NightlyTests-master/checkout/solr/build/solr-core/test/J1
   [junit4]   2> 842233 INFO  (jetty-launcher-502-thread-1) [n:127.0.0.1:44324_solr    ] o.a.s.s.SolrDispatchFilter SolrDispatchFilter.init() done
   [junit4]   2> 842233 INFO  (TEST-ConcurrentDeleteAndCreateCollectionTest.testConcurrentCreateAndDeleteOverTheSameConfig-seed#[69C7C3B4D964326A]) [    ] o.a.s.c.c.SolrZkClient Using default ZkCredentialsProvider
   [junit4]   2> 842245 INFO  (TEST-ConcurrentDeleteAndCreateCollectionTest.testConcurrentCreateAndDeleteOverTheSameConfig-seed#[69C7C3B4D964326A]) [    ] o.a.s.c.c.ConnectionManager Waiting for client to connect to ZooKeeper
   [junit4]   2> 842257 INFO  (zkCallback-510-thread-1) [    ] o.a.s.c.c.ConnectionManager Watcher org.apache.solr.common.cloud.ConnectionManager@64b90cc9 name:ZooKeeperConnection Watcher:127.0.0.1:52340 got event WatchedEvent state:SyncConnected type:None path:null path:null type:None
   [junit4]   2> 842257 INFO  (TEST-ConcurrentDeleteAndCreateCollectionTest.testConcurrentCreateAndDeleteOverTheSameConfig-seed#[69C7C3B4D964326A]) [    ] o.a.s.c.c.ConnectionManager Client is connected to ZooKeeper
   [junit4]   2> 842257 INFO  (TEST-ConcurrentDeleteAndCreateCollectionTest.testConcurrentCreateAndDeleteOverTheSameConfig-seed#[69C7C3B4D964326A]) [    ] o.a.s.c.c.SolrZkClient Using default ZkACLProvider
   [junit4]   2> 842262 INFO  (TEST-ConcurrentDeleteAndCreateCollectionTest.testConcurrentCreateAndDeleteOverTheSameConfig-seed#[69C7C3B4D964326A]) [    ] o.a.s.c.c.SolrZkClient Using default ZkCredentialsProvider
   [junit4]   2> 842300 INFO  (TEST-ConcurrentDeleteAndCreateCollectionTest.testConcurrentCreateAndDeleteOverTheSameConfig-seed#[69C7C3B4D964326A]) [    ] o.a.s.c.c.ConnectionManager Waiting for client to connect to ZooKeeper
   [junit4]   2> 842310 INFO  (zkCallback-512-thread-1) [    ] o.a.s.c.c.ConnectionManager Watcher org.apache.solr.common.cloud.ConnectionManager@1c09f4f2 name:ZooKeeperConnection Watcher:127.0.0.1:52340/solr got event WatchedEvent state:SyncConnected type:None path:null path:null type:None
   [junit4]   2> 842310 INFO  (TEST-ConcurrentDeleteAndCreateCollectionTest.testConcurrentCreateAndDeleteOverTheSameConfig-seed#[69C7C3B4D964326A]) [    ] o.a.s.c.c.ConnectionManager Client is connected to ZooKeeper
   [junit4]   2> 842311 INFO  (TEST-ConcurrentDeleteAndCreateCollectionTest.testConcurrentCreateAndDeleteOverTheSameConfig-seed#[69C7C3B4D964326A]) [    ] o.a.s.c.c.SolrZkClient Using default ZkACLProvider
   [junit4]   2> 842311 INFO  (TEST-ConcurrentDeleteAndCreateCollectionTest.testConcurrentCreateAndDeleteOverTheSameConfig-seed#[69C7C3B4D964326A]) [    ] o.a.s.c.c.SolrZkClient makePath: /configs/testconfig/schema.xml
   [junit4]   2> 842314 INFO  (TEST-ConcurrentDeleteAndCreateCollectionTest.testConcurrentCreateAndDeleteOverTheSameConfig-seed#[69C7C3B4D964326A]) [    ] o.a.s.c.c.SolrZkClient makePath: /configs/testconfig/solrconfig.xml
   [junit4]   2> 842505 INFO  (qtp946450217-3432) [n:127.0.0.1:44324_solr    ] o.a.s.h.a.CollectionsHandler Invoked Collection Action :create with params replicationFactor=1&collection.configName=testconfig&name=collection0&action=CREATE&numShards=1&wt=javabin&version=2 and sendToOCPQueue=true
   [junit4]   2> 842508 INFO  (OverseerCollectionConfigSetProcessor-96575435014995971-127.0.0.1:44324_solr-n_0000000000) [n:127.0.0.1:44324_solr    ] o.a.s.c.OverseerTaskProcessor Overseer Collection Message Handler: Get the message id:/overseer/collection-queue-work/qn-0000000000 message:{
   [junit4]   2>   "name":"collection0",
   [junit4]   2>   "fromApi":"true",
   [junit4]   2>   "replicationFactor":"1",
   [junit4]   2>   "collection.configName":"testconfig",
   [junit4]   2>   "numShards":"1",
   [junit4]   2>   "stateFormat":"2",
   [junit4]   2>   "operation":"create"}
   [junit4]   2> 842509 INFO  (OverseerThreadFactory-1293-thread-1-processing-n:127.0.0.1:44324_solr) [n:127.0.0.1:44324_solr    ] o.a.s.c.OverseerCollectionMessageHandler OverseerCollectionMessageHandler.processMessage : create , {
   [junit4]   2>   "name":"collection0",
   [junit4]   2>   "fromApi":"true",
   [junit4]   2>   "replicationFactor":"1",
   [junit4]   2>   "collection.configName":"testconfig",
   [junit4]   2>   "numShards":"1",
   [junit4]   2>   "stateFormat":"2",
   [junit4]   2>   "operation":"create"}
   [junit4]   2> 842510 INFO  (OverseerThreadFactory-1293-thread-1-processing-n:127.0.0.1:44324_solr) [n:127.0.0.1:44324_solr    ] o.a.s.c.CreateCollectionCmd Create collection collection0
   [junit4]   2> 842510 INFO  (qtp946450217-3433) [n:127.0.0.1:44324_solr    ] o.a.s.h.a.CollectionsHandler Invoked Collection Action :create with params replicationFactor=1&collection.configName=testconfig&name=collection1&action=CREATE&numShards=1&wt=javabin&version=2 and sendToOCPQueue=true
   [junit4]   2> 842517 INFO  (OverseerThreadFactory-1293-thread-1-processing-n:127.0.0.1:44324_solr) [n:127.0.0.1:44324_solr    ] o.a.s.c.OverseerCollectionMessageHandler creating collections conf node /collections/collection0 
   [junit4]   2> 842533 INFO  (OverseerThreadFactory-1293-thread-1-processing-n:127.0.0.1:44324_solr) [n:127.0.0.1:44324_solr    ] o.a.s.c.c.SolrZkClient makePath: /collections/collection0
   [junit4]   2> 842538 INFO  (OverseerCollectionConfigSetProcessor-96575435014995971-127.0.0.1:44324_solr-n_0000000000) [n:127.0.0.1:44324_solr    ] o.a.s.c.OverseerTaskProcessor Overseer Collection Message Handler: Get the message id:/overseer/collection-queue-work/qn-0000000002 message:{
   [junit4]   2>   "name":"collection1",
   [junit4]   2>   "fromApi":"true",
   [junit4]   2>   "replicationFactor":"1",
   [junit4]   2>   "collection.configName":"testconfig",
   [junit4]   2>   "numShards":"1",
   [junit4]   2>   "stateFormat":"2",
   [junit4]   2>   "operation":"create"}
   [junit4]   2> 842540 INFO  (OverseerThreadFactory-1293-thread-2-processing-n:127.0.0.1:44324_solr) [n:127.0.0.1:44324_solr    ] o.a.s.c.OverseerCollectionMessageHandler OverseerCollectionMessageHandler.processMessage : create , {
   [junit4]   2>   "name":"collection1",
   [junit4]   2>   "fromApi":"true",
   [junit4]   2>   "replicationFactor":"1",
   [junit4]   2>   "collection.configName":"testconfig",
   [junit4]   2>   "numShards":"1",
   [junit4]   2>   "stateFormat":"2",
   [junit4]   2>   "operation":"create"}
   [junit4]   2> 842540 INFO  (OverseerThreadFactory-1293-thread-2-processing-n:127.0.0.1:44324_solr) [n:127.0.0.1:44324_solr    ] o.a.s.c.CreateCollectionCmd Create collection collection1
   [junit4]   2> 842541 INFO  (OverseerThreadFactory-1293-thread-2-processing-n:127.0.0.1:44324_solr) [n:127.0.0.1:44324_solr    ] o.a.s.c.OverseerCollectionMessageHandler creating collections conf node /collections/collection1 
   [junit4]   2> 842545 INFO  (zkCallback-508-thread-1-processing-n:127.0.0.1:44324_solr) [n:127.0.0.1:44324_solr    ] o.a.s.c.c.ZkStateReader A collections change: [WatchedEvent state:SyncConnected type:NodeChildrenChanged path:/collections], has occurred - updating...
   [junit4]   2> 842545 INFO  (OverseerThreadFactory-1293-thread-2-processing-n:127.0.0.1:44324_solr) [n:127.0.0.1:44324_solr    ] o.a.s.c.c.SolrZkClient makePath: /collections/collection1
   [junit4]   2> 842562 INFO  (zkCallback-508-thread-2-processing-n:127.0.0.1:44324_solr) [n:127.0.0.1:44324_solr    ] o.a.s.c.c.ZkStateReader A collections change: [WatchedEvent state:SyncConnected type:NodeChildrenChanged path:/collections], has occurred - updating...
   [junit4]   2> 842580 INFO  (OverseerStateUpdate-96575435014995971-127.0.0.1:44324_solr-n_0000000000) [n:127.0.0.1:44324_solr    ] o.a.s.c.Overseer processMessage: queueSize: 2, message = {
   [junit4]   2>   "name":"collection1",
   [junit4]   2>   "fromApi":"true",
   [junit4]   2>   "replicationFactor":"1",
   [junit4]   2>   "collection.configName":"testconfig",
   [junit4]   2>   "numShards":"1",
   [junit4]   2>   "stateFormat":"2",
   [junit4]   2>   "operation":"create"} current state version: 0
   [junit4]   2> 842580 INFO  (OverseerStateUpdate-96575435014995971-127.0.0.1:44324_solr-n_0000000000) [n:127.0.0.1:44324_solr    ] o.a.s.c.o.ClusterStateMutator building a new cName: collection1
   [junit4]   2> 842586 INFO  (OverseerStateUpdate-96575435014995971-127.0.0.1:44324_solr-n_0000000000) [n:127.0.0.1:44324_solr    ] o.a.s.c.o.ZkStateWriter going to create_collection /collections/collection1/state.json
   [junit4]   2> 842588 INFO  (OverseerStateUpdate-96575435014995971-127.0.0.1:44324_solr-n_0000000000) [n:127.0.0.1:44324_solr    ] o.a.s.c.Overseer processMessage: queueSize: 1, message = {
   [junit4]   2>   "name":"collection0",
   [junit4]   2>   "fromApi":"true",
   [junit4]   2>   "replicationFactor":"1",
   [junit4]   2>   "collection.configName":"testconfig",
   [junit4]   2>   "numShards":"1",
   [junit4]   2>   "stateFormat":"2",
   [junit4]   2>   "operation":"create"} current state version: 0
   [junit4]   2> 842589 INFO  (OverseerStateUpdate-96575435014995971-127.0.0.1:44324_solr-n_0000000000) [n:127.0.0.1:44324_solr    ] o.a.s.c.o.ClusterStateMutator building a new cName: collection0
   [junit4]   2> 842777 INFO  (OverseerStateUpdate-96575435014995971-127.0.0.1:44324_solr-n_0000000000) [n:127.0.0.1:44324_solr    ] o.a.s.c.o.ZkStateWriter going to create_collection /collections/collection0/state.json
   [junit4]   2> 842778 INFO  (OverseerThreadFactory-1293-thread-2-processing-n:127.0.0.1:44324_solr) [n:127.0.0.1:44324_solr    ] o.a.s.c.CreateCollectionCmd Creating SolrCores for new collection collection1, shardNames [shard1] , replicationFactor : 1
   [junit4]   2> 842778 INFO  (OverseerThreadFactory-1293-thread-2-processing-n:127.0.0.1:44324_solr) [n:127.0.0.1:44324_solr    ] o.a.s.c.CreateCollectionCmd Creating core collection1_shard1_replica1 as part of shard shard1 of collection collection1 on 127.0.0.1:44324_solr
   [junit4]   2> 842885 INFO  (OverseerThreadFactory-1293-thread-1-processing-n:127.0.0.1:44324_solr) [n:127.0.0.1:44324_solr    ] o.a.s.c.CreateCollectionCmd Creating SolrCores for new collection collection0, shardNames [shard1] , replicationFactor : 1
   [junit4]   2> 842885 INFO  (OverseerThreadFactory-1293-thread-1-processing-n:127.0.0.1:44324_solr) [n:127.0.0.1:44324_solr    ] o.a.s.c.CreateCollectionCmd Creating core collection0_shard1_replica1 as part of shard shard1 of collection collection0 on 127.0.0.1:44324_solr
   [junit4]   2> 842962 INFO  (qtp946450217-3437) [n:127.0.0.1:44324_solr    ] o.a.s.h.a.CoreAdminOperation core create command qt=/admin/cores&collection.configName=testconfig&name=collection0_shard1_replica1&action=CREATE&numShards=1&collection=collection0&shard=shard1&wt=javabin&version=2
   [junit4]   2> 842964 INFO  (qtp946450217-3437) [n:127.0.0.1:44324_solr    ] o.a.s.c.CoreDescriptor Created CoreDescriptor: {name=collection0_shard1_replica1, collection.configName=testconfig, config=solrconfig.xml, transient=false, schema=schema.xml, loadOnStartup=true, configSetProperties=configsetprops.json, collection=collection0, numShards=1, dataDir=data/, shard=shard1}
   [junit4]   2> 842964 INFO  (qtp946450217-3437) [n:127.0.0.1:44324_solr c:collection0 s:shard1  x:collection0_shard1_replica1] o.a.s.c.ZkController publishing state=down
   [junit4]   2> 842965 INFO  (qtp946450217-3437) [n:127.0.0.1:44324_solr c:collection0 s:shard1  x:collection0_shard1_replica1] o.a.s.c.ZkController Registering watch for collection collection0
   [junit4]   2> 842966 INFO  (qtp946450217-3437) [n:127.0.0.1:44324_solr c:collection0 s:shard1  x:collection0_shard1_replica1] o.a.s.c.c.ZkStateReader Add data for [collection0] ver [0]
   [junit4]   2> 842966 INFO  (qtp946450217-3437) [n:127.0.0.1:44324_solr c:collection0 s:shard1  x:collection0_shard1_replica1] o.a.s.c.ZkController look for our core node name
   [junit4]   2> 842978 INFO  (qtp946450217-3438) [n:127.0.0.1:44324_solr    ] o.a.s.h.a.CoreAdminOperation core create command qt=/admin/cores&collection.configName=testconfig&name=collection1_shard1_replica1&action=CREATE&numShards=1&collection=collection1&shard=shard1&wt=javabin&version=2
   [junit4]   2> 842978 INFO  (qtp946450217-3438) [n:127.0.0.1:44324_solr    ] o.a.s.c.CoreDescriptor Created CoreDescriptor: {name=collection1_shard1_replica1, collection.configName=testconfig, config=solrconfig.xml, transient=false, schema=schema.xml, loadOnStartup=true, configSetProperties=configsetprops.json, collection=collection1, numShards=1, dataDir=data/, shard=shard1}
   [junit4]   2> 842979 INFO  (qtp946450217-3438) [n:127.0.0.1:44324_solr c:collection1 s:shard1  x:collection1_shard1_replica1] o.a.s.c.ZkController publishing state=down
   [junit4]   2> 842980 INFO  (qtp946450217-3438) [n:127.0.0.1:44324_solr c:collection1 s:shard1  x:collection1_shard1_replica1] o.a.s.c.ZkController Registering watch for collection collection1
   [junit4]   2> 842980 INFO  (qtp946450217-3438) [n:127.0.0.1:44324_solr c:collection1 s:shard1  x:collection1_shard1_replica1] o.a.s.c.c.ZkStateReader Add data for [collection1] ver [0]
   [junit4]   2> 842980 INFO  (qtp946450217-3438) [n:127.0.0.1:44324_solr c:collection1 s:shard1  x:collection1_shard1_replica1] o.a.s.c.ZkController look for our core node name
   [junit4]   2> 842997 INFO  (OverseerStateUpdate-96575435014995971-127.0.0.1:44324_solr-n_0000000000) [n:127.0.0.1:44324_solr    ] o.a.s.c.Overseer processMessage: queueSize: 2, message = {
   [junit4]   2>   "core":"collection0_shard1_replica1",
   [junit4]   2>   "roles":null,
   [junit4]   2>   "base_url":"https://127.0.0.1:44324/solr",
   [junit4]   2>   "node_name":"127.0.0.1:44324_solr",
   [junit4]   2>   "numShards":"1",
   [junit4]   2>   "state":"down",
   [junit4]   2>   "shard":"shard1",
   [junit4]   2>   "collection":"collection0",
   [junit4]   2>   "operation":"state"} current state version: 0
   [junit4]   2> 842997 INFO  (OverseerStateUpdate-96575435014995971-127.0.0.1:44324_solr-n_0000000000) [n:127.0.0.1:44324_solr    ] o.a.s.c.o.ReplicaMutator Update state numShards=1 message={
   [junit4]   2>   "core":"collection0_shard1_replica1",
   [junit4]   2>   "roles":null,
   [junit4]   2>   "base_url":"https://127.0.0.1:44324/solr",
   [junit4]   2>   "node_name":"127.0.0.1:44324_solr",
   [junit4]   2>   "numShards":"1",
   [junit4]   2>   "state":"down",
   [junit4]   2>   "shard":"shard1",
   [junit4]   2>   "collection":"collection0",
   [junit4]   2>   "operation":"state"}
   [junit4]   2> 843002 INFO  (OverseerStateUpdate-96575435014995971-127.0.0.1:44324_solr-n_0000000000) [n:127.0.0.1:44324_solr    ] o.a.s.c.Overseer processMessage: queueSize: 2, message = {
   [junit4]   2>   "core":"collection1_shard1_replica1",
   [junit4]   2>   "roles":null,
   [junit4]   2>   "base_url":"https://127.0.0.1:44324/solr",
   [junit4]   2>   "node_name":"127.0.0.1:44324_solr",
   [junit4]   2>   "numShards":"1",
   [junit4]   2>   "state":"down",
   [junit4]   2>   "shard":"shard1",
   [junit4]   2>   "collection":"collection1",
   [junit4]   2>   "operation":"state"} current state version: 0
   [junit4]   2> 843003 INFO  (OverseerStateUpdate-96575435014995971-127.0.0.1:44324_solr-n_0000000000) [n:127.0.0.1:44324_solr    ] o.a.s.c.o.ReplicaMutator Update state numShards=1 message={
   [junit4]   2>   "core":"collection1_shard1_replica1",
   [junit4]   2>   "roles":null,
   [junit4]   2>   "base_url":"https://127.0.0.1:44324/solr",
   [junit4]   2>   "node_name":"127.0.0.1:44324_solr",
   [junit4]   2>   "numShards":"1",
   [junit4]   2>   "state":"down",
   [junit4]   2>   "shard":"shard1",
   [junit4]   2>   "collection":"collection1",
   [junit4]   2>   "operation":"state"}
   [junit4]   2> 843003 INFO  (OverseerStateUpdate-96575435014995971-127.0.0.1:44324_solr-n_0000000000) [n:127.0.0.1:44324_solr    ] o.a.s.c.o.ZkStateWriter going to update_collection /collections/collection0/state.json version: 0
   [junit4]   2> 843005 INFO  (zkCallback-508-thread-4-processing-n:127.0.0.1:44324_solr) [n:127.0.0.1:44324_solr    ] o.a.s.c.c.ZkStateReader A cluster state change: [WatchedEvent state:SyncConnected type:NodeDataChanged path:/collections/collection0/state.json] for collection [collection0] has occurred - updating... (live nodes size: [1])
   [junit4]   2> 843009 INFO  (zkCallback-508-thread-4-processing-n:127.0.0.1:44324_solr) [n:127.0.0.1:44324_solr    ] o.a.s.c.c.ZkStateReader Updating data for [collection0] from [0] to [1]
   [junit4]   2> 843178 INFO  (OverseerStateUpdate-96575435014995971-127.0.0.1:44324_solr-n_0000000000) [n:127.0.0.1:44324_solr    ] o.a.s.c.o.ZkStateWriter going to update_collection /collections/collection1/state.json version: 0
   [junit4]   2> 843179 INFO  (zkCallback-508-thread-3-processing-n:127.0.0.1:44324_solr) [n:127.0.0.1:44324_solr    ] o.a.s.c.c.ZkStateReader A cluster state change: [WatchedEvent state:SyncConnected type:NodeDataChanged path:/collections/collection1/state.json] for collection [collection1] has occurred - updating... (live nodes size: [1])
   [junit4]   2> 843179 INFO  (zkCallback-508-thread-3-processing-n:127.0.0.1:44324_solr) [n:127.0.0.1:44324_solr    ] o.a.s.c.c.ZkStateReader Updating data for [collection1] from [0] to [1]
   [junit4]   2> 844030 INFO  (qtp946450217-3437) [n:127.0.0.1:44324_solr c:collection0 s:shard1  x:collection0_shard1_replica1] o.a.s.c.ZkController waiting to find shard id in clusterstate for collection0_shard1_replica1
   [junit4]   2> 844030 INFO  (qtp946450217-3437) [n:127.0.0.1:44324_solr c:collection0 s:shard1  x:collection0_shard1_replica1] o.a.s.c.ZkController Check for collection zkNode:collection0
   [junit4]   2> 844030 INFO  (qtp946450217-3438) [n:127.0.0.1:44324_solr c:collection1 s:shard1  x:collection1_shard1_replica1] o.a.s.c.ZkController waiting to find shard id in clusterstate for collection1_shard1_replica1
   [junit4]   2> 844030 INFO  (qtp946450217-3438) [n:127.0.0.1:44324_solr c:collection1 s:shard1  x:collection1_shard1_replica1] o.a.s.c.ZkController Check for collection zkNode:collection1
   [junit4]   2> 844031 INFO  (qtp946450217-3438) [n:127.0.0.1:44324_solr c:collection1 s:shard1  x:collection1_shard1_replica1] o.a.s.c.ZkController Collection zkNode exists
   [junit4]   2> 844032 INFO  (qtp946450217-3438) [n:127.0.0.1:44324_solr c:collection1 s:shard1  x:collection1_shard1_replica1] o.a.s.c.c.ZkStateReader Load collection config from: [/collections/collection1]
   [junit4]   2> 844032 INFO  (qtp946450217-3437) [n:127.0.0.1:44324_solr c:collection0 s:shard1  x:collection0_shard1_replica1] o.a.s.c.ZkController Collection zkNode exists
   [junit4]   2> 844032 INFO  (qtp946450217-3437) [n:127.0.0.1:44324_solr c:collection0 s:shard1  x:collection0_shard1_replica1] o.a.s.c.c.ZkStateReader Load collection config from: [/collections/collection0]
   [junit4]   2> 844033 INFO  (qtp946450217-3438) [n:127.0.0.1:44324_solr c:collection1 s:shard1  x:collection1_shard1_replica1] o.a.s.c.c.ZkStateReader path=[/collections/collection1] [configName]=[testconfig] specified config exists in ZooKeeper
   [junit4]   2> 844033 INFO  (qtp946450217-3438) [n:127.0.0.1:44324_solr c:collection1 s:shard1  x:collection1_shard1_replica1] o.a.s.c.SolrResourceLoader new SolrResourceLoader for directory: '/x1/jenkins/jenkins-slave/workspace/Lucene-Solr-NightlyTests-master/checkout/solr/build/solr-core/test/J1/temp/solr.cloud.ConcurrentDeleteAndCreateCollectionTest_69C7C3B4D964326A-001/tempDir-001/node1/collection1_shard1_replica1'
   [junit4]   2> 844034 INFO  (qtp946450217-3438) [n:127.0.0.1:44324_solr c:collection1 s:shard1  x:collection1_shard1_replica1] o.a.s.c.SolrResourceLoader JNDI not configured for solr (NoInitialContextEx)
   [junit4]   2> 844034 INFO  (qtp946450217-3438) [n:127.0.0.1:44324_solr c:collection1 s:shard1  x:collection1_shard1_replica1] o.a.s.c.SolrResourceLoader solr home defaulted to 'solr/' (could not find system property or JNDI)
   [junit4]   2> 844034 INFO  (qtp946450217-3437) [n:127.0.0.1:44324_solr c:collection0 s:shard1  x:collection0_shard1_replica1] o.a.s.c.c.ZkStateReader path=[/collections/collection0] [configName]=[testconfig] specified config exists in ZooKeeper
   [junit4]   2> 844035 INFO  (qtp946450217-3437) [n:127.0.0.1:44324_solr c:collection0 s:shard1  x:collection0_shard1_replica1] o.a.s.c.SolrResourceLoader new SolrResourceLoader for directory: '/x1/jenkins/jenkins-slave/workspace/Lucene-Solr-NightlyTests-master/checkout/solr/build/solr-core/test/J1/temp/solr.cloud.ConcurrentDeleteAndCreateCollectionTest_69C7C3B4D964326A-001/tempDir-001/node1/collection0_shard1_replica1'
   [junit4]   2> 844035 INFO  (qtp946450217-3437) [n:127.0.0.1:44324_solr c:collection0 s:shard1  x:collection0_shard1_replica1] o.a.s.c.SolrResourceLoader JNDI not configured for solr (NoInitialContextEx)
   [junit4]   2> 844035 INFO  (qtp946450217-3437) [n:127.0.0.1:44324_solr c:collection0 s:shard1  x:collection0_shard1_replica1] o.a.s.c.SolrResourceLoader solr home defaulted to 'solr/' (could not find system property or JNDI)
   [junit4]   2> 844036 INFO  (qtp946450217-3437) [n:127.0.0.1:44324_solr c:collection0 s:shard1  x:collection0_shard1_replica1] o.a.s.c.Config loaded config solrconfig.xml with version 0 
   [junit4]   2> 844037 INFO  (qtp946450217-3438) [n:127.0.0.1:44324_solr c:collection1 s:shard1  x:collection1_shard1_replica1] o.a.s.c.Config loaded config solrconfig.xml with version 0 
   [junit4]   2> 844042 INFO  (qtp946450217-3437) [n:127.0.0.1:44324_solr c:collection0 s:shard1  x:collection0_shard1_replica1] o.a.s.c.SolrConfig current version of requestparams : -1
   [junit4]   2> 844043 INFO  (qtp946450217-3438) [n:127.0.0.1:44324_solr c:collection1 s:shard1  x:collection1_shard1_replica1] o.a.s.c.SolrConfig current version of requestparams : -1
   [junit4]   2> 844050 INFO  (qtp946450217-3437) [n:127.0.0.1:44324_solr c:collection0 s:shard1  x:collection0_shard1_replica1] o.a.s.c.SolrConfig Using Lucene MatchVersion: 7.0.0
   [junit4]   2> 844061 INFO  (qtp946450217-3438) [n:127.0.0.1:44324_solr c:collection1 s:shard1  x:collection1_shard1_replica1] o.a.s.c.SolrConfig Using Lucene MatchVersion: 7.0.0
   [junit4]   2> 844094 INFO  (qtp946450217-3437) [n:127.0.0.1:44324_solr c:collection0 s:shard1  x:collection0_shard1_replica1] o.a.s.c.SolrConfig Loaded SolrConfig: solrconfig.xml
   [junit4]   2> 844107 INFO  (qtp946450217-3438) [n:127.0.0.1:44324_solr c:collection1 s:shard1  x:collection1_shard1_replica1] o.a.s.c.SolrConfig Loaded SolrConfig: solrconfig.xml
   [junit4]   2> 844119 INFO  (qtp946450217-3437) [n:127.0.0.1:44324_solr c:collection0 s:shard1  x:collection0_shard1_replica1] o.a.s.s.IndexSchema [collection0_shard1_replica1] Schema name=minimal
   [junit4]   2> 844122 INFO  (qtp946450217-3437) [n:127.0.0.1:44324_solr c:collection0 s:shard1  x:collection0_shard1_replica1] o.a.s.s.IndexSchema unique key field: id
   [junit4]   2> 844124 INFO  (qtp946450217-3438) [n:127.0.0.1:44324_solr c:collection1 s:shard1  x:collection1_shard1_replica1] o.a.s.s.IndexSchema [collection1_shard1_replica1] Schema name=minimal
   [junit4]   2> 844126 INFO  (qtp946450217-3438) [n:127.0.0.1:44324_solr c:collection1 s:shard1  x:collection1_shard1_replica1] o.a.s.s.IndexSchema unique key field: id
   [junit4]   2> 844126 INFO  (qtp946450217-3437) [n:127.0.0.1:44324_solr c:collection0 s:shard1  x:collection0_shard1_replica1] o.a.s.c.ConfigSetProperties Did not find ConfigSet properties, assuming default properties: Can't find resource 'configsetprops.json' in classpath or '/configs/testconfig', cwd=/x1/jenkins/jenkins-slave/workspace/Lucene-Solr-NightlyTests-master/checkout/solr/build/solr-core/test/J1
   [junit4]   2> 844126 INFO  (qtp946450217-3437) [n:127.0.0.1:44324_solr c:collection0 s:shard1  x:collection0_shard1_replica1] o.a.s.c.CoreContainer Creating SolrCore 'collection0_shard1_replica1' using configuration from collection collection0
   [junit4]   2> 844127 INFO  (qtp946450217-3437) [n:127.0.0.1:44324_solr c:collection0 s:shard1 r:core_node1 x:collection0_shard1_replica1] o.a.s.c.SolrCore org.apache.solr.core.MockDirectoryFactory
   [junit4]   2> 844129 INFO  (qtp946450217-3437) [n:127.0.0.1:44324_solr c:collection0 s:shard1 r:core_node1 x:collection0_shard1_replica1] o.a.s.c.SolrCore [[collection0_shard1_replica1] ] Opening new SolrCore at [/x1/jenkins/jenkins-slave/workspace/Lucene-Solr-NightlyTests-master/checkout/solr/build/solr-core/test/J1/temp/solr.cloud.ConcurrentDeleteAndCreateCollectionTest_69C7C3B4D964326A-001/tempDir-001/node1/collection0_shard1_replica1], dataDir=[/x1/jenkins/jenkins-slave/workspace/Lucene-Solr-NightlyTests-master/checkout/solr/build/solr-core/test/J1/temp/solr.cloud.ConcurrentDeleteAndCreateCollectionTest_69C7C3B4D964326A-001/tempDir-001/node1/./collection0_shard1_replica1/data/]
   [junit4]   2> 844129 INFO  (qtp946450217-3437) [n:127.0.0.1:44324_solr c:collection0 s:shard1 r:core_node1 x:collection0_shard1_replica1] o.a.s.c.SolrCore JMX monitoring not detected for core: collection0_shard1_replica1
   [junit4]   2> 844129 INFO  (qtp946450217-3437) [n:127.0.0.1:44324_solr c:collection0 s:shard1 r:core_node1 x:collection0_shard1_replica1] o.a.s.c.CachingDirectoryFactory return new directory for /x1/jenkins/jenkins-slave/workspace/Lucene-Solr-NightlyTests-master/checkout/solr/build/solr-core/test/J1/temp/solr.cloud.ConcurrentDeleteAndCreateCollectionTest_69C7C3B4D964326A-001/tempDir-001/node1/./collection0_shard1_replica1/data/snapshot_metadata
   [junit4]   2> 844129 INFO  (qtp946450217-3437) [n:127.0.0.1:44324_solr c:collection0 s:shard1 r:core_node1 x:collection0_shard1_replica1] o.a.s.c.s.SolrSnapshotMetaDataManager Loading from snapshot metadata file...
   [junit4]   2> 844130 INFO  (qtp946450217-3437) [n:127.0.0.1:44324_solr c:collection0 s:shard1 r:core_node1 x:collection0_shard1_replica1] o.a.s.c.CachingDirectoryFactory return new directory for /x1/jenkins/jenkins-slave/workspace/Lucene-Solr-NightlyTests-master/checkout/solr/build/solr-core/test/J1/temp/solr.cloud.ConcurrentDeleteAndCreateCollectionTest_69C7C3B4D964326A-001/tempDir-001/node1/./collection0_shard1_replica1/data
   [junit4]   2> 844130 INFO  (qtp946450217-3437) [n:127.0.0.1:44324_solr c:collection0 s:shard1 r:core_node1 x:collection0_shard1_replica1] o.a.s.c.SolrCore New index directory detected: old=null new=/x1/jenkins/jenkins-slave/workspace/Lucene-Solr-NightlyTests-master/checkout/solr/build/solr-core/test/J1/temp/solr.cloud.ConcurrentDeleteAndCreateCollectionTest_69C7C3B4D964326A-001/tempDir-001/node1/./collection0_shard1_replica1/data/index/
   [junit4]   2> 844130 WARN  (qtp946450217-3437) [n:127.0.0.1:44324_solr c:collection0 s:shard1 r:core_node1 x:collection0_shard1_replica1] o.a.s.c.SolrCore [collection0_shard1_replica1] Solr index directory '/x1/jenkins/jenkins-slave/workspace/Lucene-Solr-NightlyTests-master/checkout/solr/build/solr-core/test/J1/temp/solr.cloud.ConcurrentDeleteAndCreateCollectionTest_69C7C3B4D964326A-001/tempDir-001/node1/./collection0_shard1_replica1/data/index' doesn't exist. Creating new index...
   [junit4]   2> 844130 INFO  (qtp946450217-3437) [n:127.0.0.1:44324_solr c:collection0 s:shard1 r:core_node1 x:collection0_shard1_replica1] o.a.s.c.CachingDirectoryFactory return new directory for /x1/jenkins/jenkins-sla

[...truncated too long message...]

p/solr.handler.TestSolrConfigHandlerCloud_69C7C3B4D964326A-001/shard-4-001/cores/collection1/data/snapshot_metadata
   [junit4]   2> 7363461 INFO  (Thread-87801) [n:127.0.0.1:49246_ c:collection1 s:shard1 r:core_node4 x:collection1] o.a.s.c.CachingDirectoryFactory looking to close /x1/jenkins/jenkins-slave/workspace/Lucene-Solr-NightlyTests-master/checkout/solr/build/solr-core/test/J0/temp/solr.handler.TestSolrConfigHandlerCloud_69C7C3B4D964326A-001/shard-4-001/cores/collection1/data [CachedDir<<refCount=0;path=/x1/jenkins/jenkins-slave/workspace/Lucene-Solr-NightlyTests-master/checkout/solr/build/solr-core/test/J0/temp/solr.handler.TestSolrConfigHandlerCloud_69C7C3B4D964326A-001/shard-4-001/cores/collection1/data;done=false>>]
   [junit4]   2> 7363461 INFO  (Thread-87801) [n:127.0.0.1:49246_ c:collection1 s:shard1 r:core_node4 x:collection1] o.a.s.c.CachingDirectoryFactory Closing directory, CoreContainer#isShutdown=true
   [junit4]   2> 7363461 INFO  (Thread-87801) [n:127.0.0.1:49246_ c:collection1 s:shard1 r:core_node4 x:collection1] o.a.s.c.CachingDirectoryFactory Closing directory: /x1/jenkins/jenkins-slave/workspace/Lucene-Solr-NightlyTests-master/checkout/solr/build/solr-core/test/J0/temp/solr.handler.TestSolrConfigHandlerCloud_69C7C3B4D964326A-001/shard-4-001/cores/collection1/data
   [junit4]   2> 7363467 INFO  (Thread-87801) [n:127.0.0.1:49246_ c:collection1 s:shard1 r:core_node4 x:collection1] o.a.s.c.CachingDirectoryFactory looking to close /x1/jenkins/jenkins-slave/workspace/Lucene-Solr-NightlyTests-master/checkout/solr/build/solr-core/test/J0/temp/solr.handler.TestSolrConfigHandlerCloud_69C7C3B4D964326A-001/shard-4-001/cores/collection1/data/index [CachedDir<<refCount=0;path=/x1/jenkins/jenkins-slave/workspace/Lucene-Solr-NightlyTests-master/checkout/solr/build/solr-core/test/J0/temp/solr.handler.TestSolrConfigHandlerCloud_69C7C3B4D964326A-001/shard-4-001/cores/collection1/data/index;done=false>>]
   [junit4]   2> 7363467 INFO  (Thread-87801) [n:127.0.0.1:49246_ c:collection1 s:shard1 r:core_node4 x:collection1] o.a.s.c.CachingDirectoryFactory Closing directory, CoreContainer#isShutdown=true
   [junit4]   2> 7363467 INFO  (Thread-87801) [n:127.0.0.1:49246_ c:collection1 s:shard1 r:core_node4 x:collection1] o.a.s.c.CachingDirectoryFactory Closing directory: /x1/jenkins/jenkins-slave/workspace/Lucene-Solr-NightlyTests-master/checkout/solr/build/solr-core/test/J0/temp/solr.handler.TestSolrConfigHandlerCloud_69C7C3B4D964326A-001/shard-4-001/cores/collection1/data/index
   [junit4]   2> 7363467 WARN  (Thread-87801) [n:127.0.0.1:49246_ c:collection1 s:shard1 r:core_node4 x:collection1] o.a.s.c.SolrCores Tried to remove core collection1 from pendingCoreOps and it wasn't there. 
   [junit4]   2> 7363467 WARN  (Thread-87801) [n:127.0.0.1:49246_ c:collection1 s:shard1 r:core_node4 x:collection1] o.a.s.c.ZkController listener throws error
   [junit4]   2> org.apache.solr.common.SolrException: Unable to reload core [collection1]
   [junit4]   2> 	at org.apache.solr.core.CoreContainer.reload(CoreContainer.java:968)
   [junit4]   2> 	at org.apache.solr.core.SolrCore.lambda$getConfListener$6(SolrCore.java:2602)
   [junit4]   2> 	at org.apache.solr.cloud.ZkController.lambda$fireEventListeners$3(ZkController.java:2443)
   [junit4]   2> 	at java.lang.Thread.run(Thread.java:745)
   [junit4]   2> Caused by: org.apache.solr.common.SolrException: Failed to load config name for collection:collection1 due to: 
   [junit4]   2> 	at org.apache.solr.core.SolrCore.<init>(SolrCore.java:833)
   [junit4]   2> 	at org.apache.solr.core.SolrCore.reload(SolrCore.java:503)
   [junit4]   2> 	at org.apache.solr.core.CoreContainer.reload(CoreContainer.java:962)
   [junit4]   2> 	... 3 more
   [junit4]   2> Caused by: org.apache.solr.common.SolrException: Failed to load config name for collection:collection1 due to: 
   [junit4]   2> 	at org.apache.solr.rest.ManagedResourceStorage.newStorageIO(ManagedResourceStorage.java:98)
   [junit4]   2> 	at org.apache.solr.core.SolrCore.initRestManager(SolrCore.java:2382)
   [junit4]   2> 	at org.apache.solr.core.SolrCore.<init>(SolrCore.java:809)
   [junit4]   2> 	... 5 more
   [junit4]   2> Caused by: org.apache.solr.common.SolrException: Error loading config name for collection collection1
   [junit4]   2> 	at org.apache.solr.common.cloud.ZkStateReader.readConfigName(ZkStateReader.java:197)
   [junit4]   2> 	at org.apache.solr.rest.ManagedResourceStorage.newStorageIO(ManagedResourceStorage.java:95)
   [junit4]   2> 	... 7 more
   [junit4]   2> Caused by: org.apache.zookeeper.KeeperException$SessionExpiredException: KeeperErrorCode = Session expired for /collections/collection1
   [junit4]   2> 	at org.apache.zookeeper.KeeperException.create(KeeperException.java:127)
   [junit4]   2> 	at org.apache.zookeeper.KeeperException.create(KeeperException.java:51)
   [junit4]   2> 	at org.apache.zookeeper.ZooKeeper.getData(ZooKeeper.java:1155)
   [junit4]   2> 	at org.apache.solr.common.cloud.SolrZkClient$7.execute(SolrZkClient.java:348)
   [junit4]   2> 	at org.apache.solr.common.cloud.SolrZkClient$7.execute(SolrZkClient.java:345)
   [junit4]   2> 	at org.apache.solr.common.cloud.ZkCmdExecutor.retryOperation(ZkCmdExecutor.java:60)
   [junit4]   2> 	at org.apache.solr.common.cloud.SolrZkClient.getData(SolrZkClient.java:345)
   [junit4]   2> 	at org.apache.solr.common.cloud.ZkStateReader.readConfigName(ZkStateReader.java:178)
   [junit4]   2> 	... 8 more
   [junit4]   2> NOTE: test params are: codec=Asserting(Lucene62): {}, docValues:{}, maxPointsInLeafNode=238, maxMBSortInHeap=5.750380438790871, sim=RandomSimilarity(queryNorm=false): {}, locale=ko, timezone=Africa/Niamey
   [junit4]   2> NOTE: Linux 3.13.0-85-generic amd64/Oracle Corporation 1.8.0_102 (64-bit)/cpus=4,threads=1,free=157937416,total=521142272
   [junit4]   2> NOTE: All tests run in this JVM: [TestSolrConfigHandler, TestLegacyNumericRangeQueryBuilder, AnalyticsQueryTest, ResourceLoaderTest, TestRandomCollapseQParserPlugin, TestDFISimilarityFactory, PeerSyncTest, SmileWriterTest, TestSortByMinMaxFunction, RankQueryTest, DateFieldTest, LeaderElectionIntegrationTest, TestFieldTypeCollectionResource, DistributedExpandComponentTest, QueryEqualityTest, TestJsonFacets, QueryElevationComponentTest, RestartWhileUpdatingTest, SpatialRPTFieldTypeTest, TestSolrDeletionPolicy2, SolrRequestParserTest, HdfsTlogReplayBufferedWhileIndexingTest, UUIDUpdateProcessorFallbackTest, OverseerTaskQueueTest, CacheHeaderTest, TestDocTermOrds, CachingDirectoryFactoryTest, TestSimpleQParserPlugin, TestSerializedLuceneMatchVersion, SolrCloudExampleTest, TestConfigSetProperties, TestReplicationHandler, CloudMLTQParserTest, SignatureUpdateProcessorFactoryTest, XsltUpdateRequestHandlerTest, TestOmitPositions, ConnectionManagerTest, HdfsNNFailoverTest, DistributedFacetPivotLongTailTest, TestStressRecovery, TestRangeQuery, SecurityConfHandlerTest, RequiredFieldsTest, DataDrivenBlockJoinTest, TestHdfsUpdateLog, DistribCursorPagingTest, TestImplicitCoreProperties, TestComponentsName, HttpPartitionTest, TestUniqueKeyFieldResource, BlockJoinFacetRandomTest, TestCrossCoreJoin, TestConfigSetsAPIExclusivity, DistributedSuggestComponentTest, OverseerModifyCollectionTest, TestPHPSerializedResponseWriter, TestAtomicUpdateErrorCases, TestHighlightDedupGrouping, StandardRequestHandlerTest, DateRangeFieldTest, CollectionsAPISolrJTest, TestReplicaProperties, TestSolr4Spatial, SyncSliceTest, AsyncCallRequestStatusResponseTest, ZkStateWriterTest, TestExactSharedStatsCache, TestScoreJoinQPNoScore, TestJoin, TestManagedSchema, TestDocumentBuilder, RegexBoostProcessorTest, TestHighFrequencyDictionaryFactory, SuggestComponentContextFilterQueryTest, TestUseDocValuesAsStored, JavabinLoaderTest, DeleteReplicaTest, TestJmxIntegration, TestExpandComponent, TestHdfsCloudBackupRestore, StressHdfsTest, TestSSLRandomization, AlternateDirectoryTest, DistributedQueueTest, TestDynamicFieldResource, TestSolrCoreProperties, HLLUtilTest, TestConfigReload, TestDistributedSearch, TestGraphTermsQParserPlugin, TestReqParamsAPI, ResponseHeaderTest, TestValueSourceCache, TestQuerySenderNoQuery, SaslZkACLProviderTest, TestFoldingMultitermQuery, PathHierarchyTokenizerFactoryTest, CursorPagingTest, TestSystemIdResolver, SpellingQueryConverterTest, ClusterStateTest, ZkNodePropsTest, SliceStateTest, SystemInfoHandlerTest, UUIDFieldTest, DistributedMLTComponentTest, TestRTGBase, DistributedIntervalFacetingTest, TestEmbeddedSolrServerConstructors, TestJettySolrRunner, ActionThrottleTest, AsyncMigrateRouteKeyTest, CdcrReplicationDistributedZkTest, TestStressLiveNodes, TestBackupRepositoryFactory, TestConfigOverlay, TestConfigSets, TestNRTOpen, RequestLoggingTest, TestBlobHandler, TestSolrConfigHandlerCloud]
   [junit4]   2> NOTE: download the large Jenkins line-docs file by running 'ant get-jenkins-line-docs' in the lucene directory.
   [junit4]   2> NOTE: reproduce with: ant test  -Dtestcase=TestSolrConfigHandlerCloud -Dtests.seed=69C7C3B4D964326A -Dtests.multiplier=2 -Dtests.nightly=true -Dtests.slow=true -Dtests.linedocsfile=/home/jenkins/jenkins-slave/workspace/Lucene-Solr-NightlyTests-master/test-data/enwiki.random.lines.txt -Dtests.locale=ko -Dtests.timezone=Africa/Niamey -Dtests.asserts=true -Dtests.file.encoding=US-ASCII
   [junit4] ERROR   0.00s J0 | TestSolrConfigHandlerCloud (suite) <<<
   [junit4]    > Throwable #1: java.lang.AssertionError: ObjectTracker found 8 object(s) that were not released!!! [MDCAwareThreadPoolExecutor, MockDirectoryWrapper, SolrCore, MockDirectoryWrapper, MDCAwareThreadPoolExecutor, SolrCore, MDCAwareThreadPoolExecutor, MockDirectoryWrapper]
   [junit4]    > 	at __randomizedtesting.SeedInfo.seed([69C7C3B4D964326A]:0)
   [junit4]    > 	at org.apache.solr.SolrTestCaseJ4.teardownTestCases(SolrTestCaseJ4.java:257)
   [junit4]    > 	at java.lang.Thread.run(Thread.java:745)
   [junit4] Completed [544/631 (6!)] on J0 in 114.89s, 1 test, 1 failure <<< FAILURES!

[...truncated 60452 lines...]



Mime
View raw message