lucene-dev mailing list archives

Site index · List index
Message view « Date » · « Thread »
Top « Date » · « Thread »
From Policeman Jenkins Server <jenk...@thetaphi.de>
Subject [JENKINS] Lucene-Solr-6.x-Solaris (64bit/jdk1.8.0) - Build # 384 - Still Unstable!
Date Sun, 11 Sep 2016 10:34:18 GMT
Build: http://jenkins.thetaphi.de/job/Lucene-Solr-6.x-Solaris/384/
Java: 64bit/jdk1.8.0 -XX:+UseCompressedOops -XX:+UseG1GC

1 tests failed.
FAILED:  org.apache.solr.security.BasicAuthIntegrationTest.testBasicAuth

Error Message:
IOException occured when talking to server at: https://127.0.0.1:43304/solr

Stack Trace:
org.apache.solr.client.solrj.SolrServerException: IOException occured when talking to server at: https://127.0.0.1:43304/solr
	at __randomizedtesting.SeedInfo.seed([8F3F45576DA23C1B:33513345C9F1BF61]:0)
	at org.apache.solr.client.solrj.impl.HttpSolrClient.executeMethod(HttpSolrClient.java:606)
	at org.apache.solr.client.solrj.impl.HttpSolrClient.request(HttpSolrClient.java:261)
	at org.apache.solr.client.solrj.impl.HttpSolrClient.request(HttpSolrClient.java:250)
	at org.apache.solr.client.solrj.SolrClient.request(SolrClient.java:1219)
	at org.apache.solr.security.BasicAuthIntegrationTest.testBasicAuth(BasicAuthIntegrationTest.java:158)
	at sun.reflect.NativeMethodAccessorImpl.invoke0(Native Method)
	at sun.reflect.NativeMethodAccessorImpl.invoke(NativeMethodAccessorImpl.java:62)
	at sun.reflect.DelegatingMethodAccessorImpl.invoke(DelegatingMethodAccessorImpl.java:43)
	at java.lang.reflect.Method.invoke(Method.java:498)
	at com.carrotsearch.randomizedtesting.RandomizedRunner.invoke(RandomizedRunner.java:1764)
	at com.carrotsearch.randomizedtesting.RandomizedRunner$8.evaluate(RandomizedRunner.java:871)
	at com.carrotsearch.randomizedtesting.RandomizedRunner$9.evaluate(RandomizedRunner.java:907)
	at com.carrotsearch.randomizedtesting.RandomizedRunner$10.evaluate(RandomizedRunner.java:921)
	at com.carrotsearch.randomizedtesting.rules.SystemPropertiesRestoreRule$1.evaluate(SystemPropertiesRestoreRule.java:57)
	at org.apache.lucene.util.TestRuleSetupTeardownChained$1.evaluate(TestRuleSetupTeardownChained.java:49)
	at org.apache.lucene.util.AbstractBeforeAfterRule$1.evaluate(AbstractBeforeAfterRule.java:45)
	at org.apache.lucene.util.TestRuleThreadAndTestName$1.evaluate(TestRuleThreadAndTestName.java:48)
	at org.apache.lucene.util.TestRuleIgnoreAfterMaxFailures$1.evaluate(TestRuleIgnoreAfterMaxFailures.java:64)
	at org.apache.lucene.util.TestRuleMarkFailure$1.evaluate(TestRuleMarkFailure.java:47)
	at com.carrotsearch.randomizedtesting.rules.StatementAdapter.evaluate(StatementAdapter.java:36)
	at com.carrotsearch.randomizedtesting.ThreadLeakControl$StatementRunner.run(ThreadLeakControl.java:367)
	at com.carrotsearch.randomizedtesting.ThreadLeakControl.forkTimeoutingTask(ThreadLeakControl.java:809)
	at com.carrotsearch.randomizedtesting.ThreadLeakControl$3.evaluate(ThreadLeakControl.java:460)
	at com.carrotsearch.randomizedtesting.RandomizedRunner.runSingleTest(RandomizedRunner.java:880)
	at com.carrotsearch.randomizedtesting.RandomizedRunner$5.evaluate(RandomizedRunner.java:781)
	at com.carrotsearch.randomizedtesting.RandomizedRunner$6.evaluate(RandomizedRunner.java:816)
	at com.carrotsearch.randomizedtesting.RandomizedRunner$7.evaluate(RandomizedRunner.java:827)
	at com.carrotsearch.randomizedtesting.rules.StatementAdapter.evaluate(StatementAdapter.java:36)
	at com.carrotsearch.randomizedtesting.rules.SystemPropertiesRestoreRule$1.evaluate(SystemPropertiesRestoreRule.java:57)
	at org.apache.lucene.util.AbstractBeforeAfterRule$1.evaluate(AbstractBeforeAfterRule.java:45)
	at com.carrotsearch.randomizedtesting.rules.StatementAdapter.evaluate(StatementAdapter.java:36)
	at org.apache.lucene.util.TestRuleStoreClassName$1.evaluate(TestRuleStoreClassName.java:41)
	at com.carrotsearch.randomizedtesting.rules.NoShadowingOrOverridesOnMethodsRule$1.evaluate(NoShadowingOrOverridesOnMethodsRule.java:40)
	at com.carrotsearch.randomizedtesting.rules.NoShadowingOrOverridesOnMethodsRule$1.evaluate(NoShadowingOrOverridesOnMethodsRule.java:40)
	at com.carrotsearch.randomizedtesting.rules.StatementAdapter.evaluate(StatementAdapter.java:36)
	at com.carrotsearch.randomizedtesting.rules.StatementAdapter.evaluate(StatementAdapter.java:36)
	at com.carrotsearch.randomizedtesting.rules.StatementAdapter.evaluate(StatementAdapter.java:36)
	at org.apache.lucene.util.TestRuleAssertionsRequired$1.evaluate(TestRuleAssertionsRequired.java:53)
	at org.apache.lucene.util.TestRuleMarkFailure$1.evaluate(TestRuleMarkFailure.java:47)
	at org.apache.lucene.util.TestRuleIgnoreAfterMaxFailures$1.evaluate(TestRuleIgnoreAfterMaxFailures.java:64)
	at org.apache.lucene.util.TestRuleIgnoreTestSuites$1.evaluate(TestRuleIgnoreTestSuites.java:54)
	at com.carrotsearch.randomizedtesting.rules.StatementAdapter.evaluate(StatementAdapter.java:36)
	at com.carrotsearch.randomizedtesting.ThreadLeakControl$StatementRunner.run(ThreadLeakControl.java:367)
	at java.lang.Thread.run(Thread.java:745)
Caused by: javax.net.ssl.SSLHandshakeException: sun.security.validator.ValidatorException: PKIX path building failed: sun.security.provider.certpath.SunCertPathBuilderException: unable to find valid certification path to requested target
	at sun.security.ssl.Alerts.getSSLException(Alerts.java:192)
	at sun.security.ssl.SSLSocketImpl.fatal(SSLSocketImpl.java:1949)
	at sun.security.ssl.Handshaker.fatalSE(Handshaker.java:302)
	at sun.security.ssl.Handshaker.fatalSE(Handshaker.java:296)
	at sun.security.ssl.ClientHandshaker.serverCertificate(ClientHandshaker.java:1509)
	at sun.security.ssl.ClientHandshaker.processMessage(ClientHandshaker.java:216)
	at sun.security.ssl.Handshaker.processLoop(Handshaker.java:979)
	at sun.security.ssl.Handshaker.process_record(Handshaker.java:914)
	at sun.security.ssl.SSLSocketImpl.readRecord(SSLSocketImpl.java:1062)
	at sun.security.ssl.SSLSocketImpl.performInitialHandshake(SSLSocketImpl.java:1375)
	at sun.security.ssl.SSLSocketImpl.startHandshake(SSLSocketImpl.java:1403)
	at sun.security.ssl.SSLSocketImpl.startHandshake(SSLSocketImpl.java:1387)
	at org.apache.http.conn.ssl.SSLSocketFactory.connectSocket(SSLSocketFactory.java:543)
	at org.apache.http.conn.ssl.SSLSocketFactory.connectSocket(SSLSocketFactory.java:409)
	at org.apache.http.impl.conn.DefaultClientConnectionOperator.openConnection(DefaultClientConnectionOperator.java:177)
	at org.apache.http.impl.conn.ManagedClientConnectionImpl.open(ManagedClientConnectionImpl.java:304)
	at org.apache.http.impl.client.DefaultRequestDirector.tryConnect(DefaultRequestDirector.java:611)
	at org.apache.http.impl.client.DefaultRequestDirector.execute(DefaultRequestDirector.java:446)
	at org.apache.http.impl.client.AbstractHttpClient.doExecute(AbstractHttpClient.java:882)
	at org.apache.http.impl.client.CloseableHttpClient.execute(CloseableHttpClient.java:82)
	at org.apache.http.impl.client.CloseableHttpClient.execute(CloseableHttpClient.java:107)
	at org.apache.http.impl.client.CloseableHttpClient.execute(CloseableHttpClient.java:55)
	at org.apache.solr.client.solrj.impl.HttpSolrClient.executeMethod(HttpSolrClient.java:497)
	... 43 more
Caused by: sun.security.validator.ValidatorException: PKIX path building failed: sun.security.provider.certpath.SunCertPathBuilderException: unable to find valid certification path to requested target
	at sun.security.validator.PKIXValidator.doBuild(PKIXValidator.java:387)
	at sun.security.validator.PKIXValidator.engineValidate(PKIXValidator.java:292)
	at sun.security.validator.Validator.validate(Validator.java:260)
	at sun.security.ssl.X509TrustManagerImpl.validate(X509TrustManagerImpl.java:324)
	at sun.security.ssl.X509TrustManagerImpl.checkTrusted(X509TrustManagerImpl.java:229)
	at sun.security.ssl.X509TrustManagerImpl.checkServerTrusted(X509TrustManagerImpl.java:124)
	at sun.security.ssl.ClientHandshaker.serverCertificate(ClientHandshaker.java:1491)
	... 61 more
Caused by: sun.security.provider.certpath.SunCertPathBuilderException: unable to find valid certification path to requested target
	at sun.security.provider.certpath.SunCertPathBuilder.build(SunCertPathBuilder.java:141)
	at sun.security.provider.certpath.SunCertPathBuilder.engineBuild(SunCertPathBuilder.java:126)
	at java.security.cert.CertPathBuilder.build(CertPathBuilder.java:280)
	at sun.security.validator.PKIXValidator.doBuild(PKIXValidator.java:382)
	... 67 more




Build Log:
[...truncated 12451 lines...]
   [junit4] Suite: org.apache.solr.security.BasicAuthIntegrationTest
   [junit4]   2> Creating dataDir: /export/home/jenkins/workspace/Lucene-Solr-6.x-Solaris/solr/build/solr-core/test/J1/temp/solr.security.BasicAuthIntegrationTest_8F3F45576DA23C1B-001/init-core-data-001
   [junit4]   2> 3012399 INFO  (SUITE-BasicAuthIntegrationTest-seed#[8F3F45576DA23C1B]-worker) [    ] o.a.s.SolrTestCaseJ4 Randomized ssl (true) and clientAuth (false) via: @org.apache.solr.util.RandomizeSSL(reason=, value=NaN, ssl=NaN, clientAuth=NaN)
   [junit4]   2> 3012400 INFO  (SUITE-BasicAuthIntegrationTest-seed#[8F3F45576DA23C1B]-worker) [    ] o.a.s.c.ZkTestServer STARTING ZK TEST SERVER
   [junit4]   2> 3012400 INFO  (Thread-10885) [    ] o.a.s.c.ZkTestServer client port:0.0.0.0/0.0.0.0:0
   [junit4]   2> 3012400 INFO  (Thread-10885) [    ] o.a.s.c.ZkTestServer Starting server
   [junit4]   2> 3012500 INFO  (SUITE-BasicAuthIntegrationTest-seed#[8F3F45576DA23C1B]-worker) [    ] o.a.s.c.ZkTestServer start zk server on port:63587
   [junit4]   2> 3012500 INFO  (SUITE-BasicAuthIntegrationTest-seed#[8F3F45576DA23C1B]-worker) [    ] o.a.s.c.c.SolrZkClient Using default ZkCredentialsProvider
   [junit4]   2> 3012500 INFO  (SUITE-BasicAuthIntegrationTest-seed#[8F3F45576DA23C1B]-worker) [    ] o.a.s.c.c.ConnectionManager Waiting for client to connect to ZooKeeper
   [junit4]   2> 3012503 INFO  (zkCallback-12224-thread-1) [    ] o.a.s.c.c.ConnectionManager Watcher org.apache.solr.common.cloud.ConnectionManager@4851dae6 name:ZooKeeperConnection Watcher:127.0.0.1:63587 got event WatchedEvent state:SyncConnected type:None path:null path:null type:None
   [junit4]   2> 3012503 INFO  (SUITE-BasicAuthIntegrationTest-seed#[8F3F45576DA23C1B]-worker) [    ] o.a.s.c.c.ConnectionManager Client is connected to ZooKeeper
   [junit4]   2> 3012503 INFO  (SUITE-BasicAuthIntegrationTest-seed#[8F3F45576DA23C1B]-worker) [    ] o.a.s.c.c.SolrZkClient Using default ZkACLProvider
   [junit4]   2> 3012503 INFO  (SUITE-BasicAuthIntegrationTest-seed#[8F3F45576DA23C1B]-worker) [    ] o.a.s.c.c.SolrZkClient makePath: /solr/solr.xml
   [junit4]   2> 3012507 INFO  (SUITE-BasicAuthIntegrationTest-seed#[8F3F45576DA23C1B]-worker) [    ] o.a.s.c.c.SolrZkClient makePath: /solr/clusterprops.json
   [junit4]   2> 3012515 INFO  (jetty-launcher-12223-thread-1) [    ] o.e.j.s.Server jetty-9.3.8.v20160314
   [junit4]   2> 3012516 INFO  (jetty-launcher-12223-thread-2) [    ] o.e.j.s.Server jetty-9.3.8.v20160314
   [junit4]   2> 3012516 INFO  (jetty-launcher-12223-thread-3) [    ] o.e.j.s.Server jetty-9.3.8.v20160314
   [junit4]   2> 3012520 INFO  (jetty-launcher-12223-thread-3) [    ] o.e.j.s.h.ContextHandler Started o.e.j.s.ServletContextHandler@29dfb9bc{/solr,null,AVAILABLE}
   [junit4]   2> 3012520 INFO  (jetty-launcher-12223-thread-1) [    ] o.e.j.s.h.ContextHandler Started o.e.j.s.ServletContextHandler@b6af4d8{/solr,null,AVAILABLE}
   [junit4]   2> 3012521 INFO  (jetty-launcher-12223-thread-2) [    ] o.e.j.s.h.ContextHandler Started o.e.j.s.ServletContextHandler@59fb3bce{/solr,null,AVAILABLE}
   [junit4]   2> 3012521 INFO  (jetty-launcher-12223-thread-1) [    ] o.e.j.s.ServerConnector Started ServerConnector@165d39ac{SSL,[ssl, http/1.1]}{127.0.0.1:43276}
   [junit4]   2> 3012521 INFO  (jetty-launcher-12223-thread-1) [    ] o.e.j.s.Server Started @3016473ms
   [junit4]   2> 3012522 INFO  (jetty-launcher-12223-thread-1) [    ] o.a.s.c.s.e.JettySolrRunner Jetty properties: {hostContext=/solr, hostPort=43276}
   [junit4]   2> 3012522 INFO  (jetty-launcher-12223-thread-1) [    ] o.a.s.s.SolrDispatchFilter SolrDispatchFilter.init(): sun.misc.Launcher$AppClassLoader@6d06d69c
   [junit4]   2> 3012522 INFO  (jetty-launcher-12223-thread-1) [    ] o.a.s.c.SolrResourceLoader new SolrResourceLoader for directory: '/export/home/jenkins/workspace/Lucene-Solr-6.x-Solaris/solr/build/solr-core/test/J1/temp/solr.security.BasicAuthIntegrationTest_8F3F45576DA23C1B-001/tempDir-001/node1'
   [junit4]   2> 3012522 INFO  (jetty-launcher-12223-thread-1) [    ] o.a.s.c.SolrResourceLoader JNDI not configured for solr (NoInitialContextEx)
   [junit4]   2> 3012522 INFO  (jetty-launcher-12223-thread-3) [    ] o.e.j.s.ServerConnector Started ServerConnector@3262441d{SSL,[ssl, http/1.1]}{127.0.0.1:49036}
   [junit4]   2> 3012522 INFO  (jetty-launcher-12223-thread-3) [    ] o.e.j.s.Server Started @3016474ms
   [junit4]   2> 3012522 INFO  (jetty-launcher-12223-thread-1) [    ] o.a.s.c.SolrResourceLoader solr home defaulted to 'solr/' (could not find system property or JNDI)
   [junit4]   2> 3012523 INFO  (jetty-launcher-12223-thread-1) [    ] o.a.s.c.c.SolrZkClient Using default ZkCredentialsProvider
   [junit4]   2> 3012523 INFO  (jetty-launcher-12223-thread-1) [    ] o.a.s.c.c.ConnectionManager Waiting for client to connect to ZooKeeper
   [junit4]   2> 3012524 INFO  (jetty-launcher-12223-thread-2) [    ] o.e.j.s.ServerConnector Started ServerConnector@212e528a{SSL,[ssl, http/1.1]}{127.0.0.1:43304}
   [junit4]   2> 3012524 INFO  (jetty-launcher-12223-thread-2) [    ] o.e.j.s.Server Started @3016475ms
   [junit4]   2> 3012524 INFO  (jetty-launcher-12223-thread-2) [    ] o.a.s.c.s.e.JettySolrRunner Jetty properties: {hostContext=/solr, hostPort=43304}
   [junit4]   2> 3012524 INFO  (jetty-launcher-12223-thread-2) [    ] o.a.s.s.SolrDispatchFilter SolrDispatchFilter.init(): sun.misc.Launcher$AppClassLoader@6d06d69c
   [junit4]   2> 3012524 INFO  (jetty-launcher-12223-thread-2) [    ] o.a.s.c.SolrResourceLoader new SolrResourceLoader for directory: '/export/home/jenkins/workspace/Lucene-Solr-6.x-Solaris/solr/build/solr-core/test/J1/temp/solr.security.BasicAuthIntegrationTest_8F3F45576DA23C1B-001/tempDir-001/node2'
   [junit4]   2> 3012524 INFO  (jetty-launcher-12223-thread-2) [    ] o.a.s.c.SolrResourceLoader JNDI not configured for solr (NoInitialContextEx)
   [junit4]   2> 3012524 INFO  (jetty-launcher-12223-thread-2) [    ] o.a.s.c.SolrResourceLoader solr home defaulted to 'solr/' (could not find system property or JNDI)
   [junit4]   2> 3012524 INFO  (jetty-launcher-12223-thread-2) [    ] o.a.s.c.c.SolrZkClient Using default ZkCredentialsProvider
   [junit4]   2> 3012522 INFO  (jetty-launcher-12223-thread-3) [    ] o.a.s.c.s.e.JettySolrRunner Jetty properties: {hostContext=/solr, hostPort=49036}
   [junit4]   2> 3012525 INFO  (jetty-launcher-12223-thread-3) [    ] o.a.s.s.SolrDispatchFilter SolrDispatchFilter.init(): sun.misc.Launcher$AppClassLoader@6d06d69c
   [junit4]   2> 3012525 INFO  (jetty-launcher-12223-thread-2) [    ] o.a.s.c.c.ConnectionManager Waiting for client to connect to ZooKeeper
   [junit4]   2> 3012525 INFO  (jetty-launcher-12223-thread-3) [    ] o.a.s.c.SolrResourceLoader new SolrResourceLoader for directory: '/export/home/jenkins/workspace/Lucene-Solr-6.x-Solaris/solr/build/solr-core/test/J1/temp/solr.security.BasicAuthIntegrationTest_8F3F45576DA23C1B-001/tempDir-001/node3'
   [junit4]   2> 3012525 INFO  (jetty-launcher-12223-thread-3) [    ] o.a.s.c.SolrResourceLoader JNDI not configured for solr (NoInitialContextEx)
   [junit4]   2> 3012525 INFO  (jetty-launcher-12223-thread-3) [    ] o.a.s.c.SolrResourceLoader solr home defaulted to 'solr/' (could not find system property or JNDI)
   [junit4]   2> 3012525 INFO  (jetty-launcher-12223-thread-3) [    ] o.a.s.c.c.SolrZkClient Using default ZkCredentialsProvider
   [junit4]   2> 3012526 INFO  (zkCallback-12225-thread-1) [    ] o.a.s.c.c.ConnectionManager Watcher org.apache.solr.common.cloud.ConnectionManager@1266e6a4 name:ZooKeeperConnection Watcher:127.0.0.1:63587/solr got event WatchedEvent state:SyncConnected type:None path:null path:null type:None
   [junit4]   2> 3012527 INFO  (jetty-launcher-12223-thread-3) [    ] o.a.s.c.c.ConnectionManager Waiting for client to connect to ZooKeeper
   [junit4]   2> 3012527 INFO  (jetty-launcher-12223-thread-1) [    ] o.a.s.c.c.ConnectionManager Client is connected to ZooKeeper
   [junit4]   2> 3012527 INFO  (jetty-launcher-12223-thread-1) [    ] o.a.s.c.c.SolrZkClient Using default ZkACLProvider
   [junit4]   2> 3012528 INFO  (zkCallback-12227-thread-1) [    ] o.a.s.c.c.ConnectionManager Watcher org.apache.solr.common.cloud.ConnectionManager@4531cfd1 name:ZooKeeperConnection Watcher:127.0.0.1:63587/solr got event WatchedEvent state:SyncConnected type:None path:null path:null type:None
   [junit4]   2> 3012528 INFO  (jetty-launcher-12223-thread-3) [    ] o.a.s.c.c.ConnectionManager Client is connected to ZooKeeper
   [junit4]   2> 3012528 INFO  (zkCallback-12226-thread-1) [    ] o.a.s.c.c.ConnectionManager Watcher org.apache.solr.common.cloud.ConnectionManager@7041b391 name:ZooKeeperConnection Watcher:127.0.0.1:63587/solr got event WatchedEvent state:SyncConnected type:None path:null path:null type:None
   [junit4]   2> 3012528 INFO  (jetty-launcher-12223-thread-3) [    ] o.a.s.c.c.SolrZkClient Using default ZkACLProvider
   [junit4]   2> 3012528 INFO  (jetty-launcher-12223-thread-2) [    ] o.a.s.c.c.ConnectionManager Client is connected to ZooKeeper
   [junit4]   2> 3012528 INFO  (jetty-launcher-12223-thread-2) [    ] o.a.s.c.c.SolrZkClient Using default ZkACLProvider
   [junit4]   2> 3012529 INFO  (jetty-launcher-12223-thread-1) [    ] o.a.s.s.SolrDispatchFilter solr.xml found in ZooKeeper. Loading...
   [junit4]   2> 3012529 INFO  (jetty-launcher-12223-thread-2) [    ] o.a.s.s.SolrDispatchFilter solr.xml found in ZooKeeper. Loading...
   [junit4]   2> 3012529 INFO  (jetty-launcher-12223-thread-3) [    ] o.a.s.s.SolrDispatchFilter solr.xml found in ZooKeeper. Loading...
   [junit4]   2> 3012534 WARN  (NIOServerCxn.Factory:0.0.0.0/0.0.0.0:0) [    ] o.a.z.s.NIOServerCnxn caught end of stream exception
   [junit4]   2> EndOfStreamException: Unable to read additional data from client sessionid 0x15718be92150003, likely client has closed socket
   [junit4]   2> 	at org.apache.zookeeper.server.NIOServerCnxn.doIO(NIOServerCnxn.java:228)
   [junit4]   2> 	at org.apache.zookeeper.server.NIOServerCnxnFactory.run(NIOServerCnxnFactory.java:208)
   [junit4]   2> 	at java.lang.Thread.run(Thread.java:745)
   [junit4]   2> 3012534 INFO  (jetty-launcher-12223-thread-3) [    ] o.a.s.c.CorePropertiesLocator Config-defined core root directory: /export/home/jenkins/workspace/Lucene-Solr-6.x-Solaris/solr/build/solr-core/test/J1/temp/solr.security.BasicAuthIntegrationTest_8F3F45576DA23C1B-001/tempDir-001/node3/.
   [junit4]   2> 3012534 WARN  (NIOServerCxn.Factory:0.0.0.0/0.0.0.0:0) [    ] o.a.z.s.NIOServerCnxn caught end of stream exception
   [junit4]   2> EndOfStreamException: Unable to read additional data from client sessionid 0x15718be92150002, likely client has closed socket
   [junit4]   2> 	at org.apache.zookeeper.server.NIOServerCnxn.doIO(NIOServerCnxn.java:228)
   [junit4]   2> 	at org.apache.zookeeper.server.NIOServerCnxnFactory.run(NIOServerCnxnFactory.java:208)
   [junit4]   2> 	at java.lang.Thread.run(Thread.java:745)
   [junit4]   2> 3012535 INFO  (jetty-launcher-12223-thread-1) [    ] o.a.s.c.CorePropertiesLocator Config-defined core root directory: /export/home/jenkins/workspace/Lucene-Solr-6.x-Solaris/solr/build/solr-core/test/J1/temp/solr.security.BasicAuthIntegrationTest_8F3F45576DA23C1B-001/tempDir-001/node1/.
   [junit4]   2> 3012535 INFO  (jetty-launcher-12223-thread-1) [    ] o.a.s.c.CoreContainer New CoreContainer 538319418
   [junit4]   2> 3012535 INFO  (jetty-launcher-12223-thread-3) [    ] o.a.s.c.CoreContainer New CoreContainer 2065160575
   [junit4]   2> 3012535 INFO  (jetty-launcher-12223-thread-2) [    ] o.a.s.c.CorePropertiesLocator Config-defined core root directory: /export/home/jenkins/workspace/Lucene-Solr-6.x-Solaris/solr/build/solr-core/test/J1/temp/solr.security.BasicAuthIntegrationTest_8F3F45576DA23C1B-001/tempDir-001/node2/.
   [junit4]   2> 3012535 INFO  (jetty-launcher-12223-thread-3) [    ] o.a.s.c.CoreContainer Loading cores into CoreContainer [instanceDir=/export/home/jenkins/workspace/Lucene-Solr-6.x-Solaris/solr/build/solr-core/test/J1/temp/solr.security.BasicAuthIntegrationTest_8F3F45576DA23C1B-001/tempDir-001/node3]
   [junit4]   2> 3012535 INFO  (jetty-launcher-12223-thread-2) [    ] o.a.s.c.CoreContainer New CoreContainer 1952180469
   [junit4]   2> 3012535 INFO  (jetty-launcher-12223-thread-2) [    ] o.a.s.c.CoreContainer Loading cores into CoreContainer [instanceDir=/export/home/jenkins/workspace/Lucene-Solr-6.x-Solaris/solr/build/solr-core/test/J1/temp/solr.security.BasicAuthIntegrationTest_8F3F45576DA23C1B-001/tempDir-001/node2]
   [junit4]   2> 3012535 WARN  (jetty-launcher-12223-thread-3) [    ] o.a.s.c.CoreContainer Couldn't add files from /export/home/jenkins/workspace/Lucene-Solr-6.x-Solaris/solr/build/solr-core/test/J1/temp/solr.security.BasicAuthIntegrationTest_8F3F45576DA23C1B-001/tempDir-001/node3/lib to classpath: /export/home/jenkins/workspace/Lucene-Solr-6.x-Solaris/solr/build/solr-core/test/J1/temp/solr.security.BasicAuthIntegrationTest_8F3F45576DA23C1B-001/tempDir-001/node3/lib
   [junit4]   2> 3012536 WARN  (jetty-launcher-12223-thread-2) [    ] o.a.s.c.CoreContainer Couldn't add files from /export/home/jenkins/workspace/Lucene-Solr-6.x-Solaris/solr/build/solr-core/test/J1/temp/solr.security.BasicAuthIntegrationTest_8F3F45576DA23C1B-001/tempDir-001/node2/lib to classpath: /export/home/jenkins/workspace/Lucene-Solr-6.x-Solaris/solr/build/solr-core/test/J1/temp/solr.security.BasicAuthIntegrationTest_8F3F45576DA23C1B-001/tempDir-001/node2/lib
   [junit4]   2> 3012535 INFO  (jetty-launcher-12223-thread-1) [    ] o.a.s.c.CoreContainer Loading cores into CoreContainer [instanceDir=/export/home/jenkins/workspace/Lucene-Solr-6.x-Solaris/solr/build/solr-core/test/J1/temp/solr.security.BasicAuthIntegrationTest_8F3F45576DA23C1B-001/tempDir-001/node1]
   [junit4]   2> 3012535 WARN  (NIOServerCxn.Factory:0.0.0.0/0.0.0.0:0) [    ] o.a.z.s.NIOServerCnxn caught end of stream exception
   [junit4]   2> EndOfStreamException: Unable to read additional data from client sessionid 0x15718be92150001, likely client has closed socket
   [junit4]   2> 	at org.apache.zookeeper.server.NIOServerCnxn.doIO(NIOServerCnxn.java:228)
   [junit4]   2> 	at org.apache.zookeeper.server.NIOServerCnxnFactory.run(NIOServerCnxnFactory.java:208)
   [junit4]   2> 	at java.lang.Thread.run(Thread.java:745)
   [junit4]   2> 3012536 INFO  (jetty-launcher-12223-thread-2) [    ] o.a.s.h.c.HttpShardHandlerFactory created with socketTimeout : 90000,urlScheme : https,connTimeout : 15000,maxConnectionsPerHost : 20,maxConnections : 10000,corePoolSize : 0,maximumPoolSize : 2147483647,maxThreadIdleTime : 5,sizeOfQueue : -1,fairnessPolicy : false,useRetries : false,connectionsEvictorSleepDelay : 5000,maxConnectionIdleTime : 40000,
   [junit4]   2> 3012536 WARN  (jetty-launcher-12223-thread-1) [    ] o.a.s.c.CoreContainer Couldn't add files from /export/home/jenkins/workspace/Lucene-Solr-6.x-Solaris/solr/build/solr-core/test/J1/temp/solr.security.BasicAuthIntegrationTest_8F3F45576DA23C1B-001/tempDir-001/node1/lib to classpath: /export/home/jenkins/workspace/Lucene-Solr-6.x-Solaris/solr/build/solr-core/test/J1/temp/solr.security.BasicAuthIntegrationTest_8F3F45576DA23C1B-001/tempDir-001/node1/lib
   [junit4]   2> 3012537 INFO  (jetty-launcher-12223-thread-1) [    ] o.a.s.h.c.HttpShardHandlerFactory created with socketTimeout : 90000,urlScheme : https,connTimeout : 15000,maxConnectionsPerHost : 20,maxConnections : 10000,corePoolSize : 0,maximumPoolSize : 2147483647,maxThreadIdleTime : 5,sizeOfQueue : -1,fairnessPolicy : false,useRetries : false,connectionsEvictorSleepDelay : 5000,maxConnectionIdleTime : 40000,
   [junit4]   2> 3012536 INFO  (jetty-launcher-12223-thread-3) [    ] o.a.s.h.c.HttpShardHandlerFactory created with socketTimeout : 90000,urlScheme : https,connTimeout : 15000,maxConnectionsPerHost : 20,maxConnections : 10000,corePoolSize : 0,maximumPoolSize : 2147483647,maxThreadIdleTime : 5,sizeOfQueue : -1,fairnessPolicy : false,useRetries : false,connectionsEvictorSleepDelay : 5000,maxConnectionIdleTime : 40000,
   [junit4]   2> 3012538 INFO  (jetty-launcher-12223-thread-1) [    ] o.a.s.u.UpdateShardHandler Creating UpdateShardHandler HTTP client with params: socketTimeout=340000&connTimeout=45000&retry=true
   [junit4]   2> 3012538 INFO  (jetty-launcher-12223-thread-2) [    ] o.a.s.u.UpdateShardHandler Creating UpdateShardHandler HTTP client with params: socketTimeout=340000&connTimeout=45000&retry=true
   [junit4]   2> 3012538 INFO  (jetty-launcher-12223-thread-3) [    ] o.a.s.u.UpdateShardHandler Creating UpdateShardHandler HTTP client with params: socketTimeout=340000&connTimeout=45000&retry=true
   [junit4]   2> 3012538 INFO  (jetty-launcher-12223-thread-1) [    ] o.a.s.l.LogWatcher SLF4J impl is org.slf4j.impl.Log4jLoggerFactory
   [junit4]   2> 3012539 INFO  (jetty-launcher-12223-thread-1) [    ] o.a.s.l.LogWatcher Registering Log Listener [Log4j (org.slf4j.impl.Log4jLoggerFactory)]
   [junit4]   2> 3012539 INFO  (jetty-launcher-12223-thread-1) [    ] o.a.s.c.ZkContainer Zookeeper client=127.0.0.1:63587/solr
   [junit4]   2> 3012539 INFO  (jetty-launcher-12223-thread-2) [    ] o.a.s.l.LogWatcher SLF4J impl is org.slf4j.impl.Log4jLoggerFactory
   [junit4]   2> 3012539 INFO  (jetty-launcher-12223-thread-2) [    ] o.a.s.l.LogWatcher Registering Log Listener [Log4j (org.slf4j.impl.Log4jLoggerFactory)]
   [junit4]   2> 3012539 INFO  (jetty-launcher-12223-thread-2) [    ] o.a.s.c.ZkContainer Zookeeper client=127.0.0.1:63587/solr
   [junit4]   2> 3012539 INFO  (jetty-launcher-12223-thread-2) [    ] o.a.s.c.ZkController zkHost includes chroot
   [junit4]   2> 3012539 INFO  (jetty-launcher-12223-thread-2) [    ] o.a.s.c.c.SolrZkClient Using default ZkCredentialsProvider
   [junit4]   2> 3012539 INFO  (jetty-launcher-12223-thread-1) [    ] o.a.s.c.ZkController zkHost includes chroot
   [junit4]   2> 3012539 INFO  (jetty-launcher-12223-thread-1) [    ] o.a.s.c.c.SolrZkClient Using default ZkCredentialsProvider
   [junit4]   2> 3012540 INFO  (jetty-launcher-12223-thread-2) [    ] o.a.s.c.c.ConnectionManager Waiting for client to connect to ZooKeeper
   [junit4]   2> 3012539 INFO  (jetty-launcher-12223-thread-3) [    ] o.a.s.l.LogWatcher SLF4J impl is org.slf4j.impl.Log4jLoggerFactory
   [junit4]   2> 3012540 INFO  (jetty-launcher-12223-thread-3) [    ] o.a.s.l.LogWatcher Registering Log Listener [Log4j (org.slf4j.impl.Log4jLoggerFactory)]
   [junit4]   2> 3012540 INFO  (jetty-launcher-12223-thread-3) [    ] o.a.s.c.ZkContainer Zookeeper client=127.0.0.1:63587/solr
   [junit4]   2> 3012540 INFO  (jetty-launcher-12223-thread-1) [    ] o.a.s.c.c.ConnectionManager Waiting for client to connect to ZooKeeper
   [junit4]   2> 3012540 INFO  (jetty-launcher-12223-thread-3) [    ] o.a.s.c.ZkController zkHost includes chroot
   [junit4]   2> 3012540 INFO  (jetty-launcher-12223-thread-3) [    ] o.a.s.c.c.SolrZkClient Using default ZkCredentialsProvider
   [junit4]   2> 3012541 INFO  (jetty-launcher-12223-thread-3) [    ] o.a.s.c.c.ConnectionManager Waiting for client to connect to ZooKeeper
   [junit4]   2> 3012542 INFO  (zkCallback-12234-thread-1) [    ] o.a.s.c.c.ConnectionManager Watcher org.apache.solr.common.cloud.ConnectionManager@1404c67f name:ZooKeeperConnection Watcher:127.0.0.1:63587 got event WatchedEvent state:SyncConnected type:None path:null path:null type:None
   [junit4]   2> 3012542 INFO  (jetty-launcher-12223-thread-2) [    ] o.a.s.c.c.ConnectionManager Client is connected to ZooKeeper
   [junit4]   2> 3012542 INFO  (jetty-launcher-12223-thread-2) [    ] o.a.s.c.c.SolrZkClient Using default ZkACLProvider
   [junit4]   2> 3012543 INFO  (zkCallback-12235-thread-1) [    ] o.a.s.c.c.ConnectionManager Watcher org.apache.solr.common.cloud.ConnectionManager@400e4875 name:ZooKeeperConnection Watcher:127.0.0.1:63587 got event WatchedEvent state:SyncConnected type:None path:null path:null type:None
   [junit4]   2> 3012543 INFO  (jetty-launcher-12223-thread-1) [    ] o.a.s.c.c.ConnectionManager Client is connected to ZooKeeper
   [junit4]   2> 3012543 INFO  (jetty-launcher-12223-thread-1) [    ] o.a.s.c.c.SolrZkClient Using default ZkACLProvider
   [junit4]   2> 3012543 INFO  (jetty-launcher-12223-thread-2) [n:127.0.0.1:43304_solr    ] o.a.s.c.ZkController Added new OnReconnect listener org.apache.solr.cloud.ZkController$$Lambda$109/1314998803@25b90ec2
   [junit4]   2> 3012544 INFO  (zkCallback-12236-thread-1) [    ] o.a.s.c.c.ConnectionManager Watcher org.apache.solr.common.cloud.ConnectionManager@359ce490 name:ZooKeeperConnection Watcher:127.0.0.1:63587 got event WatchedEvent state:SyncConnected type:None path:null path:null type:None
   [junit4]   2> 3012544 INFO  (jetty-launcher-12223-thread-3) [    ] o.a.s.c.c.ConnectionManager Client is connected to ZooKeeper
   [junit4]   2> 3012544 INFO  (jetty-launcher-12223-thread-2) [n:127.0.0.1:43304_solr    ] o.a.s.c.c.ConnectionManager Waiting for client to connect to ZooKeeper
   [junit4]   2> 3012544 INFO  (jetty-launcher-12223-thread-3) [    ] o.a.s.c.c.SolrZkClient Using default ZkACLProvider
   [junit4]   2> 3012545 INFO  (jetty-launcher-12223-thread-1) [n:127.0.0.1:43276_solr    ] o.a.s.c.ZkController Added new OnReconnect listener org.apache.solr.cloud.ZkController$$Lambda$109/1314998803@6760b644
   [junit4]   2> 3012546 INFO  (zkCallback-12237-thread-1-processing-n:127.0.0.1:43304_solr) [n:127.0.0.1:43304_solr    ] o.a.s.c.c.ConnectionManager Watcher org.apache.solr.common.cloud.ConnectionManager@39972cc8 name:ZooKeeperConnection Watcher:127.0.0.1:63587/solr got event WatchedEvent state:SyncConnected type:None path:null path:null type:None
   [junit4]   2> 3012546 INFO  (jetty-launcher-12223-thread-1) [n:127.0.0.1:43276_solr    ] o.a.s.c.c.ConnectionManager Waiting for client to connect to ZooKeeper
   [junit4]   2> 3012546 INFO  (jetty-launcher-12223-thread-2) [n:127.0.0.1:43304_solr    ] o.a.s.c.c.ConnectionManager Client is connected to ZooKeeper
   [junit4]   2> 3012546 INFO  (jetty-launcher-12223-thread-3) [n:127.0.0.1:49036_solr    ] o.a.s.c.ZkController Added new OnReconnect listener org.apache.solr.cloud.ZkController$$Lambda$109/1314998803@7671bfe4
   [junit4]   2> 3012547 INFO  (jetty-launcher-12223-thread-3) [n:127.0.0.1:49036_solr    ] o.a.s.c.c.ConnectionManager Waiting for client to connect to ZooKeeper
   [junit4]   2> 3012547 INFO  (zkCallback-12238-thread-1-processing-n:127.0.0.1:43276_solr) [n:127.0.0.1:43276_solr    ] o.a.s.c.c.ConnectionManager Watcher org.apache.solr.common.cloud.ConnectionManager@15ba62b name:ZooKeeperConnection Watcher:127.0.0.1:63587/solr got event WatchedEvent state:SyncConnected type:None path:null path:null type:None
   [junit4]   2> 3012547 INFO  (jetty-launcher-12223-thread-1) [n:127.0.0.1:43276_solr    ] o.a.s.c.c.ConnectionManager Client is connected to ZooKeeper
   [junit4]   2> 3012548 INFO  (jetty-launcher-12223-thread-2) [n:127.0.0.1:43304_solr    ] o.a.s.c.c.SolrZkClient makePath: /overseer/queue
   [junit4]   2> 3012548 INFO  (zkCallback-12239-thread-1-processing-n:127.0.0.1:49036_solr) [n:127.0.0.1:49036_solr    ] o.a.s.c.c.ConnectionManager Watcher org.apache.solr.common.cloud.ConnectionManager@7ebd73c name:ZooKeeperConnection Watcher:127.0.0.1:63587/solr got event WatchedEvent state:SyncConnected type:None path:null path:null type:None
   [junit4]   2> 3012548 INFO  (jetty-launcher-12223-thread-3) [n:127.0.0.1:49036_solr    ] o.a.s.c.c.ConnectionManager Client is connected to ZooKeeper
   [junit4]   2> 3012549 INFO  (jetty-launcher-12223-thread-1) [n:127.0.0.1:43276_solr    ] o.a.s.c.c.SolrZkClient makePath: /overseer/queue
   [junit4]   2> 3012550 INFO  (jetty-launcher-12223-thread-3) [n:127.0.0.1:49036_solr    ] o.a.s.c.c.SolrZkClient makePath: /overseer/queue
   [junit4]   2> 3012551 INFO  (jetty-launcher-12223-thread-2) [n:127.0.0.1:43304_solr    ] o.a.s.c.c.SolrZkClient makePath: /overseer/collection-queue-work
   [junit4]   2> 3012552 INFO  (jetty-launcher-12223-thread-1) [n:127.0.0.1:43276_solr    ] o.a.s.c.c.SolrZkClient makePath: /overseer/collection-queue-work
   [junit4]   2> 3012552 INFO  (jetty-launcher-12223-thread-3) [n:127.0.0.1:49036_solr    ] o.a.s.c.c.SolrZkClient makePath: /overseer/collection-queue-work
   [junit4]   2> 3012555 INFO  (jetty-launcher-12223-thread-2) [n:127.0.0.1:43304_solr    ] o.a.s.c.c.SolrZkClient makePath: /overseer/collection-map-running
   [junit4]   2> 3012556 INFO  (jetty-launcher-12223-thread-3) [n:127.0.0.1:49036_solr    ] o.a.s.c.c.SolrZkClient makePath: /overseer/collection-map-running
   [junit4]   2> 3012559 INFO  (jetty-launcher-12223-thread-2) [n:127.0.0.1:43304_solr    ] o.a.s.c.c.SolrZkClient makePath: /overseer/collection-map-completed
   [junit4]   2> 3012559 INFO  (jetty-launcher-12223-thread-3) [n:127.0.0.1:49036_solr    ] o.a.s.c.c.SolrZkClient makePath: /overseer/collection-map-completed
   [junit4]   2> 3012559 INFO  (jetty-launcher-12223-thread-1) [n:127.0.0.1:43276_solr    ] o.a.s.c.c.SolrZkClient makePath: /overseer/collection-map-completed
   [junit4]   2> 3012561 INFO  (jetty-launcher-12223-thread-3) [n:127.0.0.1:49036_solr    ] o.a.s.c.c.SolrZkClient makePath: /overseer/collection-map-failure
   [junit4]   2> 3012561 INFO  (jetty-launcher-12223-thread-2) [n:127.0.0.1:43304_solr    ] o.a.s.c.c.SolrZkClient makePath: /overseer/collection-map-failure
   [junit4]   2> 3012563 INFO  (jetty-launcher-12223-thread-1) [n:127.0.0.1:43276_solr    ] o.a.s.c.c.SolrZkClient makePath: /overseer/collection-map-failure
   [junit4]   2> 3012563 INFO  (jetty-launcher-12223-thread-2) [n:127.0.0.1:43304_solr    ] o.a.s.c.c.SolrZkClient makePath: /live_nodes
   [junit4]   2> 3012564 INFO  (jetty-launcher-12223-thread-3) [n:127.0.0.1:49036_solr    ] o.a.s.c.c.SolrZkClient makePath: /live_nodes
   [junit4]   2> 3012565 INFO  (jetty-launcher-12223-thread-3) [n:127.0.0.1:49036_solr    ] o.a.s.c.c.SolrZkClient makePath: /collections
   [junit4]   2> 3012566 INFO  (jetty-launcher-12223-thread-2) [n:127.0.0.1:43304_solr    ] o.a.s.c.c.SolrZkClient makePath: /collections
   [junit4]   2> 3012566 INFO  (jetty-launcher-12223-thread-1) [n:127.0.0.1:43276_solr    ] o.a.s.c.c.SolrZkClient makePath: /collections
   [junit4]   2> 3012567 INFO  (jetty-launcher-12223-thread-2) [n:127.0.0.1:43304_solr    ] o.a.s.c.c.SolrZkClient makePath: /aliases.json
   [junit4]   2> 3012567 INFO  (jetty-launcher-12223-thread-3) [n:127.0.0.1:49036_solr    ] o.a.s.c.c.SolrZkClient makePath: /aliases.json
   [junit4]   2> 3012569 INFO  (jetty-launcher-12223-thread-2) [n:127.0.0.1:43304_solr    ] o.a.s.c.c.SolrZkClient makePath: /clusterstate.json
   [junit4]   2> 3012569 INFO  (jetty-launcher-12223-thread-3) [n:127.0.0.1:49036_solr    ] o.a.s.c.c.SolrZkClient makePath: /clusterstate.json
   [junit4]   2> 3012569 INFO  (jetty-launcher-12223-thread-1) [n:127.0.0.1:43276_solr    ] o.a.s.c.c.SolrZkClient makePath: /clusterstate.json
   [junit4]   2> 3012571 INFO  (jetty-launcher-12223-thread-3) [n:127.0.0.1:49036_solr    ] o.a.s.c.c.SolrZkClient makePath: /security.json
   [junit4]   2> 3012571 INFO  (jetty-launcher-12223-thread-2) [n:127.0.0.1:43304_solr    ] o.a.s.c.c.SolrZkClient makePath: /security.json
   [junit4]   2> 3012572 INFO  (jetty-launcher-12223-thread-2) [n:127.0.0.1:43304_solr    ] o.a.s.c.c.ZkStateReader Updating cluster state from ZooKeeper... 
   [junit4]   2> 3012572 INFO  (jetty-launcher-12223-thread-1) [n:127.0.0.1:43276_solr    ] o.a.s.c.c.ZkStateReader Updating cluster state from ZooKeeper... 
   [junit4]   2> 3012572 INFO  (jetty-launcher-12223-thread-3) [n:127.0.0.1:49036_solr    ] o.a.s.c.c.ZkStateReader Updating cluster state from ZooKeeper... 
   [junit4]   2> 3012573 INFO  (jetty-launcher-12223-thread-2) [n:127.0.0.1:43304_solr    ] o.a.s.c.c.ZkStateReader Loaded cluster properties: {urlScheme=https}
   [junit4]   2> 3012573 INFO  (jetty-launcher-12223-thread-2) [n:127.0.0.1:43304_solr    ] o.a.s.c.c.ZkStateReader Updated live nodes from ZooKeeper... (0) -> (0)
   [junit4]   2> 3012573 INFO  (jetty-launcher-12223-thread-1) [n:127.0.0.1:43276_solr    ] o.a.s.c.c.ZkStateReader Loaded cluster properties: {urlScheme=https}
   [junit4]   2> 3012574 INFO  (jetty-launcher-12223-thread-3) [n:127.0.0.1:49036_solr    ] o.a.s.c.c.ZkStateReader Loaded cluster properties: {urlScheme=https}
   [junit4]   2> 3012574 INFO  (jetty-launcher-12223-thread-1) [n:127.0.0.1:43276_solr    ] o.a.s.c.c.ZkStateReader Updated live nodes from ZooKeeper... (0) -> (0)
   [junit4]   2> 3012574 INFO  (jetty-launcher-12223-thread-3) [n:127.0.0.1:49036_solr    ] o.a.s.c.c.ZkStateReader Updated live nodes from ZooKeeper... (0) -> (0)
   [junit4]   2> 3012577 INFO  (jetty-launcher-12223-thread-2) [n:127.0.0.1:43304_solr    ] o.a.s.c.c.SolrZkClient makePath: /overseer_elect
   [junit4]   2> 3012579 INFO  (jetty-launcher-12223-thread-2) [n:127.0.0.1:43304_solr    ] o.a.s.c.c.SolrZkClient makePath: /overseer_elect/election
   [junit4]   2> 3012579 INFO  (jetty-launcher-12223-thread-3) [n:127.0.0.1:49036_solr    ] o.a.s.c.c.SolrZkClient makePath: /overseer_elect/election
   [junit4]   2> 3012581 INFO  (jetty-launcher-12223-thread-3) [n:127.0.0.1:49036_solr    ] o.a.s.c.Overseer Overseer (id=null) closing
   [junit4]   2> 3012581 INFO  (jetty-launcher-12223-thread-1) [n:127.0.0.1:43276_solr    ] o.a.s.c.Overseer Overseer (id=null) closing
   [junit4]   2> 3012581 INFO  (jetty-launcher-12223-thread-2) [n:127.0.0.1:43304_solr    ] o.a.s.c.Overseer Overseer (id=null) closing
   [junit4]   2> 3012582 INFO  (jetty-launcher-12223-thread-1) [n:127.0.0.1:43276_solr    ] o.a.s.c.LeaderElector Joined leadership election with path: /overseer_elect/election/96573123785457672-127.0.0.1:43276_solr-n_0000000002
   [junit4]   2> 3012582 INFO  (jetty-launcher-12223-thread-3) [n:127.0.0.1:49036_solr    ] o.a.s.c.LeaderElector Joined leadership election with path: /overseer_elect/election/96573123785457673-127.0.0.1:49036_solr-n_0000000000
   [junit4]   2> 3012582 INFO  (jetty-launcher-12223-thread-2) [n:127.0.0.1:43304_solr    ] o.a.s.c.LeaderElector Joined leadership election with path: /overseer_elect/election/96573123785457671-127.0.0.1:43304_solr-n_0000000001
   [junit4]   2> 3012582 INFO  (jetty-launcher-12223-thread-3) [n:127.0.0.1:49036_solr    ] o.a.s.c.OverseerElectionContext I am going to be the leader 127.0.0.1:49036_solr
   [junit4]   2> 3012583 INFO  (jetty-launcher-12223-thread-3) [n:127.0.0.1:49036_solr    ] o.a.s.c.c.SolrZkClient makePath: /overseer_elect/leader
   [junit4]   2> 3012583 INFO  (jetty-launcher-12223-thread-2) [n:127.0.0.1:43304_solr    ] o.a.s.c.LeaderElector Watching path /overseer_elect/election/96573123785457673-127.0.0.1:49036_solr-n_0000000000 to know if I could be the leader
   [junit4]   2> 3012584 INFO  (jetty-launcher-12223-thread-1) [n:127.0.0.1:43276_solr    ] o.a.s.c.LeaderElector Watching path /overseer_elect/election/96573123785457671-127.0.0.1:43304_solr-n_0000000001 to know if I could be the leader
   [junit4]   2> 3012584 INFO  (jetty-launcher-12223-thread-2) [n:127.0.0.1:43304_solr    ] o.a.s.c.ZkController Register node as live in ZooKeeper:/live_nodes/127.0.0.1:43304_solr
   [junit4]   2> 3012584 INFO  (jetty-launcher-12223-thread-2) [n:127.0.0.1:43304_solr    ] o.a.s.c.c.SolrZkClient makePath: /live_nodes/127.0.0.1:43304_solr
   [junit4]   2> 3012584 INFO  (jetty-launcher-12223-thread-1) [n:127.0.0.1:43276_solr    ] o.a.s.c.ZkController Register node as live in ZooKeeper:/live_nodes/127.0.0.1:43276_solr
   [junit4]   2> 3012584 INFO  (jetty-launcher-12223-thread-1) [n:127.0.0.1:43276_solr    ] o.a.s.c.c.SolrZkClient makePath: /live_nodes/127.0.0.1:43276_solr
   [junit4]   2> 3012585 INFO  (jetty-launcher-12223-thread-3) [n:127.0.0.1:49036_solr    ] o.a.s.c.Overseer Overseer (id=96573123785457673-127.0.0.1:49036_solr-n_0000000000) starting
   [junit4]   2> 3012585 INFO  (zkCallback-12238-thread-1-processing-n:127.0.0.1:43276_solr) [n:127.0.0.1:43276_solr    ] o.a.s.c.c.ZkStateReader A live node change: [WatchedEvent state:SyncConnected type:NodeChildrenChanged path:/live_nodes], has occurred - updating... (live nodes size: [0])
   [junit4]   2> 3012586 INFO  (zkCallback-12237-thread-1-processing-n:127.0.0.1:43304_solr) [n:127.0.0.1:43304_solr    ] o.a.s.c.c.ZkStateReader A live node change: [WatchedEvent state:SyncConnected type:NodeChildrenChanged path:/live_nodes], has occurred - updating... (live nodes size: [0])
   [junit4]   2> 3012585 INFO  (zkCallback-12239-thread-1-processing-n:127.0.0.1:49036_solr) [n:127.0.0.1:49036_solr    ] o.a.s.c.c.ZkStateReader A live node change: [WatchedEvent state:SyncConnected type:NodeChildrenChanged path:/live_nodes], has occurred - updating... (live nodes size: [0])
   [junit4]   2> 3012588 INFO  (zkCallback-12237-thread-1-processing-n:127.0.0.1:43304_solr) [n:127.0.0.1:43304_solr    ] o.a.s.c.c.ZkStateReader Updated live nodes from ZooKeeper... (0) -> (1)
   [junit4]   2> 3012588 INFO  (zkCallback-12238-thread-1-processing-n:127.0.0.1:43276_solr) [n:127.0.0.1:43276_solr    ] o.a.s.c.c.ZkStateReader Updated live nodes from ZooKeeper... (0) -> (1)
   [junit4]   2> 3012589 INFO  (zkCallback-12238-thread-2-processing-n:127.0.0.1:43276_solr) [n:127.0.0.1:43276_solr    ] o.a.s.c.c.ZkStateReader A live node change: [WatchedEvent state:SyncConnected type:NodeChildrenChanged path:/live_nodes], has occurred - updating... (live nodes size: [1])
   [junit4]   2> 3012589 INFO  (zkCallback-12237-thread-2-processing-n:127.0.0.1:43304_solr) [n:127.0.0.1:43304_solr    ] o.a.s.c.c.ZkStateReader A live node change: [WatchedEvent state:SyncConnected type:NodeChildrenChanged path:/live_nodes], has occurred - updating... (live nodes size: [1])
   [junit4]   2> 3012590 INFO  (zkCallback-12239-thread-1-processing-n:127.0.0.1:49036_solr) [n:127.0.0.1:49036_solr    ] o.a.s.c.c.ZkStateReader Updated live nodes from ZooKeeper... (0) -> (2)
   [junit4]   2> 3012590 INFO  (zkCallback-12238-thread-2-processing-n:127.0.0.1:43276_solr) [n:127.0.0.1:43276_solr    ] o.a.s.c.c.ZkStateReader Updated live nodes from ZooKeeper... (1) -> (2)
   [junit4]   2> 3012591 INFO  (zkCallback-12237-thread-2-processing-n:127.0.0.1:43304_solr) [n:127.0.0.1:43304_solr    ] o.a.s.c.c.ZkStateReader Updated live nodes from ZooKeeper... (1) -> (2)
   [junit4]   2> 3012591 INFO  (jetty-launcher-12223-thread-3) [n:127.0.0.1:49036_solr    ] o.a.s.c.c.SolrZkClient makePath: /overseer/queue-work
   [junit4]   2> 3012600 INFO  (jetty-launcher-12223-thread-3) [n:127.0.0.1:49036_solr    ] o.a.s.c.OverseerAutoReplicaFailoverThread Starting OverseerAutoReplicaFailoverThread autoReplicaFailoverWorkLoopDelay=10000 autoReplicaFailoverWaitAfterExpiration=30000 autoReplicaFailoverBadNodeExpiration=60000
   [junit4]   2> 3012601 INFO  (OverseerCollectionConfigSetProcessor-96573123785457673-127.0.0.1:49036_solr-n_0000000000) [n:127.0.0.1:49036_solr    ] o.a.s.c.OverseerTaskProcessor Process current queue of overseer operations
   [junit4]   2> 3012601 INFO  (jetty-launcher-12223-thread-3) [n:127.0.0.1:49036_solr    ] o.a.s.c.ZkController Publish node=127.0.0.1:49036_solr as DOWN
   [junit4]   2> 3012603 INFO  (jetty-launcher-12223-thread-3) [n:127.0.0.1:49036_solr    ] o.a.s.c.ZkController Register node as live in ZooKeeper:/live_nodes/127.0.0.1:49036_solr
   [junit4]   2> 3012603 INFO  (OverseerStateUpdate-96573123785457673-127.0.0.1:49036_solr-n_0000000000) [n:127.0.0.1:49036_solr    ] o.a.s.c.Overseer Starting to work on the main queue
   [junit4]   2> 3012603 INFO  (jetty-launcher-12223-thread-3) [n:127.0.0.1:49036_solr    ] o.a.s.c.c.SolrZkClient makePath: /live_nodes/127.0.0.1:49036_solr
   [junit4]   2> 3012605 INFO  (zkCallback-12238-thread-2-processing-n:127.0.0.1:43276_solr) [n:127.0.0.1:43276_solr    ] o.a.s.c.c.ZkStateReader A live node change: [WatchedEvent state:SyncConnected type:NodeChildrenChanged path:/live_nodes], has occurred - updating... (live nodes size: [2])
   [junit4]   2> 3012605 INFO  (zkCallback-12239-thread-1-processing-n:127.0.0.1:49036_solr) [n:127.0.0.1:49036_solr    ] o.a.s.c.c.ZkStateReader A live node change: [WatchedEvent state:SyncConnected type:NodeChildrenChanged path:/live_nodes], has occurred - updating... (live nodes size: [2])
   [junit4]   2> 3012605 INFO  (zkCallback-12237-thread-2-processing-n:127.0.0.1:43304_solr) [n:127.0.0.1:43304_solr    ] o.a.s.c.c.ZkStateReader A live node change: [WatchedEvent state:SyncConnected type:NodeChildrenChanged path:/live_nodes], has occurred - updating... (live nodes size: [2])
   [junit4]   2> 3012606 INFO  (OverseerStateUpdate-96573123785457673-127.0.0.1:49036_solr-n_0000000000) [n:127.0.0.1:49036_solr    ] o.a.s.c.c.ZkStateReader Updated live nodes from ZooKeeper... (2) -> (3)
   [junit4]   2> 3012606 INFO  (zkCallback-12239-thread-1-processing-n:127.0.0.1:49036_solr) [n:127.0.0.1:49036_solr    ] o.a.s.c.c.ZkStateReader Updated live nodes from ZooKeeper... (3) -> (3)
   [junit4]   2> 3012606 INFO  (zkCallback-12237-thread-2-processing-n:127.0.0.1:43304_solr) [n:127.0.0.1:43304_solr    ] o.a.s.c.c.ZkStateReader Updated live nodes from ZooKeeper... (2) -> (3)
   [junit4]   2> 3012606 INFO  (zkCallback-12238-thread-2-processing-n:127.0.0.1:43276_solr) [n:127.0.0.1:43276_solr    ] o.a.s.c.c.ZkStateReader Updated live nodes from ZooKeeper... (2) -> (3)
   [junit4]   2> 3012613 INFO  (OverseerStateUpdate-96573123785457673-127.0.0.1:49036_solr-n_0000000000) [n:127.0.0.1:49036_solr    ] o.a.s.c.Overseer processMessage: queueSize: 1, message = {
   [junit4]   2>   "operation":"downnode",
   [junit4]   2>   "node_name":"127.0.0.1:49036_solr"} current state version: 0
   [junit4]   2> 3012613 INFO  (OverseerStateUpdate-96573123785457673-127.0.0.1:49036_solr-n_0000000000) [n:127.0.0.1:49036_solr    ] o.a.s.c.o.NodeMutator DownNode state invoked for node: 127.0.0.1:49036_solr
   [junit4]   2> 3012623 INFO  (jetty-launcher-12223-thread-1) [n:127.0.0.1:43276_solr    ] o.a.s.c.CoreContainer Security conf doesn't exist. Skipping setup for authorization module.
   [junit4]   2> 3012624 INFO  (jetty-launcher-12223-thread-1) [n:127.0.0.1:43276_solr    ] o.a.s.c.CoreContainer No authentication plugin used.
   [junit4]   2> 3012624 INFO  (jetty-launcher-12223-thread-1) [n:127.0.0.1:43276_solr    ] o.a.s.c.CorePropertiesLocator Looking for core definitions underneath /export/home/jenkins/workspace/Lucene-Solr-6.x-Solaris/solr/build/solr-core/test/J1/temp/solr.security.BasicAuthIntegrationTest_8F3F45576DA23C1B-001/tempDir-001/node1/.
   [junit4]   2> 3012625 INFO  (jetty-launcher-12223-thread-1) [n:127.0.0.1:43276_solr    ] o.a.s.c.CorePropertiesLocator Found 0 core definitions
   [junit4]   2> 3012626 INFO  (jetty-launcher-12223-thread-1) [n:127.0.0.1:43276_solr    ] o.a.s.s.SolrDispatchFilter user.dir=/export/home/jenkins/workspace/Lucene-Solr-6.x-Solaris/solr/build/solr-core/test/J1
   [junit4]   2> 3012626 INFO  (jetty-launcher-12223-thread-1) [n:127.0.0.1:43276_solr    ] o.a.s.s.SolrDispatchFilter SolrDispatchFilter.init() done
   [junit4]   2> 3012636 INFO  (jetty-launcher-12223-thread-2) [n:127.0.0.1:43304_solr    ] o.a.s.c.CoreContainer Security conf doesn't exist. Skipping setup for authorization module.
   [junit4]   2> 3012636 INFO  (jetty-launcher-12223-thread-2) [n:127.0.0.1:43304_solr    ] o.a.s.c.CoreContainer No authentication plugin used.
   [junit4]   2> 3012637 INFO  (jetty-launcher-12223-thread-2) [n:127.0.0.1:43304_solr    ] o.a.s.c.CorePropertiesLocator Looking for core definitions underneath /export/home/jenkins/workspace/Lucene-Solr-6.x-Solaris/solr/build/solr-core/test/J1/temp/solr.security.BasicAuthIntegrationTest_8F3F45576DA23C1B-001/tempDir-001/node2/.
   [junit4]   2> 3012638 INFO  (jetty-launcher-12223-thread-2) [n:127.0.0.1:43304_solr    ] o.a.s.c.CorePropertiesLocator Found 0 core definitions
   [junit4]   2> 3012639 INFO  (jetty-launcher-12223-thread-3) [n:127.0.0.1:49036_solr    ] o.a.s.c.CoreContainer Security conf doesn't exist. Skipping setup for authorization module.
   [junit4]   2> 3012639 INFO  (jetty-launcher-12223-thread-3) [n:127.0.0.1:49036_solr    ] o.a.s.c.CoreContainer No authentication plugin used.
   [junit4]   2> 3012639 INFO  (jetty-launcher-12223-thread-2) [n:127.0.0.1:43304_solr    ] o.a.s.s.SolrDispatchFilter user.dir=/export/home/jenkins/workspace/Lucene-Solr-6.x-Solaris/solr/build/solr-core/test/J1
   [junit4]   2> 3012639 INFO  (jetty-launcher-12223-thread-2) [n:127.0.0.1:43304_solr    ] o.a.s.s.SolrDispatchFilter SolrDispatchFilter.init() done
   [junit4]   2> 3012640 INFO  (jetty-launcher-12223-thread-3) [n:127.0.0.1:49036_solr    ] o.a.s.c.CorePropertiesLocator Looking for core definitions underneath /export/home/jenkins/workspace/Lucene-Solr-6.x-Solaris/solr/build/solr-core/test/J1/temp/solr.security.BasicAuthIntegrationTest_8F3F45576DA23C1B-001/tempDir-001/node3/.
   [junit4]   2> 3012640 INFO  (jetty-launcher-12223-thread-3) [n:127.0.0.1:49036_solr    ] o.a.s.c.CorePropertiesLocator Found 0 core definitions
   [junit4]   2> 3012641 INFO  (jetty-launcher-12223-thread-3) [n:127.0.0.1:49036_solr    ] o.a.s.s.SolrDispatchFilter user.dir=/export/home/jenkins/workspace/Lucene-Solr-6.x-Solaris/solr/build/solr-core/test/J1
   [junit4]   2> 3012641 INFO  (jetty-launcher-12223-thread-3) [n:127.0.0.1:49036_solr    ] o.a.s.s.SolrDispatchFilter SolrDispatchFilter.init() done
   [junit4]   2> 3012642 INFO  (SUITE-BasicAuthIntegrationTest-seed#[8F3F45576DA23C1B]-worker) [    ] o.a.s.c.c.SolrZkClient Using default ZkCredentialsProvider
   [junit4]   2> 3012643 INFO  (SUITE-BasicAuthIntegrationTest-seed#[8F3F45576DA23C1B]-worker) [    ] o.a.s.c.c.ConnectionManager Waiting for client to connect to ZooKeeper
   [junit4]   2> 3012644 INFO  (zkCallback-12243-thread-1) [    ] o.a.s.c.c.ConnectionManager Watcher org.apache.solr.common.cloud.ConnectionManager@1b0e9090 name:ZooKeeperConnection Watcher:127.0.0.1:63587 got event WatchedEvent state:SyncConnected type:None path:null path:null type:None
   [junit4]   2> 3012645 INFO  (SUITE-BasicAuthIntegrationTest-seed#[8F3F45576DA23C1B]-worker) [    ] o.a.s.c.c.ConnectionManager Client is connected to ZooKeeper
   [junit4]   2> 3012645 INFO  (SUITE-BasicAuthIntegrationTest-seed#[8F3F45576DA23C1B]-worker) [    ] o.a.s.c.c.SolrZkClient Using default ZkACLProvider
   [junit4]   2> 3012647 INFO  (SUITE-BasicAuthIntegrationTest-seed#[8F3F45576DA23C1B]-worker) [    ] o.a.s.c.c.SolrZkClient Using default ZkCredentialsProvider
   [junit4]   2> 3012647 INFO  (SUITE-BasicAuthIntegrationTest-seed#[8F3F45576DA23C1B]-worker) [    ] o.a.s.c.c.ConnectionManager Waiting for client to connect to ZooKeeper
   [junit4]   2> 3012648 INFO  (zkCallback-12246-thread-1) [    ] o.a.s.c.c.ConnectionManager Watcher org.apache.solr.common.cloud.ConnectionManager@478aa21 name:ZooKeeperConnection Watcher:127.0.0.1:63587/solr got event WatchedEvent state:SyncConnected type:None path:null path:null type:None
   [junit4]   2> 3012649 INFO  (SUITE-BasicAuthIntegrationTest-seed#[8F3F45576DA23C1B]-worker) [    ] o.a.s.c.c.ConnectionManager Client is connected to ZooKeeper
   [junit4]   2> 3012649 INFO  (SUITE-BasicAuthIntegrationTest-seed#[8F3F45576DA23C1B]-worker) [    ] o.a.s.c.c.SolrZkClient Using default ZkACLProvider
   [junit4]   2> 3012649 INFO  (SUITE-BasicAuthIntegrationTest-seed#[8F3F45576DA23C1B]-worker) [    ] o.a.s.c.c.ZkStateReader Updating cluster state from ZooKeeper... 
   [junit4]   2> 3012650 INFO  (SUITE-BasicAuthIntegrationTest-seed#[8F3F45576DA23C1B]-worker) [    ] o.a.s.c.c.ZkStateReader Loaded cluster properties: {urlScheme=https}
   [junit4]   2> 3012651 INFO  (SUITE-BasicAuthIntegrationTest-seed#[8F3F45576DA23C1B]-worker) [    ] o.a.s.c.c.ZkStateReader Updated live nodes from ZooKeeper... (0) -> (3)
   [junit4]   2> 3012654 INFO  (SUITE-BasicAuthIntegrationTest-seed#[8F3F45576DA23C1B]-worker) [    ] o.a.s.c.c.SolrZkClient makePath: /configs/conf/schema.xml
   [junit4]   2> 3012657 INFO  (SUITE-BasicAuthIntegrationTest-seed#[8F3F45576DA23C1B]-worker) [    ] o.a.s.c.c.SolrZkClient makePath: /configs/conf/solrconfig.xml
   [junit4]   2> 3012677 INFO  (qtp1235268374-58119) [n:127.0.0.1:43276_solr    ] o.a.s.h.a.CollectionsHandler Invoked Collection Action :create with params replicationFactor=1&collection.configName=conf&name=authCollection&action=CREATE&numShards=3&wt=javabin&version=2 and sendToOCPQueue=true
   [junit4]   2> 3012680 INFO  (OverseerCollectionConfigSetProcessor-96573123785457673-127.0.0.1:49036_solr-n_0000000000) [n:127.0.0.1:49036_solr    ] o.a.s.c.OverseerTaskProcessor Overseer Collection Message Handler: Get the message id:/overseer/collection-queue-work/qn-0000000000 message:{
   [junit4]   2>   "name":"authCollection",
   [junit4]   2>   "fromApi":"true",
   [junit4]   2>   "replicationFactor":"1",
   [junit4]   2>   "collection.configName":"conf",
   [junit4]   2>   "numShards":"3",
   [junit4]   2>   "stateFormat":"2",
   [junit4]   2>   "operation":"create"}
   [junit4]   2> 3012681 INFO  (OverseerThreadFactory-14338-thread-1-processing-n:127.0.0.1:49036_solr) [n:127.0.0.1:49036_solr    ] o.a.s.c.OverseerCollectionMessageHandler OverseerCollectionMessageHandler.processMessage : create , {
   [junit4]   2>   "name":"authCollection",
   [junit4]   2>   "fromApi":"true",
   [junit4]   2>   "replicationFactor":"1",
   [junit4]   2>   "collection.configName":"conf",
   [junit4]   2>   "numShards":"3",
   [junit4]   2>   "stateFormat":"2",
   [junit4]   2>   "operation":"create"}
   [junit4]   2> 3012681 INFO  (OverseerThreadFactory-14338-thread-1-processing-n:127.0.0.1:49036_solr) [n:127.0.0.1:49036_solr    ] o.a.s.c.CreateCollectionCmd Create collection authCollection
   [junit4]   2> 3012681 INFO  (OverseerThreadFactory-14338-thread-1-processing-n:127.0.0.1:49036_solr) [n:127.0.0.1:49036_solr    ] o.a.s.c.OverseerCollectionMessageHandler creating collections conf node /collections/authCollection 
   [junit4]   2> 3012682 INFO  (OverseerThreadFactory-14338-thread-1-processing-n:127.0.0.1:49036_solr) [n:127.0.0.1:49036_solr    ] o.a.s.c.c.SolrZkClient makePath: /collections/authCollection
   [junit4]   2> 3012683 INFO  (zkCallback-12238-thread-2-processing-n:127.0.0.1:43276_solr) [n:127.0.0.1:43276_solr    ] o.a.s.c.c.ZkStateReader A collections change: [WatchedEvent state:SyncConnected type:NodeChildrenChanged path:/collections], has occurred - updating...
   [junit4]   2> 3012683 INFO  (zkCallback-12246-thread-1) [    ] o.a.s.c.c.ZkStateReader A collections change: [WatchedEvent state:SyncConnected type:NodeChildrenChanged path:/collections], has occurred - updating...
   [junit4]   2> 3012683 INFO  (zkCallback-12237-thread-2-processing-n:127.0.0.1:43304_solr) [n:127.0.0.1:43304_solr    ] o.a.s.c.c.ZkStateReader A collections change: [WatchedEvent state:SyncConnected type:NodeChildrenChanged path:/collections], has occurred - updating...
   [junit4]   2> 3012683 INFO  (zkCallback-12239-thread-1-processing-n:127.0.0.1:49036_solr) [n:127.0.0.1:49036_solr    ] o.a.s.c.c.ZkStateReader A collections change: [WatchedEvent state:SyncConnected type:NodeChildrenChanged path:/collections], has occurred - updating...
   [junit4]   2> 3012687 INFO  (OverseerStateUpdate-96573123785457673-127.0.0.1:49036_solr-n_0000000000) [n:127.0.0.1:49036_solr    ] o.a.s.c.Overseer processMessage: queueSize: 1, message = {
   [junit4]   2>   "name":"authCollection",
   [junit4]   2>   "fromApi":"true",
   [junit4]   2>   "replicationFactor":"1",
   [junit4]   2>   "collection.configName":"conf",
   [junit4]   2>   "numShards":"3",
   [junit4]   2>   "stateFormat":"2",
   [junit4]   2>   "operation":"create"} current state version: 0
   [junit4]   2> 3012687 INFO  (OverseerStateUpdate-96573123785457673-127.0.0.1:49036_solr-n_0000000000) [n:127.0.0.1:49036_solr    ] o.a.s.c.o.ClusterStateMutator building a new cName: authCollection
   [junit4]   2> 3012689 INFO  (OverseerStateUpdate-96573123785457673-127.0.0.1:49036_solr-n_0000000000) [n:127.0.0.1:49036_solr    ] o.a.s.c.o.ZkStateWriter going to create_collection /collections/authCollection/state.json
   [junit4]   2> 3012787 INFO  (OverseerThreadFactory-14338-thread-1-processing-n:127.0.0.1:49036_solr) [n:127.0.0.1:49036_solr    ] o.a.s.c.CreateCollectionCmd Creating SolrCores for new collection authCollection, shardNames [shard1, shard2, shard3] , replicationFactor : 1
   [junit4]   2> 3012787 INFO  (OverseerThreadFactory-14338-thread-1-processing-n:127.0.0.1:49036_solr) [n:127.0.0.1:49036_solr    ] o.a.s.c.CreateCollectionCmd Creating core authCollection_shard3_replica1 as part of shard shard3 of collection authCollection on 127.0.0.1:49036_solr
   [junit4]   2> 3012787 INFO  (OverseerThreadFactory-14338-thread-1-processing-n:127.0.0.1:49036_solr) [n:127.0.0.1:49036_solr    ] o.a.s.c.CreateCollectionCmd Creating core authCollection_shard1_replica1 as part of shard shard1 of collection authCollection on 127.0.0.1:43276_solr
   [junit4]   2> 3012788 INFO  (OverseerThreadFactory-14338-thread-1-processing-n:127.0.0.1:49036_solr) [n:127.0.0.1:49036_solr    ] o.a.s.c.CreateCollectionCmd Creating core authCollection_shard2_replica1 as part of shard shard2 of collection authCollection on 127.0.0.1:43304_solr
   [junit4]   2> 3012804 INFO  (qtp1235268374-58118) [n:127.0.0.1:43276_solr    ] o.a.s.h.a.CoreAdminOperation core create command qt=/admin/cores&collection.configName=conf&name=authCollection_shard1_replica1&action=CREATE&numShards=3&collection=authCollection&shard=shard1&wt=javabin&version=2
   [junit4]   2> 3012804 INFO  (qtp1235268374-58118) [n:127.0.0.1:43276_solr    ] o.a.s.c.CoreDescriptor Created CoreDescriptor: {name=authCollection_shard1_replica1, collection.configName=conf, config=solrconfig.xml, transient=false, schema=schema.xml, loadOnStartup=true, configSetProperties=configsetprops.json, collection=authCollection, numShards=3, dataDir=data/, shard=shard1}
   [junit4]   2> 3012808 INFO  (qtp1235268374-58118) [n:127.0.0.1:43276_solr c:authCollection s:shard1  x:authCollection_shard1_replica1] o.a.s.c.ZkController publishing state=down
   [junit4]   2> 3012812 INFO  (qtp1235268374-58118) [n:127.0.0.1:43276_solr c:authCollection s:shard1  x:authCollection_shard1_replica1] o.a.s.c.ZkController Registering watch for collection authCollection
   [junit4]   2> 3012813 INFO  (qtp1235268374-58118) [n:127.0.0.1:43276_solr c:authCollection s:shard1  x:authCollection_shard1_replica1] o.a.s.c.c.ZkStateReader Add data for [authCollection] ver [0]
   [junit4]   2> 3012813 INFO  (qtp1235268374-58118) [n:127.0.0.1:43276_solr c:authCollection s:shard1  x:authCollection_shard1_replica1] o.a.s.c.ZkController look for our core node name
   [junit4]   2> 3012814 INFO  (OverseerStateUpdate-96573123785457673-127.0.0.1:49036_solr-n_0000000000) [n:127.0.0.1:49036_solr    ] o.a.s.c.Overseer processMessage: queueSize: 1, message = {
   [junit4]   2>   "core":"authCollection_shard1_replica1",
   [junit4]   2>   "roles":null,
   [junit4]   2>   "base_url":"https://127.0.0.1:43276/solr",
   [junit4]   2>   "node_name":"127.0.0.1:43276_solr",
   [junit4]   2>   "numShards":"3",
   [junit4]   2>   "state":"down",
   [junit4]   2>   "shard":"shard1",
   [junit4]   2>   "collection":"authCollection",
   [junit4]   2>   "operation":"state"} current state version: 0
   [junit4]   2> 3012814 INFO  (OverseerStateUpdate-96573123785457673-127.0.0.1:49036_solr-n_0000000000) [n:127.0.0.1:49036_solr    ] o.a.s.c.o.ReplicaMutator Update state numShards=3 message={
   [junit4]   2>   "core":"authCollection_shard1_replica1",
   [junit4]   2>   "roles":null,
   [junit4]   2>   "base_url":"https://127.0.0.1:43276/solr",
   [junit4]   2>   "node_name":"127.0.0.1:43276_solr",
   [junit4]   2>   "numShards":"3",
   [junit4]   2>   "state":"down",
   [junit4]   2>   "shard":"shard1",
   [junit4]   2>   "collection":"authCollection",
   [junit4]   2>   "operation":"state"}
   [junit4]   2> 3012816 INFO  (qtp2001259988-58132) [n:127.0.0.1:49036_solr    ] o.a.s.h.a.CoreAdminOperation core create command qt=/admin/cores&collection.configName=conf&name=authCollection_shard3_replica1&action=CREATE&numShards=3&collection=authCollection&shard=shard3&wt=javabin&version=2
   [junit4]   2> 3012816 INFO  (qtp2001259988-58132) [n:127.0.0.1:49036_solr    ] o.a.s.c.CoreDescriptor Created CoreDescriptor: {name=authCollection_shard3_replica1, collection.configName=conf, config=solrconfig.xml, transient=false, schema=schema.xml, loadOnStartup=true, configSetProperties=configsetprops.json, collection=authCollection, numShards=3, dataDir=data/, shard=shard3}
   [junit4]   2> 3012817 INFO  (qtp2001259988-58132) [n:127.0.0.1:49036_solr c:authCollection s:shard3  x:authCollection_shard3_replica1] o.a.s.c.ZkController publishing state=down
   [junit4]   2> 3012818 INFO  (qtp2001259988-58132) [n:127.0.0.1:49036_solr c:authCollection s:shard3  x:authCollection_shard3_replica1] o.a.s.c.ZkController Registering watch for collection authCollection
   [junit4]   2> 3012818 INFO  (qtp483567162-58143) [n:127.0.0.1:43304_solr    ] o.a.s.h.a.CoreAdminOperation core create command qt=/admin/cores&collection.configName=conf&name=authCollection_shard2_replica1&action=CREATE&numShards=3&collection=authCollection&shard=shard2&wt=javabin&version=2
   [junit4]   2> 3012819 INFO  (qtp483567162-58143) [n:127.0.0.1:43304_solr    ] o.a.s.c.CoreDescriptor Created CoreDescriptor: {name=authCollection_shard2_replica1, collection.configName=conf, config=solrconfig.xml, transient=false, schema=schema.xml, loadOnStartup=true, configSetProperties=configsetprops.json, collection=authCollection, numShards=3, dataDir=data/, shard=shard2}
   [junit4]   2> 3012819 INFO  (qtp2001259988-58132) [n:127.0.0.1:49036_solr c:authCollection s:shard3  x:authCollection_shard3_replica1] o.a.s.c.c.ZkStateReader Add data for [authCollection] ver [0]
   [junit4]   2> 3012819 INFO  (qtp2001259988-58132) [n:127.0.0.1:49036_solr c:authCollection s:shard3  x:authCollection_shard3_replica1] o.a.s.c.ZkController look for our core node name
   [junit4]   2> 3012819 INFO  (OverseerStateUpdate-96573123785457673-127.0.0.1:49036_solr-n_0000000000) [n:127.0.0.1:49036_solr    ] o.a.s.c.Overseer processMessage: queueSize: 1, message = {
   [junit4]   2>   "core":"authCollection_shard3_replica1",
   [junit4]   2>   "roles":null,
   [junit4]   2>   "base_url":"https://127.0.0.1:49036/solr",
   [junit4]   2>   "node_name":"127.0.0.1:49036_solr",
   [junit4]   2>   "numShards":"3",
   [junit4]   2>   "state":"down",
   [junit4]   2>   "shard":"shard3",
   [junit4]   2>   "collection":"authCollection",
   [junit4]   2>   "operation":"state"} current state version: 0
   [junit4]   2> 3012819 INFO  (OverseerStateUpdate-96573123785457673-127.0.0.1:49036_solr-n_0000000000) [n:127.0.0.1:49036_solr    ] o.a.s.c.o.ReplicaMutator Update state numShards=3 message={
   [junit4]   2>   "core":"authCollection_shard3_replica1",
   [junit4]   2>   "roles":null,
   [junit4]   2>   "base_url":"https://127.0.0.1:49036/solr",
   [junit4]   2>   "node_name":"127.0.0.1:49036_solr",
   [junit4]   2>   "numShards":"3",
   [junit4]   2>   "state":"down",
   [junit4]   2>   "shard":"shard3",
   [junit4]   2>   "collection":"authCollection",
   [junit4]   2>   "operation":"state"}
   [junit4]   2> 3012819 INFO  (qtp483567162-58143) [n:127.0.0.1:43304_solr c:authCollection s:shard2  x:authCollection_shard2_replica1] o.a.s.c.ZkController publishing state=down
   [junit4]   2> 3012821 INFO  (qtp483567162-58143) [n:127.0.0.1:43304_solr c:authCollection s:shard2  x:authCollection_shard2_replica1] o.a.s.c.ZkController Registering watch for collection authCollection
   [junit4]   2> 3012821 INFO  (qtp483567162-58143) [n:127.0.0.1:43304_solr c:authCollection s:shard2  x:authCollection_shard2_replica1] o.a.s.c.c.ZkStateReader Add data for [authCollection] ver [0]
   [junit4]   2> 3012822 INFO  (qtp483567162-58143) [n:127.0.0.1:43304_solr c:authCollection s:shard2  x:authCollection_shard2_replica1] o.a.s.c.ZkController look for our core node name
   [junit4]   2> 3012824 INFO  (OverseerStateUpdate-96573123785457673-127.0.0.1:49036_solr-n_0000000000) [n:127.0.0.1:49036_solr    ] o.a.s.c.Overseer processMessage: queueSize: 1, message = {
   [junit4]   2>   "core":"authCollection_shard2_replica1",
   [junit4]   2>   "roles":null,
   [junit4]   2>   "base_url":"https://127.0.0.1:43304/solr",
   [junit4]   2>   "node_name":"127.0.0.1:43304_solr",
   [junit4]   2>   "numShards":"3",
   [junit4]   2>   "state":"down",
   [junit4]   2>   "shard":"shard2",
   [junit4]   2>   "collection":"authCollection",
   [junit4]   2>   "operation":"state"} current state version: 0
   [junit4]   2> 3012824 INFO  (OverseerStateUpdate-96573123785457673-127.0.0.1:49036_solr-n_0000000000) [n:127.0.0.1:49036_solr    ] o.a.s.c.o.ReplicaMutator Update state numShards=3 message={
   [junit4]   2>   "core":"authCollection_shard2_replica1",
   [junit4]   2>   "roles":null,
   [junit4]   2>   "base_url":"https://127.0.0.1:43304/solr",
   [junit4]   2>   "node_name":"127.0.0.1:43304_solr",
   [junit4]   2>   "numShards":"3",
   [junit4]   2>   "state":"down",
   [junit4]   2>   "shard":"shard2",
   [junit4]   2>   "collection":"authCollection",
   [junit4]   2>   "operation":"state"}
   [junit4]   2> 3012927 INFO  (OverseerStateUpdate-96573123785457673-127.0.0.1:49036_solr-n_0000000000) [n:127.0.0.1:49036_solr    ] o.a.s.c.o.ZkStateWriter going to update_collection /collections/authCollection/state.json version: 0
   [junit4]   2> 3012927 INFO  (zkCallback-12238-thread-2-processing-n:127.0.0.1:43276_solr) [n:127.0.0.1:43276_solr    ] o.a.s.c.c.ZkStateReader A cluster state change: [WatchedEvent state:SyncConnected type:NodeDataChanged path:/collections/authCollection/state.json] for collection [authCollection] has occurred - updating... (live nodes size: [3])
   [junit4]   2> 3012927 INFO  (zkCallback-12237-thread-2-processing-n:127.0.0.1:43304_solr) [n:127.0.0.1:43304_solr    ] o.a.s.c.c.ZkStateReader A cluster state change: [WatchedEvent state:SyncConnected type:NodeDataChanged path:/collections/authCollection/state.json] for collection [authCollection] has occurred - updating... (live nodes size: [3])
   [junit4]   2> 3012927 INFO  (zkCallback-12239-thread-1-processing-n:127.0.0.1:49036_solr) [n:127.0.0.1:49036_solr    ] o.a.s.c.c.ZkStateReader A cluster state change: [WatchedEvent state:SyncConnected type:NodeDataChanged path:/collections/authCollection/state.json] for collection [authCollection] has occurred - updating... (live nodes size: [3])
   [junit4]   2> 3012928 INFO  (zkCallback-12238-thread-2-processing-n:127.0.0.1:43276_solr) [n:127.0.0.1:43276_solr    ] o.a.s.c.c.ZkStateReader Updating data for [authCollection] from [0] to [1]
   [junit4]   2> 3012928 INFO  (zkCallback-12237-thread-2-processing-n:127.0.0.1:43304_solr) [n:127.0.0.1:43304_solr    ] o.a.s.c.c.ZkStateReader Updating data for [authCollection] from [0] to [1]
   [junit4]   2> 3012929 INFO  (zkCallback-12239-thread-1-processing-n:127.0.0.1:49036_solr) [n:127.0.0.1:49036_solr    ] o.a.s.c.c.ZkStateReader Updating data for [authCollection] from [0] to [1]
   [junit4]   2> 3013815 INFO  (qtp1235268374-58118) [n:127.0.0.1:43276_solr c:authCollection s:shard1  x:authCollection_shard1_replica1] o.a.s.c.ZkController waiting to find shard id in clusterstate for authCollection_shard1_replica1
   [junit4]   2> 3013815 INFO  (qtp1235268374-58118) [n:127.0.0.1:43276_solr c:authCollection s:shard1  x:authCollection_shard1_replica1] o.a.s.c.ZkController Check for collection zkNode:authCollection
   [junit4]   2> 3013816 INFO  (qtp1235268374-58118) [n:127.0.0.1:43276_solr c:authCollection s:shard1  x:authCollection_shard1_replica1] o.a.s.c.ZkController Collection zkNode exists
   [junit4]   2> 3013816 INFO  (qtp1235268374-58118) [n:127.0.0.1:43276_solr c:authCollection s:shard1  x:authCollection_shard1_replica1] o.a.s.c.c.ZkStateReader Load collection config from: [/collections/authCollection]
   [junit4]   2> 3013817 INFO  (qtp1235268374-58118) [n:127.0.0.1:43276_solr c:authCollection s:shard1  x:authCollection_shard1_replica1] o.a.s.c.c.ZkStateReader path=[/collections/authCollection] [configName]=[conf] specified config exists in ZooKeeper
   [junit4]   2> 3013817 INFO  (qtp1235268374-58118) [n:127.0.0.1:43276_solr c:authCollection s:shard1  x:authCollection_shard1_replica1] o.a.s.c.SolrResourceLoader new SolrResourceLoader for directory: '/export/home/jenkins/workspace/Lucene-Solr-6.x-Solaris/solr/build/solr-core/test/J1/temp/solr.security.BasicAuthIntegrationTest_8F3F45576DA23C1B-001/tempDir-001/node1/authCollection_shard1_replica1'
   [junit4]   2> 3013817 INFO  (qtp1235268374-58118) [n:127.0.0.1:43276_solr c:authCollection s:shard1  x:authCollection_shard1_replica1] o.a.s.c.SolrResourceLoader JNDI not configured for solr (NoInitialContextEx)
   [junit4]   2> 3013817 INFO  (qtp1235268374-58118) [n:127.0.0.1:43276_solr c:authCollection s:shard1  x:authCollection_shard1_replica1] o.a.s.c.SolrResourceLoader solr home defaulted to 'solr/' (could not find system property or JNDI)
   [junit4]   2> 3013819 INFO  (qtp1235268374-58118) [n:127.0.0.1:43276_solr c:authCollection s:shard1  x:authCollection_shard1_replica1] o.a.s.c.Config loaded config solrconfig.xml with version 0 
   [junit4]   2> 3013820 INFO  (qtp2001259988-58132) [n:127.0.0.1:49036_solr c:authCollection s:shard3  x:authCollection_shard3_replica1] o.a.s.c.ZkController waiting to find shard id in clusterstate for authCollection_shard3_replica1
   [junit4]   2> 3013820 INFO  (qtp2001259988-58132) [n:127.0.0.1:49036_solr c:authCollection s:shard3  x:authCollection_shard3_replica1] o.a.s.c.ZkController Check for collection zkNode:authCollection
   [junit4]   2> 3013821 INFO  (qtp2001259988-58132) [n:127.0.0.1:49036_solr c:authCollection s:shard3  x:authCollection_shard3_replica1] o.a.s.c.ZkController Collection zkNode exists
   [junit4]   2> 3013821 INFO  (qtp2001259988-58132) [n:127.0.0.1:49036_solr c:authCollection s:shard3  x:authCollection_shard3_replica1] o.a.s.c.c.ZkStateReader Load collection config from: [/collections/authCollection]
   [junit4]   2> 3013822 INFO  (qtp1235268374-58118) [n:127.0.0.1:43276_solr c:authCollection s:shard1  x:authCollection_shard1_replica1] o.a.s.c.SolrConfig current version of requestparams : -1
   [junit4]   2> 3013822 INFO  (qtp2001259988-58132) [n:127.0.0.1:49036_solr c:authCollection s:shard3  x:authCollection_shard3_replica1] o.a.s.c.c.ZkStateReader path=[/collections/authCollection] [configName]=[conf] specified config exists in ZooKeeper
   [junit4]   2> 3013823 INFO  (qtp2001259988-58132) [n:127.0.0.1:49036_solr c:authCollection s:shard3  x:authCollection_shard3_replica1] o.a.s.c.SolrResourceLoader new SolrResourceLoader for directory: '/export/home/jenkins/workspace/Lucene-Solr-6.x-Solaris/solr/build/solr-core/test/J1/temp/solr.security.BasicAuthIntegrationTest_8F3F45576DA23C1B-001/tempDir-001/node3/authCollection_shard3_replica1'
   [junit4]   2> 3013823 INFO  (qtp2001259988-58132) [n:127.0.0.1:49036_solr c:authCollection s:shard3  x:authCollection_shard3_replica1] o.a.s.c.SolrResourceLoader JNDI not configured for solr (NoInitialContextEx)
   [junit4]   2> 3013823 INFO  (qtp2001259988-58132) [n:127.0.0.1:49036_solr c:authCollection s:shard3  x:authCollection_shard3_replica1] o.a.s.c.SolrResourceLoader solr home defaulted to 'solr/' (could not find system property or JNDI)
   [junit4]   2> 3013824 INFO  (qtp1235268374-58118) [n:127.0.0.1:43276_solr c:authCollection s:shard1  x:authCollection_shard1_replica1] o.a.s.c.SolrConfig Using Lucene MatchVersion: 6.3.0
   [junit4]   2> 3013825 INFO  (qtp2001259988-58132) [n:127.0.0.1:49036_solr c:authCollection s:shard3  x:authCollection_shard3_replica1] o.a.s.c.Config loaded config solrconfig.xml with version 0 
   [junit4]   2> 3013825 INFO  (qtp483567162-58143) [n:127.0.0.1:43304_solr c:authCollection s:shard2  x:authCollection_shard2_replica1] o.a.s.c.ZkController waiting to find shard id in clusterstate for authCollection_shard2_replica1
   [junit4]   2> 3013825 INFO  (qtp483567162-58143) [n:127.0.0.1:43304_solr c:authCollection s:shard2  x:authCollection_shard2_replica1] o.a.s.c.ZkController Check for collection zkNode:authCollection
   [junit4]   2> 3013827 INFO  (qtp483567162-58143) [n:127.0.0.1:43304_solr c:authCollection s:shard2  x:authCollection_shard2_replica1] o.a.s.c.ZkController Collection zkNode exists
   [junit4]   2> 3013827 INFO  (qtp483567162-58143) [n:127.0.0.1:43304_solr c:authCollection s:shard2  x:authCollection_shard2_replica1] o.a.s.c.c.ZkStateReader Load collection config from: [/collections/authCollection]
   [junit4]   2> 3013828 INFO  (qtp1235268374-58118) [n:127.0.0.1:43276_solr c:authCollection s:shard1  x:authCollection_shard1_replica1] o.a.s.c.SolrConfig Loaded SolrConfig: solrconfig.xml
   [junit4]   2> 3013828 INFO  (qtp483567162-58143) [n:127.0.0.1:43304_solr c:authCollection s:shard2  x:authCollection_shard2_replica1] o.a.s.c.c.ZkStateReader path=[/collections/authCollection] [configName]=[conf] specified config exists in ZooKeeper
   [junit4]   2> 3013828 INFO  (qtp483567162-58143) [n:127.0.0.1:43304_solr c:authCollection s:shard2  x:authCollection_shard2_replica1] o.a.s.c.SolrResourceLoader new SolrResourceLoader for directory: '/export/home/jenkins/workspace/Lucene-Solr-6.x-Solaris/solr/build/solr-core/test/J1/temp/solr.security.BasicAuthIntegrationTest_8F3F45576DA23C1B-001/tempDir-001/node2/authCollection_shard2_replica1'
   [junit4]   2> 3013828 INFO  (qtp483567162-58143) [n:127.0.0.1:43304_solr c:authCollection s:shard2  x:authCollection_shard2_replica1] o.a.s.c.SolrResourceLoader JNDI not configured for solr (NoInitialContextEx)
   [junit4]   2> 3013828 INFO  (qtp483567162-58143) [n:127.0.0.1:43304_solr c:authCollection s:shard2  x:authCollection_shard2_replica1] o.a.s.c.SolrResourceLoader solr home defaulted to 'solr/' (could not find system property or JNDI)
   [junit4]   2> 3013829 INFO  (qtp2001259988-58132) [n:127.0.0.1:49036_solr c:authCollection s:shard3  x:authCollection_shard3_replica1] o.a.s.c.SolrConfig current version of requestparams : -1
   [junit4]   2> 3013830 INFO  (qtp2001259988-58132) [n:127.0.0.1:49036_solr c:authCollection s:shard3  x:authCollection_shard3_replica1] o.a.s.c.SolrConfig Using Lucene MatchVersion: 6.3.0
   [junit4]   2> 3013833 INFO  (qtp2001259988-58132) [n:127.0.0.1:49036_solr c:authCollection s:shard3  x:authCollection_shard3_replica1] o.a.s.c.SolrConfig Loaded SolrConfig: solrconfig.xml
   [junit4]   2> 3013834 INFO  (qtp483567162-58143) [n:127.0.0.1:43304_solr c:authCollection s:shard2  x:authCollection_shard2_replica1] o.a.s.c.Config loaded config solrconfig.xml with version 0 
   [junit4]   2> 3013836 INFO  (qtp2001259988-58132) [n:127.0.0.1:49036_solr c:authCollection s:shard3  x:authCollection_shard3_replica1] o.a.s.s.IndexSchema [authCollection_shard3_replica1] Schema name=minimal
   [junit4]   2> 3013836 INFO  (qtp1235268374-58118) [n:127.0.0.1:43276_solr c:authCollection s:shard1  x:authCollection_shard1_replica1] o.a.s.s.IndexSchema [authCollection_shard1_replica1] Schema name=minimal
   [junit4]   2> 3013839 INFO  (qtp1235268374-58118) [n:127.0.0.1:43276_solr c:authCollection s:shard1  x:authCollection_shard1_replica1] o.a.s.s.IndexSchema unique key field: id
   [junit4]   2> 3013839 INFO  (qtp2001259988-58132) [n:127.0.0.1:49036_solr c:authCollection s:shard3  x:authCollection_shard3_replica1] o.a.s.s.IndexSchema unique key field: id
   [junit4]   2> 3013839 INFO  (qtp483567162-58143) [n:127.0.0.1:43304_solr c:authCollection s:shard2  x:authCollection_shard2_replica1] o.a.s.c.SolrConfig current version of requestparams : -1
   [junit4]   2> 3013840 INFO  (qtp2001259988-58132) [n:127.0.0.1:49036_solr c:authCollection s:shard3  x:authCollection_shard3_replica1] o.a.s.c.ConfigSetProperties Did not find ConfigSet properties, assuming default properties: Can't find resource 'configsetprops.json' in classpath or '/configs/conf', cwd=/export/home/jenkins/workspace/Lucene-Solr-6.x-Solaris/solr/build/solr-core/test/J1
   [junit4]   2> 3013840 INFO  (qtp1235268374-58118) [n:127.0.0.1:43276_solr c:authCollection s:shard1  x:authCollection_shard1_replica1] o.a.s.c.ConfigSetProperties Did not find ConfigSet properties, assuming default properties: Can't find resource 'configsetprops.json' in classpath or '/configs/conf', cwd=/export/home/jenkins/workspace/Lucene-Solr-6.x-Solaris/solr/build/solr-core/test/J1
   [junit4]   2> 3013840 INFO  (qtp1235268374-58118) [n:127.0.0.1:43276_solr c:authCollection s:shard1  x:authCollection_shard1_replica1] o.a.s.c.CoreContainer Creating SolrCore 'authCollection_shard1_replica1' using configuration from collection authCollection
   [junit4]   2> 3013840 INFO  (qtp2001259988-58132) [n:127.0.0.1:49036_solr c:authCollection s:shard3  x:authCollection_shard3_replica1] o.a.s.c.CoreContainer Creating SolrCore 'authCollection_shard3_replica1' using configuration from collection authCollection
   [junit4]   2> 3013841 INFO  (qtp1235268374-58118) [n:127.0.0.1:43276_solr c:authCollection s:shard1 r:core_node1 x:authCollection_shard1_replica1] o.a.s.c.SolrCore org.apache.solr.core.MockDirectoryFactory
   [junit4]   2> 3013841 INFO  (qtp2001259988-58132) [n:127.0.0.1:49036_solr c:authCollection s:shard3 r:core_node2 x:authCollection_shard3_replica1] o.a.s.c.SolrCore org.apache.solr.core.MockDirectoryFactory
   [junit4]   2> 3013841 INFO  (qtp483567162-58143) [n:127.0.0.1:43304_solr c:authCollection s:shard2  x:authCollection_shard2_replica1] o.a.s.c.SolrConfig Using Lucene MatchVersion: 6.3.0
   [junit4]   2> 3013841 INFO  (qtp1235268374-58118) [n:127.0.0.1:43276_solr c:authCollection s:shard1 r:core_node1 x:authCollection_shard1_replica1] o.a.s.c.SolrCore [[authCollection_shard1_replica1] ] Opening new SolrCore at [/export/home/jenkins/workspace/Lucene-Solr-6.x-Solaris/solr/build/solr-core/test/J1/temp/solr.security.BasicAuthIntegrationTest_8F3F45576DA23C1B-001/tempDir-001/node1/authCollection_shard1_replica1], dataDir=[/export/home/jenkins/workspace/Lucene-Solr-6.x-Solaris/solr/build/solr-core/test/J1/temp/solr.security.BasicAuthIntegrationTest_8F3F45576DA23C1B-001/tempDir-001/node1/./authCollection_shard1_replica1/data/]
   [junit4]   2> 3013841 INFO  (qtp2001259988-58132) [n:127.0.0.1:49036_solr c:authCollection s:shard3 r:core_node2 x:authCollection_shard3_replica1] o.a.s.c.SolrCore [[authCollection_shard3_replica1] ] Opening new SolrCore at [/export/home/jenkins/workspace/Lucene-Solr-6.x-Solaris/solr/build/solr-core/test/J1/temp/solr.security.BasicAuthIntegrationTest_8F3F45576DA23C1B-001/tempDir-001/node3/authCollection_shard3_replica1], dataDir=[/export/home/jenkins/workspace/Lucene-Solr-6.x-Solaris/solr/build/solr-core/test/J1/temp/solr.security.BasicAuthIntegrationTest_8F3F45576DA23C1B-001/tempDir-001/node3/./authCollection_shard3_replica1/data/]
   [junit4]   2> 3013841 INFO  (qtp2001259988-58132) [n:127.0.0.1:49036_solr c:authCollection s:shard3 r:core_node2 x:authCollection_shard3_replica1] o.a.s.c.SolrCore JMX monitoring not detected for core: authCollection_shard3_replica1
   [junit4]   2> 3013841 INFO  (qtp1235268374-58118) [n:127.0.0.1:43276_solr c:authCollection s:shard1 r:core_node1 x:authCollection_shard1_replica1] o.a.s.c.SolrCore JMX monitoring not detected for core: authCollection_shard1_replica1
   [junit4]   2> 3013879 INFO  (qtp2001259988-58132) [n:127.0.0.1:49036_solr c:authCollection s:shard3 r:core_node2 x:authCollection_shard3_replica1] o.a.s.c.CachingDirectoryFactory return new directory for /export/home/jenkins/workspace/Lucene-Solr-6.x-Solaris/solr/build/solr-core/test/J1/temp/solr.security.BasicAuthIntegrationTest_8F3F45576DA23C1B-001/tempDir-001/node3/./authCollection_shard3_replica1/data/snapshot_metadata
   [junit4]   2> 3013879 INFO  (qtp2001259988-58132) [n:127.0.0.1:49036_solr c:authCollection s:shard3 r:core_node2 x:authCollection_shard3_replica1] o.a.s.c.s.SolrSnapshotMetaDataManager Loading from snapshot metadata file...
   [junit4]   2> 3013879 INFO  (qtp1235268374-58118) [n:127.0.0.1:43276_solr c:authCollection s:shard1 r:core_node1 x:authCollection_shard1_replica1] o.a.s.c.CachingDirectoryFactory return new directory for /export/home/jenkins/workspace/Lucene-Solr-6.x-Solaris/solr/build/solr-core/test/J1/temp/solr.security.BasicAuthIntegrationTest_8F3F45576DA23C1B-001/tempDir-001/node1/./authCollection_shard1_replica1/data/snapshot_metadata
   [junit4]   2> 3013880 INFO  (qtp1235268374-58118) [n:127.0.0.1:43276_solr c:authCollection s:shard1 r:core_node1 x:authCollection_shard1_replica1] o.a.s.c.s.SolrSnapshotMetaDataManager Loading from snapshot metadata file...
   [junit4]   2> 3013880 INFO  (qtp2001259988-58132) [n:127.0.0.1:49036_solr c:authCollection s:shard3 r:core_node2 x:authCollection_shard3_replica1] o.a.s.c.CachingDirectoryFactory return new directory for /export/home/jenkins/workspace/Lucene-Solr-6.x-Solaris/solr/build/solr-core/test/J1/temp/solr.security.BasicAuthIntegrationTest_8F3F45576DA23C1B-001/tempDir-001/node3/./authCollection_shard3_replica1/data
   [junit4]   2> 3013880 INFO  (qtp2001259988-58132) [n:127.0.0.1:49036_solr c:authCollection s:shard3 r:core_node2 x:authCollection_shard3_replica1] o.a.s.c.SolrCore New index directory detected: old=null new=/export/home/jenkins/workspace/Lucene-Solr-6.x-Solaris/solr/build/solr-core/test/J1/temp/solr.security.BasicAuthIntegrationTest_8F3F45576DA23C1B-001/tempDir-001/node3/./authCollection_shard3_replica1/data/index/
   [junit4]   2> 3013880 WARN  (qtp2001259988-58132) [n:127.0.0.1:49036_solr c:authCollection s:shard3 r:core_node2 x:authCollection_shard3_replica1] o.a.s.c.SolrCore [authCollection_shard3_replica1] Solr index directory '/export/home/jenkins/workspace/Lucene-Solr-6.x-Solaris/solr/build/solr-core/test/J1/temp/solr.security.BasicAuthIntegrationTest_8F3F45576DA23C1B-001/tempDir-001/node3/./authCollection_shard3_replica1/data/index' doesn't exist. Creating new index...
   [junit4]   2> 3013880 INFO  (qtp1235268374-58118) [n:127.0.0.1:43276_solr c:authCollection s:shard1 r:core_node1 x:authCollection_shard1_replica1] o.a.s.c.CachingDirectoryFactory return new directory for /export/home/jenkins/workspace/Lucene-Solr-6.x-Solaris/solr/build/solr-core/test/J1/temp/solr.security.BasicAuthIntegrationTest_8F3F45576DA23C1B-001/tempDir-001/node1/./authCollection_shard1_replica1/data
   [junit4]   2> 3013880 INFO  (qtp1235268374-58118) [n:127.0.0.1:43276_solr c:authCollection s:shard1 r:core_node1 x:authCollection_shard1_replica1] o.a.s.c.SolrCore New index directory detected: old=null new=/export/home/jenkins/workspace/Lucene-Solr-6.x-Solaris/solr/build/solr-core/test/J1/temp/solr.security.BasicAuthIntegrationTest_8F3F45576DA23C1B-001/tempDir-001/node1/./authCollection_shard1_replica1/data/index/
   [junit4]   2> 3013880 INFO  (qtp2001259988-58132) [n:127.0.0.1:49036_solr c:authCollection s:shard3 r:core_node2 x:authCollection_shard3_replica1] o.a.s.c.CachingDirectoryFactory return new directory for /export/home/jenkins/workspace/Lucene-Solr-6.x-Solaris/solr/build/solr-core/test/J1/temp/solr.security.BasicAuthIntegrationTest_8F3F45576DA23C1B-001/tempDir-001/node3/./authCollection_shard3_replica1/data/index
   [junit4]   2> 3013880 WARN  (qtp1235268374-58118) [n:127.0.0.1:43276_solr c:authCollection s:shard1 r:core_node1 x:authCollection_shard1_replica1] o.a.s.c.SolrCore [authCollection_shard1_replica1] Solr index directory '/export/home/jenkins/workspace/Lucene-Solr-6.x-Solaris/solr/build/solr-core/test/J1/temp/solr.security.BasicAuthIntegrationTest_8F3F45576DA23C1B-001/tempDir-001/node1/./authCollection_shard1_replica1/data/index' doesn't exist. Creating new index...
   [junit4]   2> 3013881 INFO  (qtp1235268374-58118) [n:127.0.0.1:43276_solr c:authCollection s:shard1 r:core_node1 x:authCollection_shard1_replica1] o.a.s.c.CachingDirectoryFactory return new directory for /export/home/jenkins/workspace/Lucene-Solr-6.x-Solaris/solr/build/solr-core/test/J1/temp/solr.security.BasicAuthIntegrationTest_8F3F45576DA23C1B-001/tempDir-001/node1/./authCollection_shard1_replica1/data/index
   [junit4]   2> 3013881 INFO  (qtp2001259988-58132) [n:127.0.0.1:49036_solr c:authCollection s:shard3 r:core_node2 x:authCollection_shard3_replica1] o.a.s.c.SolrDeletionPolicy SolrDeletionPolicy.onCommit: commits: num=1
   [junit4]   2> 	commit{dir=MockDirectoryWrapper(RAMDirectory@7ee00359 lockFactory=org.apache.lucene.store.SingleInstanceLockFactory@4cc24ea),segFN=segments_1,generation=1}
   [junit4]   2> 3013881 INFO  (qtp2001259988-58132) [n:127.0.0.1:49036_solr c:authCollection s:shard3 r:core_node2 x:authCollection_shard3_replica1] o.a.s.c.SolrDeletionPolicy newest commit generation = 1
   [junit4]   2> 3013881 INFO  (qtp1235268374-58118) [n:127.0.0.1:43276_solr c:authCollection s:shard1 r:core_node1 x:authCollection_shard1_replica1] o.a.s.c.SolrDeletionPolicy SolrDeletionPolicy.onCommit: commits: num=1
   [junit4]   2> 	commit{dir=MockDirectoryWrapper(RAMDirectory@6713eaea lockFactory=org.apache.lucene.store.SingleInstanceLockFactory@70c3296a),segFN=segments_1,generation=1}
   [junit4]   2> 3013881 INFO  (qtp1235268374-58118) [n:127.0.0.1:43276_solr c:authCollection s:shard1 r:core_node1 x:authCollection_shard1_replica1] o.a.s.c.SolrDeletionPolicy newest commit generation = 1
   [junit4]   2> 3013881 INFO  (qtp483567162-58143) [n:127.0.0.1:43304_solr c:authCollection s:shard2  x:authCollection_shard2_replica1] o.a.s.c.SolrConfig Loaded SolrConfig: solrconfig.xml
   [junit4]   2> 3013882 INFO  (OldIndexDirectoryCleanupThreadForCore-authCollection_shard3_replica1) [n:127.0.0.1:49036_solr c:authCollection s:shard3 r:core_node2 x:authCollection_shard3_replica1] o.a.s.c.SolrCore Looking for old index directories to cleanup for core authCollection_shard3_replica1 in /export/home/jenkins/workspace/Lucene-Solr-6.x-Solaris/solr/build/solr-core/test/J1/temp/solr.security.BasicAuthIntegrationTest_8F3F45576DA23C1B-001/tempDir-001/node3/./authCollection_shard3_replica1/data/
   [junit4]   2> 3013882 WARN  (OldIndexDirectoryCleanupThreadForCore-authCollection_shard3_replica1) [n:127.0.0.1:49036_solr c:authCollection s:shard3 r:core_node2 x:authCollection_shard3_replica1] o.a.s.c.DirectoryFactory /export/home/jenkins/workspace/Lucene-Solr-6.x-Solaris/solr/build/solr-core/test/J1/temp/solr.security.BasicAuthIntegrationTest_8F3F45576DA23C1B-001/tempDir-001/node3/./authCollection_shard3_replica1/data/ does not point to a valid data directory; skipping clean-up of old index directories.
   [junit4]   2> 3013882 INFO  (OldIndexDirectoryCleanupThreadForCore-authCollection_shard1_replica1) [n:127.0.0.1:43276_solr c:authCollection s:shard1 r:core_node1 x:authCollection_shard1_replica1] o.a.s.c.SolrCore Looking for old index directories to cleanup for core authCollection_shard1_replica1 in /export/home/jenkins/workspace/Lucene-Solr-6.x-Solaris/solr/build/solr-core/test/J1/temp/solr.security.BasicAuthIntegrationTest_8F3F45576DA23C1B-001/tempDir-001/node1/./authCollection_shard1_replica1/data/
   [junit4]   2> 3013883 WARN  (OldIndexDirectoryCleanupThreadForCore-authCollection_shard1_replica1) [n:127.0.0.1:43276_solr c:authCollection s:shard1 r:core_node1 x:authCollection_shard1_replica1] o.a.s.c.DirectoryFactory /export/home/jenkins/workspace/Lucene-Solr-6.x-Solaris/solr/build/solr-core/test/J1/temp/solr.security.BasicAuthIntegrationTest_8F3F45576DA23C1B-001/tempDir-001/node1/./authCollection_shard1_replica1/data/ does not point to a valid data directory; skipping clean-up of old index directories.
   [junit4]   2> 3013884 INFO  (qtp2001259988-58132) [n:127.0.0.1:49036_solr c:authCollection s:shard3 r:core_node2 x:authCollection_shard3_replica1] o.a.s.c.SolrCore no updateRequestProcessorChain defined as default, creating implicit default
   [junit4]   2> 3013884 INFO  (qtp1235268374-58118) [n:127.0.0.1:43276_solr c:authCollection s:shard1 r:core_node1 x:authCollection_shard1_replica1] o.a.s.c.SolrCore no updateRequestProcessorChain defined as default, creating implicit default
   [junit4]   2> 3013887 INFO  (qtp2001259988-58132) [n:127.0.0.1:49036_solr c:authCollection s:shard3 r:core_node2 x:authCollection_shard3_replica1] o.a.s.h.l.XMLLoader xsltCacheLifetimeSeconds=60
   [junit4]   2> 3013887 INFO  (qtp1235268374-58118) [n:127.0.0.1:43276_solr c:authCollection s:shard1 r:core_node1 x:authCollection_shard1_replica1] o.a.s.h.l.XMLLoader xsltCacheLifetimeSeconds=60
   [junit4]   2> 3013888 INFO  (qtp2001259988-58132) [n:127.0.0.1:49036_solr c:authCollection s:shard3 r:core_node2 x:authCollection_shard3_replica1] o.a.s.h.l.XMLLoader xsltCacheLifetimeSeconds=60
   [junit4]   2> 3013888 INFO  (qtp1235268374-58118) [n:127.0.0.1:43276_solr c:authCollection s:shard1 r:core_node1 x:authCollection_shard1_replica1] o.a.s.h.l.XMLLoader xsltCacheLifetimeSeconds=60
   [junit4]   2> 3013888 INFO  (qtp2001259988-58132) [n:127.0.0.1:49036_solr c:authCollection s:shard3 r:core_node2 x:authCollection_shard3_replica1] o.a.s.h.l.XMLLoader xsltCacheLifetimeSeconds=60
   [junit4]   2> 3013889 INFO  (qtp1235268374-58118) [n:127.0.0.1:43276_solr c:authCollection s:shard1 r:core_node1 x:authCollection_shard1_replica1] o.a.s.h.l.XMLLoader xsltCacheLifetimeSeconds=60
   [junit4]   2> 3013889 INFO  (qtp483567162-58143) [n:127.0.0.1:43304_solr c:authCollection s:shard2  x:authCollection_shard2_replica1] o.a.s.s.IndexSchema [authCollection_shard2_replica1] Schema name=minimal
   [junit4]   2> 3013889 INFO  (qtp2001259988-58132) [n:127.0.0.1:49036_solr c:authCollection s:shard3 r:core_node2 x:authCollection_shard3_replica1] o.a.s.h.l.XMLLoader xsltCacheLifetimeSeconds=60
   [junit4]   2> 3013890 INFO  (qtp1235268374-58118) [n:127.0.0.1:43276_solr c:authCollection s:shard1 r:core_node1 x:authCollection_shard1_replica1] o.a.s.h.l.XMLLoader xsltCacheLifetimeSeconds=60
   [junit4]   2> 3013891 INFO  (qtp4

[...truncated too long message...]

17)
   [junit4]   2> 	at java.lang.Thread.run(Thread.java:745)
   [junit4]   2> 3018421 INFO  (jetty-launcher-12223-thread-3) [    ] o.e.j.s.h.ContextHandler Stopped o.e.j.s.ServletContextHandler@5ed15363{/solr,null,UNAVAILABLE}
   [junit4]   2> 3018425 INFO  (SUITE-BasicAuthIntegrationTest-seed#[8F3F45576DA23C1B]-worker) [    ] o.a.s.c.ZkTestServer connecting to 127.0.0.1:63587 63587
   [junit4]   2> 3018551 INFO  (Thread-10885) [    ] o.a.s.c.ZkTestServer connecting to 127.0.0.1:63587 63587
   [junit4]   2> 3018552 WARN  (Thread-10885) [    ] o.a.s.c.ZkTestServer Watch limit violations: 
   [junit4]   2> Maximum concurrent create/delete watches above limit:
   [junit4]   2> 
   [junit4]   2> 	5	/solr/aliases.json
   [junit4]   2> 	4	/solr/security.json
   [junit4]   2> 	4	/solr/configs/conf
   [junit4]   2> 
   [junit4]   2> Maximum concurrent data watches above limit:
   [junit4]   2> 
   [junit4]   2> 	5	/solr/clusterstate.json
   [junit4]   2> 	5	/solr/clusterprops.json
   [junit4]   2> 	4	/solr/collections/authCollection/state.json
   [junit4]   2> 	2	/solr/overseer_elect/election/96573123785457671-127.0.0.1:43304_solr-n_0000000001
   [junit4]   2> 
   [junit4]   2> Maximum concurrent children watches above limit:
   [junit4]   2> 
   [junit4]   2> 	12	/solr/overseer/queue
   [junit4]   2> 	5	/solr/collections
   [junit4]   2> 	5	/solr/overseer/collection-queue-work
   [junit4]   2> 	4	/solr/live_nodes
   [junit4]   2> 	2	/solr/overseer/queue-work
   [junit4]   2> 
   [junit4]   2> 3018552 INFO  (SUITE-BasicAuthIntegrationTest-seed#[8F3F45576DA23C1B]-worker) [    ] o.a.s.SolrTestCaseJ4 ###deleteCore
   [junit4]   2> NOTE: leaving temporary files on disk at: /export/home/jenkins/workspace/Lucene-Solr-6.x-Solaris/solr/build/solr-core/test/J1/temp/solr.security.BasicAuthIntegrationTest_8F3F45576DA23C1B-001
   [junit4]   2> NOTE: test params are: codec=Asserting(Lucene62): {}, docValues:{}, maxPointsInLeafNode=94, maxMBSortInHeap=5.017310223457979, sim=ClassicSimilarity, locale=sr-ME, timezone=America/Jujuy
   [junit4]   2> NOTE: SunOS 5.11 amd64/Oracle Corporation 1.8.0_102 (64-bit)/cpus=3,threads=1,free=228865248,total=536870912
   [junit4]   2> NOTE: All tests run in this JVM: [IgnoreCommitOptimizeUpdateProcessorFactoryTest, TestHashQParserPlugin, TestSearcherReuse, TestChildDocTransformer, PreAnalyzedUpdateProcessorTest, DataDrivenBlockJoinTest, TestDefaultStatsCache, TestTrie, StatsComponentTest, ReturnFieldsTest, DistributedFacetPivotLargeTest, TestSolrConfigHandlerConcurrent, PKIAuthenticationIntegrationTest, TestFiltering, TestSolrDeletionPolicy2, StressHdfsTest, TestCollationFieldDocValues, UpdateParamsTest, BasicFunctionalityTest, ChaosMonkeySafeLeaderTest, CheckHdfsIndexTest, TestFieldCacheSanityChecker, SuggesterTSTTest, SmileWriterTest, CollectionStateFormat2Test, TestNumericTerms32, TestHdfsBackupRestoreCore, TestUniqueKeyFieldResource, SolrCoreCheckLockOnStartupTest, LoggingHandlerTest, BooleanFieldTest, BlockCacheTest, TestMacros, CSVRequestHandlerTest, EchoParamsTest, ReplicationFactorTest, AliasIntegrationTest, TestJsonFacets, HdfsThreadLeakTest, TestRestManager, TestCoreDiscovery, TestTestInjection, DefaultValueUpdateProcessorTest, SpellCheckCollatorTest, TestWriterPerf, UpdateRequestProcessorFactoryTest, TestFieldCacheWithThreads, TestCollapseQParserPlugin, BigEndianAscendingWordSerializerTest, TestSolrCloudWithKerberosAlt, TestMaxScoreQueryParser, AsyncCallRequestStatusResponseTest, ExitableDirectoryReaderTest, TestUtils, ExternalFileFieldSortTest, DeleteStatusTest, TestIndexingPerformance, CopyFieldTest, SuggestComponentContextFilterQueryTest, TestBulkSchemaConcurrent, TestSimpleTrackingShardHandler, TestConfigSetProperties, HdfsLockFactoryTest, CdcrRequestHandlerTest, SliceStateTest, TestSchemaVersionResource, AtomicUpdatesTest, TestRTimerTree, CollectionsAPIDistributedZkTest, TestFastWriter, TestDistributedGrouping, LeaderFailoverAfterPartitionTest, TestManagedSynonymFilterFactory, TestMiniSolrCloudClusterSSL, NoCacheHeaderTest, PeerSyncReplicationTest, TestRealTimeGet, SpellingQueryConverterTest, SuggesterWFSTTest, JavabinLoaderTest, TestShardHandlerFactory, LeaderInitiatedRecoveryOnShardRestartTest, TestRecoveryHdfs, GraphQueryTest, TestCodecSupport, SolrCloudExampleTest, DeleteLastCustomShardedReplicaTest, TestPHPSerializedResponseWriter, TestAuthenticationFramework, RAMDirectoryFactoryTest, AutoCommitTest, ForceLeaderTest, TestRebalanceLeaders, SolrInfoMBeanTest, CoreAdminRequestStatusTest, SimpleCollectionCreateDeleteTest, TestRawResponseWriter, HLLSerializationTest, TestMergePolicyConfig, NotRequiredUniqueKeyTest, TestSolrQueryResponse, LukeRequestHandlerTest, TestTolerantUpdateProcessorRandomCloud, TestLuceneMatchVersion, TestMiniSolrCloudCluster, CursorMarkTest, TestClassicSimilarityFactory, TestLRUStatsCache, TestQuerySenderNoQuery, MinimalSchemaTest, TestReqParamsAPI, TestFuzzyAnalyzedSuggestions, LeaderElectionIntegrationTest, ZkStateReaderTest, OverriddenZkACLAndCredentialsProvidersTest, ClusterStateTest, CloudMLTQParserTest, SortByFunctionTest, TestFilteredDocIdSet, TestJettySolrRunner, TestSolrDynamicMBean, RemoteQueryErrorTest, SearchHandlerTest, CacheHeaderTest, TestRangeQuery, TestLocalFSCloudBackupRestore, VersionInfoTest, TestStressLiveNodes, TestUninvertingReader, HdfsBasicDistributedZk2Test, TestGeoJSONResponseWriter, TestManagedSchemaAPI, ScriptEngineTest, BlockJoinFacetRandomTest, ConnectionReuseTest, TestFieldCache, TestConfigOverlay, CollectionsAPIAsyncDistributedZkTest, BufferStoreTest, SharedFSAutoReplicaFailoverTest, TestSearchPerf, OpenCloseCoreStressTest, FileBasedSpellCheckerTest, URLClassifyProcessorTest, TestPerFieldSimilarityWithDefaultOverride, TestSchemaResource, TestJoin, TestSolrCoreSnapshots, SolrCmdDistributorTest, TestSolrQueryParserDefaultOperatorResource, TestDynamicFieldResource, TestNRTOpen, MultiThreadedOCPTest, TestLMDirichletSimilarityFactory, QueryResultKeyTest, TestFieldCacheSortRandom, LeaderElectionTest, TestZkChroot, TestFaceting, TestRecovery, DistributedSpellCheckComponentTest, TermVectorComponentDistributedTest, TestReload, TestStressVersions, HardAutoCommitTest, DistributedTermsComponentTest, SimpleFacetsTest, TestSolr4Spatial, SpellCheckComponentTest, PeerSyncTest, BadIndexSchemaTest, ConvertedLegacyTest, TestFunctionQuery, TestBadConfig, TestIndexSearcher, HighlighterTest, ShowFileRequestHandlerTest, CurrencyFieldOpenExchangeTest, SolrIndexSplitterTest, SimplePostToolTest, SignatureUpdateProcessorFactoryTest, TestExtendedDismaxParser, CoreAdminHandlerTest, SolrRequestParserTest, TestFoldingMultitermQuery, DocValuesTest, SuggesterTest, SpatialFilterTest, TestCSVLoader, WordBreakSolrSpellCheckerTest, SchemaVersionSpecificBehaviorTest, TestPseudoReturnFields, FieldMutatingUpdateProcessorTest, TestAtomicUpdateErrorCases, TestWordDelimiterFilterFactory, QueryEqualityTest, DirectUpdateHandlerOptimizeTest, StatelessScriptUpdateProcessorFactoryTest, TestRemoteStreaming, DistanceFunctionTest, TestSolrDeletionPolicy1, XsltUpdateRequestHandlerTest, DebugComponentTest, IndexBasedSpellCheckerTest, DisMaxRequestHandlerTest, TestQueryUtils, StandardRequestHandlerTest, DirectSolrSpellCheckerTest, TestReversedWildcardFilterFactory, TestQueryTypes, PrimitiveFieldTypeTest, TestOmitPositions, TermsComponentTest, XmlUpdateRequestHandlerTest, RequestHandlersTest, DocumentBuilderTest, TestValueSourceCache, PathHierarchyTokenizerFactoryTest, TermVectorComponentTest, RequiredFieldsTest, FieldAnalysisRequestHandlerTest, TestSolrQueryParser, RegexBoostProcessorTest, IndexSchemaTest, TestCollationField, TestCSVResponseWriter, MBeansHandlerTest, QueryParsingTest, JsonLoaderTest, BinaryUpdateRequestHandlerTest, TestPartialUpdateDeduplication, TestLFUCache, DistributedIntervalFacetingTest, CdcrBootstrapTest, ConcurrentDeleteAndCreateCollectionTest, ConnectionManagerTest, CustomCollectionTest, DeleteShardTest, DistribJoinFromCollectionTest, HttpPartitionTest, RestartWhileUpdatingTest, RollingRestartTest, SolrCLIZkUtilsTest, TestCloudDeleteByQuery, TestCloudInspectUtil, TestCloudPseudoReturnFields, TestCollectionAPI, TestConfigSetsAPI, TestConfigSetsAPIExclusivity, TestConfigSetsAPIZkFailure, TestCryptoKeys, TestDistribDocBasedVersion, TestExclusionRuleCollectionAccess, TestLeaderElectionZkExpiry, TestLeaderInitiatedRecoveryThread, TestLockTree, TestRandomFlRTGCloud, TestReplicaProperties, TestSSLRandomization, TestShortCircuitedRequests, TriLevelCompositeIdRoutingTest, HdfsChaosMonkeyNothingIsSafeTest, HdfsCollectionsAPIDistributedZkTest, HdfsRecoverLeaseTest, CoreSorterTest, DirectoryFactoryTest, TestBackupRepositoryFactory, TestConfigSets, TestDynamicLoading, TestImplicitCoreProperties, TestInfoStreamLogging, TestInitParams, TestBlobHandler, TestRestoreCore, TestSQLHandler, TestSolrConfigHandlerCloud, FacetPivotSmallTest, SpatialHeatmapFacetsTest, TestExpandComponent, TestPivotHelperCode, TestTrackingShardHandlerFactory, HighlighterMaxOffsetTest, TestSlowCompositeReaderWrapper, TestIntervalFaceting, TestMacroExpander, TestCustomDocTransformer, TestSubQueryTransformerCrossCore, TestSubQueryTransformerDistrib, TestManagedResource, TestManagedResourceStorage, TestDefaultSearchFieldResource, TestDynamicFieldCollectionResource, TestFieldCollectionResource, TestFieldResource, TestFieldTypeCollectionResource, TestFieldTypeResource, ChangedSchemaMergeTest, DateRangeFieldTest, EnumFieldTest, SpatialRPTFieldTypeTest, TestManagedSchema, TestUseDocValuesAsStored, TestUseDocValuesAsStored2, AnalyticsMergeStrategyTest, AnalyticsQueryTest, MergeStrategyTest, RankQueryTest, TestAddFieldRealTimeGet, TestCustomSort, TestMissingGroups, TestNoOpRegenerator, TestOverriddenPrefixQueryForCustomFieldType, TestQueryWrapperFilter, TestRandomCollapseQParserPlugin, TestNonDefinedSimilarityFactory, TestExactSharedStatsCache, TestExactStatsCache, BasicAuthIntegrationTest]
   [junit4] Completed [599/630 (1!)] on J1 in 6.17s, 1 test, 1 error <<< FAILURES!

[...truncated 60373 lines...]


Mime
View raw message