lucene-dev mailing list archives

Site index · List index
Message view « Date » · « Thread »
Top « Date » · « Thread »
From Policeman Jenkins Server <jenk...@thetaphi.de>
Subject [JENKINS-EA] Lucene-Solr-master-Linux (64bit/jdk-9-ea+132) - Build # 17745 - Unstable!
Date Fri, 02 Sep 2016 11:27:40 GMT
Build: http://jenkins.thetaphi.de/job/Lucene-Solr-master-Linux/17745/
Java: 64bit/jdk-9-ea+132 -XX:-UseCompressedOops -XX:+UseConcMarkSweepGC

1 tests failed.
FAILED:  org.apache.solr.schema.TestManagedSchemaAPI.test

Error Message:
Error from server at https://127.0.0.1:41878/solr/testschemaapi_shard1_replica2: ERROR: [doc=2] unknown field 'myNewField1'

Stack Trace:
org.apache.solr.client.solrj.impl.CloudSolrClient$RouteException: Error from server at https://127.0.0.1:41878/solr/testschemaapi_shard1_replica2: ERROR: [doc=2] unknown field 'myNewField1'
	at __randomizedtesting.SeedInfo.seed([6C5C315B86FED539:E4080E812802B8C1]:0)
	at org.apache.solr.client.solrj.impl.CloudSolrClient.directUpdate(CloudSolrClient.java:753)
	at org.apache.solr.client.solrj.impl.CloudSolrClient.sendRequest(CloudSolrClient.java:1161)
	at org.apache.solr.client.solrj.impl.CloudSolrClient.requestWithRetryOnStaleState(CloudSolrClient.java:1050)
	at org.apache.solr.client.solrj.impl.CloudSolrClient.request(CloudSolrClient.java:992)
	at org.apache.solr.schema.TestManagedSchemaAPI.testAddFieldAndDocument(TestManagedSchemaAPI.java:86)
	at org.apache.solr.schema.TestManagedSchemaAPI.test(TestManagedSchemaAPI.java:55)
	at jdk.internal.reflect.NativeMethodAccessorImpl.invoke0(java.base@9-ea/Native Method)
	at jdk.internal.reflect.NativeMethodAccessorImpl.invoke(java.base@9-ea/NativeMethodAccessorImpl.java:62)
	at jdk.internal.reflect.DelegatingMethodAccessorImpl.invoke(java.base@9-ea/DelegatingMethodAccessorImpl.java:43)
	at java.lang.reflect.Method.invoke(java.base@9-ea/Method.java:535)
	at com.carrotsearch.randomizedtesting.RandomizedRunner.invoke(RandomizedRunner.java:1764)
	at com.carrotsearch.randomizedtesting.RandomizedRunner$8.evaluate(RandomizedRunner.java:871)
	at com.carrotsearch.randomizedtesting.RandomizedRunner$9.evaluate(RandomizedRunner.java:907)
	at com.carrotsearch.randomizedtesting.RandomizedRunner$10.evaluate(RandomizedRunner.java:921)
	at com.carrotsearch.randomizedtesting.rules.SystemPropertiesRestoreRule$1.evaluate(SystemPropertiesRestoreRule.java:57)
	at org.apache.lucene.util.TestRuleSetupTeardownChained$1.evaluate(TestRuleSetupTeardownChained.java:49)
	at org.apache.lucene.util.AbstractBeforeAfterRule$1.evaluate(AbstractBeforeAfterRule.java:45)
	at org.apache.lucene.util.TestRuleThreadAndTestName$1.evaluate(TestRuleThreadAndTestName.java:48)
	at org.apache.lucene.util.TestRuleIgnoreAfterMaxFailures$1.evaluate(TestRuleIgnoreAfterMaxFailures.java:64)
	at org.apache.lucene.util.TestRuleMarkFailure$1.evaluate(TestRuleMarkFailure.java:47)
	at com.carrotsearch.randomizedtesting.rules.StatementAdapter.evaluate(StatementAdapter.java:36)
	at com.carrotsearch.randomizedtesting.ThreadLeakControl$StatementRunner.run(ThreadLeakControl.java:367)
	at com.carrotsearch.randomizedtesting.ThreadLeakControl.forkTimeoutingTask(ThreadLeakControl.java:809)
	at com.carrotsearch.randomizedtesting.ThreadLeakControl$3.evaluate(ThreadLeakControl.java:460)
	at com.carrotsearch.randomizedtesting.RandomizedRunner.runSingleTest(RandomizedRunner.java:880)
	at com.carrotsearch.randomizedtesting.RandomizedRunner$5.evaluate(RandomizedRunner.java:781)
	at com.carrotsearch.randomizedtesting.RandomizedRunner$6.evaluate(RandomizedRunner.java:816)
	at com.carrotsearch.randomizedtesting.RandomizedRunner$7.evaluate(RandomizedRunner.java:827)
	at com.carrotsearch.randomizedtesting.rules.StatementAdapter.evaluate(StatementAdapter.java:36)
	at com.carrotsearch.randomizedtesting.rules.SystemPropertiesRestoreRule$1.evaluate(SystemPropertiesRestoreRule.java:57)
	at org.apache.lucene.util.AbstractBeforeAfterRule$1.evaluate(AbstractBeforeAfterRule.java:45)
	at com.carrotsearch.randomizedtesting.rules.StatementAdapter.evaluate(StatementAdapter.java:36)
	at org.apache.lucene.util.TestRuleStoreClassName$1.evaluate(TestRuleStoreClassName.java:41)
	at com.carrotsearch.randomizedtesting.rules.NoShadowingOrOverridesOnMethodsRule$1.evaluate(NoShadowingOrOverridesOnMethodsRule.java:40)
	at com.carrotsearch.randomizedtesting.rules.NoShadowingOrOverridesOnMethodsRule$1.evaluate(NoShadowingOrOverridesOnMethodsRule.java:40)
	at com.carrotsearch.randomizedtesting.rules.StatementAdapter.evaluate(StatementAdapter.java:36)
	at com.carrotsearch.randomizedtesting.rules.StatementAdapter.evaluate(StatementAdapter.java:36)
	at com.carrotsearch.randomizedtesting.rules.StatementAdapter.evaluate(StatementAdapter.java:36)
	at org.apache.lucene.util.TestRuleAssertionsRequired$1.evaluate(TestRuleAssertionsRequired.java:53)
	at org.apache.lucene.util.TestRuleMarkFailure$1.evaluate(TestRuleMarkFailure.java:47)
	at org.apache.lucene.util.TestRuleIgnoreAfterMaxFailures$1.evaluate(TestRuleIgnoreAfterMaxFailures.java:64)
	at org.apache.lucene.util.TestRuleIgnoreTestSuites$1.evaluate(TestRuleIgnoreTestSuites.java:54)
	at com.carrotsearch.randomizedtesting.rules.StatementAdapter.evaluate(StatementAdapter.java:36)
	at com.carrotsearch.randomizedtesting.ThreadLeakControl$StatementRunner.run(ThreadLeakControl.java:367)
	at java.lang.Thread.run(java.base@9-ea/Thread.java:843)
Caused by: org.apache.solr.client.solrj.impl.HttpSolrClient$RemoteSolrException: Error from server at https://127.0.0.1:41878/solr/testschemaapi_shard1_replica2: ERROR: [doc=2] unknown field 'myNewField1'
	at org.apache.solr.client.solrj.impl.HttpSolrClient.executeMethod(HttpSolrClient.java:608)
	at org.apache.solr.client.solrj.impl.HttpSolrClient.request(HttpSolrClient.java:261)
	at org.apache.solr.client.solrj.impl.HttpSolrClient.request(HttpSolrClient.java:250)
	at org.apache.solr.client.solrj.impl.LBHttpSolrClient.doRequest(LBHttpSolrClient.java:415)
	at org.apache.solr.client.solrj.impl.LBHttpSolrClient.request(LBHttpSolrClient.java:367)
	at org.apache.solr.client.solrj.impl.CloudSolrClient.lambda$directUpdate$0(CloudSolrClient.java:730)
	at java.util.concurrent.FutureTask.run(java.base@9-ea/FutureTask.java:264)
	at org.apache.solr.common.util.ExecutorUtil$MDCAwareThreadPoolExecutor.lambda$execute$0(ExecutorUtil.java:229)
	at java.util.concurrent.ThreadPoolExecutor.runWorker(java.base@9-ea/ThreadPoolExecutor.java:1158)
	at java.util.concurrent.ThreadPoolExecutor$Worker.run(java.base@9-ea/ThreadPoolExecutor.java:632)
	... 1 more




Build Log:
[...truncated 10721 lines...]
   [junit4] Suite: org.apache.solr.schema.TestManagedSchemaAPI
   [junit4]   2> Creating dataDir: /home/jenkins/workspace/Lucene-Solr-master-Linux/solr/build/solr-core/test/J1/temp/solr.schema.TestManagedSchemaAPI_6C5C315B86FED539-001/init-core-data-001
   [junit4]   2> 162757 INFO  (SUITE-TestManagedSchemaAPI-seed#[6C5C315B86FED539]-worker) [    ] o.a.s.SolrTestCaseJ4 Randomized ssl (true) and clientAuth (true) via: @org.apache.solr.util.RandomizeSSL(reason="", ssl=0.0/0.0, value=0.0/0.0, clientAuth=0.0/0.0)
   [junit4]   2> 162759 INFO  (SUITE-TestManagedSchemaAPI-seed#[6C5C315B86FED539]-worker) [    ] o.a.s.c.ZkTestServer STARTING ZK TEST SERVER
   [junit4]   2> 162759 INFO  (Thread-262) [    ] o.a.s.c.ZkTestServer client port:0.0.0.0/0.0.0.0:0
   [junit4]   2> 162759 INFO  (Thread-262) [    ] o.a.s.c.ZkTestServer Starting server
   [junit4]   2> 162859 INFO  (SUITE-TestManagedSchemaAPI-seed#[6C5C315B86FED539]-worker) [    ] o.a.s.c.ZkTestServer start zk server on port:37103
   [junit4]   2> 162859 INFO  (SUITE-TestManagedSchemaAPI-seed#[6C5C315B86FED539]-worker) [    ] o.a.s.c.c.SolrZkClient Using default ZkCredentialsProvider
   [junit4]   2> 162860 INFO  (SUITE-TestManagedSchemaAPI-seed#[6C5C315B86FED539]-worker) [    ] o.a.s.c.c.ConnectionManager Waiting for client to connect to ZooKeeper
   [junit4]   2> 162864 INFO  (zkCallback-132-thread-1) [    ] o.a.s.c.c.ConnectionManager Watcher org.apache.solr.common.cloud.ConnectionManager@58f59460 name:ZooKeeperConnection Watcher:127.0.0.1:37103 got event WatchedEvent state:SyncConnected type:None path:null path:null type:None
   [junit4]   2> 162864 INFO  (SUITE-TestManagedSchemaAPI-seed#[6C5C315B86FED539]-worker) [    ] o.a.s.c.c.ConnectionManager Client is connected to ZooKeeper
   [junit4]   2> 162864 INFO  (SUITE-TestManagedSchemaAPI-seed#[6C5C315B86FED539]-worker) [    ] o.a.s.c.c.SolrZkClient Using default ZkACLProvider
   [junit4]   2> 162864 INFO  (SUITE-TestManagedSchemaAPI-seed#[6C5C315B86FED539]-worker) [    ] o.a.s.c.c.SolrZkClient makePath: /solr/solr.xml
   [junit4]   2> 162867 INFO  (SUITE-TestManagedSchemaAPI-seed#[6C5C315B86FED539]-worker) [    ] o.a.s.c.c.SolrZkClient makePath: /solr/clusterprops.json
   [junit4]   2> 162879 INFO  (jetty-launcher-131-thread-1) [    ] o.e.j.s.Server jetty-9.3.8.v20160314
   [junit4]   2> 162880 INFO  (jetty-launcher-131-thread-2) [    ] o.e.j.s.Server jetty-9.3.8.v20160314
   [junit4]   2> 162886 INFO  (jetty-launcher-131-thread-1) [    ] o.e.j.s.h.ContextHandler Started o.e.j.s.ServletContextHandler@3fb53c17{/solr,null,AVAILABLE}
   [junit4]   2> 162901 INFO  (jetty-launcher-131-thread-2) [    ] o.e.j.s.h.ContextHandler Started o.e.j.s.ServletContextHandler@1b55f9f6{/solr,null,AVAILABLE}
   [junit4]   2> 162903 INFO  (jetty-launcher-131-thread-1) [    ] o.e.j.s.ServerConnector Started ServerConnector@76b6ab10{SSL,[ssl, http/1.1]}{127.0.0.1:41878}
   [junit4]   2> 162903 INFO  (jetty-launcher-131-thread-1) [    ] o.e.j.s.Server Started @165137ms
   [junit4]   2> 162903 INFO  (jetty-launcher-131-thread-1) [    ] o.a.s.c.s.e.JettySolrRunner Jetty properties: {hostContext=/solr, hostPort=41878}
   [junit4]   2> 162903 INFO  (jetty-launcher-131-thread-1) [    ] o.a.s.s.SolrDispatchFilter SolrDispatchFilter.init(): jdk.internal.loader.ClassLoaders$AppClassLoader@7cdbc5d3
   [junit4]   2> 162903 INFO  (jetty-launcher-131-thread-1) [    ] o.a.s.c.SolrResourceLoader new SolrResourceLoader for directory: '/home/jenkins/workspace/Lucene-Solr-master-Linux/solr/build/solr-core/test/J1/temp/solr.schema.TestManagedSchemaAPI_6C5C315B86FED539-001/tempDir-001/node1'
   [junit4]   2> 162903 INFO  (jetty-launcher-131-thread-1) [    ] o.a.s.c.SolrResourceLoader JNDI not configured for solr (NoInitialContextEx)
   [junit4]   2> 162903 INFO  (jetty-launcher-131-thread-1) [    ] o.a.s.c.SolrResourceLoader solr home defaulted to 'solr/' (could not find system property or JNDI)
   [junit4]   2> 162903 INFO  (jetty-launcher-131-thread-1) [    ] o.a.s.c.c.SolrZkClient Using default ZkCredentialsProvider
   [junit4]   2> 162904 INFO  (jetty-launcher-131-thread-1) [    ] o.a.s.c.c.ConnectionManager Waiting for client to connect to ZooKeeper
   [junit4]   2> 162905 INFO  (jetty-launcher-131-thread-2) [    ] o.e.j.s.ServerConnector Started ServerConnector@6d6967cb{SSL,[ssl, http/1.1]}{127.0.0.1:44152}
   [junit4]   2> 162905 INFO  (jetty-launcher-131-thread-2) [    ] o.e.j.s.Server Started @165139ms
   [junit4]   2> 162905 INFO  (jetty-launcher-131-thread-2) [    ] o.a.s.c.s.e.JettySolrRunner Jetty properties: {hostContext=/solr, hostPort=44152}
   [junit4]   2> 162905 INFO  (jetty-launcher-131-thread-2) [    ] o.a.s.s.SolrDispatchFilter SolrDispatchFilter.init(): jdk.internal.loader.ClassLoaders$AppClassLoader@7cdbc5d3
   [junit4]   2> 162905 INFO  (jetty-launcher-131-thread-2) [    ] o.a.s.c.SolrResourceLoader new SolrResourceLoader for directory: '/home/jenkins/workspace/Lucene-Solr-master-Linux/solr/build/solr-core/test/J1/temp/solr.schema.TestManagedSchemaAPI_6C5C315B86FED539-001/tempDir-001/node2'
   [junit4]   2> 162905 INFO  (jetty-launcher-131-thread-2) [    ] o.a.s.c.SolrResourceLoader JNDI not configured for solr (NoInitialContextEx)
   [junit4]   2> 162905 INFO  (jetty-launcher-131-thread-2) [    ] o.a.s.c.SolrResourceLoader solr home defaulted to 'solr/' (could not find system property or JNDI)
   [junit4]   2> 162905 INFO  (jetty-launcher-131-thread-2) [    ] o.a.s.c.c.SolrZkClient Using default ZkCredentialsProvider
   [junit4]   2> 162906 INFO  (jetty-launcher-131-thread-2) [    ] o.a.s.c.c.ConnectionManager Waiting for client to connect to ZooKeeper
   [junit4]   2> 162907 INFO  (zkCallback-133-thread-1) [    ] o.a.s.c.c.ConnectionManager Watcher org.apache.solr.common.cloud.ConnectionManager@49b99099 name:ZooKeeperConnection Watcher:127.0.0.1:37103/solr got event WatchedEvent state:SyncConnected type:None path:null path:null type:None
   [junit4]   2> 162907 INFO  (jetty-launcher-131-thread-1) [    ] o.a.s.c.c.ConnectionManager Client is connected to ZooKeeper
   [junit4]   2> 162907 INFO  (jetty-launcher-131-thread-1) [    ] o.a.s.c.c.SolrZkClient Using default ZkACLProvider
   [junit4]   2> 162908 INFO  (zkCallback-134-thread-1) [    ] o.a.s.c.c.ConnectionManager Watcher org.apache.solr.common.cloud.ConnectionManager@5f9c51ef name:ZooKeeperConnection Watcher:127.0.0.1:37103/solr got event WatchedEvent state:SyncConnected type:None path:null path:null type:None
   [junit4]   2> 162908 INFO  (jetty-launcher-131-thread-2) [    ] o.a.s.c.c.ConnectionManager Client is connected to ZooKeeper
   [junit4]   2> 162909 INFO  (jetty-launcher-131-thread-2) [    ] o.a.s.c.c.SolrZkClient Using default ZkACLProvider
   [junit4]   2> 162909 INFO  (jetty-launcher-131-thread-1) [    ] o.a.s.s.SolrDispatchFilter solr.xml found in ZooKeeper. Loading...
   [junit4]   2> 162909 INFO  (jetty-launcher-131-thread-2) [    ] o.a.s.s.SolrDispatchFilter solr.xml found in ZooKeeper. Loading...
   [junit4]   2> 162916 INFO  (jetty-launcher-131-thread-2) [    ] o.a.s.c.CorePropertiesLocator Config-defined core root directory: /home/jenkins/workspace/Lucene-Solr-master-Linux/solr/build/solr-core/test/J1/temp/solr.schema.TestManagedSchemaAPI_6C5C315B86FED539-001/tempDir-001/node2/.
   [junit4]   2> 162917 INFO  (jetty-launcher-131-thread-2) [    ] o.a.s.c.CoreContainer New CoreContainer 113068885
   [junit4]   2> 162917 INFO  (jetty-launcher-131-thread-2) [    ] o.a.s.c.CoreContainer Loading cores into CoreContainer [instanceDir=/home/jenkins/workspace/Lucene-Solr-master-Linux/solr/build/solr-core/test/J1/temp/solr.schema.TestManagedSchemaAPI_6C5C315B86FED539-001/tempDir-001/node2]
   [junit4]   2> 162917 WARN  (jetty-launcher-131-thread-2) [    ] o.a.s.c.CoreContainer Couldn't add files from /home/jenkins/workspace/Lucene-Solr-master-Linux/solr/build/solr-core/test/J1/temp/solr.schema.TestManagedSchemaAPI_6C5C315B86FED539-001/tempDir-001/node2/lib to classpath: /home/jenkins/workspace/Lucene-Solr-master-Linux/solr/build/solr-core/test/J1/temp/solr.schema.TestManagedSchemaAPI_6C5C315B86FED539-001/tempDir-001/node2/lib
   [junit4]   2> 162917 INFO  (jetty-launcher-131-thread-2) [    ] o.a.s.h.c.HttpShardHandlerFactory created with socketTimeout : 90000,urlScheme : https,connTimeout : 15000,maxConnectionsPerHost : 20,maxConnections : 10000,corePoolSize : 0,maximumPoolSize : 2147483647,maxThreadIdleTime : 5,sizeOfQueue : -1,fairnessPolicy : false,
   [junit4]   2> 162918 INFO  (jetty-launcher-131-thread-1) [    ] o.a.s.c.CorePropertiesLocator Config-defined core root directory: /home/jenkins/workspace/Lucene-Solr-master-Linux/solr/build/solr-core/test/J1/temp/solr.schema.TestManagedSchemaAPI_6C5C315B86FED539-001/tempDir-001/node1/.
   [junit4]   2> 162918 INFO  (jetty-launcher-131-thread-1) [    ] o.a.s.c.CoreContainer New CoreContainer 339442996
   [junit4]   2> 162918 INFO  (jetty-launcher-131-thread-1) [    ] o.a.s.c.CoreContainer Loading cores into CoreContainer [instanceDir=/home/jenkins/workspace/Lucene-Solr-master-Linux/solr/build/solr-core/test/J1/temp/solr.schema.TestManagedSchemaAPI_6C5C315B86FED539-001/tempDir-001/node1]
   [junit4]   2> 162918 WARN  (jetty-launcher-131-thread-1) [    ] o.a.s.c.CoreContainer Couldn't add files from /home/jenkins/workspace/Lucene-Solr-master-Linux/solr/build/solr-core/test/J1/temp/solr.schema.TestManagedSchemaAPI_6C5C315B86FED539-001/tempDir-001/node1/lib to classpath: /home/jenkins/workspace/Lucene-Solr-master-Linux/solr/build/solr-core/test/J1/temp/solr.schema.TestManagedSchemaAPI_6C5C315B86FED539-001/tempDir-001/node1/lib
   [junit4]   2> 162918 INFO  (jetty-launcher-131-thread-1) [    ] o.a.s.h.c.HttpShardHandlerFactory created with socketTimeout : 90000,urlScheme : https,connTimeout : 15000,maxConnectionsPerHost : 20,maxConnections : 10000,corePoolSize : 0,maximumPoolSize : 2147483647,maxThreadIdleTime : 5,sizeOfQueue : -1,fairnessPolicy : false,
   [junit4]   2> 162919 INFO  (jetty-launcher-131-thread-2) [    ] o.a.s.u.UpdateShardHandler Created UpdateShardHandler HTTP client with params: socketTimeout=340000&connTimeout=45000&maxConnections=100000&maxConnectionsPerHost=100000
   [junit4]   2> 162919 INFO  (jetty-launcher-131-thread-2) [    ] o.a.s.l.LogWatcher SLF4J impl is org.slf4j.impl.Log4jLoggerFactory
   [junit4]   2> 162919 INFO  (jetty-launcher-131-thread-2) [    ] o.a.s.l.LogWatcher Registering Log Listener [Log4j (org.slf4j.impl.Log4jLoggerFactory)]
   [junit4]   2> 162919 INFO  (jetty-launcher-131-thread-2) [    ] o.a.s.c.ZkContainer Zookeeper client=127.0.0.1:37103/solr
   [junit4]   2> 162919 INFO  (jetty-launcher-131-thread-2) [    ] o.a.s.c.ZkController zkHost includes chroot
   [junit4]   2> 162919 INFO  (jetty-launcher-131-thread-2) [    ] o.a.s.c.c.SolrZkClient Using default ZkCredentialsProvider
   [junit4]   2> 162922 INFO  (jetty-launcher-131-thread-1) [    ] o.a.s.u.UpdateShardHandler Created UpdateShardHandler HTTP client with params: socketTimeout=340000&connTimeout=45000&maxConnections=100000&maxConnectionsPerHost=100000
   [junit4]   2> 162922 INFO  (jetty-launcher-131-thread-1) [    ] o.a.s.l.LogWatcher SLF4J impl is org.slf4j.impl.Log4jLoggerFactory
   [junit4]   2> 162922 INFO  (jetty-launcher-131-thread-1) [    ] o.a.s.l.LogWatcher Registering Log Listener [Log4j (org.slf4j.impl.Log4jLoggerFactory)]
   [junit4]   2> 162922 INFO  (jetty-launcher-131-thread-1) [    ] o.a.s.c.ZkContainer Zookeeper client=127.0.0.1:37103/solr
   [junit4]   2> 162922 INFO  (jetty-launcher-131-thread-1) [    ] o.a.s.c.ZkController zkHost includes chroot
   [junit4]   2> 162922 INFO  (jetty-launcher-131-thread-1) [    ] o.a.s.c.c.SolrZkClient Using default ZkCredentialsProvider
   [junit4]   2> 162923 INFO  (jetty-launcher-131-thread-1) [    ] o.a.s.c.c.ConnectionManager Waiting for client to connect to ZooKeeper
   [junit4]   2> 162923 INFO  (jetty-launcher-131-thread-2) [    ] o.a.s.c.c.ConnectionManager Waiting for client to connect to ZooKeeper
   [junit4]   2> 162924 INFO  (zkCallback-140-thread-1) [    ] o.a.s.c.c.ConnectionManager Watcher org.apache.solr.common.cloud.ConnectionManager@5f1a6875 name:ZooKeeperConnection Watcher:127.0.0.1:37103 got event WatchedEvent state:SyncConnected type:None path:null path:null type:None
   [junit4]   2> 162924 INFO  (jetty-launcher-131-thread-1) [    ] o.a.s.c.c.ConnectionManager Client is connected to ZooKeeper
   [junit4]   2> 162924 INFO  (jetty-launcher-131-thread-1) [    ] o.a.s.c.c.SolrZkClient Using default ZkACLProvider
   [junit4]   2> 162925 WARN  (NIOServerCxn.Factory:0.0.0.0/0.0.0.0:0) [    ] o.a.z.s.NIOServerCnxn caught end of stream exception
   [junit4]   2> EndOfStreamException: Unable to read additional data from client sessionid 0x156ea8745c40003, likely client has closed socket
   [junit4]   2> 	at org.apache.zookeeper.server.NIOServerCnxn.doIO(NIOServerCnxn.java:228)
   [junit4]   2> 	at org.apache.zookeeper.server.NIOServerCnxnFactory.run(NIOServerCnxnFactory.java:208)
   [junit4]   2> 	at java.lang.Thread.run(java.base@9-ea/Thread.java:843)
   [junit4]   2> 162926 INFO  (jetty-launcher-131-thread-1) [    ] o.a.s.c.ZkController Added new OnReconnect listener org.apache.solr.cloud.ZkController$$Lambda$213/69548626@1660b87
   [junit4]   2> 162926 INFO  (jetty-launcher-131-thread-1) [    ] o.a.s.c.c.ConnectionManager Waiting for client to connect to ZooKeeper
   [junit4]   2> 162930 INFO  (zkCallback-137-thread-1) [    ] o.a.s.c.c.ConnectionManager Watcher org.apache.solr.common.cloud.ConnectionManager@c15325e name:ZooKeeperConnection Watcher:127.0.0.1:37103 got event WatchedEvent state:SyncConnected type:None path:null path:null type:None
   [junit4]   2> 162930 INFO  (jetty-launcher-131-thread-2) [    ] o.a.s.c.c.ConnectionManager Client is connected to ZooKeeper
   [junit4]   2> 162931 INFO  (jetty-launcher-131-thread-2) [    ] o.a.s.c.c.SolrZkClient Using default ZkACLProvider
   [junit4]   2> 162938 INFO  (jetty-launcher-131-thread-2) [    ] o.a.s.c.ZkController Added new OnReconnect listener org.apache.solr.cloud.ZkController$$Lambda$213/69548626@e24c3c
   [junit4]   2> 162938 INFO  (jetty-launcher-131-thread-2) [    ] o.a.s.c.c.ConnectionManager Waiting for client to connect to ZooKeeper
   [junit4]   2> 162942 INFO  (zkCallback-141-thread-1) [    ] o.a.s.c.c.ConnectionManager Watcher org.apache.solr.common.cloud.ConnectionManager@76a6511f name:ZooKeeperConnection Watcher:127.0.0.1:37103/solr got event WatchedEvent state:SyncConnected type:None path:null path:null type:None
   [junit4]   2> 162942 INFO  (jetty-launcher-131-thread-1) [    ] o.a.s.c.c.ConnectionManager Client is connected to ZooKeeper
   [junit4]   2> 162942 INFO  (zkCallback-142-thread-1) [    ] o.a.s.c.c.ConnectionManager Watcher org.apache.solr.common.cloud.ConnectionManager@76206264 name:ZooKeeperConnection Watcher:127.0.0.1:37103/solr got event WatchedEvent state:SyncConnected type:None path:null path:null type:None
   [junit4]   2> 162942 INFO  (jetty-launcher-131-thread-2) [    ] o.a.s.c.c.ConnectionManager Client is connected to ZooKeeper
   [junit4]   2> 162943 INFO  (jetty-launcher-131-thread-2) [    ] o.a.s.c.c.SolrZkClient makePath: /overseer/queue
   [junit4]   2> 162945 INFO  (jetty-launcher-131-thread-2) [    ] o.a.s.c.c.SolrZkClient makePath: /overseer/collection-queue-work
   [junit4]   2> 162945 INFO  (jetty-launcher-131-thread-1) [    ] o.a.s.c.c.SolrZkClient makePath: /overseer/collection-queue-work
   [junit4]   2> 162947 INFO  (jetty-launcher-131-thread-1) [    ] o.a.s.c.c.SolrZkClient makePath: /overseer/collection-map-running
   [junit4]   2> 162948 INFO  (jetty-launcher-131-thread-2) [    ] o.a.s.c.c.SolrZkClient makePath: /overseer/collection-map-running
   [junit4]   2> 162949 INFO  (jetty-launcher-131-thread-1) [    ] o.a.s.c.c.SolrZkClient makePath: /overseer/collection-map-completed
   [junit4]   2> 162950 INFO  (jetty-launcher-131-thread-2) [    ] o.a.s.c.c.SolrZkClient makePath: /overseer/collection-map-completed
   [junit4]   2> 162951 INFO  (jetty-launcher-131-thread-2) [    ] o.a.s.c.c.SolrZkClient makePath: /overseer/collection-map-failure
   [junit4]   2> 162951 INFO  (jetty-launcher-131-thread-1) [    ] o.a.s.c.c.SolrZkClient makePath: /overseer/collection-map-failure
   [junit4]   2> 162953 INFO  (jetty-launcher-131-thread-2) [    ] o.a.s.c.c.SolrZkClient makePath: /live_nodes
   [junit4]   2> 162953 INFO  (jetty-launcher-131-thread-1) [    ] o.a.s.c.c.SolrZkClient makePath: /live_nodes
   [junit4]   2> 162953 INFO  (jetty-launcher-131-thread-1) [    ] o.a.s.c.c.SolrZkClient makePath: /collections
   [junit4]   2> 162953 INFO  (jetty-launcher-131-thread-2) [    ] o.a.s.c.c.SolrZkClient makePath: /collections
   [junit4]   2> 162954 INFO  (jetty-launcher-131-thread-1) [    ] o.a.s.c.c.SolrZkClient makePath: /aliases.json
   [junit4]   2> 162954 INFO  (jetty-launcher-131-thread-2) [    ] o.a.s.c.c.SolrZkClient makePath: /aliases.json
   [junit4]   2> 162955 INFO  (jetty-launcher-131-thread-1) [    ] o.a.s.c.c.SolrZkClient makePath: /clusterstate.json
   [junit4]   2> 162955 INFO  (jetty-launcher-131-thread-2) [    ] o.a.s.c.c.SolrZkClient makePath: /clusterstate.json
   [junit4]   2> 162955 INFO  (jetty-launcher-131-thread-2) [    ] o.a.s.c.c.SolrZkClient makePath: /security.json
   [junit4]   2> 162955 INFO  (jetty-launcher-131-thread-1) [    ] o.a.s.c.c.SolrZkClient makePath: /security.json
   [junit4]   2> 162956 INFO  (jetty-launcher-131-thread-2) [    ] o.a.s.c.c.ZkStateReader Updating cluster state from ZooKeeper... 
   [junit4]   2> 162956 INFO  (jetty-launcher-131-thread-1) [    ] o.a.s.c.c.ZkStateReader Updating cluster state from ZooKeeper... 
   [junit4]   2> 162957 INFO  (jetty-launcher-131-thread-2) [    ] o.a.s.c.c.ZkStateReader Loaded cluster properties: {urlScheme=https}
   [junit4]   2> 162957 INFO  (jetty-launcher-131-thread-1) [    ] o.a.s.c.c.ZkStateReader Loaded cluster properties: {urlScheme=https}
   [junit4]   2> 162957 INFO  (jetty-launcher-131-thread-2) [    ] o.a.s.c.c.ZkStateReader Updated live nodes from ZooKeeper... (0) -> (0)
   [junit4]   2> 162957 INFO  (jetty-launcher-131-thread-1) [    ] o.a.s.c.c.ZkStateReader Updated live nodes from ZooKeeper... (0) -> (0)
   [junit4]   2> 162958 INFO  (jetty-launcher-131-thread-2) [    ] o.a.s.c.c.SolrZkClient makePath: /overseer_elect
   [junit4]   2> 162959 INFO  (jetty-launcher-131-thread-1) [    ] o.a.s.c.c.SolrZkClient makePath: /overseer_elect
   [junit4]   2> 162959 INFO  (jetty-launcher-131-thread-2) [    ] o.a.s.c.c.SolrZkClient makePath: /overseer_elect/election
   [junit4]   2> 162959 INFO  (jetty-launcher-131-thread-1) [    ] o.a.s.c.c.SolrZkClient makePath: /overseer_elect/election
   [junit4]   2> 162960 INFO  (jetty-launcher-131-thread-2) [    ] o.a.s.c.Overseer Overseer (id=null) closing
   [junit4]   2> 162960 INFO  (jetty-launcher-131-thread-2) [    ] o.a.s.c.LeaderElector Joined leadership election with path: /overseer_elect/election/96522308747001862-127.0.0.1:44152_solr-n_0000000000
   [junit4]   2> 162960 INFO  (jetty-launcher-131-thread-1) [    ] o.a.s.c.Overseer Overseer (id=null) closing
   [junit4]   2> 162960 INFO  (jetty-launcher-131-thread-1) [    ] o.a.s.c.LeaderElector Joined leadership election with path: /overseer_elect/election/96522308747001861-127.0.0.1:41878_solr-n_0000000001
   [junit4]   2> 162960 INFO  (jetty-launcher-131-thread-2) [    ] o.a.s.c.OverseerElectionContext I am going to be the leader 127.0.0.1:44152_solr
   [junit4]   2> 162961 INFO  (jetty-launcher-131-thread-2) [    ] o.a.s.c.c.SolrZkClient makePath: /overseer_elect/leader
   [junit4]   2> 162961 INFO  (jetty-launcher-131-thread-1) [    ] o.a.s.c.LeaderElector Watching path /overseer_elect/election/96522308747001862-127.0.0.1:44152_solr-n_0000000000 to know if I could be the leader
   [junit4]   2> 162961 INFO  (jetty-launcher-131-thread-1) [    ] o.a.s.c.ZkController Register node as live in ZooKeeper:/live_nodes/127.0.0.1:41878_solr
   [junit4]   2> 162961 INFO  (jetty-launcher-131-thread-1) [    ] o.a.s.c.c.SolrZkClient makePath: /live_nodes/127.0.0.1:41878_solr
   [junit4]   2> 162967 INFO  (jetty-launcher-131-thread-2) [    ] o.a.s.c.Overseer Overseer (id=96522308747001862-127.0.0.1:44152_solr-n_0000000000) starting
   [junit4]   2> 162967 INFO  (zkCallback-141-thread-1) [    ] o.a.s.c.c.ZkStateReader A live node change: [WatchedEvent state:SyncConnected type:NodeChildrenChanged path:/live_nodes], has occurred - updating... (live nodes size: [0])
   [junit4]   2> 162967 INFO  (zkCallback-142-thread-1) [    ] o.a.s.c.c.ZkStateReader A live node change: [WatchedEvent state:SyncConnected type:NodeChildrenChanged path:/live_nodes], has occurred - updating... (live nodes size: [0])
   [junit4]   2> 162973 INFO  (zkCallback-142-thread-1) [    ] o.a.s.c.c.ZkStateReader Updated live nodes from ZooKeeper... (0) -> (1)
   [junit4]   2> 162975 INFO  (jetty-launcher-131-thread-2) [    ] o.a.s.c.c.SolrZkClient makePath: /overseer/queue-work
   [junit4]   2> 162979 INFO  (jetty-launcher-131-thread-2) [    ] o.a.s.c.OverseerAutoReplicaFailoverThread Starting OverseerAutoReplicaFailoverThread autoReplicaFailoverWorkLoopDelay=10000 autoReplicaFailoverWaitAfterExpiration=30000 autoReplicaFailoverBadNodeExpiration=60000
   [junit4]   2> 162981 INFO  (OverseerStateUpdate-96522308747001862-127.0.0.1:44152_solr-n_0000000000) [    ] o.a.s.c.Overseer Starting to work on the main queue
   [junit4]   2> 162981 INFO  (OverseerStateUpdate-96522308747001862-127.0.0.1:44152_solr-n_0000000000) [    ] o.a.s.c.c.ZkStateReader Updated live nodes from ZooKeeper... (1) -> (1)
   [junit4]   2> 162983 INFO  (jetty-launcher-131-thread-1) [    ] o.a.s.c.CoreContainer Security conf doesn't exist. Skipping setup for authorization module.
   [junit4]   2> 162983 INFO  (jetty-launcher-131-thread-1) [    ] o.a.s.c.CoreContainer No authentication plugin used.
   [junit4]   2> 162984 INFO  (jetty-launcher-131-thread-1) [    ] o.a.s.c.CorePropertiesLocator Looking for core definitions underneath /home/jenkins/workspace/Lucene-Solr-master-Linux/solr/build/solr-core/test/J1/temp/solr.schema.TestManagedSchemaAPI_6C5C315B86FED539-001/tempDir-001/node1/.
   [junit4]   2> 162984 INFO  (jetty-launcher-131-thread-1) [    ] o.a.s.c.CorePropertiesLocator Found 0 core definitions
   [junit4]   2> 162993 INFO  (zkCallback-141-thread-1) [    ] o.a.s.c.c.ZkStateReader Updated live nodes from ZooKeeper... (0) -> (1)
   [junit4]   2> 162996 INFO  (OverseerCollectionConfigSetProcessor-96522308747001862-127.0.0.1:44152_solr-n_0000000000) [    ] o.a.s.c.OverseerTaskProcessor Process current queue of overseer operations
   [junit4]   2> 162996 INFO  (jetty-launcher-131-thread-2) [    ] o.a.s.c.ZkController Publish node=127.0.0.1:44152_solr as DOWN
   [junit4]   2> 162996 INFO  (jetty-launcher-131-thread-1) [    ] o.a.s.s.SolrDispatchFilter user.dir=/home/jenkins/workspace/Lucene-Solr-master-Linux/solr/build/solr-core/test/J1
   [junit4]   2> 162996 INFO  (jetty-launcher-131-thread-1) [    ] o.a.s.s.SolrDispatchFilter SolrDispatchFilter.init() done
   [junit4]   2> 162998 INFO  (jetty-launcher-131-thread-2) [    ] o.a.s.c.ZkController Register node as live in ZooKeeper:/live_nodes/127.0.0.1:44152_solr
   [junit4]   2> 162998 INFO  (jetty-launcher-131-thread-2) [    ] o.a.s.c.c.SolrZkClient makePath: /live_nodes/127.0.0.1:44152_solr
   [junit4]   2> 162998 INFO  (OverseerStateUpdate-96522308747001862-127.0.0.1:44152_solr-n_0000000000) [    ] o.a.s.c.Overseer processMessage: queueSize: 1, message = {
   [junit4]   2>   "operation":"downnode",
   [junit4]   2>   "node_name":"127.0.0.1:44152_solr"} current state version: 0
   [junit4]   2> 162998 INFO  (OverseerStateUpdate-96522308747001862-127.0.0.1:44152_solr-n_0000000000) [    ] o.a.s.c.o.NodeMutator DownNode state invoked for node: 127.0.0.1:44152_solr
   [junit4]   2> 162998 INFO  (zkCallback-142-thread-1) [    ] o.a.s.c.c.ZkStateReader A live node change: [WatchedEvent state:SyncConnected type:NodeChildrenChanged path:/live_nodes], has occurred - updating... (live nodes size: [1])
   [junit4]   2> 162998 INFO  (zkCallback-141-thread-1) [    ] o.a.s.c.c.ZkStateReader A live node change: [WatchedEvent state:SyncConnected type:NodeChildrenChanged path:/live_nodes], has occurred - updating... (live nodes size: [1])
   [junit4]   2> 162998 INFO  (zkCallback-141-thread-1) [    ] o.a.s.c.c.ZkStateReader Updated live nodes from ZooKeeper... (1) -> (2)
   [junit4]   2> 162998 INFO  (zkCallback-142-thread-1) [    ] o.a.s.c.c.ZkStateReader Updated live nodes from ZooKeeper... (1) -> (2)
   [junit4]   2> 163022 INFO  (jetty-launcher-131-thread-2) [    ] o.a.s.c.CoreContainer Security conf doesn't exist. Skipping setup for authorization module.
   [junit4]   2> 163023 INFO  (jetty-launcher-131-thread-2) [    ] o.a.s.c.CoreContainer No authentication plugin used.
   [junit4]   2> 163023 INFO  (jetty-launcher-131-thread-2) [    ] o.a.s.c.CorePropertiesLocator Looking for core definitions underneath /home/jenkins/workspace/Lucene-Solr-master-Linux/solr/build/solr-core/test/J1/temp/solr.schema.TestManagedSchemaAPI_6C5C315B86FED539-001/tempDir-001/node2/.
   [junit4]   2> 163023 INFO  (jetty-launcher-131-thread-2) [    ] o.a.s.c.CorePropertiesLocator Found 0 core definitions
   [junit4]   2> 163033 INFO  (jetty-launcher-131-thread-2) [    ] o.a.s.s.SolrDispatchFilter user.dir=/home/jenkins/workspace/Lucene-Solr-master-Linux/solr/build/solr-core/test/J1
   [junit4]   2> 163033 INFO  (jetty-launcher-131-thread-2) [    ] o.a.s.s.SolrDispatchFilter SolrDispatchFilter.init() done
   [junit4]   2> 163033 INFO  (SUITE-TestManagedSchemaAPI-seed#[6C5C315B86FED539]-worker) [    ] o.a.s.c.c.SolrZkClient Using default ZkCredentialsProvider
   [junit4]   2> 163034 INFO  (SUITE-TestManagedSchemaAPI-seed#[6C5C315B86FED539]-worker) [    ] o.a.s.c.c.ConnectionManager Waiting for client to connect to ZooKeeper
   [junit4]   2> 163038 INFO  (zkCallback-145-thread-1) [    ] o.a.s.c.c.ConnectionManager Watcher org.apache.solr.common.cloud.ConnectionManager@59cea713 name:ZooKeeperConnection Watcher:127.0.0.1:37103 got event WatchedEvent state:SyncConnected type:None path:null path:null type:None
   [junit4]   2> 163038 INFO  (SUITE-TestManagedSchemaAPI-seed#[6C5C315B86FED539]-worker) [    ] o.a.s.c.c.ConnectionManager Client is connected to ZooKeeper
   [junit4]   2> 163038 INFO  (SUITE-TestManagedSchemaAPI-seed#[6C5C315B86FED539]-worker) [    ] o.a.s.c.c.SolrZkClient Using default ZkACLProvider
   [junit4]   2> 163044 INFO  (SUITE-TestManagedSchemaAPI-seed#[6C5C315B86FED539]-worker) [    ] o.a.s.c.c.SolrZkClient Using default ZkCredentialsProvider
   [junit4]   2> 163046 INFO  (SUITE-TestManagedSchemaAPI-seed#[6C5C315B86FED539]-worker) [    ] o.a.s.c.c.ConnectionManager Waiting for client to connect to ZooKeeper
   [junit4]   2> 163051 INFO  (zkCallback-148-thread-1) [    ] o.a.s.c.c.ConnectionManager Watcher org.apache.solr.common.cloud.ConnectionManager@6a32fdde name:ZooKeeperConnection Watcher:127.0.0.1:37103/solr got event WatchedEvent state:SyncConnected type:None path:null path:null type:None
   [junit4]   2> 163051 INFO  (SUITE-TestManagedSchemaAPI-seed#[6C5C315B86FED539]-worker) [    ] o.a.s.c.c.ConnectionManager Client is connected to ZooKeeper
   [junit4]   2> 163051 INFO  (SUITE-TestManagedSchemaAPI-seed#[6C5C315B86FED539]-worker) [    ] o.a.s.c.c.SolrZkClient Using default ZkACLProvider
   [junit4]   2> 163051 INFO  (SUITE-TestManagedSchemaAPI-seed#[6C5C315B86FED539]-worker) [    ] o.a.s.c.c.ZkStateReader Updating cluster state from ZooKeeper... 
   [junit4]   2> 163053 INFO  (SUITE-TestManagedSchemaAPI-seed#[6C5C315B86FED539]-worker) [    ] o.a.s.c.c.ZkStateReader Loaded cluster properties: {urlScheme=https}
   [junit4]   2> 163053 INFO  (SUITE-TestManagedSchemaAPI-seed#[6C5C315B86FED539]-worker) [    ] o.a.s.c.c.ZkStateReader Updated live nodes from ZooKeeper... (0) -> (2)
   [junit4]   2> 163054 INFO  (SUITE-TestManagedSchemaAPI-seed#[6C5C315B86FED539]-worker) [    ] o.a.s.c.c.SolrZkClient makePath: /configs/conf1/solrconfig.xml
   [junit4]   2> 163056 INFO  (SUITE-TestManagedSchemaAPI-seed#[6C5C315B86FED539]-worker) [    ] o.a.s.c.c.SolrZkClient makePath: /configs/conf1/managed-schema
   [junit4]   2> 163072 INFO  (TEST-TestManagedSchemaAPI.test-seed#[6C5C315B86FED539]) [    ] o.a.s.SolrTestCaseJ4 ###Starting test
   [junit4]   2> 163114 INFO  (qtp414058973-921) [    ] o.a.s.h.a.CollectionsHandler Invoked Collection Action :create with params replicationFactor=2&collection.configName=conf1&name=testschemaapi&action=CREATE&numShards=1&wt=javabin&version=2 and sendToOCPQueue=true
   [junit4]   2> 163115 INFO  (OverseerCollectionConfigSetProcessor-96522308747001862-127.0.0.1:44152_solr-n_0000000000) [    ] o.a.s.c.OverseerTaskProcessor Overseer Collection Message Handler: Get the message id:/overseer/collection-queue-work/qn-0000000000 message:{
   [junit4]   2>   "name":"testschemaapi",
   [junit4]   2>   "fromApi":"true",
   [junit4]   2>   "replicationFactor":"2",
   [junit4]   2>   "collection.configName":"conf1",
   [junit4]   2>   "numShards":"1",
   [junit4]   2>   "stateFormat":"2",
   [junit4]   2>   "operation":"create"}
   [junit4]   2> 163120 INFO  (OverseerThreadFactory-386-thread-1) [    ] o.a.s.c.OverseerCollectionMessageHandler OverseerCollectionMessageHandler.processMessage : create , {
   [junit4]   2>   "name":"testschemaapi",
   [junit4]   2>   "fromApi":"true",
   [junit4]   2>   "replicationFactor":"2",
   [junit4]   2>   "collection.configName":"conf1",
   [junit4]   2>   "numShards":"1",
   [junit4]   2>   "stateFormat":"2",
   [junit4]   2>   "operation":"create"}
   [junit4]   2> 163120 INFO  (OverseerThreadFactory-386-thread-1) [    ] o.a.s.c.CreateCollectionCmd Create collection testschemaapi
   [junit4]   2> 163121 INFO  (OverseerThreadFactory-386-thread-1) [    ] o.a.s.c.OverseerCollectionMessageHandler creating collections conf node /collections/testschemaapi 
   [junit4]   2> 163121 INFO  (OverseerThreadFactory-386-thread-1) [    ] o.a.s.c.c.SolrZkClient makePath: /collections/testschemaapi
   [junit4]   2> 163122 INFO  (zkCallback-142-thread-1) [    ] o.a.s.c.c.ZkStateReader A collections change: [WatchedEvent state:SyncConnected type:NodeChildrenChanged path:/collections], has occurred - updating...
   [junit4]   2> 163122 INFO  (zkCallback-141-thread-1) [    ] o.a.s.c.c.ZkStateReader A collections change: [WatchedEvent state:SyncConnected type:NodeChildrenChanged path:/collections], has occurred - updating...
   [junit4]   2> 163122 INFO  (zkCallback-148-thread-1) [    ] o.a.s.c.c.ZkStateReader A collections change: [WatchedEvent state:SyncConnected type:NodeChildrenChanged path:/collections], has occurred - updating...
   [junit4]   2> 163125 INFO  (OverseerStateUpdate-96522308747001862-127.0.0.1:44152_solr-n_0000000000) [    ] o.a.s.c.Overseer processMessage: queueSize: 1, message = {
   [junit4]   2>   "name":"testschemaapi",
   [junit4]   2>   "fromApi":"true",
   [junit4]   2>   "replicationFactor":"2",
   [junit4]   2>   "collection.configName":"conf1",
   [junit4]   2>   "numShards":"1",
   [junit4]   2>   "stateFormat":"2",
   [junit4]   2>   "operation":"create"} current state version: 0
   [junit4]   2> 163125 INFO  (OverseerStateUpdate-96522308747001862-127.0.0.1:44152_solr-n_0000000000) [    ] o.a.s.c.o.ClusterStateMutator building a new cName: testschemaapi
   [junit4]   2> 163125 INFO  (OverseerStateUpdate-96522308747001862-127.0.0.1:44152_solr-n_0000000000) [    ] o.a.s.c.o.ZkStateWriter going to create_collection /collections/testschemaapi/state.json
   [junit4]   2> 163224 INFO  (OverseerThreadFactory-386-thread-1) [    ] o.a.s.c.CreateCollectionCmd Creating SolrCores for new collection testschemaapi, shardNames [shard1] , replicationFactor : 2
   [junit4]   2> 163224 INFO  (OverseerThreadFactory-386-thread-1) [    ] o.a.s.c.CreateCollectionCmd Creating core testschemaapi_shard1_replica2 as part of shard shard1 of collection testschemaapi on 127.0.0.1:41878_solr
   [junit4]   2> 163225 INFO  (OverseerThreadFactory-386-thread-1) [    ] o.a.s.c.CreateCollectionCmd Creating core testschemaapi_shard1_replica1 as part of shard shard1 of collection testschemaapi on 127.0.0.1:44152_solr
   [junit4]   2> 163255 INFO  (qtp414058973-912) [    ] o.a.s.h.a.CoreAdminOperation core create command qt=/admin/cores&collection.configName=conf1&name=testschemaapi_shard1_replica2&action=CREATE&numShards=1&collection=testschemaapi&shard=shard1&wt=javabin&version=2
   [junit4]   2> 163255 INFO  (qtp414058973-912) [    ] o.a.s.c.CoreDescriptor Created CoreDescriptor: {schema=schema.xml, dataDir=data/, collection.configName=conf1, collection=testschemaapi, loadOnStartup=true, transient=false, name=testschemaapi_shard1_replica2, numShards=1, shard=shard1, config=solrconfig.xml, configSetProperties=configsetprops.json}
   [junit4]   2> 163259 INFO  (qtp414058973-912) [    ] o.a.s.c.ZkController publishing state=down
   [junit4]   2> 163265 INFO  (OverseerStateUpdate-96522308747001862-127.0.0.1:44152_solr-n_0000000000) [    ] o.a.s.c.Overseer processMessage: queueSize: 1, message = {
   [junit4]   2>   "core":"testschemaapi_shard1_replica2",
   [junit4]   2>   "roles":null,
   [junit4]   2>   "base_url":"https://127.0.0.1:41878/solr",
   [junit4]   2>   "node_name":"127.0.0.1:41878_solr",
   [junit4]   2>   "numShards":"1",
   [junit4]   2>   "state":"down",
   [junit4]   2>   "shard":"shard1",
   [junit4]   2>   "collection":"testschemaapi",
   [junit4]   2>   "operation":"state"} current state version: 0
   [junit4]   2> 163265 INFO  (qtp414058973-912) [    ] o.a.s.c.ZkController Registering watch for collection testschemaapi
   [junit4]   2> 163265 INFO  (OverseerStateUpdate-96522308747001862-127.0.0.1:44152_solr-n_0000000000) [    ] o.a.s.c.o.ReplicaMutator Update state numShards=1 message={
   [junit4]   2>   "core":"testschemaapi_shard1_replica2",
   [junit4]   2>   "roles":null,
   [junit4]   2>   "base_url":"https://127.0.0.1:41878/solr",
   [junit4]   2>   "node_name":"127.0.0.1:41878_solr",
   [junit4]   2>   "numShards":"1",
   [junit4]   2>   "state":"down",
   [junit4]   2>   "shard":"shard1",
   [junit4]   2>   "collection":"testschemaapi",
   [junit4]   2>   "operation":"state"}
   [junit4]   2> 163267 INFO  (qtp414058973-912) [    ] o.a.s.c.c.ZkStateReader Add data for [testschemaapi] ver [0]
   [junit4]   2> 163276 INFO  (qtp414058973-912) [    ] o.a.s.c.ZkController look for our core node name
   [junit4]   2> 163277 INFO  (qtp399655909-926) [    ] o.a.s.h.a.CoreAdminOperation core create command qt=/admin/cores&collection.configName=conf1&name=testschemaapi_shard1_replica1&action=CREATE&numShards=1&collection=testschemaapi&shard=shard1&wt=javabin&version=2
   [junit4]   2> 163278 INFO  (qtp399655909-926) [    ] o.a.s.c.CoreDescriptor Created CoreDescriptor: {schema=schema.xml, dataDir=data/, collection.configName=conf1, collection=testschemaapi, loadOnStartup=true, transient=false, name=testschemaapi_shard1_replica1, numShards=1, shard=shard1, config=solrconfig.xml, configSetProperties=configsetprops.json}
   [junit4]   2> 163278 INFO  (qtp399655909-926) [    ] o.a.s.c.ZkController publishing state=down
   [junit4]   2> 163279 INFO  (qtp399655909-926) [    ] o.a.s.c.ZkController Registering watch for collection testschemaapi
   [junit4]   2> 163279 INFO  (qtp399655909-926) [    ] o.a.s.c.c.ZkStateReader Add data for [testschemaapi] ver [0]
   [junit4]   2> 163279 INFO  (OverseerStateUpdate-96522308747001862-127.0.0.1:44152_solr-n_0000000000) [    ] o.a.s.c.Overseer processMessage: queueSize: 1, message = {
   [junit4]   2>   "core":"testschemaapi_shard1_replica1",
   [junit4]   2>   "roles":null,
   [junit4]   2>   "base_url":"https://127.0.0.1:44152/solr",
   [junit4]   2>   "node_name":"127.0.0.1:44152_solr",
   [junit4]   2>   "numShards":"1",
   [junit4]   2>   "state":"down",
   [junit4]   2>   "shard":"shard1",
   [junit4]   2>   "collection":"testschemaapi",
   [junit4]   2>   "operation":"state"} current state version: 0
   [junit4]   2> 163279 INFO  (OverseerStateUpdate-96522308747001862-127.0.0.1:44152_solr-n_0000000000) [    ] o.a.s.c.o.ReplicaMutator Update state numShards=1 message={
   [junit4]   2>   "core":"testschemaapi_shard1_replica1",
   [junit4]   2>   "roles":null,
   [junit4]   2>   "base_url":"https://127.0.0.1:44152/solr",
   [junit4]   2>   "node_name":"127.0.0.1:44152_solr",
   [junit4]   2>   "numShards":"1",
   [junit4]   2>   "state":"down",
   [junit4]   2>   "shard":"shard1",
   [junit4]   2>   "collection":"testschemaapi",
   [junit4]   2>   "operation":"state"}
   [junit4]   2> 163281 INFO  (qtp399655909-926) [    ] o.a.s.c.ZkController look for our core node name
   [junit4]   2> 163382 INFO  (OverseerStateUpdate-96522308747001862-127.0.0.1:44152_solr-n_0000000000) [    ] o.a.s.c.o.ZkStateWriter going to update_collection /collections/testschemaapi/state.json version: 0
   [junit4]   2> 163382 INFO  (zkCallback-141-thread-1) [    ] o.a.s.c.c.ZkStateReader A cluster state change: [WatchedEvent state:SyncConnected type:NodeDataChanged path:/collections/testschemaapi/state.json] for collection [testschemaapi] has occurred - updating... (live nodes size: [2])
   [junit4]   2> 163382 INFO  (zkCallback-142-thread-2) [    ] o.a.s.c.c.ZkStateReader A cluster state change: [WatchedEvent state:SyncConnected type:NodeDataChanged path:/collections/testschemaapi/state.json] for collection [testschemaapi] has occurred - updating... (live nodes size: [2])
   [junit4]   2> 163382 INFO  (zkCallback-141-thread-1) [    ] o.a.s.c.c.ZkStateReader Updating data for [testschemaapi] from [0] to [1]
   [junit4]   2> 163382 INFO  (zkCallback-142-thread-2) [    ] o.a.s.c.c.ZkStateReader Updating data for [testschemaapi] from [0] to [1]
   [junit4]   2> 164276 INFO  (qtp414058973-912) [    ] o.a.s.c.ZkController waiting to find shard id in clusterstate for testschemaapi_shard1_replica2
   [junit4]   2> 164276 INFO  (qtp414058973-912) [    ] o.a.s.c.ZkController Check for collection zkNode:testschemaapi
   [junit4]   2> 164277 INFO  (qtp414058973-912) [    ] o.a.s.c.ZkController Collection zkNode exists
   [junit4]   2> 164277 INFO  (qtp414058973-912) [    ] o.a.s.c.c.ZkStateReader Load collection config from: [/collections/testschemaapi]
   [junit4]   2> 164277 INFO  (qtp414058973-912) [    ] o.a.s.c.c.ZkStateReader path=[/collections/testschemaapi] [configName]=[conf1] specified config exists in ZooKeeper
   [junit4]   2> 164277 INFO  (qtp414058973-912) [    ] o.a.s.c.SolrResourceLoader new SolrResourceLoader for directory: '/home/jenkins/workspace/Lucene-Solr-master-Linux/solr/build/solr-core/test/J1/temp/solr.schema.TestManagedSchemaAPI_6C5C315B86FED539-001/tempDir-001/node1/testschemaapi_shard1_replica2'
   [junit4]   2> 164277 INFO  (qtp414058973-912) [    ] o.a.s.c.SolrResourceLoader JNDI not configured for solr (NoInitialContextEx)
   [junit4]   2> 164277 INFO  (qtp414058973-912) [    ] o.a.s.c.SolrResourceLoader solr home defaulted to 'solr/' (could not find system property or JNDI)
   [junit4]   2> 164278 INFO  (qtp414058973-912) [    ] o.a.s.c.Config loaded config solrconfig.xml with version 0 
   [junit4]   2> 164281 INFO  (qtp399655909-926) [    ] o.a.s.c.ZkController waiting to find shard id in clusterstate for testschemaapi_shard1_replica1
   [junit4]   2> 164281 INFO  (qtp399655909-926) [    ] o.a.s.c.ZkController Check for collection zkNode:testschemaapi
   [junit4]   2> 164281 INFO  (qtp399655909-926) [    ] o.a.s.c.ZkController Collection zkNode exists
   [junit4]   2> 164281 INFO  (qtp399655909-926) [    ] o.a.s.c.c.ZkStateReader Load collection config from: [/collections/testschemaapi]
   [junit4]   2> 164282 INFO  (qtp399655909-926) [    ] o.a.s.c.c.ZkStateReader path=[/collections/testschemaapi] [configName]=[conf1] specified config exists in ZooKeeper
   [junit4]   2> 164282 INFO  (qtp399655909-926) [    ] o.a.s.c.SolrResourceLoader new SolrResourceLoader for directory: '/home/jenkins/workspace/Lucene-Solr-master-Linux/solr/build/solr-core/test/J1/temp/solr.schema.TestManagedSchemaAPI_6C5C315B86FED539-001/tempDir-001/node2/testschemaapi_shard1_replica1'
   [junit4]   2> 164282 INFO  (qtp399655909-926) [    ] o.a.s.c.SolrResourceLoader JNDI not configured for solr (NoInitialContextEx)
   [junit4]   2> 164282 INFO  (qtp399655909-926) [    ] o.a.s.c.SolrResourceLoader solr home defaulted to 'solr/' (could not find system property or JNDI)
   [junit4]   2> 164283 INFO  (qtp399655909-926) [    ] o.a.s.c.Config loaded config solrconfig.xml with version 0 
   [junit4]   2> 164290 INFO  (qtp414058973-912) [    ] o.a.s.c.SolrConfig current version of requestparams : -1
   [junit4]   2> 164296 INFO  (qtp414058973-912) [    ] o.a.s.c.SolrConfig Using Lucene MatchVersion: 7.0.0
   [junit4]   2> 164300 INFO  (qtp399655909-926) [    ] o.a.s.c.SolrConfig current version of requestparams : -1
   [junit4]   2> 164302 INFO  (qtp399655909-926) [    ] o.a.s.c.SolrConfig Using Lucene MatchVersion: 7.0.0
   [junit4]   2> 164305 INFO  (qtp414058973-912) [    ] o.a.s.c.SolrConfig Loaded SolrConfig: solrconfig.xml
   [junit4]   2> 164313 INFO  (qtp399655909-926) [    ] o.a.s.c.SolrConfig Loaded SolrConfig: solrconfig.xml
   [junit4]   2> 164333 INFO  (qtp414058973-912) [    ] o.a.s.s.IndexSchema [testschemaapi_shard1_replica2] Schema name=minimal
   [junit4]   2> 164336 INFO  (qtp399655909-926) [    ] o.a.s.s.IndexSchema [testschemaapi_shard1_replica1] Schema name=minimal
   [junit4]   2> 164339 INFO  (qtp399655909-926) [    ] o.a.s.s.IndexSchema unique key field: id
   [junit4]   2> 164341 INFO  (qtp414058973-912) [    ] o.a.s.s.IndexSchema unique key field: id
   [junit4]   2> 164350 INFO  (qtp414058973-912) [    ] o.a.s.c.ConfigSetProperties Did not find ConfigSet properties, assuming default properties: Can't find resource 'configsetprops.json' in classpath or '/configs/conf1', cwd=/home/jenkins/workspace/Lucene-Solr-master-Linux/solr/build/solr-core/test/J1
   [junit4]   2> 164350 INFO  (qtp414058973-912) [    ] o.a.s.c.CoreContainer Creating SolrCore 'testschemaapi_shard1_replica2' using configuration from collection testschemaapi
   [junit4]   2> 164350 INFO  (qtp414058973-912) [    ] o.a.s.c.SolrCore org.apache.solr.core.MockDirectoryFactory
   [junit4]   2> 164350 INFO  (qtp414058973-912) [    ] o.a.s.c.SolrCore [[testschemaapi_shard1_replica2] ] Opening new SolrCore at [/home/jenkins/workspace/Lucene-Solr-master-Linux/solr/build/solr-core/test/J1/temp/solr.schema.TestManagedSchemaAPI_6C5C315B86FED539-001/tempDir-001/node1/testschemaapi_shard1_replica2], dataDir=[/home/jenkins/workspace/Lucene-Solr-master-Linux/solr/build/solr-core/test/J1/temp/solr.schema.TestManagedSchemaAPI_6C5C315B86FED539-001/tempDir-001/node1/./testschemaapi_shard1_replica2/data/]
   [junit4]   2> 164350 INFO  (qtp414058973-912) [    ] o.a.s.c.SolrCore JMX monitoring not detected for core: testschemaapi_shard1_replica2
   [junit4]   2> 164351 INFO  (qtp414058973-912) [    ] o.a.s.c.CachingDirectoryFactory return new directory for /home/jenkins/workspace/Lucene-Solr-master-Linux/solr/build/solr-core/test/J1/temp/solr.schema.TestManagedSchemaAPI_6C5C315B86FED539-001/tempDir-001/node1/./testschemaapi_shard1_replica2/data/snapshot_metadata
   [junit4]   2> 164351 INFO  (qtp414058973-912) [    ] o.a.s.c.s.SolrSnapshotMetaDataManager Loading from snapshot metadata file...
   [junit4]   2> 164352 INFO  (qtp414058973-912) [    ] o.a.s.c.CachingDirectoryFactory return new directory for /home/jenkins/workspace/Lucene-Solr-master-Linux/solr/build/solr-core/test/J1/temp/solr.schema.TestManagedSchemaAPI_6C5C315B86FED539-001/tempDir-001/node1/./testschemaapi_shard1_replica2/data
   [junit4]   2> 164352 INFO  (qtp414058973-912) [    ] o.a.s.c.SolrCore New index directory detected: old=null new=/home/jenkins/workspace/Lucene-Solr-master-Linux/solr/build/solr-core/test/J1/temp/solr.schema.TestManagedSchemaAPI_6C5C315B86FED539-001/tempDir-001/node1/./testschemaapi_shard1_replica2/data/index/
   [junit4]   2> 164352 WARN  (qtp414058973-912) [    ] o.a.s.c.SolrCore [testschemaapi_shard1_replica2] Solr index directory '/home/jenkins/workspace/Lucene-Solr-master-Linux/solr/build/solr-core/test/J1/temp/solr.schema.TestManagedSchemaAPI_6C5C315B86FED539-001/tempDir-001/node1/./testschemaapi_shard1_replica2/data/index' doesn't exist. Creating new index...
   [junit4]   2> 164354 INFO  (qtp414058973-912) [    ] o.a.s.c.CachingDirectoryFactory return new directory for /home/jenkins/workspace/Lucene-Solr-master-Linux/solr/build/solr-core/test/J1/temp/solr.schema.TestManagedSchemaAPI_6C5C315B86FED539-001/tempDir-001/node1/./testschemaapi_shard1_replica2/data/index
   [junit4]   2> 164353 INFO  (qtp399655909-926) [    ] o.a.s.c.ConfigSetProperties Did not find ConfigSet properties, assuming default properties: Can't find resource 'configsetprops.json' in classpath or '/configs/conf1', cwd=/home/jenkins/workspace/Lucene-Solr-master-Linux/solr/build/solr-core/test/J1
   [junit4]   2> 164354 INFO  (qtp399655909-926) [    ] o.a.s.c.CoreContainer Creating SolrCore 'testschemaapi_shard1_replica1' using configuration from collection testschemaapi
   [junit4]   2> 164355 INFO  (qtp399655909-926) [    ] o.a.s.c.SolrCore org.apache.solr.core.MockDirectoryFactory
   [junit4]   2> 164355 INFO  (qtp399655909-926) [    ] o.a.s.c.SolrCore [[testschemaapi_shard1_replica1] ] Opening new SolrCore at [/home/jenkins/workspace/Lucene-Solr-master-Linux/solr/build/solr-core/test/J1/temp/solr.schema.TestManagedSchemaAPI_6C5C315B86FED539-001/tempDir-001/node2/testschemaapi_shard1_replica1], dataDir=[/home/jenkins/workspace/Lucene-Solr-master-Linux/solr/build/solr-core/test/J1/temp/solr.schema.TestManagedSchemaAPI_6C5C315B86FED539-001/tempDir-001/node2/./testschemaapi_shard1_replica1/data/]
   [junit4]   2> 164355 INFO  (qtp399655909-926) [    ] o.a.s.c.SolrCore JMX monitoring not detected for core: testschemaapi_shard1_replica1
   [junit4]   2> 164356 INFO  (qtp399655909-926) [    ] o.a.s.c.CachingDirectoryFactory return new directory for /home/jenkins/workspace/Lucene-Solr-master-Linux/solr/build/solr-core/test/J1/temp/solr.schema.TestManagedSchemaAPI_6C5C315B86FED539-001/tempDir-001/node2/./testschemaapi_shard1_replica1/data/snapshot_metadata
   [junit4]   2> 164356 INFO  (qtp399655909-926) [    ] o.a.s.c.s.SolrSnapshotMetaDataManager Loading from snapshot metadata file...
   [junit4]   2> 164357 INFO  (qtp399655909-926) [    ] o.a.s.c.CachingDirectoryFactory return new directory for /home/jenkins/workspace/Lucene-Solr-master-Linux/solr/build/solr-core/test/J1/temp/solr.schema.TestManagedSchemaAPI_6C5C315B86FED539-001/tempDir-001/node2/./testschemaapi_shard1_replica1/data
   [junit4]   2> 164357 INFO  (qtp399655909-926) [    ] o.a.s.c.SolrCore New index directory detected: old=null new=/home/jenkins/workspace/Lucene-Solr-master-Linux/solr/build/solr-core/test/J1/temp/solr.schema.TestManagedSchemaAPI_6C5C315B86FED539-001/tempDir-001/node2/./testschemaapi_shard1_replica1/data/index/
   [junit4]   2> 164357 WARN  (qtp399655909-926) [    ] o.a.s.c.SolrCore [testschemaapi_shard1_replica1] Solr index directory '/home/jenkins/workspace/Lucene-Solr-master-Linux/solr/build/solr-core/test/J1/temp/solr.schema.TestManagedSchemaAPI_6C5C315B86FED539-001/tempDir-001/node2/./testschemaapi_shard1_replica1/data/index' doesn't exist. Creating new index...
   [junit4]   2> 164357 INFO  (qtp399655909-926) [    ] o.a.s.c.CachingDirectoryFactory return new directory for /home/jenkins/workspace/Lucene-Solr-master-Linux/solr/build/solr-core/test/J1/temp/solr.schema.TestManagedSchemaAPI_6C5C315B86FED539-001/tempDir-001/node2/./testschemaapi_shard1_replica1/data/index
   [junit4]   2> 164359 INFO  (qtp399655909-926) [    ] o.a.s.c.SolrDeletionPolicy SolrDeletionPolicy.onCommit: commits: num=1
   [junit4]   2> 	commit{dir=MockDirectoryWrapper(RAMDirectory@4c390001 lockFactory=org.apache.lucene.store.SingleInstanceLockFactory@34358e6e),segFN=segments_1,generation=1}
   [junit4]   2> 164359 INFO  (qtp399655909-926) [    ] o.a.s.c.SolrDeletionPolicy newest commit generation = 1
   [junit4]   2> 164360 INFO  (qtp414058973-912) [    ] o.a.s.c.SolrDeletionPolicy SolrDeletionPolicy.onCommit: commits: num=1
   [junit4]   2> 	commit{dir=MockDirectoryWrapper(RAMDirectory@8b8b503 lockFactory=org.apache.lucene.store.SingleInstanceLockFactory@6314ae3),segFN=segments_1,generation=1}
   [junit4]   2> 164360 INFO  (qtp414058973-912) [    ] o.a.s.c.SolrDeletionPolicy newest commit generation = 1
   [junit4]   2> 164361 INFO  (qtp399655909-926) [    ] o.a.s.c.SolrCore no updateRequestProcessorChain defined as default, creating implicit default
   [junit4]   2> 164364 INFO  (qtp399655909-926) [    ] o.a.s.h.l.XMLLoader xsltCacheLifetimeSeconds=60
   [junit4]   2> 164366 INFO  (qtp399655909-926) [    ] o.a.s.h.l.XMLLoader xsltCacheLifetimeSeconds=60
   [junit4]   2> 164367 INFO  (OldIndexDirectoryCleanupThreadForCore-testschemaapi_shard1_replica2) [    ] o.a.s.c.SolrCore Looking for old index directories to cleanup for core testschemaapi_shard1_replica2 in /home/jenkins/workspace/Lucene-Solr-master-Linux/solr/build/solr-core/test/J1/temp/solr.schema.TestManagedSchemaAPI_6C5C315B86FED539-001/tempDir-001/node1/./testschemaapi_shard1_replica2/data/
   [junit4]   2> 164367 INFO  (qtp399655909-926) [    ] o.a.s.h.l.XMLLoader xsltCacheLifetimeSeconds=60
   [junit4]   2> 164367 WARN  (OldIndexDirectoryCleanupThreadForCore-testschemaapi_shard1_replica2) [    ] o.a.s.c.DirectoryFactory /home/jenkins/workspace/Lucene-Solr-master-Linux/solr/build/solr-core/test/J1/temp/solr.schema.TestManagedSchemaAPI_6C5C315B86FED539-001/tempDir-001/node1/./testschemaapi_shard1_replica2/data/ does not point to a valid data directory; skipping clean-up of old index directories.
   [junit4]   2> 164368 INFO  (qtp399655909-926) [    ] o.a.s.h.l.XMLLoader xsltCacheLifetimeSeconds=60
   [junit4]   2> 164369 INFO  (qtp414058973-912) [    ] o.a.s.c.SolrCore no updateRequestProcessorChain defined as default, creating implicit default
   [junit4]   2> 164370 INFO  (qtp399655909-926) [    ] o.a.s.c.RequestHandlers Registered paths: /admin/mbeans,/update/json/docs,/admin/luke,/export,/get,/admin/properties,/update/json,/admin/threads,/update/csv,/sql,/graph,/select,/admin/segments,/admin/system,/replication,/config,/stream,/schema,/admin/plugins,/admin/logging,/admin/ping,/update,/admin/file,/terms
   [junit4]   2> 164370 INFO  (qtp399655909-926) [    ] o.a.s.c.SolrCore Using default statsCache cache: org.apache.solr.search.stats.LocalStatsCache
   [junit4]   2> 164370 INFO  (OldIndexDirectoryCleanupThreadForCore-testschemaapi_shard1_replica1) [    ] o.a.s.c.SolrCore Looking for old index directories to cleanup for core testschemaapi_shard1_replica1 in /home/jenkins/workspace/Lucene-Solr-master-Linux/solr/build/solr-core/test/J1/temp/solr.schema.TestManagedSchemaAPI_6C5C315B86FED539-001/tempDir-001/node2/./testschemaapi_shard1_replica1/data/
   [junit4]   2> 164371 WARN  (OldIndexDirectoryCleanupThreadForCore-testschemaapi_shard1_replica1) [    ] o.a.s.c.DirectoryFactory /home/jenkins/workspace/Lucene-Solr-master-Linux/solr/build/solr-core/test/J1/temp/solr.schema.TestManagedSchemaAPI_6C5C315B86FED539-001/tempDir-001/node2/./testschemaapi_shard1_replica1/data/ does not point to a valid data directory; skipping clean-up of old index directories.
   [junit4]   2> 164371 INFO  (qtp399655909-926) [    ] o.a.s.u.UpdateHandler Using UpdateLog implementation: org.apache.solr.update.UpdateLog
   [junit4]   2> 164371 INFO  (qtp399655909-926) [    ] o.a.s.u.UpdateLog Initializing UpdateLog: dataDir=null defaultSyncLevel=FLUSH numRecordsToKeep=100 maxNumLogsToKeep=10 numVersionBuckets=65536
   [junit4]   2> 164371 INFO  (qtp414058973-912) [    ] o.a.s.h.l.XMLLoader xsltCacheLifetimeSeconds=60
   [junit4]   2> 164373 INFO  (qtp399655909-926) [    ] o.a.s.u.CommitTracker Hard AutoCommit: disabled
   [junit4]   2> 164373 INFO  (qtp399655909-926) [    ] o.a.s.u.CommitTracker Soft AutoCommit: disabled
   [junit4]   2> 164374 INFO  (qtp414058973-912) [    ] o.a.s.h.l.XMLLoader xsltCacheLifetimeSeconds=60
   [junit4]   2> 164374 INFO  (qtp399655909-926) [    ] o.a.s.c.SolrDeletionPolicy SolrDeletionPolicy.onInit: commits: num=1
   [junit4]   2> 	commit{dir=MockDirectoryWrapper(RAMDirectory@4c390001 lockFactory=org.apache.lucene.store.SingleInstanceLockFactory@34358e6e),segFN=segments_1,generation=1}
   [junit4]   2> 164374 INFO  (qtp399655909-926) [    ] o.a.s.c.SolrDeletionPolicy newest commit generation = 1
   [junit4]   2> 164375 INFO  (qtp399655909-926) [    ] o.a.s.s.SolrIndexSearcher Opening [Searcher@2e3cc397[testschemaapi_shard1_replica1] main]
   [junit4]   2> 164375 INFO  (qtp399655909-926) [    ] o.a.s.c.c.ZkStateReader Load collection config from: [/collections/testschemaapi]
   [junit4]   2> 164376 INFO  (qtp414058973-912) [    ] o.a.s.h.l.XMLLoader xsltCacheLifetimeSeconds=60
   [junit4]   2> 164376 INFO  (qtp399655909-926) [    ] o.a.s.c.c.ZkStateReader path=[/collections/testschemaapi] [configName]=[conf1] specified config exists in ZooKeeper
   [junit4]   2> 164376 INFO  (qtp399655909-926) [    ] o.a.s.r.ManagedResourceStorage Setting up ZooKeeper-based storage for the RestManager with znodeBase: /configs/conf1
   [junit4]   2> 164377 INFO  (qtp399655909-926) [    ] o.a.s.r.ManagedResourceStorage Configured ZooKeeperStorageIO with znodeBase: /configs/conf1
   [junit4]   2> 164377 INFO  (qtp399655909-926) [    ] o.a.s.r.RestManager Initializing RestManager with initArgs: {}
   [junit4]   2> 164377 INFO  (qtp399655909-926) [    ] o.a.s.r.ManagedResourceStorage Reading _rest_managed.json using ZooKeeperStorageIO:path=/configs/conf1
   [junit4]   2> 164378 INFO  (qtp399655909-926) [    ] o.a.s.r.ManagedResourceStorage No data found for znode /configs/conf1/_rest_managed.json
   [junit4]   2> 164378 INFO  (qtp414058973-912) [    ] o.a.s.h.l.XMLLoader xsltCacheLifetimeSeconds=60
   [junit4]   2> 164378 INFO  (qtp399655909-926) [    ] o.a.s.r.ManagedResourceStorage Loaded null at path _rest_managed.json using ZooKeeperStorageIO:path=/configs/conf1
   [junit4]   2> 164378 INFO  (qtp399655909-926) [    ] o.a.s.r.RestManager Initializing 0 registered ManagedResources
   [junit4]   2> 164380 INFO  (qtp414058973-912) [    ] o.a.s.c.RequestHandlers Registered paths: /admin/mbeans,/update/json/docs,/admin/luke,/export,/get,/admin/properties,/update/json,/admin/threads,/update/csv,/sql,/graph,/select,/admin/segments,/admin/system,/replication,/config,/stream,/schema,/admin/plugins,/admin/logging,/admin/ping,/update,/admin/file,/terms
   [junit4]   2> 164380 INFO  (qtp414058973-912) [    ] o.a.s.c.SolrCore Using default statsCache cache: org.apache.solr.search.stats.LocalStatsCache
   [junit4]   2> 164380 INFO  (qtp414058973-912) [    ] o.a.s.u.UpdateHandler Using UpdateLog implementation: org.apache.solr.update.UpdateLog
   [junit4]   2> 164380 INFO  (qtp414058973-912) [    ] o.a.s.u.UpdateLog Initializing UpdateLog: dataDir=null defaultSyncLevel=FLUSH numRecordsToKeep=100 maxNumLogsToKeep=10 numVersionBuckets=65536
   [junit4]   2> 164381 INFO  (qtp399655909-926) [    ] o.a.s.s.ZkIndexSchemaReader Creating ZooKeeper watch for the managed schema at /configs/conf1/managed-schema
   [junit4]   2> 164382 INFO  (qtp414058973-912) [    ] o.a.s.u.CommitTracker Hard AutoCommit: disabled
   [junit4]   2> 164382 INFO  (qtp414058973-912) [    ] o.a.s.u.CommitTracker Soft AutoCommit: disabled
   [junit4]   2> 164383 INFO  (qtp414058973-912) [    ] o.a.s.c.SolrDeletionPolicy SolrDeletionPolicy.onInit: commits: num=1
   [junit4]   2> 	commit{dir=MockDirectoryWrapper(RAMDirectory@8b8b503 lockFactory=org.apache.lucene.store.SingleInstanceLockFactory@6314ae3),segFN=segments_1,generation=1}
   [junit4]   2> 164383 INFO  (qtp414058973-912) [    ] o.a.s.c.SolrDeletionPolicy newest commit generation = 1
   [junit4]   2> 164383 INFO  (qtp414058973-912) [    ] o.a.s.s.SolrIndexSearcher Opening [Searcher@55eefe8f[testschemaapi_shard1_replica2] main]
   [junit4]   2> 164384 INFO  (qtp414058973-912) [    ] o.a.s.c.c.ZkStateReader Load collection config from: [/collections/testschemaapi]
   [junit4]   2> 164384 INFO  (qtp399655909-926) [    ] o.a.s.c.ZkController Added new OnReconnect listener ZkIndexSchemaReader: /configs/conf1/managed-schema, uniqueCoreId: testschemaapi_shard1_replica1:4106380742891089
   [junit4]   2> 164385 INFO  (qtp399655909-926) [    ] o.a.s.h.ReplicationHandler Commits will be reserved for  10000
   [junit4]   2> 164385 INFO  (qtp414058973-912) [    ] o.a.s.c.c.ZkStateReader path=[/collections/testschemaapi] [configName]=[conf1] specified config exists in ZooKeeper
   [junit4]   2> 164385 INFO  (qtp414058973-912) [    ] o.a.s.r.ManagedResourceStorage Setting up ZooKeeper-based storage for the RestManager with znodeBase: /configs/conf1
   [junit4]   2> 164385 INFO  (searcherExecutor-390-thread-1) [    ] o.a.s.c.SolrCore [testschemaapi_shard1_replica1] Registered new searcher Searcher@2e3cc397[testschemaapi_shard1_replica1] main{ExitableDirectoryReader(UninvertingDirectoryReader())}
   [junit4]   2> 164385 INFO  (qtp399655909-926) [    ] o.a.s.u.UpdateLog Looking up max value of version field to seed version buckets
   [junit4]   2> 164385 INFO  (qtp399655909-926) [    ] o.a.s.u.VersionInfo Refreshing highest value of _version_ for 65536 version buckets from index
   [junit4]   2> 164385 INFO  (qtp414058973-912) [    ] o.a.s.r.ManagedResourceStorage Configured ZooKeeperStorageIO with znodeBase: /configs/conf1
   [junit4]   2> 164385 INFO  (qtp399655909-926) [    ] o.a.s.u.VersionInfo No terms found for _version_, cannot seed version bucket highest value from index
   [junit4]   2> 164385 INFO  (qtp414058973-912) [    ] o.a.s.r.RestManager Initializing RestManager with initArgs: {}
   [junit4]   2> 164388 INFO  (qtp414058973-912) [    ] o.a.s.r.ManagedResourceStorage Reading _rest_managed.json using ZooKeeperStorageIO:path=/configs/conf1
   [junit4]   2> 164388 INFO  (qtp399655909-926) [    ] o.a.s.u.UpdateLog Could not find max version in index or recent updates, using new clock 1544356941659111424
   [junit4]   2> 164388 INFO  (qtp414058973-912) [    ] o.a.s.r.ManagedResourceStorage No data found for znode /configs/conf1/_rest_managed.json
   [junit4]   2> 164388 INFO  (qtp414058973-912) [    ] o.a.s.r.ManagedResourceStorage Loaded null at path _rest_managed.json using ZooKeeperStorageIO:path=/configs/conf1
   [junit4]   2> 164388 INFO  (qtp414058973-912) [    ] o.a.s.r.RestManager Initializing 0 registered ManagedResources
   [junit4]   2> 164388 INFO  (qtp414058973-912) [    ] o.a.s.s.ZkIndexSchemaReader Creating ZooKeeper watch for the managed schema at /configs/conf1/managed-schema
   [junit4]   2> 164389 INFO  (qtp414058973-912) [    ] o.a.s.c.ZkController Added new OnReconnect listener ZkIndexSchemaReader: /configs/conf1/managed-schema, uniqueCoreId: testschemaapi_shard1_replica2:4106380738071704
   [junit4]   2> 164390 INFO  (qtp414058973-912) [    ] o.a.s.h.ReplicationHandler Commits will be reserved for  10000
   [junit4]   2> 164390 INFO  (qtp414058973-912) [    ] o.a.s.u.UpdateLog Looking up max value of version field to seed version buckets
   [junit4]   2> 164390 INFO  (qtp414058973-912) [    ] o.a.s.u.VersionInfo Refreshing highest value of _version_ for 65536 version buckets from index
   [junit4]   2> 164390 INFO  (qtp414058973-912) [    ] o.a.s.u.VersionInfo No terms found for _version_, cannot seed version bucket highest value from index
   [junit4]   2> 164390 INFO  (qtp414058973-912) [    ] o.a.s.u.UpdateLog Could not find max version in index or recent updates, using new clock 1544356941661208576
   [junit4]   2> 164390 INFO  (qtp399655909-926) [    ] o.a.s.u.UpdateLog Took 5.0ms to seed version buckets with highest version 1544356941659111424
   [junit4]   2> 164390 INFO  (qtp399655909-926) [    ] o.a.s.c.ZkController watch zkdir /configs/conf1
   [junit4]   2> 164391 INFO  (qtp399655909-926) [    ] o.a.s.c.CoreContainer registering core: testschemaapi_shard1_replica1
   [junit4]   2> 164391 INFO  (qtp399655909-926) [    ] o.a.s.c.ZkController Register replica - core:testschemaapi_shard1_replica1 address:https://127.0.0.1:44152/solr collection:testschemaapi shard:shard1
   [junit4]   2> 164392 INFO  (qtp414058973-912) [    ] o.a.s.u.UpdateLog Took 2.0ms to seed version buckets with highest version 1544356941661208576
   [junit4]   2> 164392 INFO  (qtp414058973-912) [    ] o.a.s.c.ZkController watch zkdir /configs/conf1
   [junit4]   2> 164392 INFO  (searcherExecutor-389-thread-1) [    ] o.a.s.c.SolrCore [testschemaapi_shard1_replica2] Registered new searcher Searcher@55eefe8f[testschemaapi_shard1_replica2] main{ExitableDirectoryReader(UninvertingDirectoryReader())}
   [junit4]   2> 164394 INFO  (qtp414058973-912) [    ] o.a.s.c.CoreContainer registering core: testschemaapi_shard1_replica2
   [junit4]   2> 164394 INFO  (qtp414058973-912) [    ] o.a.s.c.ZkController Register replica - core:testschemaapi_shard1_replica2 address:https://127.0.0.1:41878/solr collection:testschemaapi shard:shard1
   [junit4]   2> 164398 INFO  (qtp414058973-912) [    ] o.a.s.c.c.SolrZkClient makePath: /collections/testschemaapi/leader_elect/shard1/election
   [junit4]   2> 164401 INFO  (qtp414058973-912) [    ] o.a.s.c.LeaderElector Joined leadership election with path: /collections/testschemaapi/leader_elect/shard1/election/96522308747001861-core_node1-n_0000000000
   [junit4]   2> 164401 INFO  (qtp414058973-912) [    ] o.a.s.c.ShardLeaderElectionContext Running the leader process for shard=shard1 and weAreReplacement=false and leaderVoteWait=10000
   [junit4]   2> 164403 INFO  (qtp414058973-912) [    ] o.a.s.c.ShardLeaderElectionContext Waiting until we see more replicas up for shard shard1: total=2 found=1 timeoutin=9999ms
   [junit4]   2> 164403 INFO  (OverseerStateUpdate-96522308747001862-127.0.0.1:44152_solr-n_0000000000) [    ] o.a.s.c.Overseer processMessage: queueSize: 1, message = {
   [junit4]   2>   "operation":"leader",
   [junit4]   2>   "shard":"shard1",
   [junit4]   2>   "collection":"testschemaapi"} current state version: 0
   [junit4]   2> 164404 INFO  (qtp399655909-926) [    ] o.a.s.c.LeaderElector Joined leadership election with path: /collections/testschemaapi/leader_elect/shard1/election/96522308747001862-core_node2-n_0000000001
   [junit4]   2> 164405 INFO  (qtp399655909-926) [    ] o.a.s.c.LeaderElector Watching path /collections/testschemaapi/leader_elect/shard1/election/96522308747001861-core_node1-n_0000000000 to know if I could be the leader
   [junit4]   2> 164506 INFO  (OverseerStateUpdate-96522308747001862-127.0.0.1:44152_solr-n_0000000000) [    ] o.a.s.c.o.ZkStateWriter going to update_collection /collections/testschemaapi/state.json version: 1
   [junit4]   2> 164506 INFO  (zkCallback-141-thread-1) [    ] o.a.s.c.c.ZkStateReader A cluster state change: [WatchedEvent state:SyncConnected type:NodeDataChanged path:/collections/testschemaapi/state.json] for collection [testschemaapi] has occurred - updating... (live nodes size: [2])
   [junit4]   2> 164507 INFO  (zkCallback-141-thread-1) [    ] o.a.s.c.c.ZkStateReader Updating data for [testschemaapi] from [1] to [2]
   [junit4]   2> 164507 INFO  (zkCallback-142-thread-1) [    ] o.a.s.c.c.ZkStateReader A cluster state change: [WatchedEvent state:SyncConnected type:NodeDataChanged path:/collections/testschemaapi/state.json] for collection [testschemaapi] has occurred - updating... (live nodes size: [2])
   [junit4]   2> 164507 INFO  (zkCallback-142-thread-1) [    ] o.a.s.c.c.ZkStateReader Updating data for [testschemaapi] from [1] to [2]
   [junit4]   2> 164904 INFO  (qtp414058973-912) [    ] o.a.s.c.ShardLeaderElectionContext Enough replicas found to continue.
   [junit4]   2> 164904 INFO  (qtp414058973-912) [    ] o.a.s.c.ShardLeaderElectionContext I may be the new leader - try and sync
   [junit4]   2> 164904 INFO  (qtp414058973-912) [    ] o.a.s.c.SyncStrategy Sync replicas to https://127.0.0.1:41878/solr/testschemaapi_shard1_replica2/
   [junit4]   2> 164904 INFO  (qtp414058973-912) [    ] o.a.s.u.PeerSync PeerSync: core=testschemaapi_shard1_replica2 url=https://127.0.0.1:41878/solr START replicas=[https://127.0.0.1:44152/solr/testschemaapi_shard1_replica1/] nUpdates=100
   [junit4]   2> 164906 INFO  (qtp414058973-912) [    ] o.a.s.u.PeerSync PeerSync: core=testschemaapi_shard1_replica2 url=https://127.0.0.1:41878/solr DONE.  We have no versions.  sync failed.
   [junit4]   2> 164906 INFO  (qtp414058973-912) [    ] o.a.s.c.SyncStrategy Leader's attempt to sync with shard failed, moving to the next candidate
   [junit4]   2> 164906 INFO  (qtp414058973-912) [    ] o.a.s.c.ShardLeaderElectionContext We failed sync, but we have no versions - we can't sync in that case - we were active before, so become leader anyway
   [junit4]   2> 164907 INFO  (qtp414058973-912) [    ] o.a.s.c.c.SolrZkClient makePath: /collections/testschemaapi/leaders/shard1
   [junit4]   2> 164909 INFO  (qtp414058973-912) [    ] o.a.s.c.ShardLeaderElectionContextBase Creating leader registration node /collections/testschemaapi/leaders/shard1/leader after winning as /collections/testschemaapi/leader_elect/shard1/election/96522308747001861-core_node1-n_0000000000
   [junit4]   2> 164910 INFO  (qtp414058973-912) [    ] o.a.s.c.ShardLeaderElectionContext I am the new leader: https://127.0.0.1:41878/solr/testschemaapi_shard1_replica2/ shard1
   [junit4]   2> 164911 INFO  (OverseerStateUpdate-96522308747001862-127.0.0.1:44152_solr-n_0000000000) [    ] o.a.s.c.Overseer processMessage: queueSize: 1, message = {
   [junit4]   2>   "operation":"leader",
   [junit4]   2>   "shard":"shard1",
   [junit4]   2>   "collection":"testschemaapi",
   [junit4]   2>   "base_url":"https://127.0.0.1:41878/solr",
   [junit4]   2>   "core":"testschemaapi_shard1_replica2",
   [junit4]   2>   "state":"active"} current state version: 0
   [junit4]   2> 164921 INFO  (qtp399655909-925) [    ] o.a.s.c.S.Request [testschemaapi_shard1_replica1]  webapp=/solr path=/get params={distrib=false&qt=/get&fingerprint=false&getVersions=100&wt=javabin&version=2} status=0 QTime=1
   [junit4]   2> 165013 INFO  (OverseerStateUpdate-96522308747001862-127.0.0.1:44152_solr-n_0000000000) [    ] o.a.s.c.o.ZkStateWriter going to update_collection /collections/testschemaapi/state.json version: 2
   [junit4]   2> 165014 INFO  (zkCallback-141-thread-1) [    ] o.a.s.c.c.ZkStateReader A cluster state change: [WatchedEvent state:SyncConnected type:NodeDataChanged path:/collections/testschemaapi/state.json] for collection [testschemaapi] has occurred - updating... (live nodes size: [2])
   [junit4]   2> 165014 INFO  (zkCallback-142-thread-2) [    ] o.a.s.c.c.ZkStateReader A cluster state change: [WatchedEvent state:SyncConnected type:NodeDataChanged path:/collections/testschemaapi/state.json] for collection [testschemaapi] has occurred - updating... (live nodes size: [2])
   [junit4]   2> 165014 INFO  (zkCallback-141-thread-1) [    ] o.a.s.c.c.ZkStateReader Updating data for [testschemaapi] from [2] to [3]
   [junit4]   2> 165014 INFO  (zkCallback-142-thread-2) [    ] o.a.s.c.c.ZkStateReader Updating data for [testschemaapi] from [2] to [3]
   [junit4]   2> 165061 INFO  (qtp414058973-912) [    ] o.a.s.c.ZkController We are https://127.0.0.1:41878/solr/testschemaapi_shard1_replica2/ and leader is https://127.0.0.1:41878/solr/testschemaapi_shard1_replica2/
   [junit4]   2> 165061 INFO  (qtp414058973-912) [    ] o.a.s.c.ZkController No LogReplay needed for core=testschemaapi_shard1_replica2 baseURL=https://127.0.0.1:41878/solr
   [junit4]   2> 165061 INFO  (qtp414058973-912) [    ] o.a.s.c.ZkController I am the leader, no recovery necessary
   [junit4]   2> 165062 INFO  (qtp414058973-912) [    ] o.a.s.c.ZkController publishing state=active
   [junit4]   2> 165063 INFO  (qtp414058973-912) [    ] o.a.s.c.c.ZkStateReader Forcing refresh of watched collection state for testschemaapi
   [junit4]   2> 165063 INFO  (OverseerStateUpdate-96522308747001862-127.0.0.1:44152_solr-n_0000000000) [    ] o.a.s.c.Overseer processMessage: queueSize: 1, message = {
   [junit4]   2>   "core":"testschemaapi_shard1_replica2",
   [junit4]   2>   "core_node_name":"core_node1",
   [junit4]   2>   "roles":null,
   [junit4]   2>   "base_url":"https://127.0.0.1:41878/solr",
   [junit4]   2>   "node_name":"127.0.0.1:41878_solr",
   [junit4]   2>   "numShards":"1",
   [junit4]   2>   "state":"active",
   [junit4]   2>   "shard":"shard1",
   [junit4]   2>   "collection":"testschemaapi",
   [junit4]   2>   "operation":"state"} current state version: 0
   [junit4]   2> 165063 INFO  (OverseerStateUpdate-96522308747001862-127.0.0.1:44152_solr-n_0000000000) [    ] o.a.s.c.o.ReplicaMutator Update state numShards=1 message={
   [junit4]   2>   "core":"testschemaapi_shard1_replica2",
   [junit4]   2>   "core_node_name":"core_node1",
   [junit4]   2>   "roles":null,
   [junit4]   2>   "base_url":"https://127.0.0.1:41878/solr",
   [junit4]   2>   "node_name":"127.0.0.1:41878_solr",
   [junit4]   2>   "numShards":"1",
   [junit4]   2>   "state":"active",
   [junit4]   2>   "shard":"shard1",
   [junit4]   2>   "collection":"testschemaapi",
   [junit4]   2>   "operation":"state"}
   [junit4]   2> 165064 INFO  (qtp414058973-912) [    ] o.a.s.s.HttpSolrCall [admin] webapp=null path=/admin/cores params={qt=/admin/cores&collection.configName=conf1&name=testschemaapi_shard1_replica2&action=CREATE&numShards=1&collection=testschemaapi&shard=shard1&wt=javabin&version=2} status=0 QTime=1809
   [junit4]   2> 165166 INFO  (OverseerStateUpdate-96522308747001862-127.0.0.1:44152_solr-n_0000000000) [    ] o.a.s.c.o.ZkStateWriter going to update_collection /collections/testschemaapi/state.json version: 3
   [junit4]   2> 165166 INFO  (zkCallback-141-thread-1) [    ] o.a.s.c.c.ZkStateReader A cluster state change: [WatchedEvent state:SyncConnected type:NodeDataChanged path:/collections/testschemaapi/state.json] for collection [testschemaapi] has occurred - updating... (live nodes size: [2])
   [junit4]   2> 165166 INFO  (zkCallback-142-thread-1) [    ] o.a.s.c.c.ZkStateReader A cluster state change: [WatchedEvent state:SyncConnected type:NodeDataChanged path:/collections/testschemaapi/state.json] for collection [testschemaapi] has occurred - updating... (live nodes size: [2])
   [junit4]   2> 165167 INFO  (zkCallback-141-thread-1) [    ] o.a.s.c.c.ZkStateReader Updating data for [testschemaapi] from [3] to [4]
   [junit4]   2> 165167 INFO  (zkCallback-142-thread-1) [    ] o.a.s.c.c.ZkStateReader Updating data for [testschemaapi] from [3] to [4]
   [junit4]   2> 165405 INFO  (qtp399655909-926) [    ] o.a.s.c.ZkController We are https://127.0.0.1:44152/solr/testschemaapi_shard1_replica1/ and leader is https://127.0.0.1:41878/solr/testschemaapi_shard1_replica2/
   [junit4]   2> 165406 INFO  (qtp399655909-926) [    ] o.a.s.c.ZkController No LogReplay needed for core=testschemaapi_shard1_replica1 baseURL=https://127.0.0.1:44152/solr
   [junit4]   2> 165406 INFO  (qtp399655909-926) [    ] o.a.s.c.ZkController Core needs to recover:testschemaapi_shard1_replica1
   [junit4]   2> 165406 INFO  (qtp399655909-926) [    ] o.a.s.c.c.ZkStateReader Forcing refresh of watched collection state for testschemaapi
   [junit4]   2> 165406 INFO  (updateExecutor-135-thread-1) [    ] o.a.s.u.DefaultSolrCoreState Running recovery
   [junit4]   2> 165406 INFO  (recoveryExecutor-136-thread-1) [    ] o.a.s.c.RecoveryStrategy Starting recovery process. recoveringAfterStartup=true
   [junit4]   2> 165406 INFO  (recoveryExecutor-136-thread-1) [    ] o.a.s.c.RecoveryStrategy ###### startupVersions=[[]]
   [junit4]   2> 165406 INFO  (recoveryExecutor-136-thread-1) [    ] o.a.s.c.RecoveryStrategy Begin buffering updates. core=[testschemaapi_shard1_replica1]
   [junit4]   2> 165406 INFO  (recoveryExecutor-136-thread-1) [    ] o.a.s.u.UpdateLog Starting to buffer updates. FSUpdateLog{state=ACTIVE, tlog=null}
   [junit4]   2> 165406 INFO  (recoveryExecutor-136-thread-1) [    ] o.a.s.c.RecoveryStrategy Publishing state of core [testschemaapi_shard1_replica1] as recovering, leader is [https://127.0.0.1:41878/solr/testschemaapi_shard1_replica2/] and I am [https://127.0.0.1:44152/solr/testschemaapi_shard1_replica1/]
   [junit4]   2> 165406 INFO  (recoveryExecutor-136-thread-1) [    ] o.a.s.c.ZkController publishing state=recovering
   [junit4]   2> 165407 INFO  (qtp399655909-926) [    ] o.a.s.s.HttpSolrCall [admin] webapp=null path=/admin/cores params={qt=/admin/cores&collection.configName=conf1&name=testschemaapi_shard1_replica1&action=CREATE&numShards=1&collection=testschemaapi&shard=shard1&wt=javabin&version=2} status=0 QTime=2129
   [junit4]   2> 165407 INFO  (OverseerStateUpdate-96522308747001862-127.0.0.1:44152_solr-n_0000000000) [    ] o.a.s.c.Overseer processMessage: queueSize: 1, message = {
   [junit4]   2>   "core":"testschemaapi_shard1_replica1",
   [junit4]   2>   "core_node_name":"core_node2",
   [junit4]   2>   "roles":null,
   [junit4]   2>   "base_url":"https://127.0.0.1:44152/solr",
   [junit4]   2>   "node_name":"127.0.0.1:44152_solr",
   [junit4]   2>   "numShards":"1",
   [junit4]   2>   "state":"recovering",
   [junit4]   2>   "shard":"shard1",
   [junit4]   2>   "collection":"testschemaapi",
   [junit4]   2>   "operation":"state"} current state version: 0
   [junit4]   2> 165407 INFO  (OverseerStateUpdate-96522308747001862-127.0.0.1:44152_solr-n_0000000000) [    ] o.a.s.c.o.ReplicaMutator Update state numShards=1 message={
   [junit4]   2>   "core":"testschemaapi_shard1_replica1",
   [junit4]   2>   "core_node_name":"core_node2",
   [junit4]   2>   "roles":null,
   [junit4]   2>   "base_url":"https://127.0.0.1:44152/solr",
   [junit4]   2>   "node_name":"127.0.0.1:44152_solr",
   [junit4]   2>   "numShards":"1",
   [junit4]   2>   "state":"recovering",
   [junit4]   2>   "shard":"shard1",
   [junit4]   2>   "collection":"testschemaapi",
   [junit4]   2>   "operation":"state"}
   [junit4]   2> 165409 INFO  (zkCallback-141-thread-1) [    ] o.a.s.c.OverseerTaskQueue NodeDataChanged fired on path /overseer/collection-queue-work/qnr-0000000000 state SyncConnected latchEventType null
   [junit4]   2> 165409 INFO  (recoveryExecutor-136-thread-1) [    ] o.a.s.c.RecoveryStrategy Sending prep recovery command to [https://127.0.0.1:41878/solr]; [WaitForState: action=PREPRECOVERY&core=testschemaapi_shard1_replica2&nodeName=127.0.0.1:44152_solr&coreNodeName=core_node2&state=recovering&checkLive=true&onlyIfLeader=true&onlyIfLeaderActive=true]
   [junit4]   2> 165409 INFO  (OverseerThreadFactory-386-thread-1) [    ] o.a.s.c.OverseerTaskProcessor Overseer Collection Message Handler: Message id:/overseer/collection-queue-work/qn-0000000000 complete, response:{success={127.0.0.1:41878_solr={responseHeader={status=0,QTime=1809},core=testschemaapi_shard1_replica2},127.0.0.1:44152_solr={responseHeader={status=0,QTime=2129},core=testschemaapi_shard1_replica1}}}
   [junit4]   2> 165411 INFO  (qtp414058973-921) [    ] o.a.s.h.a.CollectionsHandler Wait for new collection to be active for at most 30 seconds. Check all shard replicas
   [junit4]   2> 165413 INFO  (qtp414058973-912) [    ] o.a.s.h.a.CoreAdminOperation Going to wait for coreNodeName: core_node2, state: recovering, checkLive: true, onlyIfLeader: true, onlyIfLeaderActive: true
   [junit4]   2> 165413 INFO  (qtp414058973-912) [    ] o.a.s.c.c.ZkStateReader Forcing refresh of watched collection state for testschemaapi
   [junit4]   2> 165413 INFO  (qtp414058973-912) [    ] o.a.s.h.a.CoreAdminOperation Will wait a max of 183 seconds to see testschemaapi_shard1_replica2 (shard1 of testschemaapi) have state: recovering
   [junit4]   2> 165413 INFO  (qtp414058973-912) [    ] o.a.s.h.a.CoreAdminOperation In WaitForState(recovering): collection=testschemaapi, shard=shard1, thisCore=testschemaapi_shard1_replica2, leaderDoesNotNeedRecovery=false, isLeader? true, live=true, checkLive=true, currentState=down, localState=active, nodeName=127.0.0.1:44152_solr, coreNodeName=core_node2, onlyIfActiveCheckResult=false, nodeProps: core_node2:{"core":"testschemaapi_shard1_replica1","base_url":"https://127.0.0.1:44152/solr","node_name":"127.0.0.1:44152_solr","state":"down"}
   [junit4]   2> 165509 INFO  (OverseerStateUpdate-96522308747001862-127.0.0.1:44152_solr-n_0000000000) [    ] o.a.s.c.o.ZkStateWriter going to update_collection /collections/testschemaapi/state.json version: 4
   [junit4]   2> 165509 INFO  (zkCallback-142-thread-1) [    ] o.a.s.c.c.ZkStateReader A cluster state change: [WatchedEvent state:SyncConnected type:NodeDataChanged path:/collections/testschemaapi/state.json] for collection [testschemaapi] has occurred - updating... (live nodes size: [2])
   [junit4]   2> 165509 INFO  (zkCallback-141-thread-1) [    ] o.a.s.c.c.ZkStateReader A cluster state change: [WatchedEvent state:SyncConnected type:NodeDataChanged path:/collections/testschemaapi/state.json] for collection [testschemaapi] has occurred - updating... (live nodes size: [2])
   [junit4]   2> 165510 INFO  (zkCallback-142-thread-1) [    ] o.a.s.c.c.ZkStateReader Updating data for [testschemaapi] from [4] to [5]
   [junit4]   2> 165510 INFO  (zkCallback-141-thread-1) [    ] o.a.s.c.c.ZkStateReader Updating data for [testschemaapi] from [4] to [5]
   [junit4]   2> 166413 INFO  (qtp414058973-912) [    ] o.a.s.h.a.CoreAdminOperation In WaitForState(recovering): collection=testschemaapi, shard=shard1, thisCore=testschemaapi_shard1_replica2, leaderDoesNotNeedRecovery=false, isLeader? true, live=true, checkLive=true, currentState=recovering, localState=active, nodeName=127.0.0.1:44152_solr, coreNodeName=core_node2, onlyIfActiveCheckResult=false, nodeProps: core_node2:{"core":"testschemaapi_shard1_replica1","base_url":"https://127.0.0.1:44152/solr","node_name":"127.0.0.1:44152_solr","state":"recovering"}
   [junit4]   2> 166413 INFO  (qtp414058973-912) [    ] o.a.s.h.a.CoreAdminOperation Waited coreNodeName: core_node2, state: recovering, checkLive: true, onlyIfLeader: true for: 1 seconds.
   [junit4]   2> 166413 INFO  (qtp414058973-912) [    ] o.a.s.s.HttpSolrCall [admin] webapp=null path=/admin/cores params={nodeName=127.0.0.1:44152_solr&onlyIfLeaderActive=true&core=testschemaapi_shard1_replica2&coreNodeName=core_node2&action=PREPRECOVERY&checkLive=true&state=recovering&onlyIfLeader=true&wt=javabin&version=2} status=0 QTime=1000
   [junit4]   2> 167122 INFO  (OverseerCollectionConfigSetProcessor-96522308747001862-127.0.0.1:44152_solr-n_0000000000) [    ] o.a.s.c.OverseerTaskQueue Response ZK path: /overseer/collection-queue-work/qnr-0000000000 doesn't exist.  Requestor may have disconnected from ZooKeeper
   [junit4]   2> 173414 INFO  (recoveryExecutor-136-thread-1) [    ] o.a.s.c.RecoveryStrategy Attempting to PeerSync from [https://127.0.0.1:41878/solr/testschemaapi_shard1_replica2/] - recoveringAfterStartup=[true]
   [junit4]   2> 173415 INFO  (recoveryExecutor-136-thread-1) [    ] o.a.s.u.PeerSync PeerSync: core=testschemaapi_shard1_replica1 url=https://127.0.0.1:44152/solr START replicas=[https://127.0.0.1:41878/solr/testschemaapi_shard1_replica2/] nUpdates=100
   [junit4]   2> 173415 WARN  (recoveryExecutor-136-thread-1) [    ] o.a.s.u.PeerSync no frame of reference to tell if we've missed updates
   [junit4]   2> 173415 INFO  (recoveryExecutor-136-thread-1) [    ] o.a.s.c.RecoveryStrategy PeerSync Recovery was not successful - trying replication.
   [junit4]   2> 173415 INFO  (recoveryExecutor-136-thread-1) [    ] o.a.s.c.RecoveryStrategy Starting Replication Recovery.
   [junit4]   2> 173415 INFO  (recoveryExecutor-136-thread-1) [    ] o.a.s.c.RecoveryStrategy Attempting to replicate from [https://127.0.0.1:41878/solr/testschemaapi_shard1_replica2/].
   [junit4]   2> 173427 INFO  (qtp414058973-914) [    ] o.a.s.u.DirectUpdateHandler2 start commit{,optimize=false,openSearcher=false,waitSearcher=true,expungeDeletes=false,softCommit=false,prepareCommit=false}
   [junit4]   2> 173429 INFO  (qtp414058973-914) [    ] o.a.s.u.DirectUpdateHandler2 No uncommitted changes. Skipping IW.commit.
   [junit4]   2> 173429 INFO  (qtp414058973-913) [    ] o.a.s.u.IndexFingerprint IndexFingerprint millis:0.0 result:{maxVersionSpecified=9223372036854775807, maxVersionEncountered=0, maxInHash=0, versionsHash=0, numVersions=0, numDocs=0, maxDoc=0}
   [junit4]   2> 173429 INFO  (qtp414058973-914) [    ] o.a.s.u.DirectUpdateHandler2 end_commit_flush
   [junit4]   2> 173429 INFO  (qtp414058973-913) [    ] o.a.s.c.S.Request [testschemaapi_shard1_replica2]  webapp=/solr path=/get params={distrib=false&qt=/get&fingerprint=true&getVersions=100&wt=javabin&version=2} status=0 QTime=3
   [junit4]   2> 173429 INFO  (qtp414058973-914) [    ] o.a.s.u.p.LogUpdateProcessorFactory [testschemaapi_shard1_replica2]  webapp=/solr path=/update params={waitSearcher=true&openSearcher=false&commit=true&softCommit=false&commit_end_point=true&wt=javabin&version=2}{commit=} 0 2
   [junit4]   2> 173436 INFO  (qtp414058973-912) [    ] o.a.s.c.S.Request [testschemaapi_shard1_replica2]  webapp=/solr path=/replication params={qt=/replication&wt=javabin&version=2&command=indexversion} status=0 QTime=0
   [junit4]   2> 173437 INFO  (recoveryExecutor-136-thread-1) [    ] o.a.s.c.RecoveryStrategy No replay needed.
   [junit4]   2> 173437 INFO  (recoveryExecutor-136-thread-1) [    ] o.a.s.c.RecoveryStrategy Replication Recovery was successful.
   [junit4]   2> 173437 INFO  (recoveryExecutor-136-thread-1) [    ] o.a.s.c.RecoveryStrategy Registering as Active after recovery.
   [junit4]   2> 173437 INFO  (recoveryExecutor-136-thread-1) [    ] o.a.s.c.ZkController publishing state=active
   [junit4]   2> 173440 INFO  (recoveryExecutor-136-thread-1) [    ] o.a.s.c.RecoveryStrategy Updating version bucket highest from index after successful recovery.
   [junit4]   2> 173440 INFO  (recoveryExecutor-136-thread-1) [    ] o.a.s.u.UpdateLog Looking up max value of version field to seed version buckets
   [junit4]   2> 173440 INFO  (recoveryExecutor-136-thread-1) [    ] o.a.s.u.VersionInfo Refreshing highest value of _version_ for 65536 version buckets from index
   [junit4]   2> 173440 INFO  (recoveryExecutor-136-thread-1) [    ] o.a.s.u.VersionInfo No terms found for _version_, cannot seed version bucket highest value from index
   [junit4]   2> 173440 INFO  (recoveryExecutor-136-thread-1) [    ] o.a.s.u.UpdateLog Could not find max version in index or recent updates, using new clock 1544356951150821376
   [junit4]   2> 173440 INFO  (OverseerStateUpdate-96522308747001862-127.0.0.1:44152_solr-n_0000000000) [    ] o.a.s.c.Overseer processMessage: queueSize: 1, message = {
   [junit4]   2>   "core":"testschemaapi_shard1_replica1",
   [junit4]   2>   "core_node_name":"core_node2",
   [junit4]   2>   "roles":null,
   [junit4]   2>   "base_url":"https://127.0.0.1:44152/solr",
   [junit4]   2>   "node_name":"127.0.0.1:44152_solr",
   [junit4]   2>   "numShards":"1",
   [junit4]   2>   "state":"active",
   [junit4]   2>   "shard":"shard1",
   [junit4]   2>   "collection":"testschemaapi",
   [junit4]   2>   "operation":"state"} current state version: 0
   [junit4]   2> 173440 INFO  (OverseerStateUpdate-96522308747001862-127.0.0.1:44152_solr-n_0000000000) [    ] o.a.s.c.o.ReplicaMutator Update state numShards=1 message={
   [junit4]   2>   "core":"testschemaapi_shard1_replica1",
   [junit4]   2>   "core_node_name":"core_node2",
   [junit4]   2>   "roles":null,
   [junit4]   2>   "base_url":"https://127.0.0.1:44152/solr",
   [junit4]   2>   "node_name":"127.0.0.1:44152_sol

[...truncated too long message...]

erting(_0(7.0.0):C1)))}
   [junit4]   2> 174725 INFO  (Thread-287) [    ] o.a.s.c.SolrCore [testschemaapi_shard1_replica2] Closing main searcher on request.
   [junit4]   2> 174725 INFO  (Thread-287) [    ] o.a.s.c.CachingDirectoryFactory Closing MockDirectoryFactory - 3 directories currently being tracked
   [junit4]   2> 174725 INFO  (Thread-287) [    ] o.a.s.c.CachingDirectoryFactory looking to close /home/jenkins/workspace/Lucene-Solr-master-Linux/solr/build/solr-core/test/J1/temp/solr.schema.TestManagedSchemaAPI_6C5C315B86FED539-001/tempDir-001/node1/./testschemaapi_shard1_replica2/data/index [CachedDir<<refCount=0;path=/home/jenkins/workspace/Lucene-Solr-master-Linux/solr/build/solr-core/test/J1/temp/solr.schema.TestManagedSchemaAPI_6C5C315B86FED539-001/tempDir-001/node1/./testschemaapi_shard1_replica2/data/index;done=false>>]
   [junit4]   2> 174726 INFO  (Thread-287) [    ] o.a.s.c.CachingDirectoryFactory Closing directory, CoreContainer#isShutdown=true
   [junit4]   2> 174726 INFO  (Thread-287) [    ] o.a.s.c.CachingDirectoryFactory Closing directory: /home/jenkins/workspace/Lucene-Solr-master-Linux/solr/build/solr-core/test/J1/temp/solr.schema.TestManagedSchemaAPI_6C5C315B86FED539-001/tempDir-001/node1/./testschemaapi_shard1_replica2/data/index
   [junit4]   2> 174726 INFO  (Thread-287) [    ] o.a.s.c.CachingDirectoryFactory looking to close /home/jenkins/workspace/Lucene-Solr-master-Linux/solr/build/solr-core/test/J1/temp/solr.schema.TestManagedSchemaAPI_6C5C315B86FED539-001/tempDir-001/node1/./testschemaapi_shard1_replica2/data [CachedDir<<refCount=0;path=/home/jenkins/workspace/Lucene-Solr-master-Linux/solr/build/solr-core/test/J1/temp/solr.schema.TestManagedSchemaAPI_6C5C315B86FED539-001/tempDir-001/node1/./testschemaapi_shard1_replica2/data;done=false>>]
   [junit4]   2> 174726 INFO  (Thread-287) [    ] o.a.s.c.CachingDirectoryFactory Closing directory, CoreContainer#isShutdown=true
   [junit4]   2> 174726 INFO  (Thread-287) [    ] o.a.s.c.CachingDirectoryFactory Closing directory: /home/jenkins/workspace/Lucene-Solr-master-Linux/solr/build/solr-core/test/J1/temp/solr.schema.TestManagedSchemaAPI_6C5C315B86FED539-001/tempDir-001/node1/./testschemaapi_shard1_replica2/data
   [junit4]   2> 174726 INFO  (Thread-287) [    ] o.a.s.c.CachingDirectoryFactory looking to close /home/jenkins/workspace/Lucene-Solr-master-Linux/solr/build/solr-core/test/J1/temp/solr.schema.TestManagedSchemaAPI_6C5C315B86FED539-001/tempDir-001/node1/./testschemaapi_shard1_replica2/data/snapshot_metadata [CachedDir<<refCount=0;path=/home/jenkins/workspace/Lucene-Solr-master-Linux/solr/build/solr-core/test/J1/temp/solr.schema.TestManagedSchemaAPI_6C5C315B86FED539-001/tempDir-001/node1/./testschemaapi_shard1_replica2/data/snapshot_metadata;done=false>>]
   [junit4]   2> 174726 INFO  (Thread-287) [    ] o.a.s.c.CachingDirectoryFactory Closing directory, CoreContainer#isShutdown=true
   [junit4]   2> 174726 INFO  (Thread-287) [    ] o.a.s.c.CachingDirectoryFactory Closing directory: /home/jenkins/workspace/Lucene-Solr-master-Linux/solr/build/solr-core/test/J1/temp/solr.schema.TestManagedSchemaAPI_6C5C315B86FED539-001/tempDir-001/node1/./testschemaapi_shard1_replica2/data/snapshot_metadata
   [junit4]   2> 174727 INFO  (jetty-launcher-131-thread-1) [    ] o.a.s.c.Overseer Overseer (id=96522308747001862-127.0.0.1:44152_solr-n_0000000000) closing
   [junit4]   2> 174727 INFO  (OverseerStateUpdate-96522308747001862-127.0.0.1:44152_solr-n_0000000000) [    ] o.a.s.c.Overseer Overseer Loop exiting : 127.0.0.1:44152_solr
   [junit4]   2> 174727 WARN  (Thread-287) [    ] o.a.s.c.ZkController listener throws error
   [junit4]   2> org.apache.solr.common.SolrException: Unable to reload core [testschemaapi_shard1_replica2]
   [junit4]   2> 	at org.apache.solr.core.CoreContainer.reload(CoreContainer.java:968)
   [junit4]   2> 	at org.apache.solr.core.SolrCore.lambda$getConfListener$6(SolrCore.java:2596)
   [junit4]   2> 	at org.apache.solr.cloud.ZkController.lambda$fireEventListeners$3(ZkController.java:2443)
   [junit4]   2> 	at java.lang.Thread.run(java.base@9-ea/Thread.java:843)
   [junit4]   2> Caused by: org.apache.solr.common.SolrException: Failed to load config name for collection:testschemaapi due to: 
   [junit4]   2> 	at org.apache.solr.core.SolrCore.<init>(SolrCore.java:833)
   [junit4]   2> 	at org.apache.solr.core.SolrCore.reload(SolrCore.java:503)
   [junit4]   2> 	at org.apache.solr.core.CoreContainer.reload(CoreContainer.java:962)
   [junit4]   2> 	... 3 more
   [junit4]   2> Caused by: org.apache.solr.common.SolrException: Failed to load config name for collection:testschemaapi due to: 
   [junit4]   2> 	at org.apache.solr.rest.ManagedResourceStorage.newStorageIO(ManagedResourceStorage.java:98)
   [junit4]   2> 	at org.apache.solr.core.SolrCore.initRestManager(SolrCore.java:2376)
   [junit4]   2> 	at org.apache.solr.core.SolrCore.<init>(SolrCore.java:809)
   [junit4]   2> 	... 5 more
   [junit4]   2> Caused by: org.apache.solr.common.SolrException: Error loading config name for collection testschemaapi
   [junit4]   2> 	at org.apache.solr.common.cloud.ZkStateReader.readConfigName(ZkStateReader.java:197)
   [junit4]   2> 	at org.apache.solr.rest.ManagedResourceStorage.newStorageIO(ManagedResourceStorage.java:95)
   [junit4]   2> 	... 7 more
   [junit4]   2> Caused by: org.apache.zookeeper.KeeperException$SessionExpiredException: KeeperErrorCode = Session expired for /collections/testschemaapi
   [junit4]   2> 	at org.apache.zookeeper.KeeperException.create(KeeperException.java:127)
   [junit4]   2> 	at org.apache.zookeeper.KeeperException.create(KeeperException.java:51)
   [junit4]   2> 	at org.apache.zookeeper.ZooKeeper.getData(ZooKeeper.java:1155)
   [junit4]   2> 	at org.apache.solr.common.cloud.SolrZkClient$7.execute(SolrZkClient.java:348)
   [junit4]   2> 	at org.apache.solr.common.cloud.SolrZkClient$7.execute(SolrZkClient.java:345)
   [junit4]   2> 	at org.apache.solr.common.cloud.ZkCmdExecutor.retryOperation(ZkCmdExecutor.java:60)
   [junit4]   2> 	at org.apache.solr.common.cloud.SolrZkClient.getData(SolrZkClient.java:345)
   [junit4]   2> 	at org.apache.solr.common.cloud.ZkStateReader.readConfigName(ZkStateReader.java:178)
   [junit4]   2> 	... 8 more
   [junit4]   2> 174729 INFO  (zkCallback-142-thread-7) [    ] o.a.s.c.c.ZkStateReader A live node change: [WatchedEvent state:SyncConnected type:NodeChildrenChanged path:/live_nodes], has occurred - updating... (live nodes size: [1])
   [junit4]   2> 174729 WARN  (zkCallback-142-thread-7) [    ] o.a.s.c.c.ZkStateReader ZooKeeper watch triggered, but Solr cannot talk to ZK: [KeeperErrorCode = Session expired for /live_nodes]
   [junit4]   2> 174730 INFO  (jetty-launcher-131-thread-1) [    ] o.e.j.s.h.ContextHandler Stopped o.e.j.s.ServletContextHandler@1b55f9f6{/solr,null,UNAVAILABLE}
   [junit4]   2> 176214 WARN  (zkCallback-141-thread-1) [    ] o.a.s.c.c.ZkStateReader ZooKeeper watch triggered, but Solr cannot talk to ZK: [KeeperErrorCode = Session expired for /live_nodes]
   [junit4]   2> 176214 INFO  (jetty-launcher-131-thread-2) [    ] o.e.j.s.h.ContextHandler Stopped o.e.j.s.ServletContextHandler@3fb53c17{/solr,null,UNAVAILABLE}
   [junit4]   2> 176215 INFO  (SUITE-TestManagedSchemaAPI-seed#[6C5C315B86FED539]-worker) [    ] o.a.s.c.ZkTestServer connecting to 127.0.0.1:37103 37103
   [junit4]   2> 176320 INFO  (Thread-262) [    ] o.a.s.c.ZkTestServer connecting to 127.0.0.1:37103 37103
   [junit4]   2> 176320 WARN  (Thread-262) [    ] o.a.s.c.ZkTestServer Watch limit violations: 
   [junit4]   2> Maximum concurrent create/delete watches above limit:
   [junit4]   2> 
   [junit4]   2> 	6	/solr/configs/conf1
   [junit4]   2> 	5	/solr/configs/conf1/managed-schema
   [junit4]   2> 	3	/solr/aliases.json
   [junit4]   2> 	2	/solr/security.json
   [junit4]   2> 
   [junit4]   2> Maximum concurrent data watches above limit:
   [junit4]   2> 
   [junit4]   2> 	3	/solr/clusterstate.json
   [junit4]   2> 	3	/solr/clusterprops.json
   [junit4]   2> 	2	/solr/collections/testschemaapi/state.json
   [junit4]   2> 
   [junit4]   2> Maximum concurrent children watches above limit:
   [junit4]   2> 
   [junit4]   2> 	9	/solr/overseer/queue
   [junit4]   2> 	9	/solr/overseer/collection-queue-work
   [junit4]   2> 	4	/solr/overseer/queue-work
   [junit4]   2> 	3	/solr/live_nodes
   [junit4]   2> 	3	/solr/collections
   [junit4]   2> 
   [junit4]   2> 176321 INFO  (SUITE-TestManagedSchemaAPI-seed#[6C5C315B86FED539]-worker) [    ] o.a.s.SolrTestCaseJ4 ###deleteCore
   [junit4]   2> NOTE: leaving temporary files on disk at: /home/jenkins/workspace/Lucene-Solr-master-Linux/solr/build/solr-core/test/J1/temp/solr.schema.TestManagedSchemaAPI_6C5C315B86FED539-001
   [junit4]   2> Sep 02, 2016 10:52:42 AM com.carrotsearch.randomizedtesting.ThreadLeakControl checkThreadLeaks
   [junit4]   2> WARNING: Will linger awaiting termination of 1 leaked thread(s).
   [junit4]   2> NOTE: test params are: codec=Asserting(Lucene62): {_version_=Lucene50(blocksize=128), id=BlockTreeOrds(blocksize=128), myNewField=PostingsFormat(name=Direct)}, docValues:{}, maxPointsInLeafNode=466, maxMBSortInHeap=5.660724166990218, sim=RandomSimilarity(queryNorm=false): {}, locale=cy, timezone=Asia/Aden
   [junit4]   2> NOTE: Linux 4.4.0-31-generic amd64/Oracle Corporation 9-ea (64-bit)/cpus=12,threads=1,free=259674552,total=508887040
   [junit4]   2> NOTE: All tests run in this JVM: [NotRequiredUniqueKeyTest, TestPartialUpdateDeduplication, TestEmbeddedSolrServerConstructors, CachingDirectoryFactoryTest, DistributedExpandComponentTest, TestSolrCoreProperties, PeerSyncReplicationTest, SolrInfoMBeanTest, TestSolrCoreSnapshots, TestStressCloudBlindAtomicUpdates, SolrIndexSplitterTest, SecurityConfHandlerTest, DistributedFacetPivotSmallAdvancedTest, TestDocumentBuilder, TestBinaryResponseWriter, TestManagedSchemaAPI]
   [junit4] Completed [69/632 (1!)] on J1 in 14.08s, 1 test, 1 error <<< FAILURES!

[...truncated 51511 lines...]


Mime
View raw message