lucene-dev mailing list archives

Site index · List index
Message view « Date » · « Thread »
Top « Date » · « Thread »
From Apache Jenkins Server <jenk...@builds.apache.org>
Subject [JENKINS] Lucene-Solr-Tests-6.x - Build # 442 - Still Failing
Date Fri, 02 Sep 2016 04:05:08 GMT
Build: https://builds.apache.org/job/Lucene-Solr-Tests-6.x/442/

2 tests failed.
FAILED:  junit.framework.TestSuite.org.apache.solr.cloud.TestRequestForwarding

Error Message:
1 thread leaked from SUITE scope at org.apache.solr.cloud.TestRequestForwarding:     1) Thread[id=211, name=OverseerHdfsCoreFailoverThread-96520513629257737-127.0.0.1:53296_solr-n_0000000002, state=TIMED_WAITING, group=Overseer Hdfs SolrCore Failover Thread.]         at java.lang.Thread.sleep(Native Method)         at org.apache.solr.cloud.OverseerAutoReplicaFailoverThread.run(OverseerAutoReplicaFailoverThread.java:137)         at java.lang.Thread.run(Thread.java:745)

Stack Trace:
com.carrotsearch.randomizedtesting.ThreadLeakError: 1 thread leaked from SUITE scope at org.apache.solr.cloud.TestRequestForwarding: 
   1) Thread[id=211, name=OverseerHdfsCoreFailoverThread-96520513629257737-127.0.0.1:53296_solr-n_0000000002, state=TIMED_WAITING, group=Overseer Hdfs SolrCore Failover Thread.]
        at java.lang.Thread.sleep(Native Method)
        at org.apache.solr.cloud.OverseerAutoReplicaFailoverThread.run(OverseerAutoReplicaFailoverThread.java:137)
        at java.lang.Thread.run(Thread.java:745)
	at __randomizedtesting.SeedInfo.seed([2FC5452D3A987335]:0)


FAILED:  junit.framework.TestSuite.org.apache.solr.cloud.TestRequestForwarding

Error Message:
There are still zombie threads that couldn't be terminated:    1) Thread[id=211, name=OverseerHdfsCoreFailoverThread-96520513629257737-127.0.0.1:53296_solr-n_0000000002, state=RUNNABLE, group=Overseer Hdfs SolrCore Failover Thread.]         at java.lang.Thread.sleep(Native Method)         at org.apache.solr.cloud.OverseerAutoReplicaFailoverThread.run(OverseerAutoReplicaFailoverThread.java:137)         at java.lang.Thread.run(Thread.java:745)

Stack Trace:
com.carrotsearch.randomizedtesting.ThreadLeakError: There are still zombie threads that couldn't be terminated:
   1) Thread[id=211, name=OverseerHdfsCoreFailoverThread-96520513629257737-127.0.0.1:53296_solr-n_0000000002, state=RUNNABLE, group=Overseer Hdfs SolrCore Failover Thread.]
        at java.lang.Thread.sleep(Native Method)
        at org.apache.solr.cloud.OverseerAutoReplicaFailoverThread.run(OverseerAutoReplicaFailoverThread.java:137)
        at java.lang.Thread.run(Thread.java:745)
	at __randomizedtesting.SeedInfo.seed([2FC5452D3A987335]:0)




Build Log:
[...truncated 10671 lines...]
   [junit4] Suite: org.apache.solr.cloud.TestRequestForwarding
   [junit4]   2> Creating dataDir: /x1/jenkins/jenkins-slave/workspace/Lucene-Solr-Tests-6.x/solr/build/solr-core/test/J2/temp/solr.cloud.TestRequestForwarding_2FC5452D3A987335-001/init-core-data-001
   [junit4]   2> 49235 INFO  (SUITE-TestRequestForwarding-seed#[2FC5452D3A987335]-worker) [    ] o.a.s.SolrTestCaseJ4 Randomized ssl (false) and clientAuth (false) via: @org.apache.solr.SolrTestCaseJ4$SuppressSSL(bugUrl=None)
   [junit4]   2> 49237 INFO  (TEST-TestRequestForwarding.testMultiCollectionQuery-seed#[2FC5452D3A987335]) [    ] o.a.s.SolrTestCaseJ4 ###Starting testMultiCollectionQuery
   [junit4]   2> 49246 INFO  (TEST-TestRequestForwarding.testMultiCollectionQuery-seed#[2FC5452D3A987335]) [    ] o.a.s.c.ZkTestServer STARTING ZK TEST SERVER
   [junit4]   2> 49249 INFO  (Thread-19) [    ] o.a.s.c.ZkTestServer client port:0.0.0.0/0.0.0.0:0
   [junit4]   2> 49249 INFO  (Thread-19) [    ] o.a.s.c.ZkTestServer Starting server
   [junit4]   2> 49348 INFO  (TEST-TestRequestForwarding.testMultiCollectionQuery-seed#[2FC5452D3A987335]) [    ] o.a.s.c.ZkTestServer start zk server on port:43299
   [junit4]   2> 49350 INFO  (TEST-TestRequestForwarding.testMultiCollectionQuery-seed#[2FC5452D3A987335]) [    ] o.a.s.c.c.SolrZkClient Using default ZkCredentialsProvider
   [junit4]   2> 49399 INFO  (TEST-TestRequestForwarding.testMultiCollectionQuery-seed#[2FC5452D3A987335]) [    ] o.a.s.c.c.ConnectionManager Waiting for client to connect to ZooKeeper
   [junit4]   2> 49444 INFO  (zkCallback-10-thread-1) [    ] o.a.s.c.c.ConnectionManager Watcher org.apache.solr.common.cloud.ConnectionManager@6630dfc5 name:ZooKeeperConnection Watcher:127.0.0.1:43299 got event WatchedEvent state:SyncConnected type:None path:null path:null type:None
   [junit4]   2> 49444 INFO  (TEST-TestRequestForwarding.testMultiCollectionQuery-seed#[2FC5452D3A987335]) [    ] o.a.s.c.c.ConnectionManager Client is connected to ZooKeeper
   [junit4]   2> 49445 INFO  (TEST-TestRequestForwarding.testMultiCollectionQuery-seed#[2FC5452D3A987335]) [    ] o.a.s.c.c.SolrZkClient Using default ZkACLProvider
   [junit4]   2> 49445 INFO  (TEST-TestRequestForwarding.testMultiCollectionQuery-seed#[2FC5452D3A987335]) [    ] o.a.s.c.c.SolrZkClient makePath: /solr/solr.xml
   [junit4]   2> 49481 WARN  (NIOServerCxn.Factory:0.0.0.0/0.0.0.0:0) [    ] o.a.z.s.NIOServerCnxn caught end of stream exception
   [junit4]   2> EndOfStreamException: Unable to read additional data from client sessionid 0x156e8e550690000, likely client has closed socket
   [junit4]   2> 	at org.apache.zookeeper.server.NIOServerCnxn.doIO(NIOServerCnxn.java:228)
   [junit4]   2> 	at org.apache.zookeeper.server.NIOServerCnxnFactory.run(NIOServerCnxnFactory.java:208)
   [junit4]   2> 	at java.lang.Thread.run(Thread.java:745)
   [junit4]   2> 49683 INFO  (jetty-launcher-9-thread-1) [    ] o.e.j.s.Server jetty-9.3.8.v20160314
   [junit4]   2> 49683 INFO  (jetty-launcher-9-thread-3) [    ] o.e.j.s.Server jetty-9.3.8.v20160314
   [junit4]   2> 49683 INFO  (jetty-launcher-9-thread-2) [    ] o.e.j.s.Server jetty-9.3.8.v20160314
   [junit4]   2> 49877 INFO  (jetty-launcher-9-thread-1) [    ] o.e.j.s.h.ContextHandler Started o.e.j.s.ServletContextHandler@6f206767{/solr,null,AVAILABLE}
   [junit4]   2> 49880 INFO  (jetty-launcher-9-thread-3) [    ] o.e.j.s.h.ContextHandler Started o.e.j.s.ServletContextHandler@5e73eb6e{/solr,null,AVAILABLE}
   [junit4]   2> 49917 INFO  (jetty-launcher-9-thread-2) [    ] o.e.j.s.h.ContextHandler Started o.e.j.s.ServletContextHandler@23cb392c{/solr,null,AVAILABLE}
   [junit4]   2> 49927 INFO  (jetty-launcher-9-thread-1) [    ] o.e.j.s.ServerConnector Started ServerConnector@5f098807{HTTP/1.1,[http/1.1]}{127.0.0.1:57576}
   [junit4]   2> 49927 INFO  (jetty-launcher-9-thread-1) [    ] o.e.j.s.Server Started @54614ms
   [junit4]   2> 49927 INFO  (jetty-launcher-9-thread-1) [    ] o.a.s.c.s.e.JettySolrRunner Jetty properties: {hostContext=/solr, hostPort=57576}
   [junit4]   2> 49944 INFO  (jetty-launcher-9-thread-3) [    ] o.e.j.s.ServerConnector Started ServerConnector@3c11127f{HTTP/1.1,[http/1.1]}{127.0.0.1:53296}
   [junit4]   2> 49945 INFO  (jetty-launcher-9-thread-3) [    ] o.e.j.s.Server Started @54632ms
   [junit4]   2> 49945 INFO  (jetty-launcher-9-thread-3) [    ] o.a.s.c.s.e.JettySolrRunner Jetty properties: {hostContext=/solr, hostPort=53296}
   [junit4]   2> 49952 INFO  (jetty-launcher-9-thread-2) [    ] o.e.j.s.ServerConnector Started ServerConnector@7b18fc7f{HTTP/1.1,[http/1.1]}{127.0.0.1:44202}
   [junit4]   2> 49952 INFO  (jetty-launcher-9-thread-2) [    ] o.e.j.s.Server Started @54639ms
   [junit4]   2> 49952 INFO  (jetty-launcher-9-thread-2) [    ] o.a.s.c.s.e.JettySolrRunner Jetty properties: {hostContext=/solr, hostPort=44202}
   [junit4]   2> 49960 INFO  (jetty-launcher-9-thread-1) [    ] o.a.s.s.SolrDispatchFilter SolrDispatchFilter.init(): sun.misc.Launcher$AppClassLoader@73d16e93
   [junit4]   2> 49960 INFO  (jetty-launcher-9-thread-2) [    ] o.a.s.s.SolrDispatchFilter SolrDispatchFilter.init(): sun.misc.Launcher$AppClassLoader@73d16e93
   [junit4]   2> 49961 INFO  (jetty-launcher-9-thread-3) [    ] o.a.s.s.SolrDispatchFilter SolrDispatchFilter.init(): sun.misc.Launcher$AppClassLoader@73d16e93
   [junit4]   2> 49963 INFO  (jetty-launcher-9-thread-1) [    ] o.a.s.c.SolrResourceLoader new SolrResourceLoader for directory: '/x1/jenkins/jenkins-slave/workspace/Lucene-Solr-Tests-6.x/solr/build/solr-core/test/J2/temp/solr.cloud.TestRequestForwarding_2FC5452D3A987335-001/tempDir-001/node1'
   [junit4]   2> 49963 INFO  (jetty-launcher-9-thread-1) [    ] o.a.s.c.SolrResourceLoader JNDI not configured for solr (NoInitialContextEx)
   [junit4]   2> 49963 INFO  (jetty-launcher-9-thread-1) [    ] o.a.s.c.SolrResourceLoader solr home defaulted to 'solr/' (could not find system property or JNDI)
   [junit4]   2> 49964 INFO  (jetty-launcher-9-thread-2) [    ] o.a.s.c.SolrResourceLoader new SolrResourceLoader for directory: '/x1/jenkins/jenkins-slave/workspace/Lucene-Solr-Tests-6.x/solr/build/solr-core/test/J2/temp/solr.cloud.TestRequestForwarding_2FC5452D3A987335-001/tempDir-001/node3'
   [junit4]   2> 49964 INFO  (jetty-launcher-9-thread-3) [    ] o.a.s.c.SolrResourceLoader new SolrResourceLoader for directory: '/x1/jenkins/jenkins-slave/workspace/Lucene-Solr-Tests-6.x/solr/build/solr-core/test/J2/temp/solr.cloud.TestRequestForwarding_2FC5452D3A987335-001/tempDir-001/node2'
   [junit4]   2> 49964 INFO  (jetty-launcher-9-thread-1) [    ] o.a.s.c.c.SolrZkClient Using default ZkCredentialsProvider
   [junit4]   2> 49964 INFO  (jetty-launcher-9-thread-2) [    ] o.a.s.c.SolrResourceLoader JNDI not configured for solr (NoInitialContextEx)
   [junit4]   2> 49964 INFO  (jetty-launcher-9-thread-2) [    ] o.a.s.c.SolrResourceLoader solr home defaulted to 'solr/' (could not find system property or JNDI)
   [junit4]   2> 49964 INFO  (jetty-launcher-9-thread-2) [    ] o.a.s.c.c.SolrZkClient Using default ZkCredentialsProvider
   [junit4]   2> 49965 INFO  (jetty-launcher-9-thread-3) [    ] o.a.s.c.SolrResourceLoader JNDI not configured for solr (NoInitialContextEx)
   [junit4]   2> 49965 INFO  (jetty-launcher-9-thread-3) [    ] o.a.s.c.SolrResourceLoader solr home defaulted to 'solr/' (could not find system property or JNDI)
   [junit4]   2> 49965 INFO  (jetty-launcher-9-thread-3) [    ] o.a.s.c.c.SolrZkClient Using default ZkCredentialsProvider
   [junit4]   2> 49972 INFO  (jetty-launcher-9-thread-2) [    ] o.a.s.c.c.ConnectionManager Waiting for client to connect to ZooKeeper
   [junit4]   2> 49992 INFO  (jetty-launcher-9-thread-1) [    ] o.a.s.c.c.ConnectionManager Waiting for client to connect to ZooKeeper
   [junit4]   2> 50006 INFO  (jetty-launcher-9-thread-3) [    ] o.a.s.c.c.ConnectionManager Waiting for client to connect to ZooKeeper
   [junit4]   2> 50021 INFO  (zkCallback-12-thread-1) [    ] o.a.s.c.c.ConnectionManager Watcher org.apache.solr.common.cloud.ConnectionManager@4493c94b name:ZooKeeperConnection Watcher:127.0.0.1:43299/solr got event WatchedEvent state:SyncConnected type:None path:null path:null type:None
   [junit4]   2> 50021 INFO  (jetty-launcher-9-thread-2) [    ] o.a.s.c.c.ConnectionManager Client is connected to ZooKeeper
   [junit4]   2> 50021 INFO  (jetty-launcher-9-thread-2) [    ] o.a.s.c.c.SolrZkClient Using default ZkACLProvider
   [junit4]   2> 50023 INFO  (zkCallback-11-thread-1) [    ] o.a.s.c.c.ConnectionManager Watcher org.apache.solr.common.cloud.ConnectionManager@f500311 name:ZooKeeperConnection Watcher:127.0.0.1:43299/solr got event WatchedEvent state:SyncConnected type:None path:null path:null type:None
   [junit4]   2> 50023 INFO  (jetty-launcher-9-thread-1) [    ] o.a.s.c.c.ConnectionManager Client is connected to ZooKeeper
   [junit4]   2> 50023 INFO  (jetty-launcher-9-thread-1) [    ] o.a.s.c.c.SolrZkClient Using default ZkACLProvider
   [junit4]   2> 50037 INFO  (jetty-launcher-9-thread-2) [    ] o.a.s.s.SolrDispatchFilter solr.xml found in ZooKeeper. Loading...
   [junit4]   2> 50037 INFO  (zkCallback-13-thread-1) [    ] o.a.s.c.c.ConnectionManager Watcher org.apache.solr.common.cloud.ConnectionManager@649c6d29 name:ZooKeeperConnection Watcher:127.0.0.1:43299/solr got event WatchedEvent state:SyncConnected type:None path:null path:null type:None
   [junit4]   2> 50037 INFO  (jetty-launcher-9-thread-1) [    ] o.a.s.s.SolrDispatchFilter solr.xml found in ZooKeeper. Loading...
   [junit4]   2> 50037 INFO  (jetty-launcher-9-thread-3) [    ] o.a.s.c.c.ConnectionManager Client is connected to ZooKeeper
   [junit4]   2> 50037 INFO  (jetty-launcher-9-thread-3) [    ] o.a.s.c.c.SolrZkClient Using default ZkACLProvider
   [junit4]   2> 50041 INFO  (jetty-launcher-9-thread-3) [    ] o.a.s.s.SolrDispatchFilter solr.xml found in ZooKeeper. Loading...
   [junit4]   2> 50122 INFO  (jetty-launcher-9-thread-3) [    ] o.a.s.c.CorePropertiesLocator Config-defined core root directory: /x1/jenkins/jenkins-slave/workspace/Lucene-Solr-Tests-6.x/solr/build/solr-core/test/J2/temp/solr.cloud.TestRequestForwarding_2FC5452D3A987335-001/tempDir-001/node2/.
   [junit4]   2> 50123 INFO  (jetty-launcher-9-thread-3) [    ] o.a.s.c.CoreContainer New CoreContainer 1412761792
   [junit4]   2> 50123 INFO  (jetty-launcher-9-thread-3) [    ] o.a.s.c.CoreContainer Loading cores into CoreContainer [instanceDir=/x1/jenkins/jenkins-slave/workspace/Lucene-Solr-Tests-6.x/solr/build/solr-core/test/J2/temp/solr.cloud.TestRequestForwarding_2FC5452D3A987335-001/tempDir-001/node2]
   [junit4]   2> 50123 WARN  (jetty-launcher-9-thread-3) [    ] o.a.s.c.CoreContainer Couldn't add files from /x1/jenkins/jenkins-slave/workspace/Lucene-Solr-Tests-6.x/solr/build/solr-core/test/J2/temp/solr.cloud.TestRequestForwarding_2FC5452D3A987335-001/tempDir-001/node2/lib to classpath: /x1/jenkins/jenkins-slave/workspace/Lucene-Solr-Tests-6.x/solr/build/solr-core/test/J2/temp/solr.cloud.TestRequestForwarding_2FC5452D3A987335-001/tempDir-001/node2/lib
   [junit4]   2> 50134 INFO  (jetty-launcher-9-thread-3) [    ] o.a.s.h.c.HttpShardHandlerFactory created with socketTimeout : 90000,urlScheme : ,connTimeout : 15000,maxConnectionsPerHost : 20,maxConnections : 10000,corePoolSize : 0,maximumPoolSize : 2147483647,maxThreadIdleTime : 5,sizeOfQueue : -1,fairnessPolicy : false,useRetries : false,connectionsEvictorSleepDelay : 5000,maxConnectionIdleTime : 40000,
   [junit4]   2> 50138 INFO  (jetty-launcher-9-thread-1) [    ] o.a.s.c.CorePropertiesLocator Config-defined core root directory: /x1/jenkins/jenkins-slave/workspace/Lucene-Solr-Tests-6.x/solr/build/solr-core/test/J2/temp/solr.cloud.TestRequestForwarding_2FC5452D3A987335-001/tempDir-001/node1/.
   [junit4]   2> 50138 INFO  (jetty-launcher-9-thread-1) [    ] o.a.s.c.CoreContainer New CoreContainer 1573853775
   [junit4]   2> 50138 INFO  (jetty-launcher-9-thread-1) [    ] o.a.s.c.CoreContainer Loading cores into CoreContainer [instanceDir=/x1/jenkins/jenkins-slave/workspace/Lucene-Solr-Tests-6.x/solr/build/solr-core/test/J2/temp/solr.cloud.TestRequestForwarding_2FC5452D3A987335-001/tempDir-001/node1]
   [junit4]   2> 50139 WARN  (jetty-launcher-9-thread-1) [    ] o.a.s.c.CoreContainer Couldn't add files from /x1/jenkins/jenkins-slave/workspace/Lucene-Solr-Tests-6.x/solr/build/solr-core/test/J2/temp/solr.cloud.TestRequestForwarding_2FC5452D3A987335-001/tempDir-001/node1/lib to classpath: /x1/jenkins/jenkins-slave/workspace/Lucene-Solr-Tests-6.x/solr/build/solr-core/test/J2/temp/solr.cloud.TestRequestForwarding_2FC5452D3A987335-001/tempDir-001/node1/lib
   [junit4]   2> 50139 INFO  (jetty-launcher-9-thread-1) [    ] o.a.s.h.c.HttpShardHandlerFactory created with socketTimeout : 90000,urlScheme : ,connTimeout : 15000,maxConnectionsPerHost : 20,maxConnections : 10000,corePoolSize : 0,maximumPoolSize : 2147483647,maxThreadIdleTime : 5,sizeOfQueue : -1,fairnessPolicy : false,useRetries : false,connectionsEvictorSleepDelay : 5000,maxConnectionIdleTime : 40000,
   [junit4]   2> 50140 INFO  (jetty-launcher-9-thread-1) [    ] o.a.s.u.UpdateShardHandler Creating UpdateShardHandler HTTP client with params: socketTimeout=340000&connTimeout=45000&retry=true
   [junit4]   2> 50148 INFO  (jetty-launcher-9-thread-1) [    ] o.a.s.l.LogWatcher SLF4J impl is org.slf4j.impl.Log4jLoggerFactory
   [junit4]   2> 50148 INFO  (jetty-launcher-9-thread-1) [    ] o.a.s.l.LogWatcher Registering Log Listener [Log4j (org.slf4j.impl.Log4jLoggerFactory)]
   [junit4]   2> 50148 INFO  (jetty-launcher-9-thread-1) [    ] o.a.s.c.ZkContainer Zookeeper client=127.0.0.1:43299/solr
   [junit4]   2> 50152 INFO  (jetty-launcher-9-thread-3) [    ] o.a.s.u.UpdateShardHandler Creating UpdateShardHandler HTTP client with params: socketTimeout=340000&connTimeout=45000&retry=true
   [junit4]   2> 50154 INFO  (jetty-launcher-9-thread-3) [    ] o.a.s.l.LogWatcher SLF4J impl is org.slf4j.impl.Log4jLoggerFactory
   [junit4]   2> 50154 INFO  (jetty-launcher-9-thread-3) [    ] o.a.s.l.LogWatcher Registering Log Listener [Log4j (org.slf4j.impl.Log4jLoggerFactory)]
   [junit4]   2> 50154 INFO  (jetty-launcher-9-thread-3) [    ] o.a.s.c.ZkContainer Zookeeper client=127.0.0.1:43299/solr
   [junit4]   2> 50160 INFO  (jetty-launcher-9-thread-2) [    ] o.a.s.c.CorePropertiesLocator Config-defined core root directory: /x1/jenkins/jenkins-slave/workspace/Lucene-Solr-Tests-6.x/solr/build/solr-core/test/J2/temp/solr.cloud.TestRequestForwarding_2FC5452D3A987335-001/tempDir-001/node3/.
   [junit4]   2> 50162 INFO  (jetty-launcher-9-thread-2) [    ] o.a.s.c.CoreContainer New CoreContainer 1475092224
   [junit4]   2> 50162 INFO  (jetty-launcher-9-thread-2) [    ] o.a.s.c.CoreContainer Loading cores into CoreContainer [instanceDir=/x1/jenkins/jenkins-slave/workspace/Lucene-Solr-Tests-6.x/solr/build/solr-core/test/J2/temp/solr.cloud.TestRequestForwarding_2FC5452D3A987335-001/tempDir-001/node3]
   [junit4]   2> 50162 WARN  (jetty-launcher-9-thread-2) [    ] o.a.s.c.CoreContainer Couldn't add files from /x1/jenkins/jenkins-slave/workspace/Lucene-Solr-Tests-6.x/solr/build/solr-core/test/J2/temp/solr.cloud.TestRequestForwarding_2FC5452D3A987335-001/tempDir-001/node3/lib to classpath: /x1/jenkins/jenkins-slave/workspace/Lucene-Solr-Tests-6.x/solr/build/solr-core/test/J2/temp/solr.cloud.TestRequestForwarding_2FC5452D3A987335-001/tempDir-001/node3/lib
   [junit4]   2> 50162 INFO  (jetty-launcher-9-thread-2) [    ] o.a.s.h.c.HttpShardHandlerFactory created with socketTimeout : 90000,urlScheme : ,connTimeout : 15000,maxConnectionsPerHost : 20,maxConnections : 10000,corePoolSize : 0,maximumPoolSize : 2147483647,maxThreadIdleTime : 5,sizeOfQueue : -1,fairnessPolicy : false,useRetries : false,connectionsEvictorSleepDelay : 5000,maxConnectionIdleTime : 40000,
   [junit4]   2> 50163 INFO  (jetty-launcher-9-thread-2) [    ] o.a.s.u.UpdateShardHandler Creating UpdateShardHandler HTTP client with params: socketTimeout=340000&connTimeout=45000&retry=true
   [junit4]   2> 50164 INFO  (jetty-launcher-9-thread-2) [    ] o.a.s.l.LogWatcher SLF4J impl is org.slf4j.impl.Log4jLoggerFactory
   [junit4]   2> 50164 INFO  (jetty-launcher-9-thread-2) [    ] o.a.s.l.LogWatcher Registering Log Listener [Log4j (org.slf4j.impl.Log4jLoggerFactory)]
   [junit4]   2> 50164 INFO  (jetty-launcher-9-thread-2) [    ] o.a.s.c.ZkContainer Zookeeper client=127.0.0.1:43299/solr
   [junit4]   2> 50183 INFO  (jetty-launcher-9-thread-3) [    ] o.a.s.c.ZkController zkHost includes chroot
   [junit4]   2> 50184 INFO  (jetty-launcher-9-thread-3) [    ] o.a.s.c.c.SolrZkClient Using default ZkCredentialsProvider
   [junit4]   2> 50196 INFO  (jetty-launcher-9-thread-3) [    ] o.a.s.c.c.ConnectionManager Waiting for client to connect to ZooKeeper
   [junit4]   2> 50196 INFO  (jetty-launcher-9-thread-1) [    ] o.a.s.c.ZkController zkHost includes chroot
   [junit4]   2> 50196 INFO  (jetty-launcher-9-thread-1) [    ] o.a.s.c.c.SolrZkClient Using default ZkCredentialsProvider
   [junit4]   2> 50208 INFO  (jetty-launcher-9-thread-1) [    ] o.a.s.c.c.ConnectionManager Waiting for client to connect to ZooKeeper
   [junit4]   2> 50184 INFO  (jetty-launcher-9-thread-2) [    ] o.a.s.c.ZkController zkHost includes chroot
   [junit4]   2> 50208 INFO  (jetty-launcher-9-thread-2) [    ] o.a.s.c.c.SolrZkClient Using default ZkCredentialsProvider
   [junit4]   2> 50216 INFO  (jetty-launcher-9-thread-2) [    ] o.a.s.c.c.ConnectionManager Waiting for client to connect to ZooKeeper
   [junit4]   2> 50228 INFO  (zkCallback-21-thread-1) [    ] o.a.s.c.c.ConnectionManager Watcher org.apache.solr.common.cloud.ConnectionManager@41da4480 name:ZooKeeperConnection Watcher:127.0.0.1:43299 got event WatchedEvent state:SyncConnected type:None path:null path:null type:None
   [junit4]   2> 50228 INFO  (jetty-launcher-9-thread-1) [    ] o.a.s.c.c.ConnectionManager Client is connected to ZooKeeper
   [junit4]   2> 50229 INFO  (jetty-launcher-9-thread-1) [    ] o.a.s.c.c.SolrZkClient Using default ZkACLProvider
   [junit4]   2> 50244 INFO  (zkCallback-22-thread-1) [    ] o.a.s.c.c.ConnectionManager Watcher org.apache.solr.common.cloud.ConnectionManager@5069beaf name:ZooKeeperConnection Watcher:127.0.0.1:43299 got event WatchedEvent state:SyncConnected type:None path:null path:null type:None
   [junit4]   2> 50244 INFO  (jetty-launcher-9-thread-2) [    ] o.a.s.c.c.ConnectionManager Client is connected to ZooKeeper
   [junit4]   2> 50252 INFO  (jetty-launcher-9-thread-2) [    ] o.a.s.c.c.SolrZkClient Using default ZkACLProvider
   [junit4]   2> 50253 INFO  (zkCallback-20-thread-1) [    ] o.a.s.c.c.ConnectionManager Watcher org.apache.solr.common.cloud.ConnectionManager@d3f86f4 name:ZooKeeperConnection Watcher:127.0.0.1:43299 got event WatchedEvent state:SyncConnected type:None path:null path:null type:None
   [junit4]   2> 50253 INFO  (jetty-launcher-9-thread-3) [    ] o.a.s.c.c.ConnectionManager Client is connected to ZooKeeper
   [junit4]   2> 50257 INFO  (jetty-launcher-9-thread-3) [    ] o.a.s.c.c.SolrZkClient Using default ZkACLProvider
   [junit4]   2> 50258 INFO  (jetty-launcher-9-thread-1) [n:127.0.0.1:57576_solr    ] o.a.s.c.ZkController Added new OnReconnect listener org.apache.solr.cloud.ZkController$$Lambda$108/872343659@a4ffe3e
   [junit4]   2> 50263 INFO  (jetty-launcher-9-thread-2) [n:127.0.0.1:44202_solr    ] o.a.s.c.ZkController Added new OnReconnect listener org.apache.solr.cloud.ZkController$$Lambda$108/872343659@420538ad
   [junit4]   2> 50276 INFO  (jetty-launcher-9-thread-2) [n:127.0.0.1:44202_solr    ] o.a.s.c.c.ConnectionManager Waiting for client to connect to ZooKeeper
   [junit4]   2> 50300 INFO  (jetty-launcher-9-thread-1) [n:127.0.0.1:57576_solr    ] o.a.s.c.c.ConnectionManager Waiting for client to connect to ZooKeeper
   [junit4]   2> 50324 INFO  (zkCallback-24-thread-1-processing-n:127.0.0.1:44202_solr) [n:127.0.0.1:44202_solr    ] o.a.s.c.c.ConnectionManager Watcher org.apache.solr.common.cloud.ConnectionManager@3b926ca7 name:ZooKeeperConnection Watcher:127.0.0.1:43299/solr got event WatchedEvent state:SyncConnected type:None path:null path:null type:None
   [junit4]   2> 50324 INFO  (jetty-launcher-9-thread-2) [n:127.0.0.1:44202_solr    ] o.a.s.c.c.ConnectionManager Client is connected to ZooKeeper
   [junit4]   2> 50327 INFO  (jetty-launcher-9-thread-3) [n:127.0.0.1:53296_solr    ] o.a.s.c.ZkController Added new OnReconnect listener org.apache.solr.cloud.ZkController$$Lambda$108/872343659@458464ac
   [junit4]   2> 50334 INFO  (jetty-launcher-9-thread-2) [n:127.0.0.1:44202_solr    ] o.a.s.c.c.SolrZkClient makePath: /overseer/queue
   [junit4]   2> 50349 INFO  (jetty-launcher-9-thread-2) [n:127.0.0.1:44202_solr    ] o.a.s.c.c.SolrZkClient makePath: /overseer/collection-queue-work
   [junit4]   2> 50355 INFO  (jetty-launcher-9-thread-2) [n:127.0.0.1:44202_solr    ] o.a.s.c.c.SolrZkClient makePath: /overseer/collection-map-running
   [junit4]   2> 50364 INFO  (zkCallback-23-thread-1-processing-n:127.0.0.1:57576_solr) [n:127.0.0.1:57576_solr    ] o.a.s.c.c.ConnectionManager Watcher org.apache.solr.common.cloud.ConnectionManager@5d9f938a name:ZooKeeperConnection Watcher:127.0.0.1:43299/solr got event WatchedEvent state:SyncConnected type:None path:null path:null type:None
   [junit4]   2> 50364 INFO  (jetty-launcher-9-thread-1) [n:127.0.0.1:57576_solr    ] o.a.s.c.c.ConnectionManager Client is connected to ZooKeeper
   [junit4]   2> 50367 INFO  (jetty-launcher-9-thread-3) [n:127.0.0.1:53296_solr    ] o.a.s.c.c.ConnectionManager Waiting for client to connect to ZooKeeper
   [junit4]   2> 50384 INFO  (jetty-launcher-9-thread-2) [n:127.0.0.1:44202_solr    ] o.a.s.c.c.SolrZkClient makePath: /overseer/collection-map-completed
   [junit4]   2> 50391 INFO  (jetty-launcher-9-thread-2) [n:127.0.0.1:44202_solr    ] o.a.s.c.c.SolrZkClient makePath: /overseer/collection-map-failure
   [junit4]   2> 50399 INFO  (jetty-launcher-9-thread-2) [n:127.0.0.1:44202_solr    ] o.a.s.c.c.SolrZkClient makePath: /live_nodes
   [junit4]   2> 50405 INFO  (jetty-launcher-9-thread-2) [n:127.0.0.1:44202_solr    ] o.a.s.c.c.SolrZkClient makePath: /collections
   [junit4]   2> 50416 INFO  (jetty-launcher-9-thread-1) [n:127.0.0.1:57576_solr    ] o.a.s.c.c.SolrZkClient makePath: /aliases.json
   [junit4]   2> 50418 INFO  (jetty-launcher-9-thread-1) [n:127.0.0.1:57576_solr    ] o.a.s.c.c.SolrZkClient makePath: /clusterstate.json
   [junit4]   2> 50420 INFO  (jetty-launcher-9-thread-1) [n:127.0.0.1:57576_solr    ] o.a.s.c.c.SolrZkClient makePath: /security.json
   [junit4]   2> 50423 INFO  (jetty-launcher-9-thread-1) [n:127.0.0.1:57576_solr    ] o.a.s.c.c.ZkStateReader Updating cluster state from ZooKeeper... 
   [junit4]   2> 50425 INFO  (jetty-launcher-9-thread-1) [n:127.0.0.1:57576_solr    ] o.a.s.c.c.ZkStateReader Loaded empty cluster properties
   [junit4]   2> 50433 INFO  (jetty-launcher-9-thread-2) [n:127.0.0.1:44202_solr    ] o.a.s.c.c.ZkStateReader Updating cluster state from ZooKeeper... 
   [junit4]   2> 50434 INFO  (jetty-launcher-9-thread-1) [n:127.0.0.1:57576_solr    ] o.a.s.c.c.ZkStateReader Updated live nodes from ZooKeeper... (0) -> (0)
   [junit4]   2> 50441 INFO  (jetty-launcher-9-thread-2) [n:127.0.0.1:44202_solr    ] o.a.s.c.c.ZkStateReader Loaded empty cluster properties
   [junit4]   2> 50449 INFO  (zkCallback-25-thread-1-processing-n:127.0.0.1:53296_solr) [n:127.0.0.1:53296_solr    ] o.a.s.c.c.ConnectionManager Watcher org.apache.solr.common.cloud.ConnectionManager@7a09c54d name:ZooKeeperConnection Watcher:127.0.0.1:43299/solr got event WatchedEvent state:SyncConnected type:None path:null path:null type:None
   [junit4]   2> 50449 INFO  (jetty-launcher-9-thread-3) [n:127.0.0.1:53296_solr    ] o.a.s.c.c.ConnectionManager Client is connected to ZooKeeper
   [junit4]   2> 50453 INFO  (jetty-launcher-9-thread-2) [n:127.0.0.1:44202_solr    ] o.a.s.c.c.ZkStateReader Updated live nodes from ZooKeeper... (0) -> (0)
   [junit4]   2> 50493 INFO  (jetty-launcher-9-thread-1) [n:127.0.0.1:57576_solr    ] o.a.s.c.c.SolrZkClient makePath: /overseer_elect
   [junit4]   2> 50494 INFO  (jetty-launcher-9-thread-2) [n:127.0.0.1:44202_solr    ] o.a.s.c.c.SolrZkClient makePath: /overseer_elect
   [junit4]   2> 50508 INFO  (jetty-launcher-9-thread-2) [n:127.0.0.1:44202_solr    ] o.a.s.c.c.SolrZkClient makePath: /overseer_elect/election
   [junit4]   2> 50509 INFO  (jetty-launcher-9-thread-1) [n:127.0.0.1:57576_solr    ] o.a.s.c.c.SolrZkClient makePath: /overseer_elect/election
   [junit4]   2> 50511 INFO  (jetty-launcher-9-thread-1) [n:127.0.0.1:57576_solr    ] o.a.s.c.Overseer Overseer (id=null) closing
   [junit4]   2> 50511 INFO  (jetty-launcher-9-thread-2) [n:127.0.0.1:44202_solr    ] o.a.s.c.Overseer Overseer (id=null) closing
   [junit4]   2> 50516 INFO  (jetty-launcher-9-thread-3) [n:127.0.0.1:53296_solr    ] o.a.s.c.c.ZkStateReader Updating cluster state from ZooKeeper... 
   [junit4]   2> 50516 INFO  (jetty-launcher-9-thread-2) [n:127.0.0.1:44202_solr    ] o.a.s.c.LeaderElector Joined leadership election with path: /overseer_elect/election/96520513629257735-127.0.0.1:44202_solr-n_0000000000
   [junit4]   2> 50516 INFO  (jetty-launcher-9-thread-1) [n:127.0.0.1:57576_solr    ] o.a.s.c.LeaderElector Joined leadership election with path: /overseer_elect/election/96520513629257736-127.0.0.1:57576_solr-n_0000000001
   [junit4]   2> 50519 INFO  (jetty-launcher-9-thread-2) [n:127.0.0.1:44202_solr    ] o.a.s.c.OverseerElectionContext I am going to be the leader 127.0.0.1:44202_solr
   [junit4]   2> 50519 INFO  (jetty-launcher-9-thread-2) [n:127.0.0.1:44202_solr    ] o.a.s.c.c.SolrZkClient makePath: /overseer_elect/leader
   [junit4]   2> 50519 INFO  (jetty-launcher-9-thread-3) [n:127.0.0.1:53296_solr    ] o.a.s.c.c.ZkStateReader Loaded empty cluster properties
   [junit4]   2> 50521 INFO  (jetty-launcher-9-thread-1) [n:127.0.0.1:57576_solr    ] o.a.s.c.LeaderElector Watching path /overseer_elect/election/96520513629257735-127.0.0.1:44202_solr-n_0000000000 to know if I could be the leader
   [junit4]   2> 50521 INFO  (jetty-launcher-9-thread-3) [n:127.0.0.1:53296_solr    ] o.a.s.c.c.ZkStateReader Updated live nodes from ZooKeeper... (0) -> (0)
   [junit4]   2> 50522 INFO  (jetty-launcher-9-thread-1) [n:127.0.0.1:57576_solr    ] o.a.s.c.ZkController Register node as live in ZooKeeper:/live_nodes/127.0.0.1:57576_solr
   [junit4]   2> 50522 INFO  (jetty-launcher-9-thread-1) [n:127.0.0.1:57576_solr    ] o.a.s.c.c.SolrZkClient makePath: /live_nodes/127.0.0.1:57576_solr
   [junit4]   2> 50523 INFO  (jetty-launcher-9-thread-2) [n:127.0.0.1:44202_solr    ] o.a.s.c.Overseer Overseer (id=96520513629257735-127.0.0.1:44202_solr-n_0000000000) starting
   [junit4]   2> 50532 INFO  (zkCallback-24-thread-1-processing-n:127.0.0.1:44202_solr) [n:127.0.0.1:44202_solr    ] o.a.s.c.c.ZkStateReader A live node change: [WatchedEvent state:SyncConnected type:NodeChildrenChanged path:/live_nodes], has occurred - updating... (live nodes size: [0])
   [junit4]   2> 50532 INFO  (zkCallback-23-thread-1-processing-n:127.0.0.1:57576_solr) [n:127.0.0.1:57576_solr    ] o.a.s.c.c.ZkStateReader A live node change: [WatchedEvent state:SyncConnected type:NodeChildrenChanged path:/live_nodes], has occurred - updating... (live nodes size: [0])
   [junit4]   2> 50532 INFO  (zkCallback-25-thread-1-processing-n:127.0.0.1:53296_solr) [n:127.0.0.1:53296_solr    ] o.a.s.c.c.ZkStateReader A live node change: [WatchedEvent state:SyncConnected type:NodeChildrenChanged path:/live_nodes], has occurred - updating... (live nodes size: [0])
   [junit4]   2> 50538 INFO  (zkCallback-23-thread-1-processing-n:127.0.0.1:57576_solr) [n:127.0.0.1:57576_solr    ] o.a.s.c.c.ZkStateReader Updated live nodes from ZooKeeper... (0) -> (1)
   [junit4]   2> 50542 INFO  (zkCallback-24-thread-1-processing-n:127.0.0.1:44202_solr) [n:127.0.0.1:44202_solr    ] o.a.s.c.c.ZkStateReader Updated live nodes from ZooKeeper... (0) -> (1)
   [junit4]   2> 50546 INFO  (jetty-launcher-9-thread-2) [n:127.0.0.1:44202_solr    ] o.a.s.c.c.SolrZkClient makePath: /overseer/queue-work
   [junit4]   2> 50550 INFO  (zkCallback-25-thread-1-processing-n:127.0.0.1:53296_solr) [n:127.0.0.1:53296_solr    ] o.a.s.c.c.ZkStateReader Updated live nodes from ZooKeeper... (0) -> (1)
   [junit4]   2> 50552 INFO  (jetty-launcher-9-thread-3) [n:127.0.0.1:53296_solr    ] o.a.s.c.Overseer Overseer (id=null) closing
   [junit4]   2> 50553 INFO  (jetty-launcher-9-thread-3) [n:127.0.0.1:53296_solr    ] o.a.s.c.LeaderElector Joined leadership election with path: /overseer_elect/election/96520513629257737-127.0.0.1:53296_solr-n_0000000002
   [junit4]   2> 50554 INFO  (jetty-launcher-9-thread-3) [n:127.0.0.1:53296_solr    ] o.a.s.c.LeaderElector Watching path /overseer_elect/election/96520513629257736-127.0.0.1:57576_solr-n_0000000001 to know if I could be the leader
   [junit4]   2> 50555 INFO  (jetty-launcher-9-thread-3) [n:127.0.0.1:53296_solr    ] o.a.s.c.ZkController Publish node=127.0.0.1:53296_solr as DOWN
   [junit4]   2> 50569 INFO  (jetty-launcher-9-thread-3) [n:127.0.0.1:53296_solr    ] o.a.s.c.ZkController Register node as live in ZooKeeper:/live_nodes/127.0.0.1:53296_solr
   [junit4]   2> 50569 INFO  (jetty-launcher-9-thread-3) [n:127.0.0.1:53296_solr    ] o.a.s.c.c.SolrZkClient makePath: /live_nodes/127.0.0.1:53296_solr
   [junit4]   2> 50574 INFO  (jetty-launcher-9-thread-2) [n:127.0.0.1:44202_solr    ] o.a.s.c.OverseerAutoReplicaFailoverThread Starting OverseerAutoReplicaFailoverThread autoReplicaFailoverWorkLoopDelay=10000 autoReplicaFailoverWaitAfterExpiration=30000 autoReplicaFailoverBadNodeExpiration=60000
   [junit4]   2> 50578 INFO  (zkCallback-23-thread-1-processing-n:127.0.0.1:57576_solr) [n:127.0.0.1:57576_solr    ] o.a.s.c.c.ZkStateReader A live node change: [WatchedEvent state:SyncConnected type:NodeChildrenChanged path:/live_nodes], has occurred - updating... (live nodes size: [1])
   [junit4]   2> 50578 INFO  (zkCallback-25-thread-1-processing-n:127.0.0.1:53296_solr) [n:127.0.0.1:53296_solr    ] o.a.s.c.c.ZkStateReader A live node change: [WatchedEvent state:SyncConnected type:NodeChildrenChanged path:/live_nodes], has occurred - updating... (live nodes size: [1])
   [junit4]   2> 50578 INFO  (zkCallback-24-thread-1-processing-n:127.0.0.1:44202_solr) [n:127.0.0.1:44202_solr    ] o.a.s.c.c.ZkStateReader A live node change: [WatchedEvent state:SyncConnected type:NodeChildrenChanged path:/live_nodes], has occurred - updating... (live nodes size: [1])
   [junit4]   2> 50589 INFO  (zkCallback-23-thread-1-processing-n:127.0.0.1:57576_solr) [n:127.0.0.1:57576_solr    ] o.a.s.c.c.ZkStateReader Updated live nodes from ZooKeeper... (1) -> (2)
   [junit4]   2> 50589 INFO  (zkCallback-24-thread-1-processing-n:127.0.0.1:44202_solr) [n:127.0.0.1:44202_solr    ] o.a.s.c.c.ZkStateReader Updated live nodes from ZooKeeper... (1) -> (2)
   [junit4]   2> 50589 INFO  (zkCallback-25-thread-1-processing-n:127.0.0.1:53296_solr) [n:127.0.0.1:53296_solr    ] o.a.s.c.c.ZkStateReader Updated live nodes from ZooKeeper... (1) -> (2)
   [junit4]   2> 50605 INFO  (OverseerStateUpdate-96520513629257735-127.0.0.1:44202_solr-n_0000000000) [n:127.0.0.1:44202_solr    ] o.a.s.c.Overseer Starting to work on the main queue
   [junit4]   2> 50607 INFO  (OverseerStateUpdate-96520513629257735-127.0.0.1:44202_solr-n_0000000000) [n:127.0.0.1:44202_solr    ] o.a.s.c.c.ZkStateReader Updated live nodes from ZooKeeper... (2) -> (2)
   [junit4]   2> 50612 INFO  (OverseerStateUpdate-96520513629257735-127.0.0.1:44202_solr-n_0000000000) [n:127.0.0.1:44202_solr    ] o.a.s.c.Overseer processMessage: queueSize: 1, message = {
   [junit4]   2>   "operation":"downnode",
   [junit4]   2>   "node_name":"127.0.0.1:53296_solr"} current state version: 0
   [junit4]   2> 50615 INFO  (OverseerStateUpdate-96520513629257735-127.0.0.1:44202_solr-n_0000000000) [n:127.0.0.1:44202_solr    ] o.a.s.c.o.NodeMutator DownNode state invoked for node: 127.0.0.1:53296_solr
   [junit4]   2> 50627 INFO  (OverseerCollectionConfigSetProcessor-96520513629257735-127.0.0.1:44202_solr-n_0000000000) [n:127.0.0.1:44202_solr    ] o.a.s.c.OverseerTaskProcessor Process current queue of overseer operations
   [junit4]   2> 50634 INFO  (jetty-launcher-9-thread-2) [n:127.0.0.1:44202_solr    ] o.a.s.c.ZkController Publish node=127.0.0.1:44202_solr as DOWN
   [junit4]   2> 50636 INFO  (jetty-launcher-9-thread-2) [n:127.0.0.1:44202_solr    ] o.a.s.c.ZkController Register node as live in ZooKeeper:/live_nodes/127.0.0.1:44202_solr
   [junit4]   2> 50636 INFO  (jetty-launcher-9-thread-2) [n:127.0.0.1:44202_solr    ] o.a.s.c.c.SolrZkClient makePath: /live_nodes/127.0.0.1:44202_solr
   [junit4]   2> 50638 INFO  (OverseerStateUpdate-96520513629257735-127.0.0.1:44202_solr-n_0000000000) [n:127.0.0.1:44202_solr    ] o.a.s.c.Overseer processMessage: queueSize: 1, message = {
   [junit4]   2>   "operation":"downnode",
   [junit4]   2>   "node_name":"127.0.0.1:44202_solr"} current state version: 0
   [junit4]   2> 50638 INFO  (OverseerStateUpdate-96520513629257735-127.0.0.1:44202_solr-n_0000000000) [n:127.0.0.1:44202_solr    ] o.a.s.c.o.NodeMutator DownNode state invoked for node: 127.0.0.1:44202_solr
   [junit4]   2> 50639 INFO  (zkCallback-23-thread-1-processing-n:127.0.0.1:57576_solr) [n:127.0.0.1:57576_solr    ] o.a.s.c.c.ZkStateReader A live node change: [WatchedEvent state:SyncConnected type:NodeChildrenChanged path:/live_nodes], has occurred - updating... (live nodes size: [2])
   [junit4]   2> 50639 INFO  (zkCallback-25-thread-1-processing-n:127.0.0.1:53296_solr) [n:127.0.0.1:53296_solr    ] o.a.s.c.c.ZkStateReader A live node change: [WatchedEvent state:SyncConnected type:NodeChildrenChanged path:/live_nodes], has occurred - updating... (live nodes size: [2])
   [junit4]   2> 50640 INFO  (zkCallback-24-thread-1-processing-n:127.0.0.1:44202_solr) [n:127.0.0.1:44202_solr    ] o.a.s.c.c.ZkStateReader A live node change: [WatchedEvent state:SyncConnected type:NodeChildrenChanged path:/live_nodes], has occurred - updating... (live nodes size: [2])
   [junit4]   2> 50640 INFO  (zkCallback-23-thread-1-processing-n:127.0.0.1:57576_solr) [n:127.0.0.1:57576_solr    ] o.a.s.c.c.ZkStateReader Updated live nodes from ZooKeeper... (2) -> (3)
   [junit4]   2> 50640 INFO  (zkCallback-25-thread-1-processing-n:127.0.0.1:53296_solr) [n:127.0.0.1:53296_solr    ] o.a.s.c.c.ZkStateReader Updated live nodes from ZooKeeper... (2) -> (3)
   [junit4]   2> 50641 INFO  (zkCallback-24-thread-1-processing-n:127.0.0.1:44202_solr) [n:127.0.0.1:44202_solr    ] o.a.s.c.c.ZkStateReader Updated live nodes from ZooKeeper... (2) -> (3)
   [junit4]   2> 50792 INFO  (jetty-launcher-9-thread-1) [n:127.0.0.1:57576_solr    ] o.a.s.c.CoreContainer Security conf doesn't exist. Skipping setup for authorization module.
   [junit4]   2> 50792 INFO  (jetty-launcher-9-thread-1) [n:127.0.0.1:57576_solr    ] o.a.s.c.CoreContainer No authentication plugin used.
   [junit4]   2> 50801 INFO  (jetty-launcher-9-thread-1) [n:127.0.0.1:57576_solr    ] o.a.s.c.CorePropertiesLocator Looking for core definitions underneath /x1/jenkins/jenkins-slave/workspace/Lucene-Solr-Tests-6.x/solr/build/solr-core/test/J2/temp/solr.cloud.TestRequestForwarding_2FC5452D3A987335-001/tempDir-001/node1/.
   [junit4]   2> 50804 INFO  (jetty-launcher-9-thread-1) [n:127.0.0.1:57576_solr    ] o.a.s.c.CorePropertiesLocator Found 0 core definitions
   [junit4]   2> 50847 INFO  (jetty-launcher-9-thread-3) [n:127.0.0.1:53296_solr    ] o.a.s.c.CoreContainer Security conf doesn't exist. Skipping setup for authorization module.
   [junit4]   2> 50847 INFO  (jetty-launcher-9-thread-3) [n:127.0.0.1:53296_solr    ] o.a.s.c.CoreContainer No authentication plugin used.
   [junit4]   2> 50848 INFO  (jetty-launcher-9-thread-3) [n:127.0.0.1:53296_solr    ] o.a.s.c.CorePropertiesLocator Looking for core definitions underneath /x1/jenkins/jenkins-slave/workspace/Lucene-Solr-Tests-6.x/solr/build/solr-core/test/J2/temp/solr.cloud.TestRequestForwarding_2FC5452D3A987335-001/tempDir-001/node2/.
   [junit4]   2> 50848 INFO  (jetty-launcher-9-thread-3) [n:127.0.0.1:53296_solr    ] o.a.s.c.CorePropertiesLocator Found 0 core definitions
   [junit4]   2> 50850 INFO  (jetty-launcher-9-thread-2) [n:127.0.0.1:44202_solr    ] o.a.s.c.CoreContainer Security conf doesn't exist. Skipping setup for authorization module.
   [junit4]   2> 50850 INFO  (jetty-launcher-9-thread-2) [n:127.0.0.1:44202_solr    ] o.a.s.c.CoreContainer No authentication plugin used.
   [junit4]   2> 50851 INFO  (jetty-launcher-9-thread-2) [n:127.0.0.1:44202_solr    ] o.a.s.c.CorePropertiesLocator Looking for core definitions underneath /x1/jenkins/jenkins-slave/workspace/Lucene-Solr-Tests-6.x/solr/build/solr-core/test/J2/temp/solr.cloud.TestRequestForwarding_2FC5452D3A987335-001/tempDir-001/node3/.
   [junit4]   2> 50851 INFO  (jetty-launcher-9-thread-2) [n:127.0.0.1:44202_solr    ] o.a.s.c.CorePropertiesLocator Found 0 core definitions
   [junit4]   2> 50857 INFO  (jetty-launcher-9-thread-1) [n:127.0.0.1:57576_solr    ] o.a.s.s.SolrDispatchFilter user.dir=/x1/jenkins/jenkins-slave/workspace/Lucene-Solr-Tests-6.x/solr/build/solr-core/test/J2
   [junit4]   2> 50857 INFO  (jetty-launcher-9-thread-1) [n:127.0.0.1:57576_solr    ] o.a.s.s.SolrDispatchFilter SolrDispatchFilter.init() done
   [junit4]   2> 50869 INFO  (jetty-launcher-9-thread-2) [n:127.0.0.1:44202_solr    ] o.a.s.s.SolrDispatchFilter user.dir=/x1/jenkins/jenkins-slave/workspace/Lucene-Solr-Tests-6.x/solr/build/solr-core/test/J2
   [junit4]   2> 50869 INFO  (jetty-launcher-9-thread-2) [n:127.0.0.1:44202_solr    ] o.a.s.s.SolrDispatchFilter SolrDispatchFilter.init() done
   [junit4]   2> 50874 INFO  (jetty-launcher-9-thread-3) [n:127.0.0.1:53296_solr    ] o.a.s.s.SolrDispatchFilter user.dir=/x1/jenkins/jenkins-slave/workspace/Lucene-Solr-Tests-6.x/solr/build/solr-core/test/J2
   [junit4]   2> 50874 INFO  (jetty-launcher-9-thread-3) [n:127.0.0.1:53296_solr    ] o.a.s.s.SolrDispatchFilter SolrDispatchFilter.init() done
   [junit4]   2> 50874 INFO  (TEST-TestRequestForwarding.testMultiCollectionQuery-seed#[2FC5452D3A987335]) [    ] o.a.s.c.c.SolrZkClient Using default ZkCredentialsProvider
   [junit4]   2> 50877 INFO  (TEST-TestRequestForwarding.testMultiCollectionQuery-seed#[2FC5452D3A987335]) [    ] o.a.s.c.c.ConnectionManager Waiting for client to connect to ZooKeeper
   [junit4]   2> 50882 INFO  (zkCallback-29-thread-1) [    ] o.a.s.c.c.ConnectionManager Watcher org.apache.solr.common.cloud.ConnectionManager@36e396c9 name:ZooKeeperConnection Watcher:127.0.0.1:43299 got event WatchedEvent state:SyncConnected type:None path:null path:null type:None
   [junit4]   2> 50882 INFO  (TEST-TestRequestForwarding.testMultiCollectionQuery-seed#[2FC5452D3A987335]) [    ] o.a.s.c.c.ConnectionManager Client is connected to ZooKeeper
   [junit4]   2> 50882 INFO  (TEST-TestRequestForwarding.testMultiCollectionQuery-seed#[2FC5452D3A987335]) [    ] o.a.s.c.c.SolrZkClient Using default ZkACLProvider
   [junit4]   2> 50896 INFO  (TEST-TestRequestForwarding.testMultiCollectionQuery-seed#[2FC5452D3A987335]) [    ] o.a.s.c.c.SolrZkClient Using default ZkCredentialsProvider
   [junit4]   2> 50899 INFO  (TEST-TestRequestForwarding.testMultiCollectionQuery-seed#[2FC5452D3A987335]) [    ] o.a.s.c.c.ConnectionManager Waiting for client to connect to ZooKeeper
   [junit4]   2> 50904 INFO  (zkCallback-31-thread-1) [    ] o.a.s.c.c.ConnectionManager Watcher org.apache.solr.common.cloud.ConnectionManager@66e63e33 name:ZooKeeperConnection Watcher:127.0.0.1:43299/solr got event WatchedEvent state:SyncConnected type:None path:null path:null type:None
   [junit4]   2> 50904 INFO  (TEST-TestRequestForwarding.testMultiCollectionQuery-seed#[2FC5452D3A987335]) [    ] o.a.s.c.c.ConnectionManager Client is connected to ZooKeeper
   [junit4]   2> 50905 INFO  (TEST-TestRequestForwarding.testMultiCollectionQuery-seed#[2FC5452D3A987335]) [    ] o.a.s.c.c.SolrZkClient Using default ZkACLProvider
   [junit4]   2> 50923 INFO  (TEST-TestRequestForwarding.testMultiCollectionQuery-seed#[2FC5452D3A987335]) [    ] o.a.s.c.c.SolrZkClient makePath: /configs/conf1/solrconfig-spellcheckcomponent.xml
   [junit4]   2> 50937 INFO  (TEST-TestRequestForwarding.testMultiCollectionQuery-seed#[2FC5452D3A987335]) [    ] o.a.s.c.c.SolrZkClient makePath: /configs/conf1/schema-null-charfilters-analyzer.xml
   [junit4]   2> 50942 INFO  (TEST-TestRequestForwarding.testMultiCollectionQuery-seed#[2FC5452D3A987335]) [    ] o.a.s.c.c.SolrZkClient makePath: /configs/conf1/regex-boost-processor-test.txt
   [junit4]   2> 50947 INFO  (TEST-TestRequestForwarding.testMultiCollectionQuery-seed#[2FC5452D3A987335]) [    ] o.a.s.c.c.SolrZkClient makePath: /configs/conf1/solrconfig-spellchecker.xml
   [junit4]   2> 50952 INFO  (TEST-TestRequestForwarding.testMultiCollectionQuery-seed#[2FC5452D3A987335]) [    ] o.a.s.c.c.SolrZkClient makePath: /configs/conf1/bad-schema-multiple-asterisk-copyfield-dest-should-fail-test.xml
   [junit4]   2> 50955 INFO  (TEST-TestRequestForwarding.testMultiCollectionQuery-seed#[2FC5452D3A987335]) [    ] o.a.s.c.c.SolrZkClient makePath: /configs/conf1/schema-docValuesFaceting.xml
   [junit4]   2> 50960 INFO  (TEST-TestRequestForwarding.testMultiCollectionQuery-seed#[2FC5452D3A987335]) [    ] o.a.s.c.c.SolrZkClient makePath: /configs/conf1/solrconfig-tlog-with-delayingcomponent.xml
   [junit4]   2> 50963 INFO  (TEST-TestRequestForwarding.testMultiCollectionQuery-seed#[2FC5452D3A987335]) [    ] o.a.s.c.c.SolrZkClient makePath: /configs/conf1/bad-schema-currency-ft-bogus-default-code.xml
   [junit4]   2> 50965 INFO  (TEST-TestRequestForwarding.testMultiCollectionQuery-seed#[2FC5452D3A987335]) [    ] o.a.s.c.c.SolrZkClient makePath: /configs/conf1/schema-numeric.xml
   [junit4]   2> 50971 INFO  (TEST-TestRequestForwarding.testMultiCollectionQuery-seed#[2FC5452D3A987335]) [    ] o.a.s.c.c.SolrZkClient makePath: /configs/conf1/solrconfig_codec.xml
   [junit4]   2> 50978 INFO  (TEST-TestRequestForwarding.testMultiCollectionQuery-seed#[2FC5452D3A987335]) [    ] o.a.s.c.c.SolrZkClient makePath: /configs/conf1/bad-schema-multiple-asterisk-copyfield-source-should-fail-test.xml
   [junit4]   2> 50981 INFO  (TEST-TestRequestForwarding.testMultiCollectionQuery-seed#[2FC5452D3A987335]) [    ] o.a.s.c.c.SolrZkClient makePath: /configs/conf1/schema_latest.xml
   [junit4]   2> 50983 INFO  (TEST-TestRequestForwarding.testMultiCollectionQuery-seed#[2FC5452D3A987335]) [    ] o.a.s.c.c.SolrZkClient makePath: /configs/conf1/schema-sorts.xml
   [junit4]   2> 50986 INFO  (TEST-TestRequestForwarding.testMultiCollectionQuery-seed#[2FC5452D3A987335]) [    ] o.a.s.c.c.SolrZkClient makePath: /configs/conf1/solrconfig-headers.xml
   [junit4]   2> 50988 INFO  (TEST-TestRequestForwarding.testMultiCollectionQuery-seed#[2FC5452D3A987335]) [    ] o.a.s.c.c.SolrZkClient makePath: /configs/conf1/solrconfig-implicitproperties.xml
   [junit4]   2> 50991 INFO  (TEST-TestRequestForwarding.testMultiCollectionQuery-seed#[2FC5452D3A987335]) [    ] o.a.s.c.c.SolrZkClient makePath: /configs/conf1/bad-solrconfig-bogus-scriptengine-name.xml
   [junit4]   2> 50993 INFO  (TEST-TestRequestForwarding.testMultiCollectionQuery-seed#[2FC5452D3A987335]) [    ] o.a.s.c.c.SolrZkClient makePath: /configs/conf1/schema-snippet-types.incl
   [junit4]   2> 50995 INFO  (TEST-TestRequestForwarding.testMultiCollectionQuery-seed#[2FC5452D3A987335]) [    ] o.a.s.c.c.SolrZkClient makePath: /configs/conf1/solrconfig-parsing-update-processor-chains.xml
   [junit4]   2> 50998 INFO  (TEST-TestRequestForwarding.testMultiCollectionQuery-seed#[2FC5452D3A987335]) [    ] o.a.s.c.c.SolrZkClient makePath: /configs/conf1/schema-docValuesMissing.xml
   [junit4]   2> 51000 INFO  (TEST-TestRequestForwarding.testMultiCollectionQuery-seed#[2FC5452D3A987335]) [    ] o.a.s.c.c.SolrZkClient makePath: /configs/conf1/solrconfig-noopregen.xml
   [junit4]   2> 51002 INFO  (TEST-TestRequestForwarding.testMultiCollectionQuery-seed#[2FC5452D3A987335]) [    ] o.a.s.c.c.SolrZkClient makePath: /configs/conf1/schema-one-field-no-dynamic-field-unique-key.xml
   [junit4]   2> 51005 INFO  (TEST-TestRequestForwarding.testMultiCollectionQuery-seed#[2FC5452D3A987335]) [    ] o.a.s.c.c.SolrZkClient makePath: /configs/conf1/solrconfig-script-updateprocessor.xml
   [junit4]   2> 51007 INFO  (TEST-TestRequestForwarding.testMultiCollectionQuery-seed#[2FC5452D3A987335]) [    ] o.a.s.c.c.SolrZkClient makePath: /configs/conf1/bad-error-solrconfig.xml
   [junit4]   2> 51010 INFO  (TEST-TestRequestForwarding.testMultiCollectionQuery-seed#[2FC5452D3A987335]) [    ] o.a.s.c.c.SolrZkClient makePath: /configs/conf1/solrconfig-suggestercomponent.xml
   [junit4]   2> 51012 INFO  (TEST-TestRequestForwarding.testMultiCollectionQuery-seed#[2FC5452D3A987335]) [    ] o.a.s.c.c.SolrZkClient makePath: /configs/conf1/bad-currency.xml
   [junit4]   2> 51014 INFO  (TEST-TestRequestForwarding.testMultiCollectionQuery-seed#[2FC5452D3A987335]) [    ] o.a.s.c.c.SolrZkClient makePath: /configs/conf1/solrconfig-query-parser-init.xml
   [junit4]   2> 51017 INFO  (TEST-TestRequestForwarding.testMultiCollectionQuery-seed#[2FC5452D3A987335]) [    ] o.a.s.c.c.SolrZkClient makePath: /configs/conf1/solrconfig-caching.xml
   [junit4]   2> 51019 INFO  (TEST-TestRequestForwarding.testMultiCollectionQuery-seed#[2FC5452D3A987335]) [    ] o.a.s.c.c.SolrZkClient makePath: /configs/conf1/conditional.updateprocessor.js
   [junit4]   2> 51021 INFO  (TEST-TestRequestForwarding.testMultiCollectionQuery-seed#[2FC5452D3A987335]) [    ] o.a.s.c.c.SolrZkClient makePath: /configs/conf1/solrconfig-indexconfig-mergepolicyfactory.xml
   [junit4]   2> 51024 INFO  (TEST-TestRequestForwarding.testMultiCollectionQuery-seed#[2FC5452D3A987335]) [    ] o.a.s.c.c.SolrZkClient makePath: /configs/conf1/compoundDictionary.txt
   [junit4]   2> 51026 INFO  (TEST-TestRequestForwarding.testMultiCollectionQuery-seed#[2FC5452D3A987335]) [    ] o.a.s.c.c.SolrZkClient makePath: /configs/conf1/solrconfig-tieredmergepolicyfactory.xml
   [junit4]   2> 51028 INFO  (TEST-TestRequestForwarding.testMultiCollectionQuery-seed#[2FC5452D3A987335]) [    ] o.a.s.c.c.SolrZkClient makePath: /configs/conf1/phrasesuggest.txt
   [junit4]   2> 51030 INFO  (TEST-TestRequestForwarding.testMultiCollectionQuery-seed#[2FC5452D3A987335]) [    ] o.a.s.c.c.SolrZkClient makePath: /configs/conf1/solrconfig-transformers.xml
   [junit4]   2> 51033 INFO  (TEST-TestRequestForwarding.testMultiCollectionQuery-seed#[2FC5452D3A987335]) [    ] o.a.s.c.c.SolrZkClient makePath: /configs/conf1/bad-schema-not-indexed-but-norms.xml
   [junit4]   2> 51035 INFO  (TEST-TestRequestForwarding.testMultiCollectionQuery-seed#[2FC5452D3A987335]) [    ] o.a.s.c.c.SolrZkClient makePath: /configs/conf1/blendedInfixSuggest.txt
   [junit4]   2> 51037 INFO  (TEST-TestRequestForwarding.testMultiCollectionQuery-seed#[2FC5452D3A987335]) [    ] o.a.s.c.c.SolrZkClient makePath: /configs/conf1/schema-phrasesuggest.xml
   [junit4]   2> 51040 INFO  (TEST-TestRequestForwarding.testMultiCollectionQuery-seed#[2FC5452D3A987335]) [    ] o.a.s.c.c.SolrZkClient makePath: /configs/conf1/hunspell-test.dic
   [junit4]   2> 51042 INFO  (TEST-TestRequestForwarding.testMultiCollectionQuery-seed#[2FC5452D3A987335]) [    ] o.a.s.c.c.SolrZkClient makePath: /configs/conf1/schema-HighlighterMaxOffsetTest.xml
   [junit4]   2> 51045 INFO  (TEST-TestRequestForwarding.testMultiCollectionQuery-seed#[2FC5452D3A987335]) [    ] o.a.s.c.c.SolrZkClient makePath: /configs/conf1/schema-rest-lucene-match-version.xml
   [junit4]   2> 51047 INFO  (TEST-TestRequestForwarding.testMultiCollectionQuery-seed#[2FC5452D3A987335]) [    ] o.a.s.c.c.SolrZkClient makePath: /configs/conf1/solrconfig-functionquery.xml
   [junit4]   2> 51049 INFO  (TEST-TestRequestForwarding.testMultiCollectionQuery-seed#[2FC5452D3A987335]) [    ] o.a.s.c.c.SolrZkClient makePath: /configs/conf1/solrconfig-externalversionconstraint.xml
   [junit4]   2> 51052 INFO  (TEST-TestRequestForwarding.testMultiCollectionQuery-seed#[2FC5452D3A987335]) [    ] o.a.s.c.c.SolrZkClient makePath: /configs/conf1/bad-schema-codec-global-vs-ft-mismatch.xml
   [junit4]   2> 51054 INFO  (TEST-TestRequestForwarding.testMultiCollectionQuery-seed#[2FC5452D3A987335]) [    ] o.a.s.c.c.SolrZkClient makePath: /configs/conf1/schema-sim.xml
   [junit4]   2> 51056 INFO  (TEST-TestRequestForwarding.testMultiCollectionQuery-seed#[2FC5452D3A987335]) [    ] o.a.s.c.c.SolrZkClient makePath: /configs/conf1/schema-docValuesMulti.xml
   [junit4]   2> 51058 INFO  (TEST-TestRequestForwarding.testMultiCollectionQuery-seed#[2FC5452D3A987335]) [    ] o.a.s.c.c.SolrZkClient makePath: /configs/conf1/solrconfig-logmergepolicyfactory.xml
   [junit4]   2> 51061 INFO  (TEST-TestRequestForwarding.testMultiCollectionQuery-seed#[2FC5452D3A987335]) [    ] o.a.s.c.c.SolrZkClient makePath: /configs/conf1/solrconfig-collapseqparser.xml
   [junit4]   2> 51063 INFO  (TEST-TestRequestForwarding.testMultiCollectionQuery-seed#[2FC5452D3A987335]) [    ] o.a.s.c.c.SolrZkClient makePath: /configs/conf1/solrconfig-analytics-query.xml
   [junit4]   2> 51066 INFO  (TEST-TestRequestForwarding.testMultiCollectionQuery-seed#[2FC5452D3A987335]) [    ] o.a.s.c.c.SolrZkClient makePath: /configs/conf1/schema-sweetspot.xml
   [junit4]   2> 51068 INFO  (TEST-TestRequestForwarding.testMultiCollectionQuery-seed#[2FC5452D3A987335]) [    ] o.a.s.c.c.SolrZkClient makePath: /configs/conf1/solrconfig-searcher-listeners1.xml
   [junit4]   2> 51071 INFO  (TEST-TestRequestForwarding.testMultiCollectionQuery-seed#[2FC5452D3A987335]) [    ] o.a.s.c.c.SolrZkClient makePath: /configs/conf1/schema-id-and-version-fields-only.xml
   [junit4]   2> 51073 INFO  (TEST-TestRequestForwarding.testMultiCollectionQuery-seed#[2FC5452D3A987335]) [    ] o.a.s.c.c.SolrZkClient makePath: /configs/conf1/solrconfig-classification.xml
   [junit4]   2> 51076 INFO  (TEST-TestRequestForwarding.testMultiCollectionQuery-seed#[2FC5452D3A987335]) [    ] o.a.s.c.c.SolrZkClient makePath: /configs/conf1/bad-solrconfig-schema-mutable-but-not-managed.xml
   [junit4]   2> 51078 INFO  (TEST-TestRequestForwarding.testMultiCollectionQuery-seed#[2FC5452D3A987335]) [    ] o.a.s.c.c.SolrZkClient makePath: /configs/conf1/hunspell-test.aff
   [junit4]   2> 51080 INFO  (TEST-TestRequestForwarding.testMultiCollectionQuery-seed#[2FC5452D3A987335]) [    ] o.a.s.c.c.SolrZkClient makePath: /configs/conf1/solrconfig-response-log-component.xml
   [junit4]   2> 51082 INFO  (TEST-TestRequestForwarding.testMultiCollectionQuery-seed#[2FC5452D3A987335]) [    ] o.a.s.c.c.SolrZkClient makePath: /configs/conf1/bad-schema-sim-default-does-not-exist.xml
   [junit4]   2> 51085 INFO  (TEST-TestRequestForwarding.testMultiCollectionQuery-seed#[2FC5452D3A987335]) [    ] o.a.s.c.c.SolrZkClient makePath: /configs/conf1/bad-schema-dynamicfield-required.xml
   [junit4]   2> 51087 INFO  (TEST-TestRequestForwarding.testMultiCollectionQuery-seed#[2FC5452D3A987335]) [    ] o.a.s.c.c.SolrZkClient makePath: /configs/conf1/bad-schema-not-indexed-but-pos.xml
   [junit4]   2> 51089 INFO  (TEST-TestRequestForwarding.testMultiCollectionQuery-seed#[2FC5452D3A987335]) [    ] o.a.s.c.c.SolrZkClient makePath: /configs/conf1/solrconfig-hash.xml
   [junit4]   2> 51091 INFO  (TEST-TestRequestForwarding.testMultiCollectionQuery-seed#[2FC5452D3A987335]) [    ] o.a.s.c.c.SolrZkClient makePath: /configs/conf1/solrconfig-components-name.xml
   [junit4]   2> 51094 INFO  (TEST-TestRequestForwarding.testMultiCollectionQuery-seed#[2FC5452D3A987335]) [    ] o.a.s.c.c.SolrZkClient makePath: /configs/conf1/bad-mp-solrconfig.xml
   [junit4]   2> 51096 INFO  (TEST-TestRequestForwarding.testMultiCollectionQuery-seed#[2FC5452D3A987335]) [    ] o.a.s.c.c.SolrZkClient makePath: /configs/conf1/solrconfig.snippet.randomindexconfig.xml
   [junit4]   2> 51098 INFO  (TEST-TestRequestForwarding.testMultiCollectionQuery-seed#[2FC5452D3A987335]) [    ] o.a.s.c.c.SolrZkClient makePath: /configs/conf1/solrconfig-xinclude.xml
   [junit4]   2> 51100 INFO  (TEST-TestRequestForwarding.testMultiCollectionQuery-seed#[2FC5452D3A987335]) [    ] o.a.s.c.c.SolrZkClient makePath: /configs/conf1/cross-compatible.js
   [junit4]   2> 51103 INFO  (TEST-TestRequestForwarding.testMultiCollectionQuery-seed#[2FC5452D3A987335]) [    ] o.a.s.c.c.SolrZkClient makePath: /configs/conf1/solrconfig_perf.xml
   [junit4]   2> 51105 INFO  (TEST-TestRequestForwarding.testMultiCollectionQuery-seed#[2FC5452D3A987335]) [    ] o.a.s.c.c.SolrZkClient makePath: /configs/conf1/bad-solrconfig-invalid-scriptfile.xml
   [junit4]   2> 51107 INFO  (TEST-TestRequestForwarding.testMultiCollectionQuery-seed#[2FC5452D3A987335]) [    ] o.a.s.c.c.SolrZkClient makePath: /configs/conf1/solrconfig-basic.xml
   [junit4]   2> 51109 INFO  (TEST-TestRequestForwarding.testMultiCollectionQuery-seed#[2FC5452D3A987335]) [    ] o.a.s.c.c.SolrZkClient makePath: /configs/conf1/solrconfig-sql.xml
   [junit4]   2> 51112 INFO  (TEST-TestRequestForwarding.testMultiCollectionQuery-seed#[2FC5452D3A987335]) [    ] o.a.s.c.c.SolrZkClient makePath: /configs/conf1/schema-replication1.xml
   [junit4]   2> 51114 INFO  (TEST-TestRequestForwarding.testMultiCollectionQuery-seed#[2FC5452D3A987335]) [    ] o.a.s.c.c.SolrZkClient makePath: /configs/conf1/bad-solrconfig-missing-scriptfile.xml
   [junit4]   2> 51116 INFO  (TEST-TestRequestForwarding.testMultiCollectionQuery-seed#[2FC5452D3A987335]) [    ] o.a.s.c.c.SolrZkClient makePath: /configs/conf1/solrconfig-altdirectory.xml
   [junit4]   2> 51118 INFO  (TEST-TestRequestForwarding.testMultiCollectionQuery-seed#[2FC5452D3A987335]) [    ] o.a.s.c.c.SolrZkClient makePath: /configs/conf1/schema-distributed-missing-sort.xml
   [junit4]   2> 51121 INFO  (TEST-TestRequestForwarding.testMultiCollectionQuery-seed#[2FC5452D3A987335]) [    ] o.a.s.c.c.SolrZkClient makePath: /configs/conf1/enumsConfig.xml
   [junit4]   2> 51123 INFO  (TEST-TestRequestForwarding.testMultiCollectionQuery-seed#[2FC5452D3A987335]) [    ] o.a.s.c.c.SolrZkClient makePath: /configs/conf1/solrconfig-sortingmergepolicyfactory.xml
   [junit4]   2> 51125 INFO  (TEST-TestRequestForwarding.testMultiCollectionQuery-seed#[2FC5452D3A987335]) [    ] o.a.s.c.c.SolrZkClient makePath: /configs/conf1/schema-tfidf.xml
   [junit4]   2> 51127 INFO  (TEST-TestRequestForwarding.testMultiCollectionQuery-seed#[2FC5452D3A987335]) [    ] o.a.s.c.c.SolrZkClient makePath: /configs/conf1/jasuggest.txt
   [junit4]   2> 51132 INFO  (TEST-TestRequestForwarding.testMultiCollectionQuery-seed#[2FC5452D3A987335]) [    ] o.a.s.c.c.SolrZkClient makePath: /configs/conf1/bad-schema-dup-field.xml
   [junit4]   2> 51135 INFO  (TEST-TestRequestForwarding.testMultiCollectionQuery-seed#[2FC5452D3A987335]) [    ] o.a.s.c.c.SolrZkClient makePath: /configs/conf1/solrconfig-cdcrupdatelog.xml
   [junit4]   2> 51137 INFO  (TEST-TestRequestForwarding.testMultiCollectionQuery-seed#[2FC5452D3A987335]) [    ] o.a.s.c.c.SolrZkClient makePath: /configs/conf1/fuzzysuggest.txt
   [junit4]   2> 51140 INFO  (TEST-TestRequestForwarding.testMultiCollectionQuery-seed#[2FC5452D3A987335]) [    ] o.a.s.c.c.SolrZkClient makePath: /configs/conf1/schema-minimal.xml
   [junit4]   2> 51150 INFO  (TEST-TestRequestForwarding.testMultiCollectionQuery-seed#[2FC5452D3A987335]) [    ] o.a.s.c.c.SolrZkClient makePath: /configs/conf1/solrconfig-highlight.xml
   [junit4]   2> 51152 INFO  (TEST-TestRequestForwarding.testMultiCollectionQuery-seed#[2FC5452D3A987335]) [    ] o.a.s.c.c.SolrZkClient makePath: /configs/conf1/solrconfig-tieredmergepolicy.xml
   [junit4]   2> 51155 INFO  (TEST-TestRequestForwarding.testMultiCollectionQuery-seed#[2FC5452D3A987335]) [    ] o.a.s.c.c.SolrZkClient makePath: /configs/conf1/schema-blockjoinfacetcomponent.xml
   [junit4]   2> 51157 INFO  (TEST-TestRequestForwarding.testMultiCollectionQuery-seed#[2FC5452D3A987335]) [    ] o.a.s.c.c.SolrZkClient makePath: /configs/conf1/schema-version-indexed.xml
   [junit4]   2> 51159 INFO  (TEST-TestRequestForwarding.testMultiCollectionQuery-seed#[2FC5452D3A987335]) [    ] o.a.s.c.c.SolrZkClient makePath: /configs/conf1/bad-schema-unsupported-docValues.xml
   [junit4]   2> 51161 INFO  (TEST-TestRequestForwarding.testMultiCollectionQuery-seed#[2FC5452D3A987335]) [    ] o.a.s.c.c.SolrZkClient makePath: /configs/conf1/mapping-ISOLatin1Accent.txt
   [junit4]   2> 51165 INFO  (TEST-TestRequestForwarding.testMultiCollectionQuery-seed#[2FC5452D3A987335]) [    ] o.a.s.c.c.SolrZkClient makePath: /configs/conf1/schema-lmdirichlet.xml
   [junit4]   2> 51167 INFO  (TEST-TestRequestForwarding.testMultiCollectionQuery-seed#[2FC5452D3A987335]) [    ] o.a.s.c.c.SolrZkClient makePath: /configs/conf1/schema-synonym-tokenizer.xml
   [junit4]   2> 51169 INFO  (TEST-TestRequestForwarding.testMultiCollectionQuery-seed#[2FC5452D3A987335]) [    ] o.a.s.c.c.SolrZkClient makePath: /configs/conf1/stop-2.txt
   [junit4]   2> 51172 INFO  (TEST-TestRequestForwarding.testMultiCollectionQuery-seed#[2FC5452D3A987335]) [    ] o.a.s.c.c.SolrZkClient makePath: /configs/conf1/schema-non-stored-docvalues.xml
   [junit4]   2> 51174 INFO  (TEST-TestRequestForwarding.testMultiCollectionQuery-seed#[2FC5452D3A987335]) [    ] o.a.s.c.c.SolrZkClient makePath: /configs/conf1/schema-sim-default-override.xml
   [junit4]   2> 51176 INFO  (TEST-TestRequestForwarding.testMultiCollectionQuery-seed#[2FC5452D3A987335]) [    ] o.a.s.c.c.SolrZkClient makePath: /configs/conf1/solrconfig-plugcollector.xml
   [junit4]   2> 51179 INFO  (TEST-TestRequestForwarding.testMultiCollectionQuery-seed#[2FC5452D3A987335]) [    ] o.a.s.c.c.SolrZkClient makePath: /configs/conf1/solrconfig-managed-schema-test.xml
   [junit4]   2> 51181 INFO  (TEST-TestRequestForwarding.testMultiCollectionQuery-seed#[2FC5452D3A987335]) [    ] o.a.s.c.c.SolrZkClient makePath: /configs/conf1/bad-schema-uniquekey-uses-default.xml
   [junit4]   2> 51183 INFO  (TEST-TestRequestForwarding.testMultiCollectionQuery-seed#[2FC5452D3A987335]) [    ] o.a.s.c.c.SolrZkClient makePath: /configs/conf1/bad-schema-sim-global-vs-ft-mismatch.xml
   [junit4]   2> 51185 INFO  (TEST-TestRequestForwarding.testMultiCollectionQuery-seed#[2FC5452D3A987335]) [    ] o.a.s.c.c.SolrZkClient makePath: /configs/conf1/solrconfig-warmer.xml
   [junit4]   2> 51187 INFO  (TEST-TestRequestForwarding.testMultiCollectionQuery-seed#[2FC5452D3A987335]) [    ] o.a.s.c.c.SolrZkClient makePath: /configs/conf1/schema11.xml
   [junit4]   2> 51190 INFO  (TEST-TestRequestForwarding.testMultiCollectionQuery-seed#[2FC5452D3A987335]) [    ] o.a.s.c.c.SolrZkClient makePath: /configs/conf1/solrconfig-tlog.xml
   [junit4]   2> 51193 INFO  (TEST-TestRequestForwarding.testMultiCollectionQuery-seed#[2FC5452D3A987335]) [    ] o.a.s.c.c.SolrZkClient makePath: /configs/conf1/solrconfig-withgethandler.xml
   [junit4]   2> 51204 INFO  (TEST-TestRequestForwarding.testMultiCollectionQuery-seed#[2FC5452D3A987335]) [    ] o.a.s.c.c.SolrZkClient makePath: /configs/conf1/schema-lmjelinekmercer.xml
   [junit4]   2> 51207 INFO  (TEST-TestRequestForwarding.testMultiCollectionQuery-seed#[2FC5452D3A987335]) [    ] o.a.s.c.c.SolrZkClient makePath: /configs/conf1/schema12.xml
   [junit4]   2> 51209 INFO  (TEST-TestRequestForwarding.testMultiCollectionQuery-seed#[2FC5452D3A987335]) [    ] o.a.s.c.c.SolrZkClient makePath: /configs/conf1/solrconfig-SOLR-749.xml
   [junit4]   2> 51211 INFO  (TEST-TestRequestForwarding.testMultiCollectionQuery-seed#[2FC5452D3A987335]) [    ] o.a.s.c.c.SolrZkClient makePath: /configs/conf1/bad-schema-sweetspot-partial-hyperbolic.xml
   [junit4]   2> 51214 INFO  (TEST-TestRequestForwarding.testMultiCollectionQuery-seed#[2FC5452D3A987335]) [    ] o.a.s.c.c.SolrZkClient makePath: /configs/conf1/solrconfig-master2.xml
   [junit4]   2> 51216 INFO  (TEST-TestRequestForwarding.testMultiCollectionQuery-seed#[2FC5452D3A987335]) [    ] o.a.s.c.c.SolrZkClient makePath: /configs/conf1/schema-bm25.xml
   [junit4]   2> 51218 INFO  (TEST-TestRequestForwarding.testMultiCollectionQuery-seed#[2FC5452D3A987335]) [    ] o.a.s.c.c.SolrZkClient makePath: /configs/conf1/open-exchange-rates.json
   [junit4]   2> 51220 INFO  (TEST-TestRequestForwarding.testMultiCollectionQuery-seed#[2FC5452D3A987335]) [    ] o.a.s.c.c.SolrZkClient makePath: /configs/conf1/schema-preanalyzed.xml
   [junit4]   2> 51222 INFO  (TEST-TestRequestForwarding.testMultiCollectionQuery-seed#[2FC5452D3A987335]) [    ] o.a.s.c.c.SolrZkClient makePath: /configs/conf1/schema-snippet-type.xml
   [junit4]   2> 51225 INFO  (TEST-TestRequestForwarding.testMultiCollectionQuery-seed#[2FC5452D3A987335]) [    ] o.a.s.c.c.SolrZkClient makePath: /configs/conf1/solrconfig-suggestercomponent-context-filter-query.xml
   [junit4]   2> 51227 INFO  (TEST-TestRequestForwarding.testMultiCollectionQuery-seed#[2FC5452D3A987335]) [    ] o.a.s.c.c.SolrZkClient makePath: /configs/conf1/schema-distrib-interval-faceting.xml
   [junit4]   2> 51229 INFO  (TEST-TestRequestForwarding.testMultiCollectionQuery-seed#[2FC5452D3A987335]) [    ] o.a.s.c.c.SolrZkClient makePath: /configs/conf1/solrconfig-master1.xml
   [junit4]   2> 51231 INFO  (TEST-TestRequestForwarding.testMultiCollectionQuery-seed#[2FC5452D3A987335]) [    ] o.a.s.c.c.SolrZkClient makePath: /configs/conf1/bad-schema-currency-ft-oer-norates.xml
   [junit4]   2> 51233 INFO  (TEST-TestRequestForwarding.testMultiCollectionQuery-seed#[2FC5452D3A987335]) [    ] o.a.s.c.c.SolrZkClient makePath: /configs/conf1/solrconfig-schemaless.xml
   [junit4]   2> 51240 INFO  (TEST-TestRequestForwarding.testMultiCollectionQuery-seed#[2FC5452D3A987335]) [    ] o.a.s.c.c.SolrZkClient makePath: /configs/conf1/bad-schema-dynamicfield-default-val.xml
   [junit4]   2> 51242 INFO  (TEST-TestRequestForwarding.testMultiCollectionQuery-seed#[2FC5452D3A987335]) [    ] o.a.s.c.c.SolrZkClient makePath: /configs/conf1/bad-schema-sweetspot-partial-norms.xml
   [junit4]   2> 51244 INFO  (TEST-TestRequestForwarding.testMultiCollectionQuery-seed#[2FC5452D3A987335]) [    ] o.a.s.c.c.SolrZkClient makePath: /configs/conf1/elevate.xml
   [junit4]   2> 51246 INFO  (TEST-TestRequestForwarding.testMultiCollectionQuery-seed#[2FC5452D3A987335]) [    ] o.a.s.c.c.SolrZkClient makePath: /configs/conf1/schema-required-fields.xml
   [junit4]   2> 51249 INFO  (TEST-TestRequestForwarding.testMultiCollectionQuery-seed#[2FC5452D3A987335]) [    ] o.a.s.c.c.SolrZkClient makePath: /configs/conf1/solrconfig-doc-expire-update-processor.xml
   [junit4]   2> 51251 INFO  (TEST-TestRequestForwarding.testMultiCollectionQuery-seed#[2FC5452D3A987335]) [    ] o.a.s.c.c.SolrZkClient makePath: /configs/conf1/schema-charfilters.xml
   [junit4]   2> 51253 INFO  (TEST-TestRequestForwarding.testMultiCollectionQuery-seed#[2FC5452D3A987335]) [    ] o.a.s.c.c.SolrZkClient makePath: /configs/conf1/solrconfig-querysender.xml
   [junit4]   2> 51255 INFO  (TEST-TestRequestForwarding.testMultiCollectionQuery-seed#[2FC5452D3A987335]) [    ] o.a.s.c.c.SolrZkClient makePath: /configs/conf1/bad-schema-nontext-analyzer.xml
   [junit4]   2> 51258 INFO  (TEST-TestRequestForwarding.testMultiCollectionQuery-seed#[2FC5452D3A987335]) [    ] o.a.s.c.c.SolrZkClient makePath: /configs/conf1/frenchArticles.txt
   [junit4]   2> 51260 INFO  (TEST-TestRequestForwarding.testMultiCollectionQuery-seed#[2FC5452D3A987335]) [    ] o.a.s.c.c.SolrZkClient makePath: /configs/conf1/solrconfig-tolerant-search.xml
   [junit4]   2> 51262 INFO  (TEST-TestRequestForwarding.testMultiCollectionQuery-seed#[2FC5452D3A987335]) [    ] o.a.s.c.c.SolrZkClient makePath: /configs/conf1/bad-schema-sim-default-has-no-explicit-sim.xml
   [junit4]   2> 51265 INFO  (TEST-TestRequestForwarding.testMultiCollectionQuery-seed#[2FC5452D3A987335]) [    ] o.a.s.c.c.SolrZkClient makePath: /configs/conf1/synonyms.txt
   [junit4]   2> 51268 INFO  (TEST-TestRequestForwarding.testMultiCollectionQuery-seed#[2FC5452D3A987335]) [    ] o.a.s.c.c.SolrZkClient makePath: /configs/conf1/solrconfig-update-processor-chains.xml
   [junit4]   2> 51270 INFO  (TEST-TestRequestForwarding.testMultiCollectionQuery-seed#[2FC5452D3A987335]) [    ] o.a.s.c.c.SolrZkClient makePath: /configs/conf1/schema-rest.xml
   [junit4]   2> 51272 INFO  (TEST-TestRequestForwarding.testMultiCollectionQuery-seed#[2FC5452D3A987335]) [    ] o.a.s.c.c.SolrZkClient makePath: /configs/conf1/trivial.updateprocessor0.js
   [junit4]   2> 51276 INFO  (TEST-TestRequestForwarding.testMultiCollectionQuery-seed#[2FC5452D3A987335]) [    ] o.a.s.c.c.SolrZkClient makePath: /configs/conf1/solrconfig-mergepolicy-nocfs.xml
   [junit4]   2> 51279 INFO  (TEST-TestRequestForwarding.testMultiCollectionQuery-seed#[2FC5452D3A987335]) [    ] o.a.s.c.c.SolrZkClient makePath: /configs/conf1/solrconfig-reqHandler.incl
   [junit4]   2> 51281 INFO  (TEST-TestRequestForwarding.testMultiCollectionQuery-seed#[2FC5452D3A987335]) [    ] o.a.s.c.c.SolrZkClient makePath: /configs/conf1/schema.xml
   [junit4]   2> 51284 INFO  (TEST-TestRequestForwarding.testMultiCollectionQuery-seed#[2FC5452D3A987335]) [    ] o.a.s.c.c.SolrZkClient makePath: /configs/conf1/schema-spellchecker.xml
   [junit4]   2> 51286 INFO  (TEST-TestRequestForwarding.testMultiCollectionQuery-seed#[2FC5452D3A987335]) [    ] o.a.s.c.c.SolrZkClient makePath: /configs/conf1/solrconfig-doctransformers.xml
   [junit4]   2> 51290 INFO  (TEST-TestRequestForwarding.testMultiCollectionQuery-seed#[2FC5452D3A987335]) [    ] o.a.s.c.c.SolrZkClient makePath: /configs/conf1/schema-reversed.xml
   [junit4]   2> 51292 INFO  (TEST-TestRequestForwarding.testMultiCollectionQuery-seed#[2FC5452D3A987335]) [    ] o.a.s.c.c.SolrZkClient makePath: /configs/conf1/solrconfig-managed-schema.xml
   [junit4]   2> 51297 INFO  (TEST-TestRequestForwarding.testMultiCollectionQuery-seed#[2FC5452D3A987335]) [    ] o.a.s.c.c.SolrZkClient makePath: /configs/conf1/bad-schema-omit-tf-but-not-pos.xml
   [junit4]   2> 51301 INFO  (TEST-TestRequestForwarding.testMultiCollectionQuery-seed#[2FC5452D3A987335]) [    ] o.a.s.c.c.SolrZkClient makePath: /configs/conf1/solrconfig-solcoreproperties.xml
   [junit4]   2> 51303 INFO  (TEST-TestRequestForwarding.testMultiCollectionQuery-seed#[2FC5452D3A987335]) [    ] o.a.s.c.c.SolrZkClient makePath: /configs/conf1/currency.xml
   [junit4]   2> 51305 INFO  (TEST-TestRequestForwarding.testMultiCollectionQuery-seed#[2FC5452D3A987335]) [    ] o.a.s.c.c.SolrZkClient makePath: /configs/conf1/keep-1.txt
   [junit4]   2> 51307 INFO  (TEST-TestRequestForwarding.testMultiCollectionQuery-seed#[2FC5452D3A987335]) [    ] o.a.s.c.c.SolrZkClient makePath: /configs/conf1/throw.error.on.add.updateprocessor.js
   [junit4]   2> 51309 INFO  (TEST-TestRequestForwarding.testMultiCollectionQuery-seed#[2FC5452D3A987335]) [    ] o.a.s.c.c.SolrZkClient makePath: /configs/conf1/solrconfig-master-throttled.xml
   [junit4]   2> 51314 INFO  (TEST-TestRequestForwarding.testMultiCollectionQuery-seed#[2FC5452D3A987335]) [    ] o.a.s.c.c.SolrZkClient makePath: /configs/conf1/solrconfig-distrib-update-processor-chains.xml
   [junit4]   2> 51316 INFO  (TEST-TestRequestForwarding.testMultiCollectionQuery-seed#[2FC5452D3A987335]) [    ] o.a.s.c.c.SolrZkClient makePath: /configs/conf1/schema-single-dynamic-copy-field.xml
   [junit4]   2> 51319 INFO  (TEST-TestRequestForwarding.testMultiCollectionQuery-seed#[2FC5452D3A987335]) [    ] o.a.s.c.c.SolrZkClient makePath: /configs/conf1/schema-xinclude.xml
   [junit4]   2> 51322 INFO  (TEST-TestRequestForwarding.testMultiCollectionQuery-seed#[2FC5452D3A987335]) [    ] o.a.s.c.c.SolrZkClient makePath: /configs/conf1/solrconfig-elevate.xml
   [junit4]   2> 51327 INFO  (TEST-TestRequestForwarding.testMultiCollectionQuery-seed#[2FC5452D3A987335]) [    ] o.a.s.c.c.SolrZkClient makePath: /configs/conf1/stoptypes-2.txt
   [junit4]   2> 51332 INFO  (TEST-TestRequestForwarding.testMultiCollectionQuery-seed#[2FC5452D3A987335]) [    ] o.a.s.c.c.SolrZkClient makePath: /configs/conf1/schema-complex-phrase.xml
   [junit4]   2> 51335 INFO  (TEST-TestRequestForwarding.testMultiCollectionQuery-seed#[2FC5452D3A987335]) [    ] o.a.s.c.c.SolrZkClient makePath: /configs/conf1/solrconfig-master1-keepOneBackup.xml
   [junit4]   2> 51339 INFO  (TEST-TestRequestForwarding.testMultiCollectionQuery-seed#[2FC5452D3A987335]) [    ] o.a.s.c.c.SolrZkClient makePath: /configs/conf1/bad-schema-bogus-analysis-parameters.xml
   [junit4]   2> 51342 INFO  (TEST-TestRequestForwarding.testMultiCollectionQuery-seed#[2FC5452D3A987335]) [    ] o.a.s.c.c.SolrZkClient makePath: /configs/conf1/stemdict.txt
   [junit4]   2> 51345 INFO  (TEST-TestRequestForwarding.testMultiCollectionQuery-seed#[2FC5452D3A987335]) [    ] o.a.s.c.c.SolrZkClient makePath: /configs/conf1/schema-trie.xml
   [junit4]   2> 51354 INFO  (TEST-TestRequestForwarding.testMultiCollectionQuery-seed#[2FC5452D3A987335]) [    ] o.a.s.c.c.SolrZkClient makePath: /configs/conf1/wdftypes.txt
   [junit4]   2> 51356 INFO  (TEST-TestRequestForwarding.testMultiCollectionQuery-seed#[2FC5452D3A987335]) [    ] o.a.s.c.c.SolrZkClient makePath: /configs/conf1/solrconfig-slave1.xml
   [junit4]   2> 51360 INFO  (TEST-TestRequestForwarding.testMultiCollectionQuery-seed#[2FC5452D3A987335]) [    ] o.a.s.c.c.SolrZkClient makePath: /configs/conf1/solrconfig-defaults.xml
   [junit4]   2> 51364 INFO  (TEST-TestRequestForwarding.testMultiCollectionQuery-seed#[2FC5452D3A987335]) [    ] o.a.s.c.c.SolrZkClient makePath: /configs/conf1/schema-graph.xml
   [junit4]   2> 51369 INFO  (TEST-TestRequestForwarding.testMultiCollectionQuery-seed#[2FC5452D3A987335]) [    ] o.a.s.c.c.SolrZkClient makePath: /configs/conf1/bad-schema-external-filefield.xml
   [junit4]   2> 51371 INFO  (TEST-TestRequestForwarding.testMultiCollectionQuery-seed#[2FC5452D3A987335]) [    ] o.a.s.c.c.SolrZkClient makePath: /configs/conf1/schema-docValues.xml
   [junit4]   2> 51375 INFO  (TEST-TestRequestForwarding.testMultiCollectionQuery-seed#[2FC5452D3A987335]) [    ] o.a.s.c.c.SolrZkClient makePath: /configs/conf1/solrconfig-delpolicy2.xml
   [junit4]   2> 51381 INFO  (TEST-TestRequestForwarding.testMultiCollectionQuery-seed#[2FC5452D3A987335]) [    ] o.a.s.c.c.SolrZkClient makePath: /configs/conf1/schemasurround.xml
   [junit4]   2> 51384 INFO  (TEST-TestRequestForwarding.testMultiCollectionQuery-seed#[2FC5452D3A987335]) [    ] o.a.s.c.c.SolrZkClient makePath: /configs/conf1/solrconfig-test-misc.xml
   [junit4]   2> 51388 INFO  (TEST-TestRequestForwarding.testMultiCollectionQuery-seed#[2FC5452D3A987335]) [    ] o.a.s.c.c.SolrZkClient makePath: /configs/conf1/schema15.xml
   [junit4]   2> 51402 INFO  (TEST-TestRequestForwarding.testMultiCollectionQuery-seed#[2FC5452D3A987335]) [    ] o.a.s.c.c.SolrZkClient makePath: /configs/conf1/schema-class-name-shortening-on-serialization.xml
   [junit4]   2> 51404 INFO  (TEST-TestRequestForwarding.testMultiCollectionQuery-seed#[2FC5452D3A987335]) [    ] o.a.s.c.c.SolrZkClient makePath: /configs/conf1/schema-add-schema-fields-update-processor.xml
   [junit4]   2> 51424 INFO  (TEST-TestRequestForwarding.testMultiCollectionQuery-seed#[2FC5452D3A987335]) [    ] o.a.s.c.c.SolrZkClient makePath: /configs/conf1/schema-collate.xml
   [junit4]   2> 51465 INFO  (TEST-TestRequestForwarding.testMultiCollectionQuery-seed#[2FC5452D3A987335]) [    ] o.a.s.c.c.SolrZkClient makePath: /configs/conf1/old_synonyms.txt
   [junit4]   2> 51468 INFO  (TEST-TestRequestForwarding.testMultiCollectionQuery-seed#[2FC5452D3A987335]) [    ] o.a.s.c.c.SolrZkClient makePath: /configs/conf1/schema-snippet-field.xml
   [junit4]   2> 51471 INFO  (TEST-TestRequestForwarding.testMultiCollectionQuery-seed#[2FC5452D3A987335]) [    ] o.a.s.c.c.SolrZkClient makePath: /configs/conf1/solrconfig-indexconfig.xml
   [junit4]   2> 51474 INFO  (TEST-TestRequestForwarding.testMultiCollectionQuery-seed#[2FC5452D3A987335]) [    ] o.a.s.c.c.SolrZkClient makePath: /configs/conf1/bad_solrconfig.xml
   [junit4]   2> 51475 INFO  (TEST-TestRequestForwarding.testMultiCollectionQuery-seed#[2FC5452D3A987335]) [    ] o.a.s.c.c.SolrZkClient makePath: /configs/conf1/schema-eff.xml
   [junit4]   2> 51477 INFO  (TEST-TestRequestForwarding.testMultiCollectionQuery-seed#[2FC5452D3A987335]) [    ] o.a.s.c.c.SolrZkClient makePath: /configs/conf1/bad-schema-uniquekey-multivalued.xml
   [junit4]   2> 51479 INFO  (TEST-TestRequestForwarding.testMultiCollectionQuery-seed#[2FC5452D3A987335]) [    ] o.a.s.c.c.SolrZkClient makePath: /configs/conf1/bad-solrconfig-nrtmode.xml
   [junit4]   2> 51481 INFO  (TEST-TestRequestForwarding.testMultiCollectionQuery-seed#[2FC5452D3A987335]) [    ] o.a.s.c.c.SolrZkClient makePath: /configs/conf1/analyzingInfixSuggest.txt
   [junit4]   2> 51486 INFO  (TEST-TestRequestForwarding.testMultiCollectionQuery-seed#[2FC5452D3A987335]) [    ] o.a.s.c.c.SolrZkClient makePath: /configs/conf1/solrconfig-repeater.xml
   [junit4]   2> 51488 INFO  (TEST-TestRequestForwarding.testMultiCollectionQuery-seed#[2FC5452D3A987335]) [    ] o.a.s.c.c.SolrZkClient makePath: /configs/conf1/schema-spatial.xml
   [junit4]   2> 51503 INFO  (TEST-TestRequestForwarding.testMultiCollectionQuery-seed#[2FC5452D3A987335]) [    ] o.a.s.c.c.SolrZkClient makePath: /configs/conf1/schema-hash.xml
   [junit4]   2> 51512 INFO  (TEST-TestRequestForwarding.testMultiCollectionQuery-seed#[2FC5452D3A987335]) [    ] o.a.s.c.c.SolrZkClient makePath: /configs/conf1/solrconfig-spatial.xml
   [junit4]   2> 51514 INFO  (TEST-TestRequestForwarding.testMultiCollectionQuery-seed#[2FC5452D3A987335]) [    ] o.a.s.c.c.SolrZkClient makePath: /configs/conf1/schema-field-sort-values.xml
   [junit4]   2> 51517 INFO  (TEST-TestRequestForwarding.testMultiCollectionQuery-seed#[2FC5452D3A987335]) [    ] o.a.s.c.c.SolrZkClient makePath: /configs/conf1/stoptypes-1.txt
   [junit4]   2> 51519 INFO  (TEST-TestRequestForwarding.testMultiCollectionQuery-seed#[2FC5452D3A987335]) [    ] o.a.s.c.c.SolrZkClient makePath: /configs/conf1/bad-schema-init-error.xml
   [junit4]   2> 51532 INFO  (TEST-TestRequestForwarding.testMultiCollectionQuery-seed#[2FC5452D3A987335]) [    ] o.a.s.c.c.SolrZkClient makePath: /configs/conf1/schema-customfield.xml
   [junit4]   2> 51537 INFO  (TEST-TestRequestForwarding.testMultiCollectionQuery-seed#[2FC5452D3A987335]) [    ] o.a.s.c.c.SolrZkClient makePath: /configs/conf1/bad-solrconfig-managed-schema-named-schema.xml.xml
   [junit4]   2> 51539 INFO  (TEST-TestRequestForwarding.testMultiCollectionQuery-seed#[2FC5452D3A987335]) [    ] o.a.s.c.c.SolrZkClient makePath: /configs/conf1/solrconfig-paramset.xml
   [junit4]   2> 51541 INFO  (TEST-TestRequestForwarding.testMultiCollectionQuery-seed#[2FC5452D3A987335]) [    ] o.a.s.c.c.SolrZkClient makePath: /configs/conf1/bad-schema-dup-dynamicField.xml
   [junit4]   2> 51543 INFO  (TEST-TestRequestForwarding.testMultiCollectionQuery-seed#[2FC5452D3A987335]) [    ] o.a.s.c.c.SolrZkClient makePath: /configs/conf1/stopwords.txt
   [junit4]   2> 51545 INFO  (TEST-TestRequestForwarding.testMultiCollectionQuery-seed#[2FC5452D3A987335]) [    ] o.a.s.c.c.SolrZkClient makePath: /configs/conf1/schema-folding.xml
   [junit4]   2> 51547 INFO  (TEST-TestRequestForwarding.testMultiCollectionQuery-seed#[2FC5452D3A987335]) [    ] o.a.s.c.c.SolrZkClient makePath: /configs/conf1/schema-classification.xml
   [junit4]   2> 51550 INFO  (TEST-TestRequestForwarding.testMultiCollectionQuery-seed#[2FC5452D3A987335]) [    ] o.a.s.c.c.SolrZkClient makePath: /configs/conf1/stopwithbom.txt
   [junit4]   2> 51552 INFO  (TEST-TestRequestForwarding.testMultiCollectionQuery-seed#[2FC5452D3A987335]) [    ] o.a.s.c.c.SolrZkClient makePath: /configs/conf1/missleading.extension.updateprocessor.js.txt
   [junit4]   2> 51554 INFO  (TEST-TestRequestForwarding.testMultiCollectionQuery-seed#[2FC5452D3A987335]) [    ] o.a.s.c.c.SolrZkClient makePath: /configs/conf1/bad-schema-currency-dynamic-multivalued.xml
   [junit4]   2> 51555 INFO  (TEST-TestRequestForwarding.testMultiCollectionQuery-seed#[2FC5452D3A987335]) [    ] o.a.s.c.c.SolrZkClient makePath: /configs/conf1/schema-binaryfield.xml
   [junit4]   2> 51557 INFO  (TEST-TestRequestForwarding.testMultiCollectionQuery-seed#[2FC5452D3A987335]) [    ] o.a.s.c.c.SolrZkClient makePath: /configs/conf1/solrconfig-slave.xml
   [junit4]   2> 51559 INFO  (TEST-TestRequestForwarding.testMultiCollectionQuery-seed#[2FC5452D3A987335]) [    ] o.a.s.c.c.SolrZkClient makePath: /configs/conf1/schema-luceneMatchVersion.xml
   [junit4]   2> 51561 INFO  (TEST-TestRequestForwarding.testMultiCollectionQuery-seed#[2FC5452D3A987335]) [    ] o.a.s.c.c.SolrZkClient makePath: /configs/conf1/solrconfig-cdcr.xml
   [junit4]   2> 51563 INFO  (TEST-TestRequestForwarding.testMultiCollectionQuery-seed#[2FC5452D3A987335]) [    ] o.a.s.c.c.SolrZkClient makePath: /configs/conf1/schema-sortingresponse.xml
   [junit4]   2> 51566 INFO  (TEST-TestRequestForwarding.testMultiCollectionQuery-seed#[2FC5452D3A987335]) [    ] o.a.s.c.c.SolrZkClient makePath: /configs/conf1/bad-schema-sweetspot-partial-baseline.xml
   [junit4]   2> 51568 INFO  (TEST-TestRequestForwarding.testMultiCollectionQuery-seed#[2FC5452D3A987335]) [    ] o.a.s.c.c.SolrZkClient makePath: /configs/conf1/schema-stop-keep.xml
   [junit4]   2> 51575 INFO  (TEST-TestRequestForwarding.testMultiCollectionQuery-seed#[2FC5452D3A987335]) [    ] o.a.s.c.c.SolrZkClient makePath: /configs/conf1/solrconfig-infostream-logging.xml
   [junit4]   2> 51577 INFO  (TEST-TestRequestForwarding.testMultiCollectionQuery-seed#[2FC5452D3A987335]) [    ] o.a.s.c.c.SolrZkClient makePath: /configs/conf1/bad-schema-uniquekey-is-copyfield-dest.xml
   [junit4]   2> 51580 INFO  (TEST-TestRequestForwarding.testMultiCollectionQuery-seed#[2FC5452D3A987335]) [    ] o.a.s.c.c.SolrZkClient makePath: /configs/conf1/solrconfig-master.xml
   [junit4]   2> 51582 INFO  (TEST-TestRequestForwarding.testMultiCollectionQuery-seed#[2FC5452D3A987335]) [    ] o.a.s.c.c.SolrZkClient makePath: /configs/conf1/schema-replication2.xml
   [junit4]   2> 51584 INFO  (TEST-TestRequestForwarding.testMultiCollectionQuery-seed#[2FC5452D3A987335]) [    ] o.a.s.c.c.SolrZkClient makePath: /configs/conf1/bad-schema-currency-ft-bogus-code-in-xml.xml
   [junit4]   2> 51585 INFO  (TEST-TestRequestForwarding.testMultiCollectionQuery-seed#[2FC5452D3A987335]) [    ] o.a.s.c.c.SolrZkClient makePath: /configs/conf1/addfields.updateprocessor.js
   [junit4]   2> 51588 INFO  (TEST-TestRequestForwarding.testMultiCollectionQuery-seed#[2FC5452D3A987335]) [    ] o.a.s.c.c.SolrZkClient makePath: /configs/conf1/schema-dfr.xml
   [junit4]   2> 51590 INFO  (TEST-TestRequestForwarding.testMultiCollectionQuery-seed#[2FC5452D3A987335]) [    ] o.a.s.c.c.SolrZkClient makePath: /configs/conf1/schema-enums.xml
   [junit4]   2> 51612 INFO  (TEST-TestRequestForwarding.testMultiCollectionQuery-seed#[2FC5452D3A987335]) [    ] o.a.s.c.c.SolrZkClient makePath: /configs/conf1/solrconfig-delpolicy1.xml
   [junit4]   2> 51633 INFO  (TEST-TestRequestForwarding.testMultiCollectionQuery-seed#[2FC5452D3A987335]) [    ] o.a.s.c.c.SolrZkClient makePath: /configs/conf1/solrconfig-minimal.xml
   [junit4]   2> 51635 INFO  (TEST-TestRequestForwarding.testMultiCollectionQuery-seed#[2FC5452D3A987335]) [    ] o.a.s.c.c.SolrZkClient makePath: /configs/conf1/bad-solrconfig-multiple-cfs.xml
   [junit4]   2> 51645 INFO  (TEST-TestRequestForwarding.testMultiCollectionQuery-seed#[2FC5452D3A987335]) [    ] o.a.s.c.c.SolrZkClient makePath: /configs/conf1/trivial.updateprocessor1.js
   [junit4]   2> 51648 INFO  (TEST-TestRequestForwarding.testMultiCollectionQuery-seed#[2FC5452D3A987335]) [    ] o.a.s.c.c.SolrZkClient makePath: /configs/conf1/missing.functions.updateprocessor.js
   [junit4]   2> 51650 INFO  (TEST-TestRequestForwarding.testMultiCollectionQuery-seed#[2FC5452D3A987335]) [    ] o.a.s.c.c.SolrZkClient makePath: /configs/conf1/bad-solrconfig-multiple-dirfactory.xml
   [junit4]   2> 51653 INFO  (TEST-TestRequestForwarding.testMultiCollectionQuery-seed#[2FC5452D3A987335]) [    ] o.a.s.c.c.SolrZkClient makePath: /configs/conf1/solrconfig.xml
   [junit4]   2> 51669 INFO  (TEST-TestRequestForwarding.testMultiCollectionQuery-seed#[2FC5452D3A987335]) [    ] o.a.s.c.c.SolrZkClient makePath: /configs/conf1/bad-schema-misplaced-asterisk-copyfield-source-should-fail-test.xml
   [junit4]   2> 51672 INFO  (TEST-TestRequestForwarding.testMultiCollectionQuery-seed#[2FC5452D3A987335]) [    ] o.a.s.c.c.SolrZkClient makePath: /configs/conf1/solrconfig-add-schema-fields-update-processor-chains.xml
   [junit4]   2> 51674 INFO  (TEST-TestRequestForwarding.testMultiCollectionQuery-seed#[2FC5452D3A987335]) [    ] o.a.s.c.c.SolrZkClient makePath: /configs/conf1/schema-version-dv.xml
   [junit4]   2> 51685 INFO  (TEST-TestRequestForwarding.testMultiCollectionQuery-seed#[2FC5452D3A987335]) [    ] o.a.s.c.c.SolrZkClient makePath: /configs/conf1/solrconfig-delaying-component.xml
   [junit4]   2> 51687 INFO  (TEST-TestRequestForwarding.testMultiCollectionQuery-seed#[2FC5452D3A987335]) [    ] o.a.s.c.c.SolrZkClient makePath: /configs/conf1/schema-custom-field.xml
   [junit4]   2> 51688 INFO  (TEST-TestRequestForwarding.testMultiCollectionQuery-seed#[2FC5452D3A987335]) [    ] o.a.s.c.c.SolrZkClient makePath: /configs/conf1/schema-ib.xml
   [junit4]   2> 51690 INFO  (TEST-TestRequestForwarding.testMultiCollectionQuery-seed#[2FC5452D3A987335]) [    ] o.a.s.c.c.SolrZkClient makePath: /configs/conf1/keep-2.txt
   [junit4]   2> 51694 INFO  (TEST-TestRequestForwarding.testMultiCollectionQuery-seed#[2FC5452D3A987335]) [    ] o.a.s.c.c.SolrZkClient makePath: /configs/conf1/schema-one-field-no-dynamic-field.xml
   [junit4]   2> 51696 INFO  (TEST-TestRequestForwarding.testMultiCollectionQuery-seed#[2FC5452D3A987335]) [    ] o.a.s.c.c.SolrZkClient makePath: /configs/conf1/schema-not-required-unique-key.xml
   [junit4]   2> 51697 INFO  (TEST-TestRequestForwarding.testMultiCollectionQuery-seed#[2FC5452D3A987335]) [    ] o.a.s.c.c.SolrZkClient makePath: /configs/conf1/solrconfig-tolerant-update-minimal.xml
   [junit4]   2> 51699 INFO  (TEST-TestRequestForwarding.testMultiCollectionQuery-seed#[2FC5452D3A987335]) [    ] o.a.s.c.c.SolrZkClient makePath: /configs/conf1/schema-minimal-atomic-stress.xml
   [junit4]   2> 51701 INFO  (TEST-TestRequestForwarding.testMultiCollectionQuery-seed#[2FC5452D3A987335]) [    ] o.a.s.c.c.SolrZkClient makePath: /configs/conf1/hyphenation.dtd
   [junit4]   2> 51703 INFO  (TEST-TestRequestForwarding.testMultiCollectionQuery-seed#[2FC5452D3A987335]) [    ] o.a.s.c.c.SolrZkClient makePath: /configs/conf1/schema-sql.xml
   [junit4]   2> 51705 INFO  (TEST-TestRequestForwarding.testMultiCollectionQuery-seed#[2FC5452D3A987335]) [    ] o.a.s.c.c.SolrZkClient makePath: /configs/conf1/schema-copyfield-test.xml
   [junit4]   2> 51707 INFO  (TEST-TestRequestForwarding.testMultiCollectionQuery-seed#[2FC5452D3A987335]) [    ] o.a.s.c.c.SolrZkClient makePath: /configs/conf1/bad-schema-analyzer-class-and-nested.xml
   [junit4]   2> 51708 INFO  (TEST-TestRequestForwarding.testMultiCollectionQuery-seed#[2FC5452D3A987335]) [    ] o.a.s.c.c.SolrZkClient makePath: /configs/conf1/bad-mpf-solrconfig.xml
   [junit4]   2> 51730 INFO  (TEST-TestRequestForwarding.testMultiCollectionQuery-seed#[2FC5452D3A987335]) [    ] o.a.s.c.c.SolrZkClient makePath: /configs/conf1/bad-schema-currency-ft-multivalued.xml
   [junit4]   2> 51733 INFO  (TEST-TestRequestForwarding.testMultiCollectionQuery-seed#[2FC5452D3A987335]) [    ] o.a.s.c.c.SolrZkClient makePath: /configs/conf1/solrconfig-querysender-noquery.xml
   [junit4]   2> 51736 INFO  (TEST-TestRequestForwarding.testMultiCollectionQuery-seed#[2FC5452D3A987335]) [    ] o.a.s.c.c.SolrZkClient makePath: /configs/conf1/solrconfig-phrasesuggest.xml
   [junit4]   2> 51739 INFO  (TEST-TestRequestForwarding.testMultiCollectionQuery-seed#[2FC5452D3A987335]) [    ] o.a.s.c.c.SolrZkClient makePath: /configs/conf1/stopwordsWrongEncoding.txt
   [junit4]   2> 51741 INFO  (TEST-TestRequestForwarding.testMultiCollectionQuery-seed#[2FC5452D3A987335]) [    ] o.a.s.c.c.SolrZkClient makePath: /configs/conf1/schema-simpleqpplugin.xml
   [junit4]   2> 51743 INFO  (TEST-TestRequestForwarding.testMultiCollectionQuery-seed#[2FC5452D3A987335]) [    ] o.a.s.c.c.SolrZkClient makePath: /configs/conf1/solrconfig-mergepolicy-defaults.xml
   [junit4]   2> 51745 INFO  (TEST-TestRequestForwarding.testMultiCollectionQuery-seed#[2FC5452D3A987335]) [    ] o.a.s.c.c.SolrZkClient makePath: /configs/conf1/bad-schema-dup-fieldType.xml
   [junit4]   2> 51747 INFO  (TEST-TestRequestForwarding.testMultiCollectionQuery-seed#[2FC5452D3A987335]) [    ] o.a.s.c.c.SolrZkClient makePath: /configs/conf1/solrconfig-warmer-randommergepolicyfactory.xml
   [junit4]   2> 51749 INFO  (TEST-TestRequestForwarding.testMultiCollectionQuery-seed#[2FC5452D3A987335]) [    ] o.a.s.c.c.SolrZkClient makePath: /configs/conf1/stop-snowball.txt
   [junit4]   2> 51751 INFO  (TEST-TestRequestForwarding.testMultiCollectionQuery-seed#[2FC5452D3A987335]) [    ] o.a.s.c.c.SolrZkClient makePath: /configs/conf1/solrconfig-mergepolicy-legacy.xml
   [junit4]   2> 51756 INFO  (TEST-TestRequestForwarding.testMultiCollectionQuery-seed#[2FC5452D3A987335]) [    ] o.a.s.c.c.SolrZkClient makePath: /configs/conf1/solrconfig-nocache.xml
   [junit4]   2> 51757 INFO  (TEST-TestRequestForwarding.testMultiCollectionQuery-seed#[2FC5452D3A987335]) [    ] o.a.s.c.c.SolrZkClient makePath: /configs/conf1/da_compoundDictionary.txt
   [junit4]   2> 51759 INFO  (TEST-TestRequestForwarding.testMultiCollectionQuery-seed#[2FC5452D3A987335]) [    ] o.a.s.c.c.SolrZkClient makePath: /configs/conf1/bad-schema-not-indexed-but-tf.xml
   [junit4]   2> 51761 INFO  (TEST-TestRequestForwarding.testMultiCollectionQuery-seed#[2FC5452D3A987335]) [    ] o.a.s.c.c.SolrZkClient makePath: /configs/conf1/solrconfig-postingshighlight.xml
   [junit4]   2> 51768 INFO  (TEST-TestRequestForwarding.testMultiCollectionQuery-seed#[2FC5452D3A987335]) [    ] o.a.s.c.c.SolrZkClient makePath: /configs/conf1/xslt/dummy-using-include.xsl
   [junit4]   2> 51775 INFO  (TEST-TestRequestForwarding.testMultiCollectionQuery-seed#[2FC5452D3A987335]) [    ] o.a.s.c.c.SolrZkClient makePath: /configs/conf1/xslt/dummy.xsl
   [junit4]   2> 51777 INFO  (TEST-TestRequestForwarding.testMultiCollectionQuery-seed#[2FC5452D3A987335]) [    ] o.a.s.c.c.SolrZkClient makePath: /configs/conf1/xslt/xsl-update-handler-test.xsl
   [junit4]   2> 51779 INFO  (TEST-TestRequestForwarding.testMultiCollectionQuery-seed#[2FC5452D3A987335]) [    ] o.a.s.c.c.SolrZkClient makePath: /configs/conf1/da_UTF8.xml
   [junit4]   2> 51780 INFO  (TEST-TestRequestForwarding.testMultiCollectionQuery-seed#[2FC5452D3A987335]) [    ] o.a.s.c.c.SolrZkClient makePath: /configs/conf1/solrconfig-logmergepolicy.xml
   [junit4]   2> 51782 INFO  (TEST-TestRequestForwarding.testMultiCollectionQuery-seed#[2FC5452D3A987335]) [    ] o.a.s.c.c.SolrZkClient makePath: /configs/conf1/schema-collate-dv.xml
   [junit4]   2> 51784 INFO  (TEST-TestRequestForwarding.testMultiCollectionQuery-seed#[2FC5452D3A987335]) [    ] o.a.s.c.c.SolrZkClient makePath: /configs/conf1/bad-solrconfig-unexpected-schema-attribute.xml
   [junit4]   2> 51785 INFO  (TEST-TestRequestForwarding.testMultiCollectionQuery-seed#[2FC5452D3A987335]) [    ] o.a.s.c.c.SolrZkClient makePath: /configs/conf1/schema-postingshighlight.xml
   [junit4]   2> 51796 INFO  (TEST-TestRequestForwarding.testMultiCollectionQuery-seed#[2FC5452D3A987335]) [    ] o.a.s.c.c.SolrZkClient makePath: /configs/conf1/schema-docValuesJoin.xml
   [junit4]   2> 51798 INFO  (TEST-TestRequestForwarding.testMultiCollectionQuery-seed#

[...truncated too long message...]

stency detected during lambda shape analysis
 [ecj-lint] ----------
 [ecj-lint] ----------
 [ecj-lint] 11. WARNING in /x1/jenkins/jenkins-slave/workspace/Lucene-Solr-Tests-6.x/solr/core/src/java/org/apache/solr/core/HdfsDirectoryFactory.java (at line 227)
 [ecj-lint] 	dir = new BlockDirectory(path, hdfsDir, cache, null, blockCacheReadEnabled, false, cacheMerges, cacheReadOnce);
 [ecj-lint] 	^^^^^^^^^^^^^^^^^^^^^^^^^^^^^^^^^^^^^^^^^^^^^^^^^^^^^^^^^^^^^^^^^^^^^^^^^^^^^^^^^^^^^^^^^^^^^^^^^^^^^^^^^^^^^^
 [ecj-lint] Resource leak: 'dir' is never closed
 [ecj-lint] ----------
 [ecj-lint] ----------
 [ecj-lint] 12. WARNING in /x1/jenkins/jenkins-slave/workspace/Lucene-Solr-Tests-6.x/solr/core/src/java/org/apache/solr/handler/AnalysisRequestHandlerBase.java (at line 120)
 [ecj-lint] 	reader = cfiltfac.create(reader);
 [ecj-lint] 	^^^^^^^^^^^^^^^^^^^^^^^^^^^^^^^^
 [ecj-lint] Resource leak: 'reader' is not closed at this location
 [ecj-lint] ----------
 [ecj-lint] 13. WARNING in /x1/jenkins/jenkins-slave/workspace/Lucene-Solr-Tests-6.x/solr/core/src/java/org/apache/solr/handler/AnalysisRequestHandlerBase.java (at line 144)
 [ecj-lint] 	return namedList;
 [ecj-lint] 	^^^^^^^^^^^^^^^^^
 [ecj-lint] Resource leak: 'listBasedTokenStream' is not closed at this location
 [ecj-lint] ----------
 [ecj-lint] ----------
 [ecj-lint] 14. WARNING in /x1/jenkins/jenkins-slave/workspace/Lucene-Solr-Tests-6.x/solr/core/src/java/org/apache/solr/handler/ReplicationHandler.java (at line 1243)
 [ecj-lint] 	DirectoryReader reader = s==null ? null : s.get().getIndexReader();
 [ecj-lint] 	                ^^^^^^
 [ecj-lint] Resource leak: 'reader' is never closed
 [ecj-lint] ----------
 [ecj-lint] ----------
 [ecj-lint] 15. WARNING in /x1/jenkins/jenkins-slave/workspace/Lucene-Solr-Tests-6.x/solr/core/src/java/org/apache/solr/handler/SQLHandler.java (at line 253)
 [ecj-lint] 	ParallelStream parallelStream = new ParallelStream(workerZkHost, workerCollection, tupleStream, numWorkers, comp);
 [ecj-lint] 	               ^^^^^^^^^^^^^^
 [ecj-lint] Resource leak: 'parallelStream' is never closed
 [ecj-lint] ----------
 [ecj-lint] 16. WARNING in /x1/jenkins/jenkins-slave/workspace/Lucene-Solr-Tests-6.x/solr/core/src/java/org/apache/solr/handler/SQLHandler.java (at line 392)
 [ecj-lint] 	ParallelStream parallelStream = new ParallelStream(workerZkHost, workerCollection, tupleStream, numWorkers, comp);
 [ecj-lint] 	               ^^^^^^^^^^^^^^
 [ecj-lint] Resource leak: 'parallelStream' is never closed
 [ecj-lint] ----------
 [ecj-lint] ----------
 [ecj-lint] 17. WARNING in /x1/jenkins/jenkins-slave/workspace/Lucene-Solr-Tests-6.x/solr/core/src/java/org/apache/solr/handler/component/ExpandComponent.java (at line 223)
 [ecj-lint] 	UninvertingReader uninvertingReader = new UninvertingReader(new ReaderWrapper(searcher.getLeafReader(), field), mapping);
 [ecj-lint] 	                  ^^^^^^^^^^^^^^^^^
 [ecj-lint] Resource leak: 'uninvertingReader' is never closed
 [ecj-lint] ----------
 [ecj-lint] ----------
 [ecj-lint] 18. WARNING in /x1/jenkins/jenkins-slave/workspace/Lucene-Solr-Tests-6.x/solr/core/src/java/org/apache/solr/highlight/DefaultSolrHighlighter.java (at line 544)
 [ecj-lint] 	tvWindowStream = new OffsetWindowTokenFilter(tvStream);
 [ecj-lint] 	^^^^^^^^^^^^^^^^^^^^^^^^^^^^^^^^^^^^^^^^^^^^^^^^^^^^^^
 [ecj-lint] Resource leak: 'tvWindowStream' is never closed
 [ecj-lint] ----------
 [ecj-lint] ----------
 [ecj-lint] 19. WARNING in /x1/jenkins/jenkins-slave/workspace/Lucene-Solr-Tests-6.x/solr/core/src/java/org/apache/solr/request/SimpleFacets.java (at line 829)
 [ecj-lint] 	fastForRandomSet = new HashDocSet(sset.getDocs(), 0, sset.size());
 [ecj-lint] 	^^^^^^^^^^^^^^^^^^^^^^^^^^^^^^^^^^^^^^^^^^^^^^^^^^^^^^^^^^^^^^^^^
 [ecj-lint] Resource leak: 'fastForRandomSet' is never closed
 [ecj-lint] ----------
 [ecj-lint] ----------
 [ecj-lint] 20. WARNING in /x1/jenkins/jenkins-slave/workspace/Lucene-Solr-Tests-6.x/solr/core/src/java/org/apache/solr/schema/OpenExchangeRatesOrgProvider.java (at line 146)
 [ecj-lint] 	ratesJsonStream = resourceLoader.openResource(ratesFileLocation);
 [ecj-lint] 	^^^^^^^^^^^^^^^^^^^^^^^^^^^^^^^^^^^^^^^^^^^^^^^^^^^^^^^^^^^^^^^^
 [ecj-lint] Resource leak: 'ratesJsonStream' is not closed at this location
 [ecj-lint] ----------
 [ecj-lint] ----------
 [ecj-lint] 21. WARNING in /x1/jenkins/jenkins-slave/workspace/Lucene-Solr-Tests-6.x/solr/core/src/java/org/apache/solr/search/CollapsingQParserPlugin.java (at line 1177)
 [ecj-lint] 	UninvertingReader uninvertingReader = new UninvertingReader(new ReaderWrapper(searcher.getLeafReader(), collapseField), mapping);
 [ecj-lint] 	                  ^^^^^^^^^^^^^^^^^
 [ecj-lint] Resource leak: 'uninvertingReader' is never closed
 [ecj-lint] ----------
 [ecj-lint] ----------
 [ecj-lint] 22. WARNING in /x1/jenkins/jenkins-slave/workspace/Lucene-Solr-Tests-6.x/solr/core/src/java/org/apache/solr/search/DocSlice.java (at line 145)
 [ecj-lint] 	HashDocSet h = new HashDocSet(docs,offset,len);
 [ecj-lint] 	           ^
 [ecj-lint] Resource leak: 'h' is never closed
 [ecj-lint] ----------
 [ecj-lint] 23. WARNING in /x1/jenkins/jenkins-slave/workspace/Lucene-Solr-Tests-6.x/solr/core/src/java/org/apache/solr/search/DocSlice.java (at line 154)
 [ecj-lint] 	HashDocSet h = new HashDocSet(docs,offset,len);
 [ecj-lint] 	           ^
 [ecj-lint] Resource leak: 'h' is never closed
 [ecj-lint] ----------
 [ecj-lint] 24. WARNING in /x1/jenkins/jenkins-slave/workspace/Lucene-Solr-Tests-6.x/solr/core/src/java/org/apache/solr/search/DocSlice.java (at line 163)
 [ecj-lint] 	HashDocSet h = new HashDocSet(docs,offset,len);
 [ecj-lint] 	           ^
 [ecj-lint] Resource leak: 'h' is never closed
 [ecj-lint] ----------
 [ecj-lint] ----------
 [ecj-lint] 25. WARNING in /x1/jenkins/jenkins-slave/workspace/Lucene-Solr-Tests-6.x/solr/core/src/java/org/apache/solr/search/function/OrdFieldSource.java (at line 78)
 [ecj-lint] 	SolrIndexSearcher is = (SolrIndexSearcher) o;
 [ecj-lint] 	                  ^^
 [ecj-lint] Resource leak: 'is' is never closed
 [ecj-lint] ----------
 [ecj-lint] ----------
 [ecj-lint] 26. WARNING in /x1/jenkins/jenkins-slave/workspace/Lucene-Solr-Tests-6.x/solr/core/src/java/org/apache/solr/search/function/ReverseOrdFieldSource.java (at line 78)
 [ecj-lint] 	SolrIndexSearcher is = (SolrIndexSearcher) o;
 [ecj-lint] 	                  ^^
 [ecj-lint] Resource leak: 'is' is never closed
 [ecj-lint] ----------
 [ecj-lint] ----------
 [ecj-lint] 27. WARNING in /x1/jenkins/jenkins-slave/workspace/Lucene-Solr-Tests-6.x/solr/core/src/java/org/apache/solr/servlet/SolrDispatchFilter.java (at line 184)
 [ecj-lint] 	throw new SolrException(ErrorCode.SERVER_ERROR, "Error occurred while loading solr.xml from zookeeper", e);
 [ecj-lint] 	^^^^^^^^^^^^^^^^^^^^^^^^^^^^^^^^^^^^^^^^^^^^^^^^^^^^^^^^^^^^^^^^^^^^^^^^^^^^^^^^^^^^^^^^^^^^^^^^^^^^^^^^^^^
 [ecj-lint] Resource leak: 'loader' is not closed at this location
 [ecj-lint] ----------
 [ecj-lint] ----------
 [ecj-lint] 28. WARNING in /x1/jenkins/jenkins-slave/workspace/Lucene-Solr-Tests-6.x/solr/core/src/java/org/apache/solr/update/CdcrTransactionLog.java (at line 98)
 [ecj-lint] 	ChannelFastInputStream is = new ChannelFastInputStream(channel, pos);
 [ecj-lint] 	                       ^^
 [ecj-lint] Resource leak: 'is' is never closed
 [ecj-lint] ----------
 [ecj-lint] ----------
 [ecj-lint] 29. WARNING in /x1/jenkins/jenkins-slave/workspace/Lucene-Solr-Tests-6.x/solr/core/src/java/org/apache/solr/update/TransactionLog.java (at line 226)
 [ecj-lint] 	ChannelFastInputStream is = new ChannelFastInputStream(channel, pos);
 [ecj-lint] 	                       ^^
 [ecj-lint] Resource leak: 'is' is never closed
 [ecj-lint] ----------
 [ecj-lint] 30. WARNING in /x1/jenkins/jenkins-slave/workspace/Lucene-Solr-Tests-6.x/solr/core/src/java/org/apache/solr/update/TransactionLog.java (at line 226)
 [ecj-lint] 	ChannelFastInputStream is = new ChannelFastInputStream(channel, pos);
 [ecj-lint] 	                       ^^
 [ecj-lint] Resource leak: 'is' is never closed
 [ecj-lint] ----------
 [ecj-lint] ----------
 [ecj-lint] 31. WARNING in /x1/jenkins/jenkins-slave/workspace/Lucene-Solr-Tests-6.x/solr/core/src/java/org/apache/solr/util/SimplePostTool.java (at line 640)
 [ecj-lint] 	BAOS bos =  new BAOS();
 [ecj-lint] 	     ^^^
 [ecj-lint] Resource leak: 'bos' is never closed
 [ecj-lint] ----------
 [ecj-lint] 32. WARNING in /x1/jenkins/jenkins-slave/workspace/Lucene-Solr-Tests-6.x/solr/core/src/java/org/apache/solr/util/SimplePostTool.java (at line 640)
 [ecj-lint] 	BAOS bos =  new BAOS();
 [ecj-lint] 	     ^^^
 [ecj-lint] Resource leak: 'bos' is never closed
 [ecj-lint] ----------
 [ecj-lint] ----------
 [ecj-lint] 33. WARNING in /x1/jenkins/jenkins-slave/workspace/Lucene-Solr-Tests-6.x/solr/core/src/java/org/apache/solr/util/SolrLogLayout.java (at line 149)
 [ecj-lint] 	SolrQueryRequest req = requestInfo == null ? null : requestInfo.getReq();
 [ecj-lint] 	                 ^^^
 [ecj-lint] Resource leak: 'req' is never closed
 [ecj-lint] ----------
 [ecj-lint] 33 problems (4 errors, 29 warnings)

BUILD FAILED
/x1/jenkins/jenkins-slave/workspace/Lucene-Solr-Tests-6.x/build.xml:763: The following error occurred while executing this line:
/x1/jenkins/jenkins-slave/workspace/Lucene-Solr-Tests-6.x/build.xml:101: The following error occurred while executing this line:
/x1/jenkins/jenkins-slave/workspace/Lucene-Solr-Tests-6.x/solr/build.xml:652: The following error occurred while executing this line:
/x1/jenkins/jenkins-slave/workspace/Lucene-Solr-Tests-6.x/lucene/common-build.xml:1992: The following error occurred while executing this line:
/x1/jenkins/jenkins-slave/workspace/Lucene-Solr-Tests-6.x/lucene/common-build.xml:2031: Compile failed; see the compiler error output for details.

Total time: 83 minutes 15 seconds
Build step 'Invoke Ant' marked build as failure
Archiving artifacts
Recording test results
Email was triggered for: Failure - Any
Sending email for trigger: Failure - Any




Mime
View raw message