lucene-dev mailing list archives

Site index · List index
Message view « Date » · « Thread »
Top « Date » · « Thread »
From Apache Jenkins Server <jenk...@builds.apache.org>
Subject [JENKINS] Lucene-Solr-Tests-6.x - Build # 443 - Unstable
Date Wed, 07 Sep 2016 03:58:15 GMT
Build: https://builds.apache.org/job/Lucene-Solr-Tests-6.x/443/

1 tests failed.
FAILED:  org.apache.solr.core.TestArbitraryIndexDir.testLoadNewIndexDir

Error Message:
Exception during query

Stack Trace:
java.lang.RuntimeException: Exception during query
	at __randomizedtesting.SeedInfo.seed([761573F5FF0B5D42:9F4FC8CD6192CDEA]:0)
	at org.apache.solr.SolrTestCaseJ4.assertQ(SolrTestCaseJ4.java:783)
	at org.apache.solr.core.TestArbitraryIndexDir.testLoadNewIndexDir(TestArbitraryIndexDir.java:107)
	at sun.reflect.NativeMethodAccessorImpl.invoke0(Native Method)
	at sun.reflect.NativeMethodAccessorImpl.invoke(NativeMethodAccessorImpl.java:62)
	at sun.reflect.DelegatingMethodAccessorImpl.invoke(DelegatingMethodAccessorImpl.java:43)
	at java.lang.reflect.Method.invoke(Method.java:498)
	at com.carrotsearch.randomizedtesting.RandomizedRunner.invoke(RandomizedRunner.java:1764)
	at com.carrotsearch.randomizedtesting.RandomizedRunner$8.evaluate(RandomizedRunner.java:871)
	at com.carrotsearch.randomizedtesting.RandomizedRunner$9.evaluate(RandomizedRunner.java:907)
	at com.carrotsearch.randomizedtesting.RandomizedRunner$10.evaluate(RandomizedRunner.java:921)
	at com.carrotsearch.randomizedtesting.rules.SystemPropertiesRestoreRule$1.evaluate(SystemPropertiesRestoreRule.java:57)
	at com.carrotsearch.randomizedtesting.rules.SystemPropertiesRestoreRule$1.evaluate(SystemPropertiesRestoreRule.java:57)
	at org.apache.lucene.util.TestRuleSetupTeardownChained$1.evaluate(TestRuleSetupTeardownChained.java:49)
	at org.apache.lucene.util.AbstractBeforeAfterRule$1.evaluate(AbstractBeforeAfterRule.java:45)
	at org.apache.lucene.util.TestRuleThreadAndTestName$1.evaluate(TestRuleThreadAndTestName.java:48)
	at org.apache.lucene.util.TestRuleIgnoreAfterMaxFailures$1.evaluate(TestRuleIgnoreAfterMaxFailures.java:64)
	at org.apache.lucene.util.TestRuleMarkFailure$1.evaluate(TestRuleMarkFailure.java:47)
	at com.carrotsearch.randomizedtesting.rules.StatementAdapter.evaluate(StatementAdapter.java:36)
	at com.carrotsearch.randomizedtesting.ThreadLeakControl$StatementRunner.run(ThreadLeakControl.java:367)
	at com.carrotsearch.randomizedtesting.ThreadLeakControl.forkTimeoutingTask(ThreadLeakControl.java:809)
	at com.carrotsearch.randomizedtesting.ThreadLeakControl$3.evaluate(ThreadLeakControl.java:460)
	at com.carrotsearch.randomizedtesting.RandomizedRunner.runSingleTest(RandomizedRunner.java:880)
	at com.carrotsearch.randomizedtesting.RandomizedRunner$5.evaluate(RandomizedRunner.java:781)
	at com.carrotsearch.randomizedtesting.RandomizedRunner$6.evaluate(RandomizedRunner.java:816)
	at com.carrotsearch.randomizedtesting.RandomizedRunner$7.evaluate(RandomizedRunner.java:827)
	at com.carrotsearch.randomizedtesting.rules.StatementAdapter.evaluate(StatementAdapter.java:36)
	at com.carrotsearch.randomizedtesting.rules.SystemPropertiesRestoreRule$1.evaluate(SystemPropertiesRestoreRule.java:57)
	at org.apache.lucene.util.AbstractBeforeAfterRule$1.evaluate(AbstractBeforeAfterRule.java:45)
	at com.carrotsearch.randomizedtesting.rules.StatementAdapter.evaluate(StatementAdapter.java:36)
	at org.apache.lucene.util.TestRuleStoreClassName$1.evaluate(TestRuleStoreClassName.java:41)
	at com.carrotsearch.randomizedtesting.rules.NoShadowingOrOverridesOnMethodsRule$1.evaluate(NoShadowingOrOverridesOnMethodsRule.java:40)
	at com.carrotsearch.randomizedtesting.rules.NoShadowingOrOverridesOnMethodsRule$1.evaluate(NoShadowingOrOverridesOnMethodsRule.java:40)
	at com.carrotsearch.randomizedtesting.rules.StatementAdapter.evaluate(StatementAdapter.java:36)
	at com.carrotsearch.randomizedtesting.rules.StatementAdapter.evaluate(StatementAdapter.java:36)
	at com.carrotsearch.randomizedtesting.rules.StatementAdapter.evaluate(StatementAdapter.java:36)
	at org.apache.lucene.util.TestRuleAssertionsRequired$1.evaluate(TestRuleAssertionsRequired.java:53)
	at org.apache.lucene.util.TestRuleMarkFailure$1.evaluate(TestRuleMarkFailure.java:47)
	at org.apache.lucene.util.TestRuleIgnoreAfterMaxFailures$1.evaluate(TestRuleIgnoreAfterMaxFailures.java:64)
	at org.apache.lucene.util.TestRuleIgnoreTestSuites$1.evaluate(TestRuleIgnoreTestSuites.java:54)
	at com.carrotsearch.randomizedtesting.rules.StatementAdapter.evaluate(StatementAdapter.java:36)
	at com.carrotsearch.randomizedtesting.ThreadLeakControl$StatementRunner.run(ThreadLeakControl.java:367)
	at java.lang.Thread.run(Thread.java:745)
Caused by: java.lang.RuntimeException: REQUEST FAILED: xpath=*[count(//doc)=1]
	xml response was: <?xml version="1.0" encoding="UTF-8"?>
<response>
<lst name="responseHeader"><int name="status">0</int><int name="QTime">0</int></lst><result name="response" numFound="0" start="0"></result>
</response>

	request was:q=id:2&qt=standard&start=0&rows=20&version=2.2
	at org.apache.solr.SolrTestCaseJ4.assertQ(SolrTestCaseJ4.java:776)
	... 41 more




Build Log:
[...truncated 11654 lines...]
   [junit4] Suite: org.apache.solr.core.TestArbitraryIndexDir
   [junit4]   2> Creating dataDir: /x1/jenkins/jenkins-slave/workspace/Lucene-Solr-Tests-6.x/solr/build/solr-core/test/J2/temp/solr.core.TestArbitraryIndexDir_761573F5FF0B5D42-001/init-core-data-001
   [junit4]   2> 2001994 INFO  (SUITE-TestArbitraryIndexDir-seed#[761573F5FF0B5D42]-worker) [    ] o.a.s.SolrTestCaseJ4 Randomized ssl (true) and clientAuth (true) via: @org.apache.solr.util.RandomizeSSL(reason=, ssl=NaN, value=NaN, clientAuth=NaN)
   [junit4]   2> 2001996 INFO  (TEST-TestArbitraryIndexDir.testLoadNewIndexDir-seed#[761573F5FF0B5D42]) [    ] o.a.s.SolrTestCaseJ4 ###Starting testLoadNewIndexDir
   [junit4]   2> 2001997 INFO  (TEST-TestArbitraryIndexDir.testLoadNewIndexDir-seed#[761573F5FF0B5D42]) [    ] o.a.s.SolrTestCaseJ4 ####initCore
   [junit4]   2> 2001997 INFO  (TEST-TestArbitraryIndexDir.testLoadNewIndexDir-seed#[761573F5FF0B5D42]) [    ] o.a.s.c.SolrResourceLoader new SolrResourceLoader for directory: '/x1/jenkins/jenkins-slave/workspace/Lucene-Solr-Tests-6.x/solr/core/src/test-files/solr/collection1'
   [junit4]   2> 2001997 INFO  (TEST-TestArbitraryIndexDir.testLoadNewIndexDir-seed#[761573F5FF0B5D42]) [    ] o.a.s.c.SolrResourceLoader JNDI not configured for solr (NoInitialContextEx)
   [junit4]   2> 2001997 INFO  (TEST-TestArbitraryIndexDir.testLoadNewIndexDir-seed#[761573F5FF0B5D42]) [    ] o.a.s.c.SolrResourceLoader using system property solr.solr.home: /x1/jenkins/jenkins-slave/workspace/Lucene-Solr-Tests-6.x/solr/core/src/test-files/solr
   [junit4]   2> 2001997 INFO  (TEST-TestArbitraryIndexDir.testLoadNewIndexDir-seed#[761573F5FF0B5D42]) [    ] o.a.s.c.SolrResourceLoader Adding 'file:/x1/jenkins/jenkins-slave/workspace/Lucene-Solr-Tests-6.x/solr/core/src/test-files/solr/collection1/lib/classes/' to classloader
   [junit4]   2> 2001997 INFO  (TEST-TestArbitraryIndexDir.testLoadNewIndexDir-seed#[761573F5FF0B5D42]) [    ] o.a.s.c.SolrResourceLoader Adding 'file:/x1/jenkins/jenkins-slave/workspace/Lucene-Solr-Tests-6.x/solr/core/src/test-files/solr/collection1/lib/README' to classloader
   [junit4]   2> 2002029 INFO  (TEST-TestArbitraryIndexDir.testLoadNewIndexDir-seed#[761573F5FF0B5D42]) [    ] o.a.s.c.SolrConfig current version of requestparams : -1
   [junit4]   2> 2002038 INFO  (TEST-TestArbitraryIndexDir.testLoadNewIndexDir-seed#[761573F5FF0B5D42]) [    ] o.a.s.c.SolrConfig Using Lucene MatchVersion: 6.3.0
   [junit4]   2> 2002067 INFO  (TEST-TestArbitraryIndexDir.testLoadNewIndexDir-seed#[761573F5FF0B5D42]) [    ] o.a.s.c.SolrConfig Loaded SolrConfig: solrconfig.xml
   [junit4]   2> 2002071 INFO  (TEST-TestArbitraryIndexDir.testLoadNewIndexDir-seed#[761573F5FF0B5D42]) [    ] o.a.s.s.IndexSchema [null] Schema name=test
   [junit4]   2> 2002195 INFO  (TEST-TestArbitraryIndexDir.testLoadNewIndexDir-seed#[761573F5FF0B5D42]) [    ] o.a.s.s.IndexSchema default search field in schema is text
   [junit4]   2> 2002200 INFO  (TEST-TestArbitraryIndexDir.testLoadNewIndexDir-seed#[761573F5FF0B5D42]) [    ] o.a.s.s.IndexSchema unique key field: id
   [junit4]   2> 2002201 WARN  (TEST-TestArbitraryIndexDir.testLoadNewIndexDir-seed#[761573F5FF0B5D42]) [    ] o.a.s.s.IndexSchema Field text is not multivalued and destination for multiple copyFields (2)
   [junit4]   2> 2002210 INFO  (TEST-TestArbitraryIndexDir.testLoadNewIndexDir-seed#[761573F5FF0B5D42]) [    ] o.a.s.s.FileExchangeRateProvider Reloading exchange rates from file currency.xml
   [junit4]   2> 2002211 INFO  (TEST-TestArbitraryIndexDir.testLoadNewIndexDir-seed#[761573F5FF0B5D42]) [    ] o.a.s.s.FileExchangeRateProvider Reloading exchange rates from file currency.xml
   [junit4]   2> 2002213 INFO  (TEST-TestArbitraryIndexDir.testLoadNewIndexDir-seed#[761573F5FF0B5D42]) [    ] o.a.s.c.SolrResourceLoader JNDI not configured for solr (NoInitialContextEx)
   [junit4]   2> 2002213 INFO  (TEST-TestArbitraryIndexDir.testLoadNewIndexDir-seed#[761573F5FF0B5D42]) [    ] o.a.s.c.SolrResourceLoader using system property solr.solr.home: /x1/jenkins/jenkins-slave/workspace/Lucene-Solr-Tests-6.x/solr/core/src/test-files/solr
   [junit4]   2> 2002213 INFO  (TEST-TestArbitraryIndexDir.testLoadNewIndexDir-seed#[761573F5FF0B5D42]) [    ] o.a.s.c.SolrResourceLoader new SolrResourceLoader for directory: '/x1/jenkins/jenkins-slave/workspace/Lucene-Solr-Tests-6.x/solr/core/src/test-files/solr'
   [junit4]   2> 2002213 INFO  (TEST-TestArbitraryIndexDir.testLoadNewIndexDir-seed#[761573F5FF0B5D42]) [    ] o.a.s.c.SolrResourceLoader JNDI not configured for solr (NoInitialContextEx)
   [junit4]   2> 2002213 INFO  (TEST-TestArbitraryIndexDir.testLoadNewIndexDir-seed#[761573F5FF0B5D42]) [    ] o.a.s.c.SolrResourceLoader using system property solr.solr.home: /x1/jenkins/jenkins-slave/workspace/Lucene-Solr-Tests-6.x/solr/core/src/test-files/solr
   [junit4]   2> 2002213 INFO  (TEST-TestArbitraryIndexDir.testLoadNewIndexDir-seed#[761573F5FF0B5D42]) [    ] o.a.s.c.CoreContainer New CoreContainer 6982006
   [junit4]   2> 2002213 INFO  (TEST-TestArbitraryIndexDir.testLoadNewIndexDir-seed#[761573F5FF0B5D42]) [    ] o.a.s.c.CoreContainer Loading cores into CoreContainer [instanceDir=/x1/jenkins/jenkins-slave/workspace/Lucene-Solr-Tests-6.x/solr/core/src/test-files/solr]
   [junit4]   2> 2002214 WARN  (TEST-TestArbitraryIndexDir.testLoadNewIndexDir-seed#[761573F5FF0B5D42]) [    ] o.a.s.c.CoreContainer Couldn't add files from /x1/jenkins/jenkins-slave/workspace/Lucene-Solr-Tests-6.x/solr/core/src/test-files/solr/lib to classpath: /x1/jenkins/jenkins-slave/workspace/Lucene-Solr-Tests-6.x/solr/core/src/test-files/solr/lib
   [junit4]   2> 2002214 INFO  (TEST-TestArbitraryIndexDir.testLoadNewIndexDir-seed#[761573F5FF0B5D42]) [    ] o.a.s.h.c.HttpShardHandlerFactory created with socketTimeout : 600000,connTimeout : 60000,maxConnectionsPerHost : 20,maxConnections : 10000,corePoolSize : 0,maximumPoolSize : 2147483647,maxThreadIdleTime : 5,sizeOfQueue : -1,fairnessPolicy : false,useRetries : false,connectionsEvictorSleepDelay : 5000,maxConnectionIdleTime : 40000,
   [junit4]   2> 2002228 INFO  (TEST-TestArbitraryIndexDir.testLoadNewIndexDir-seed#[761573F5FF0B5D42]) [    ] o.a.s.u.UpdateShardHandler Creating UpdateShardHandler HTTP client with params: socketTimeout=30000&connTimeout=30000&retry=true
   [junit4]   2> 2002229 INFO  (TEST-TestArbitraryIndexDir.testLoadNewIndexDir-seed#[761573F5FF0B5D42]) [    ] o.a.s.l.LogWatcher SLF4J impl is org.slf4j.impl.Log4jLoggerFactory
   [junit4]   2> 2002229 INFO  (TEST-TestArbitraryIndexDir.testLoadNewIndexDir-seed#[761573F5FF0B5D42]) [    ] o.a.s.l.LogWatcher Registering Log Listener [Log4j (org.slf4j.impl.Log4jLoggerFactory)]
   [junit4]   2> 2002229 INFO  (TEST-TestArbitraryIndexDir.testLoadNewIndexDir-seed#[761573F5FF0B5D42]) [    ] o.a.s.c.CoreContainer Security conf doesn't exist. Skipping setup for authorization module.
   [junit4]   2> 2002229 INFO  (TEST-TestArbitraryIndexDir.testLoadNewIndexDir-seed#[761573F5FF0B5D42]) [    ] o.a.s.c.CoreContainer No authentication plugin used.
   [junit4]   2> 2002230 INFO  (TEST-TestArbitraryIndexDir.testLoadNewIndexDir-seed#[761573F5FF0B5D42]) [    ] o.a.s.c.CoreDescriptor Created CoreDescriptor: {name=collection1, config=solrconfig.xml, transient=false, schema=schema12.xml, loadOnStartup=true, configSetProperties=configsetprops.json, collection=collection1, dataDir=/x1/jenkins/jenkins-slave/workspace/Lucene-Solr-Tests-6.x/solr/build/solr-core/test/J2/temp/solr.core.TestArbitraryIndexDir_761573F5FF0B5D42-001/init-core-data-001, shard=shard1}
   [junit4]   2> 2002234 INFO  (coreLoadExecutor-4124-thread-1) [    ] o.a.s.c.SolrResourceLoader new SolrResourceLoader for directory: '/x1/jenkins/jenkins-slave/workspace/Lucene-Solr-Tests-6.x/solr/core/src/test-files/solr/collection1'
   [junit4]   2> 2002246 INFO  (coreLoadExecutor-4124-thread-1) [    ] o.a.s.c.SolrResourceLoader JNDI not configured for solr (NoInitialContextEx)
   [junit4]   2> 2002247 INFO  (coreLoadExecutor-4124-thread-1) [    ] o.a.s.c.SolrResourceLoader using system property solr.solr.home: /x1/jenkins/jenkins-slave/workspace/Lucene-Solr-Tests-6.x/solr/core/src/test-files/solr
   [junit4]   2> 2002247 INFO  (coreLoadExecutor-4124-thread-1) [    ] o.a.s.c.SolrResourceLoader Adding 'file:/x1/jenkins/jenkins-slave/workspace/Lucene-Solr-Tests-6.x/solr/core/src/test-files/solr/collection1/lib/classes/' to classloader
   [junit4]   2> 2002247 INFO  (coreLoadExecutor-4124-thread-1) [    ] o.a.s.c.SolrResourceLoader Adding 'file:/x1/jenkins/jenkins-slave/workspace/Lucene-Solr-Tests-6.x/solr/core/src/test-files/solr/collection1/lib/README' to classloader
   [junit4]   2> 2002293 INFO  (coreLoadExecutor-4124-thread-1) [    ] o.a.s.c.SolrConfig current version of requestparams : -1
   [junit4]   2> 2002301 INFO  (coreLoadExecutor-4124-thread-1) [    ] o.a.s.c.SolrConfig Using Lucene MatchVersion: 6.3.0
   [junit4]   2> 2002356 INFO  (coreLoadExecutor-4124-thread-1) [    ] o.a.s.c.SolrConfig Loaded SolrConfig: solrconfig.xml
   [junit4]   2> 2002360 INFO  (coreLoadExecutor-4124-thread-1) [    ] o.a.s.s.IndexSchema [collection1] Schema name=test
   [junit4]   2> 2002566 INFO  (coreLoadExecutor-4124-thread-1) [    ] o.a.s.s.IndexSchema default search field in schema is text
   [junit4]   2> 2002567 INFO  (coreLoadExecutor-4124-thread-1) [    ] o.a.s.s.IndexSchema unique key field: id
   [junit4]   2> 2002567 WARN  (coreLoadExecutor-4124-thread-1) [    ] o.a.s.s.IndexSchema Field text is not multivalued and destination for multiple copyFields (2)
   [junit4]   2> 2002571 INFO  (coreLoadExecutor-4124-thread-1) [    ] o.a.s.s.FileExchangeRateProvider Reloading exchange rates from file currency.xml
   [junit4]   2> 2002577 INFO  (coreLoadExecutor-4124-thread-1) [    ] o.a.s.s.FileExchangeRateProvider Reloading exchange rates from file currency.xml
   [junit4]   2> 2002580 INFO  (coreLoadExecutor-4124-thread-1) [    ] o.a.s.c.ConfigSetProperties Did not find ConfigSet properties, assuming default properties: Can't find resource 'configsetprops.json' in classpath or '/x1/jenkins/jenkins-slave/workspace/Lucene-Solr-Tests-6.x/solr/core/src/test-files/solr/collection1'
   [junit4]   2> 2002580 INFO  (coreLoadExecutor-4124-thread-1) [    ] o.a.s.c.CoreContainer Creating SolrCore 'collection1' using configuration from instancedir /x1/jenkins/jenkins-slave/workspace/Lucene-Solr-Tests-6.x/solr/core/src/test-files/solr/collection1
   [junit4]   2> 2002580 INFO  (coreLoadExecutor-4124-thread-1) [    x:collection1] o.a.s.c.SolrCore org.apache.solr.core.MockFSDirectoryFactory
   [junit4]   2> 2002580 INFO  (coreLoadExecutor-4124-thread-1) [    x:collection1] o.a.s.c.SolrCore [[collection1] ] Opening new SolrCore at [/x1/jenkins/jenkins-slave/workspace/Lucene-Solr-Tests-6.x/solr/core/src/test-files/solr/collection1], dataDir=[/x1/jenkins/jenkins-slave/workspace/Lucene-Solr-Tests-6.x/solr/build/solr-core/test/J2/temp/solr.core.TestArbitraryIndexDir_761573F5FF0B5D42-001/init-core-data-001/]
   [junit4]   2> 2002580 INFO  (coreLoadExecutor-4124-thread-1) [    x:collection1] o.a.s.c.JmxMonitoredMap JMX monitoring is enabled. Adding Solr mbeans to JMX Server: com.sun.jmx.mbeanserver.JmxMBeanServer@3611f68
   [junit4]   2> 2002581 INFO  (coreLoadExecutor-4124-thread-1) [    x:collection1] o.a.s.c.CachingDirectoryFactory return new directory for /x1/jenkins/jenkins-slave/workspace/Lucene-Solr-Tests-6.x/solr/build/solr-core/test/J2/temp/solr.core.TestArbitraryIndexDir_761573F5FF0B5D42-001/init-core-data-001/snapshot_metadata
   [junit4]   2> 2002581 INFO  (coreLoadExecutor-4124-thread-1) [    x:collection1] o.a.s.c.s.SolrSnapshotMetaDataManager Loading from snapshot metadata file...
   [junit4]   2> 2002581 INFO  (coreLoadExecutor-4124-thread-1) [    x:collection1] o.a.s.c.CachingDirectoryFactory return new directory for /x1/jenkins/jenkins-slave/workspace/Lucene-Solr-Tests-6.x/solr/build/solr-core/test/J2/temp/solr.core.TestArbitraryIndexDir_761573F5FF0B5D42-001/init-core-data-001
   [junit4]   2> 2002584 INFO  (coreLoadExecutor-4124-thread-1) [    x:collection1] o.a.s.c.SolrCore New index directory detected: old=null new=/x1/jenkins/jenkins-slave/workspace/Lucene-Solr-Tests-6.x/solr/build/solr-core/test/J2/temp/solr.core.TestArbitraryIndexDir_761573F5FF0B5D42-001/init-core-data-001/index/
   [junit4]   2> 2002584 WARN  (coreLoadExecutor-4124-thread-1) [    x:collection1] o.a.s.c.SolrCore [collection1] Solr index directory '/x1/jenkins/jenkins-slave/workspace/Lucene-Solr-Tests-6.x/solr/build/solr-core/test/J2/temp/solr.core.TestArbitraryIndexDir_761573F5FF0B5D42-001/init-core-data-001/index' doesn't exist. Creating new index...
   [junit4]   2> 2002585 INFO  (coreLoadExecutor-4124-thread-1) [    x:collection1] o.a.s.c.CachingDirectoryFactory return new directory for /x1/jenkins/jenkins-slave/workspace/Lucene-Solr-Tests-6.x/solr/build/solr-core/test/J2/temp/solr.core.TestArbitraryIndexDir_761573F5FF0B5D42-001/init-core-data-001/index
   [junit4]   2> 2002591 INFO  (coreLoadExecutor-4124-thread-1) [    x:collection1] o.a.s.u.RandomMergePolicy RandomMergePolicy wrapping class org.apache.lucene.index.TieredMergePolicy: [TieredMergePolicy: maxMergeAtOnce=27, maxMergeAtOnceExplicit=47, maxMergedSegmentMB=47.2705078125, floorSegmentMB=2.0263671875, forceMergeDeletesPctAllowed=17.209827536058203, segmentsPerTier=25.0, maxCFSSegmentSizeMB=8.796093022207999E12, noCFSRatio=0.5595236838487887
   [junit4]   2> 2002640 INFO  (coreLoadExecutor-4124-thread-1) [    x:collection1] o.a.s.c.SolrDeletionPolicy SolrDeletionPolicy.onCommit: commits: num=1
   [junit4]   2> 	commit{dir=MockDirectoryWrapper(SimpleFSDirectory@/x1/jenkins/jenkins-slave/workspace/Lucene-Solr-Tests-6.x/solr/build/solr-core/test/J2/temp/solr.core.TestArbitraryIndexDir_761573F5FF0B5D42-001/init-core-data-001/index lockFactory=org.apache.lucene.store.SingleInstanceLockFactory@53b8fa05),segFN=segments_1,generation=1}
   [junit4]   2> 2002640 INFO  (coreLoadExecutor-4124-thread-1) [    x:collection1] o.a.s.c.SolrDeletionPolicy newest commit generation = 1
   [junit4]   2> 2002652 INFO  (coreLoadExecutor-4124-thread-1) [    x:collection1] o.a.s.u.p.UpdateRequestProcessorChain creating updateRequestProcessorChain "dedupe"
   [junit4]   2> 2002652 INFO  (coreLoadExecutor-4124-thread-1) [    x:collection1] o.a.s.u.p.UpdateRequestProcessorChain inserting DistributedUpdateProcessorFactory into updateRequestProcessorChain "dedupe"
   [junit4]   2> 2002652 INFO  (coreLoadExecutor-4124-thread-1) [    x:collection1] o.a.s.u.p.UpdateRequestProcessorChain creating updateRequestProcessorChain "dedupe-allfields"
   [junit4]   2> 2002652 INFO  (coreLoadExecutor-4124-thread-1) [    x:collection1] o.a.s.u.p.UpdateRequestProcessorChain inserting DistributedUpdateProcessorFactory into updateRequestProcessorChain "dedupe-allfields"
   [junit4]   2> 2002652 INFO  (coreLoadExecutor-4124-thread-1) [    x:collection1] o.a.s.u.p.UpdateRequestProcessorChain creating updateRequestProcessorChain "stored_sig"
   [junit4]   2> 2002652 INFO  (coreLoadExecutor-4124-thread-1) [    x:collection1] o.a.s.u.p.UpdateRequestProcessorChain inserting DistributedUpdateProcessorFactory into updateRequestProcessorChain "stored_sig"
   [junit4]   2> 2002652 INFO  (coreLoadExecutor-4124-thread-1) [    x:collection1] o.a.s.u.p.UpdateRequestProcessorChain creating updateRequestProcessorChain "uniq-fields"
   [junit4]   2> 2002652 INFO  (coreLoadExecutor-4124-thread-1) [    x:collection1] o.a.s.u.p.UpdateRequestProcessorChain inserting DistributedUpdateProcessorFactory into updateRequestProcessorChain "uniq-fields"
   [junit4]   2> 2002652 INFO  (coreLoadExecutor-4124-thread-1) [    x:collection1] o.a.s.u.p.UpdateRequestProcessorChain creating updateRequestProcessorChain "distrib-dup-test-chain-explicit"
   [junit4]   2> 2002653 INFO  (coreLoadExecutor-4124-thread-1) [    x:collection1] o.a.s.u.p.UpdateRequestProcessorChain creating updateRequestProcessorChain "distrib-dup-test-chain-implicit"
   [junit4]   2> 2002653 INFO  (coreLoadExecutor-4124-thread-1) [    x:collection1] o.a.s.u.p.UpdateRequestProcessorChain inserting DistributedUpdateProcessorFactory into updateRequestProcessorChain "distrib-dup-test-chain-implicit"
   [junit4]   2> 2002653 INFO  (coreLoadExecutor-4124-thread-1) [    x:collection1] o.a.s.c.SolrCore no updateRequestProcessorChain defined as default, creating implicit default
   [junit4]   2> 2002654 INFO  (coreLoadExecutor-4124-thread-1) [    x:collection1] o.a.s.h.l.XMLLoader xsltCacheLifetimeSeconds=60
   [junit4]   2> 2002655 INFO  (coreLoadExecutor-4124-thread-1) [    x:collection1] o.a.s.h.l.XMLLoader xsltCacheLifetimeSeconds=60
   [junit4]   2> 2002656 INFO  (OldIndexDirectoryCleanupThreadForCore-collection1) [    x:collection1] o.a.s.c.SolrCore Looking for old index directories to cleanup for core collection1 in /x1/jenkins/jenkins-slave/workspace/Lucene-Solr-Tests-6.x/solr/build/solr-core/test/J2/temp/solr.core.TestArbitraryIndexDir_761573F5FF0B5D42-001/init-core-data-001/
   [junit4]   2> 2002660 INFO  (coreLoadExecutor-4124-thread-1) [    x:collection1] o.a.s.h.l.XMLLoader xsltCacheLifetimeSeconds=60
   [junit4]   2> 2002661 INFO  (coreLoadExecutor-4124-thread-1) [    x:collection1] o.a.s.h.l.XMLLoader xsltCacheLifetimeSeconds=60
   [junit4]   2> 2002665 INFO  (coreLoadExecutor-4124-thread-1) [    x:collection1] o.a.s.c.PluginBag requestHandler : 'lazy' created with startup=lazy 
   [junit4]   2> 2002675 INFO  (coreLoadExecutor-4124-thread-1) [    x:collection1] o.a.s.c.RequestHandlers Registered paths: /admin/mbeans,standard,spellCheckCompRH,lazy,/update/json/docs,/admin/luke,/export,spellCheckWithWordbreak_Direct,tvrh,/get,/admin/properties,/update/json,mltrh,/admin/threads,/search-facet-def,/update/csv,/sql,/graph,/search-facet-invariants,/admin/segments,spellCheckCompRH1,/mlt,/admin/system,/replication,dismax,defaults,/config,/stream,/schema,/admin/plugins,/admin/logging,spellCheckWithWordbreak,mock,/admin/ping,/update,/admin/file,/terms,spellCheckCompRH_Direct,/debug/dump
   [junit4]   2> 2002675 INFO  (coreLoadExecutor-4124-thread-1) [    x:collection1] o.a.s.c.SolrCore Using default statsCache cache: org.apache.solr.search.stats.LocalStatsCache
   [junit4]   2> 2002676 INFO  (coreLoadExecutor-4124-thread-1) [    x:collection1] o.a.s.u.CommitTracker Hard AutoCommit: disabled
   [junit4]   2> 2002676 INFO  (coreLoadExecutor-4124-thread-1) [    x:collection1] o.a.s.u.CommitTracker Soft AutoCommit: disabled
   [junit4]   2> 2002676 INFO  (coreLoadExecutor-4124-thread-1) [    x:collection1] o.a.s.u.RandomMergePolicy RandomMergePolicy wrapping class org.apache.lucene.index.LogByteSizeMergePolicy: [LogByteSizeMergePolicy: minMergeSize=1677721, mergeFactor=37, maxMergeSize=2147483648, maxMergeSizeForForcedMerge=9223372036854775807, calibrateSizeByDeletes=true, maxMergeDocs=2147483647, maxCFSSegmentSizeMB=8.796093022207999E12, noCFSRatio=0.8063089755422408]
   [junit4]   2> 2002677 INFO  (coreLoadExecutor-4124-thread-1) [    x:collection1] o.a.s.c.SolrDeletionPolicy SolrDeletionPolicy.onInit: commits: num=1
   [junit4]   2> 	commit{dir=MockDirectoryWrapper(SimpleFSDirectory@/x1/jenkins/jenkins-slave/workspace/Lucene-Solr-Tests-6.x/solr/build/solr-core/test/J2/temp/solr.core.TestArbitraryIndexDir_761573F5FF0B5D42-001/init-core-data-001/index lockFactory=org.apache.lucene.store.SingleInstanceLockFactory@53b8fa05),segFN=segments_1,generation=1}
   [junit4]   2> 2002677 INFO  (coreLoadExecutor-4124-thread-1) [    x:collection1] o.a.s.c.SolrDeletionPolicy newest commit generation = 1
   [junit4]   2> 2002677 INFO  (coreLoadExecutor-4124-thread-1) [    x:collection1] o.a.s.s.SolrIndexSearcher Opening [Searcher@1ff91c50[collection1] main]
   [junit4]   2> 2002677 INFO  (coreLoadExecutor-4124-thread-1) [    x:collection1] o.a.s.r.RestManager Initializing RestManager with initArgs: {storageIO=org.apache.solr.rest.ManagedResourceStorage$InMemoryStorageIO}
   [junit4]   2> 2002677 INFO  (coreLoadExecutor-4124-thread-1) [    x:collection1] o.a.s.r.ManagedResourceStorage Reading _rest_managed.json using InMemoryStorage
   [junit4]   2> 2002677 INFO  (coreLoadExecutor-4124-thread-1) [    x:collection1] o.a.s.r.RestManager Initializing 0 registered ManagedResources
   [junit4]   2> 2002677 INFO  (coreLoadExecutor-4124-thread-1) [    x:collection1] o.a.s.h.c.SpellCheckComponent Initializing spell checkers
   [junit4]   2> 2002692 INFO  (coreLoadExecutor-4124-thread-1) [    x:collection1] o.a.s.s.DirectSolrSpellChecker init: {name=direct,classname=DirectSolrSpellChecker,field=lowerfilt,minQueryLength=3}
   [junit4]   2> 2003005 INFO  (coreLoadExecutor-4124-thread-1) [    x:collection1] o.a.s.h.ReplicationHandler Commits will be reserved for  10000
   [junit4]   2> 2003005 INFO  (searcherExecutor-4125-thread-1-processing-x:collection1) [    x:collection1] o.a.s.h.c.SpellCheckComponent Loading spell index for spellchecker: default
   [junit4]   2> 2003006 INFO  (searcherExecutor-4125-thread-1-processing-x:collection1) [    x:collection1] o.a.s.h.c.SpellCheckComponent Loading spell index for spellchecker: direct
   [junit4]   2> 2003006 INFO  (searcherExecutor-4125-thread-1-processing-x:collection1) [    x:collection1] o.a.s.h.c.SpellCheckComponent Loading spell index for spellchecker: wordbreak
   [junit4]   2> 2003006 INFO  (searcherExecutor-4125-thread-1-processing-x:collection1) [    x:collection1] o.a.s.h.c.SpellCheckComponent Loading spell index for spellchecker: multipleFields
   [junit4]   2> 2003006 INFO  (searcherExecutor-4125-thread-1-processing-x:collection1) [    x:collection1] o.a.s.h.c.SpellCheckComponent Loading spell index for spellchecker: jarowinkler
   [junit4]   2> 2003006 INFO  (searcherExecutor-4125-thread-1-processing-x:collection1) [    x:collection1] o.a.s.h.c.SpellCheckComponent Loading spell index for spellchecker: external
   [junit4]   2> 2003006 INFO  (searcherExecutor-4125-thread-1-processing-x:collection1) [    x:collection1] o.a.s.h.c.SpellCheckComponent Loading spell index for spellchecker: freq
   [junit4]   2> 2003007 INFO  (searcherExecutor-4125-thread-1-processing-x:collection1) [    x:collection1] o.a.s.h.c.SpellCheckComponent Loading spell index for spellchecker: fqcn
   [junit4]   2> 2003007 INFO  (searcherExecutor-4125-thread-1-processing-x:collection1) [    x:collection1] o.a.s.h.c.SpellCheckComponent Loading spell index for spellchecker: perDict
   [junit4]   2> 2003007 INFO  (searcherExecutor-4125-thread-1-processing-x:collection1) [    x:collection1] o.a.s.c.SolrCore [collection1] Registered new searcher Searcher@1ff91c50[collection1] main{ExitableDirectoryReader(UninvertingDirectoryReader())}
   [junit4]   2> 2003008 INFO  (coreLoadExecutor-4124-thread-1) [    x:collection1] o.a.s.c.CoreContainer registering core: collection1
   [junit4]   2> 2003013 INFO  (TEST-TestArbitraryIndexDir.testLoadNewIndexDir-seed#[761573F5FF0B5D42]) [    ] o.a.s.SolrTestCaseJ4 ####initCore end
   [junit4]   2> 2003015 INFO  (TEST-TestArbitraryIndexDir.testLoadNewIndexDir-seed#[761573F5FF0B5D42]) [    ] o.a.s.u.p.LogUpdateProcessorFactory [collection1]  webapp=null path=null params={}{add=[1]} 0 2
   [junit4]   2> 2003072 INFO  (TEST-TestArbitraryIndexDir.testLoadNewIndexDir-seed#[761573F5FF0B5D42]) [    ] o.a.s.u.DirectUpdateHandler2 start commit{,optimize=false,openSearcher=true,waitSearcher=true,expungeDeletes=false,softCommit=false,prepareCommit=false}
   [junit4]   2> 2003111 INFO  (TEST-TestArbitraryIndexDir.testLoadNewIndexDir-seed#[761573F5FF0B5D42]) [    ] o.a.s.c.SolrDeletionPolicy SolrDeletionPolicy.onCommit: commits: num=2
   [junit4]   2> 	commit{dir=MockDirectoryWrapper(SimpleFSDirectory@/x1/jenkins/jenkins-slave/workspace/Lucene-Solr-Tests-6.x/solr/build/solr-core/test/J2/temp/solr.core.TestArbitraryIndexDir_761573F5FF0B5D42-001/init-core-data-001/index lockFactory=org.apache.lucene.store.SingleInstanceLockFactory@53b8fa05),segFN=segments_1,generation=1}
   [junit4]   2> 	commit{dir=MockDirectoryWrapper(SimpleFSDirectory@/x1/jenkins/jenkins-slave/workspace/Lucene-Solr-Tests-6.x/solr/build/solr-core/test/J2/temp/solr.core.TestArbitraryIndexDir_761573F5FF0B5D42-001/init-core-data-001/index lockFactory=org.apache.lucene.store.SingleInstanceLockFactory@53b8fa05),segFN=segments_2,generation=2}
   [junit4]   2> 2003112 INFO  (TEST-TestArbitraryIndexDir.testLoadNewIndexDir-seed#[761573F5FF0B5D42]) [    ] o.a.s.c.SolrDeletionPolicy newest commit generation = 2
   [junit4]   2> 2003124 INFO  (TEST-TestArbitraryIndexDir.testLoadNewIndexDir-seed#[761573F5FF0B5D42]) [    ] o.a.s.c.SolrCore New index directory detected: old=/x1/jenkins/jenkins-slave/workspace/Lucene-Solr-Tests-6.x/solr/build/solr-core/test/J2/temp/solr.core.TestArbitraryIndexDir_761573F5FF0B5D42-001/init-core-data-001/index/ new=/x1/jenkins/jenkins-slave/workspace/Lucene-Solr-Tests-6.x/solr/build/solr-core/test/J2/temp/solr.core.TestArbitraryIndexDir_761573F5FF0B5D42-001/init-core-data-001/index_temp
   [junit4]   2> 2003125 INFO  (TEST-TestArbitraryIndexDir.testLoadNewIndexDir-seed#[761573F5FF0B5D42]) [    ] o.a.s.s.SolrIndexSearcher Opening [Searcher@4ff146c2[collection1] main]
   [junit4]   2> 2003125 INFO  (TEST-TestArbitraryIndexDir.testLoadNewIndexDir-seed#[761573F5FF0B5D42]) [    ] o.a.s.u.DirectUpdateHandler2 end_commit_flush
   [junit4]   2> 2003129 INFO  (searcherExecutor-4125-thread-1) [    ] o.a.s.c.SolrCore [collection1] Registered new searcher Searcher@4ff146c2[collection1] main{ExitableDirectoryReader(UninvertingDirectoryReader(Uninverting(_0(6.3.0):c1)))}
   [junit4]   2> 2003129 INFO  (TEST-TestArbitraryIndexDir.testLoadNewIndexDir-seed#[761573F5FF0B5D42]) [    ] o.a.s.u.p.LogUpdateProcessorFactory [collection1]  webapp=null path=null params={}{commit=} 0 56
   [junit4]   2> 2003129 INFO  (TEST-TestArbitraryIndexDir.testLoadNewIndexDir-seed#[761573F5FF0B5D42]) [    ] o.a.s.c.SolrResourceLoader new SolrResourceLoader for directory: '/x1/jenkins/jenkins-slave/workspace/Lucene-Solr-Tests-6.x/solr/core/src/test-files/solr/collection1'
   [junit4]   2> 2003130 INFO  (TEST-TestArbitraryIndexDir.testLoadNewIndexDir-seed#[761573F5FF0B5D42]) [    ] o.a.s.c.SolrResourceLoader JNDI not configured for solr (NoInitialContextEx)
   [junit4]   2> 2003130 INFO  (TEST-TestArbitraryIndexDir.testLoadNewIndexDir-seed#[761573F5FF0B5D42]) [    ] o.a.s.c.SolrResourceLoader using system property solr.solr.home: /x1/jenkins/jenkins-slave/workspace/Lucene-Solr-Tests-6.x/solr/core/src/test-files/solr
   [junit4]   2> 2003130 INFO  (TEST-TestArbitraryIndexDir.testLoadNewIndexDir-seed#[761573F5FF0B5D42]) [    ] o.a.s.c.SolrResourceLoader Adding 'file:/x1/jenkins/jenkins-slave/workspace/Lucene-Solr-Tests-6.x/solr/core/src/test-files/solr/collection1/lib/classes/' to classloader
   [junit4]   2> 2003130 INFO  (TEST-TestArbitraryIndexDir.testLoadNewIndexDir-seed#[761573F5FF0B5D42]) [    ] o.a.s.c.SolrResourceLoader Adding 'file:/x1/jenkins/jenkins-slave/workspace/Lucene-Solr-Tests-6.x/solr/core/src/test-files/solr/collection1/lib/README' to classloader
   [junit4]   2> 2003161 INFO  (TEST-TestArbitraryIndexDir.testLoadNewIndexDir-seed#[761573F5FF0B5D42]) [    ] o.a.s.c.SolrConfig current version of requestparams : -1
   [junit4]   2> 2003174 INFO  (TEST-TestArbitraryIndexDir.testLoadNewIndexDir-seed#[761573F5FF0B5D42]) [    ] o.a.s.c.SolrConfig Using Lucene MatchVersion: 6.3.0
   [junit4]   2> 2003197 INFO  (TEST-TestArbitraryIndexDir.testLoadNewIndexDir-seed#[761573F5FF0B5D42]) [    ] o.a.s.c.SolrConfig Loaded SolrConfig: solrconfig.xml
   [junit4]   2> 2003207 INFO  (TEST-TestArbitraryIndexDir.testLoadNewIndexDir-seed#[761573F5FF0B5D42]) [    ] o.a.s.s.IndexSchema [collection1] Schema name=test
   [junit4]   2> 2003308 INFO  (TEST-TestArbitraryIndexDir.testLoadNewIndexDir-seed#[761573F5FF0B5D42]) [    ] o.a.s.s.IndexSchema default search field in schema is text
   [junit4]   2> 2003309 INFO  (TEST-TestArbitraryIndexDir.testLoadNewIndexDir-seed#[761573F5FF0B5D42]) [    ] o.a.s.s.IndexSchema unique key field: id
   [junit4]   2> 2003310 WARN  (TEST-TestArbitraryIndexDir.testLoadNewIndexDir-seed#[761573F5FF0B5D42]) [    ] o.a.s.s.IndexSchema Field text is not multivalued and destination for multiple copyFields (2)
   [junit4]   2> 2003314 INFO  (TEST-TestArbitraryIndexDir.testLoadNewIndexDir-seed#[761573F5FF0B5D42]) [    ] o.a.s.s.FileExchangeRateProvider Reloading exchange rates from file currency.xml
   [junit4]   2> 2003316 INFO  (TEST-TestArbitraryIndexDir.testLoadNewIndexDir-seed#[761573F5FF0B5D42]) [    ] o.a.s.s.FileExchangeRateProvider Reloading exchange rates from file currency.xml
   [junit4]   2> 2003319 INFO  (TEST-TestArbitraryIndexDir.testLoadNewIndexDir-seed#[761573F5FF0B5D42]) [    ] o.a.s.c.ConfigSetProperties Did not find ConfigSet properties, assuming default properties: Can't find resource 'configsetprops.json' in classpath or '/x1/jenkins/jenkins-slave/workspace/Lucene-Solr-Tests-6.x/solr/core/src/test-files/solr/collection1'
   [junit4]   2> 2003319 INFO  (TEST-TestArbitraryIndexDir.testLoadNewIndexDir-seed#[761573F5FF0B5D42]) [    ] o.a.s.c.CoreContainer Reloading SolrCore 'collection1' using configuration from instancedir /x1/jenkins/jenkins-slave/workspace/Lucene-Solr-Tests-6.x/solr/core/src/test-files/solr/collection1
   [junit4]   2> 2003319 INFO  (TEST-TestArbitraryIndexDir.testLoadNewIndexDir-seed#[761573F5FF0B5D42]) [    x:collection1] o.a.s.c.SolrCore [[collection1] ] Opening new SolrCore at [/x1/jenkins/jenkins-slave/workspace/Lucene-Solr-Tests-6.x/solr/core/src/test-files/solr/collection1], dataDir=[/x1/jenkins/jenkins-slave/workspace/Lucene-Solr-Tests-6.x/solr/build/solr-core/test/J2/temp/solr.core.TestArbitraryIndexDir_761573F5FF0B5D42-001/init-core-data-001/]
   [junit4]   2> 2003319 INFO  (TEST-TestArbitraryIndexDir.testLoadNewIndexDir-seed#[761573F5FF0B5D42]) [    x:collection1] o.a.s.c.JmxMonitoredMap JMX monitoring is enabled. Adding Solr mbeans to JMX Server: com.sun.jmx.mbeanserver.JmxMBeanServer@3611f68
   [junit4]   2> 2003320 INFO  (TEST-TestArbitraryIndexDir.testLoadNewIndexDir-seed#[761573F5FF0B5D42]) [    x:collection1] o.a.s.c.s.SolrSnapshotMetaDataManager Loading from snapshot metadata file...
   [junit4]   2> 2003324 INFO  (TEST-TestArbitraryIndexDir.testLoadNewIndexDir-seed#[761573F5FF0B5D42]) [    x:collection1] o.a.s.c.SolrCore New index directory detected: old=null new=/x1/jenkins/jenkins-slave/workspace/Lucene-Solr-Tests-6.x/solr/build/solr-core/test/J2/temp/solr.core.TestArbitraryIndexDir_761573F5FF0B5D42-001/init-core-data-001/index_temp
   [junit4]   2> 2003331 INFO  (TEST-TestArbitraryIndexDir.testLoadNewIndexDir-seed#[761573F5FF0B5D42]) [    x:collection1] o.a.s.u.p.UpdateRequestProcessorChain creating updateRequestProcessorChain "dedupe"
   [junit4]   2> 2003331 INFO  (TEST-TestArbitraryIndexDir.testLoadNewIndexDir-seed#[761573F5FF0B5D42]) [    x:collection1] o.a.s.u.p.UpdateRequestProcessorChain inserting DistributedUpdateProcessorFactory into updateRequestProcessorChain "dedupe"
   [junit4]   2> 2003331 INFO  (TEST-TestArbitraryIndexDir.testLoadNewIndexDir-seed#[761573F5FF0B5D42]) [    x:collection1] o.a.s.u.p.UpdateRequestProcessorChain creating updateRequestProcessorChain "dedupe-allfields"
   [junit4]   2> 2003331 INFO  (TEST-TestArbitraryIndexDir.testLoadNewIndexDir-seed#[761573F5FF0B5D42]) [    x:collection1] o.a.s.u.p.UpdateRequestProcessorChain inserting DistributedUpdateProcessorFactory into updateRequestProcessorChain "dedupe-allfields"
   [junit4]   2> 2003331 INFO  (TEST-TestArbitraryIndexDir.testLoadNewIndexDir-seed#[761573F5FF0B5D42]) [    x:collection1] o.a.s.u.p.UpdateRequestProcessorChain creating updateRequestProcessorChain "stored_sig"
   [junit4]   2> 2003331 INFO  (TEST-TestArbitraryIndexDir.testLoadNewIndexDir-seed#[761573F5FF0B5D42]) [    x:collection1] o.a.s.u.p.UpdateRequestProcessorChain inserting DistributedUpdateProcessorFactory into updateRequestProcessorChain "stored_sig"
   [junit4]   2> 2003331 INFO  (TEST-TestArbitraryIndexDir.testLoadNewIndexDir-seed#[761573F5FF0B5D42]) [    x:collection1] o.a.s.u.p.UpdateRequestProcessorChain creating updateRequestProcessorChain "uniq-fields"
   [junit4]   2> 2003331 INFO  (TEST-TestArbitraryIndexDir.testLoadNewIndexDir-seed#[761573F5FF0B5D42]) [    x:collection1] o.a.s.u.p.UpdateRequestProcessorChain inserting DistributedUpdateProcessorFactory into updateRequestProcessorChain "uniq-fields"
   [junit4]   2> 2003331 INFO  (TEST-TestArbitraryIndexDir.testLoadNewIndexDir-seed#[761573F5FF0B5D42]) [    x:collection1] o.a.s.u.p.UpdateRequestProcessorChain creating updateRequestProcessorChain "distrib-dup-test-chain-explicit"
   [junit4]   2> 2003332 INFO  (TEST-TestArbitraryIndexDir.testLoadNewIndexDir-seed#[761573F5FF0B5D42]) [    x:collection1] o.a.s.u.p.UpdateRequestProcessorChain creating updateRequestProcessorChain "distrib-dup-test-chain-implicit"
   [junit4]   2> 2003332 INFO  (TEST-TestArbitraryIndexDir.testLoadNewIndexDir-seed#[761573F5FF0B5D42]) [    x:collection1] o.a.s.u.p.UpdateRequestProcessorChain inserting DistributedUpdateProcessorFactory into updateRequestProcessorChain "distrib-dup-test-chain-implicit"
   [junit4]   2> 2003332 INFO  (TEST-TestArbitraryIndexDir.testLoadNewIndexDir-seed#[761573F5FF0B5D42]) [    x:collection1] o.a.s.c.SolrCore no updateRequestProcessorChain defined as default, creating implicit default
   [junit4]   2> 2003333 INFO  (TEST-TestArbitraryIndexDir.testLoadNewIndexDir-seed#[761573F5FF0B5D42]) [    x:collection1] o.a.s.h.l.XMLLoader xsltCacheLifetimeSeconds=60
   [junit4]   2> 2003334 INFO  (TEST-TestArbitraryIndexDir.testLoadNewIndexDir-seed#[761573F5FF0B5D42]) [    x:collection1] o.a.s.h.l.XMLLoader xsltCacheLifetimeSeconds=60
   [junit4]   2> 2003335 INFO  (TEST-TestArbitraryIndexDir.testLoadNewIndexDir-seed#[761573F5FF0B5D42]) [    x:collection1] o.a.s.h.l.XMLLoader xsltCacheLifetimeSeconds=60
   [junit4]   2> 2003336 INFO  (TEST-TestArbitraryIndexDir.testLoadNewIndexDir-seed#[761573F5FF0B5D42]) [    x:collection1] o.a.s.h.l.XMLLoader xsltCacheLifetimeSeconds=60
   [junit4]   2> 2003337 INFO  (TEST-TestArbitraryIndexDir.testLoadNewIndexDir-seed#[761573F5FF0B5D42]) [    x:collection1] o.a.s.c.CachingDirectoryFactory return new directory for /x1/jenkins/jenkins-slave/workspace/Lucene-Solr-Tests-6.x/solr/build/solr-core/test/J2/temp/solr.core.TestArbitraryIndexDir_761573F5FF0B5D42-001/init-core-data-001/index_temp
   [junit4]   2> 2003337 INFO  (OldIndexDirectoryCleanupThreadForCore-collection1) [    x:collection1] o.a.s.c.SolrCore Looking for old index directories to cleanup for core collection1 in /x1/jenkins/jenkins-slave/workspace/Lucene-Solr-Tests-6.x/solr/build/solr-core/test/J2/temp/solr.core.TestArbitraryIndexDir_761573F5FF0B5D42-001/init-core-data-001/
   [junit4]   2> 2003338 INFO  (OldIndexDirectoryCleanupThreadForCore-collection1) [    x:collection1] o.a.s.c.DirectoryFactory Found 1 old index directories to clean-up under /x1/jenkins/jenkins-slave/workspace/Lucene-Solr-Tests-6.x/solr/build/solr-core/test/J2/temp/solr.core.TestArbitraryIndexDir_761573F5FF0B5D42-001/init-core-data-001/
   [junit4]   2> 2003338 WARN  (OldIndexDirectoryCleanupThreadForCore-collection1) [    x:collection1] o.a.s.c.CachingDirectoryFactory Cannot delete directory /x1/jenkins/jenkins-slave/workspace/Lucene-Solr-Tests-6.x/solr/build/solr-core/test/J2/temp/solr.core.TestArbitraryIndexDir_761573F5FF0B5D42-001/init-core-data-001/index as it is still being referenced in the cache!
   [junit4]   2> 2003338 WARN  (OldIndexDirectoryCleanupThreadForCore-collection1) [    x:collection1] o.a.s.c.DirectoryFactory Delete old index directory /x1/jenkins/jenkins-slave/workspace/Lucene-Solr-Tests-6.x/solr/build/solr-core/test/J2/temp/solr.core.TestArbitraryIndexDir_761573F5FF0B5D42-001/init-core-data-001/index failed.
   [junit4]   2> 2003343 INFO  (TEST-TestArbitraryIndexDir.testLoadNewIndexDir-seed#[761573F5FF0B5D42]) [    x:collection1] o.a.s.c.PluginBag requestHandler : 'lazy' created with startup=lazy 
   [junit4]   2> 2003346 INFO  (TEST-TestArbitraryIndexDir.testLoadNewIndexDir-seed#[761573F5FF0B5D42]) [    x:collection1] o.a.s.c.RequestHandlers Registered paths: /admin/mbeans,standard,spellCheckCompRH,lazy,/update/json/docs,/admin/luke,/export,spellCheckWithWordbreak_Direct,tvrh,/get,/admin/properties,/update/json,mltrh,/admin/threads,/search-facet-def,/update/csv,/sql,/graph,/search-facet-invariants,/admin/segments,spellCheckCompRH1,/mlt,/admin/system,/replication,dismax,defaults,/config,/stream,/schema,/admin/plugins,/admin/logging,spellCheckWithWordbreak,mock,/admin/ping,/update,/admin/file,/terms,spellCheckCompRH_Direct,/debug/dump
   [junit4]   2> 2003346 INFO  (TEST-TestArbitraryIndexDir.testLoadNewIndexDir-seed#[761573F5FF0B5D42]) [    x:collection1] o.a.s.c.SolrCore Using default statsCache cache: org.apache.solr.search.stats.LocalStatsCache
   [junit4]   2> 2003346 INFO  (TEST-TestArbitraryIndexDir.testLoadNewIndexDir-seed#[761573F5FF0B5D42]) [    x:collection1] o.a.s.u.CommitTracker Hard AutoCommit: disabled
   [junit4]   2> 2003346 INFO  (TEST-TestArbitraryIndexDir.testLoadNewIndexDir-seed#[761573F5FF0B5D42]) [    x:collection1] o.a.s.u.CommitTracker Soft AutoCommit: disabled
   [junit4]   2> 2003347 INFO  (TEST-TestArbitraryIndexDir.testLoadNewIndexDir-seed#[761573F5FF0B5D42]) [    x:collection1] o.a.s.s.SolrIndexSearcher Opening [Searcher@331978cd[collection1] main]
   [junit4]   2> 2003347 INFO  (TEST-TestArbitraryIndexDir.testLoadNewIndexDir-seed#[761573F5FF0B5D42]) [    x:collection1] o.a.s.r.RestManager Initializing RestManager with initArgs: {storageIO=org.apache.solr.rest.ManagedResourceStorage$InMemoryStorageIO}
   [junit4]   2> 2003347 INFO  (TEST-TestArbitraryIndexDir.testLoadNewIndexDir-seed#[761573F5FF0B5D42]) [    x:collection1] o.a.s.r.ManagedResourceStorage Reading _rest_managed.json using InMemoryStorage
   [junit4]   2> 2003347 INFO  (TEST-TestArbitraryIndexDir.testLoadNewIndexDir-seed#[761573F5FF0B5D42]) [    x:collection1] o.a.s.r.RestManager Initializing 0 registered ManagedResources
   [junit4]   2> 2003347 INFO  (TEST-TestArbitraryIndexDir.testLoadNewIndexDir-seed#[761573F5FF0B5D42]) [    x:collection1] o.a.s.h.c.SpellCheckComponent Initializing spell checkers
   [junit4]   2> 2003348 INFO  (TEST-TestArbitraryIndexDir.testLoadNewIndexDir-seed#[761573F5FF0B5D42]) [    x:collection1] o.a.s.s.DirectSolrSpellChecker init: {name=direct,classname=DirectSolrSpellChecker,field=lowerfilt,minQueryLength=3}
   [junit4]   2> 2003350 INFO  (TEST-TestArbitraryIndexDir.testLoadNewIndexDir-seed#[761573F5FF0B5D42]) [    x:collection1] o.a.s.h.ReplicationHandler Commits will be reserved for  10000
   [junit4]   2> 2003357 INFO  (TEST-TestArbitraryIndexDir.testLoadNewIndexDir-seed#[761573F5FF0B5D42]) [    x:collection1] o.a.s.u.DefaultSolrCoreState Closing old IndexWriter... core=collection1
   [junit4]   2> 2003357 INFO  (searcherExecutor-4129-thread-1-processing-x:collection1) [    x:collection1] o.a.s.h.c.SpellCheckComponent Loading spell index for spellchecker: default
   [junit4]   2> 2003357 INFO  (searcherExecutor-4129-thread-1-processing-x:collection1) [    x:collection1] o.a.s.h.c.SpellCheckComponent Loading spell index for spellchecker: direct
   [junit4]   2> 2003358 INFO  (searcherExecutor-4129-thread-1-processing-x:collection1) [    x:collection1] o.a.s.h.c.SpellCheckComponent Loading spell index for spellchecker: wordbreak
   [junit4]   2> 2003443 INFO  (TEST-TestArbitraryIndexDir.testLoadNewIndexDir-seed#[761573F5FF0B5D42]) [    x:collection1] o.a.s.u.RandomMergePolicy RandomMergePolicy wrapping class org.apache.lucene.index.LogDocMergePolicy: [LogDocMergePolicy: minMergeSize=1000, mergeFactor=15, maxMergeSize=9223372036854775807, maxMergeSizeForForcedMerge=9223372036854775807, calibrateSizeByDeletes=false, maxMergeDocs=2147483647, maxCFSSegmentSizeMB=0.4541015625, noCFSRatio=0.0]
   [junit4]   2> 2003445 INFO  (TEST-TestArbitraryIndexDir.testLoadNewIndexDir-seed#[761573F5FF0B5D42]) [    x:collection1] o.a.s.c.SolrDeletionPolicy SolrDeletionPolicy.onInit: commits: num=1
   [junit4]   2> 	commit{dir=MockDirectoryWrapper(SimpleFSDirectory@/x1/jenkins/jenkins-slave/workspace/Lucene-Solr-Tests-6.x/solr/build/solr-core/test/J2/temp/solr.core.TestArbitraryIndexDir_761573F5FF0B5D42-001/init-core-data-001/index_temp lockFactory=org.apache.lucene.store.SingleInstanceLockFactory@1e712f5),segFN=segments_1,generation=1}
   [junit4]   2> 2003445 INFO  (TEST-TestArbitraryIndexDir.testLoadNewIndexDir-seed#[761573F5FF0B5D42]) [    x:collection1] o.a.s.c.SolrDeletionPolicy newest commit generation = 1
   [junit4]   2> 2003445 INFO  (TEST-TestArbitraryIndexDir.testLoadNewIndexDir-seed#[761573F5FF0B5D42]) [    x:collection1] o.a.s.u.DefaultSolrCoreState New IndexWriter is ready to be used.
   [junit4]   2> 2003445 WARN  (TEST-TestArbitraryIndexDir.testLoadNewIndexDir-seed#[761573F5FF0B5D42]) [    x:collection1] o.a.s.c.SolrCore [collection1] PERFORMANCE WARNING: Overlapping onDeckSearchers=2
   [junit4]   2> 2003446 INFO  (TEST-TestArbitraryIndexDir.testLoadNewIndexDir-seed#[761573F5FF0B5D42]) [    x:collection1] o.a.s.s.SolrIndexSearcher Opening [Searcher@60c4bb16[collection1] main]
   [junit4]   2> 2003446 INFO  (TEST-TestArbitraryIndexDir.testLoadNewIndexDir-seed#[761573F5FF0B5D42]) [    x:collection1] o.a.s.c.CoreContainer replacing core: collection1
   [junit4]   2> 2003446 INFO  (TEST-TestArbitraryIndexDir.testLoadNewIndexDir-seed#[761573F5FF0B5D42]) [    x:collection1] o.a.s.c.SolrCore [collection1]  CLOSING SolrCore org.apache.solr.core.SolrCore@702ff806
   [junit4]   2> 2003446 INFO  (TEST-TestArbitraryIndexDir.testLoadNewIndexDir-seed#[761573F5FF0B5D42]) [    x:collection1] o.a.s.u.DirectUpdateHandler2 closing DirectUpdateHandler2{commits=1,autocommits=0,soft autocommits=0,optimizes=0,rollbacks=0,expungeDeletes=0,docsPending=0,adds=0,deletesById=0,deletesByQuery=0,errors=0,cumulative_adds=1,cumulative_deletesById=0,cumulative_deletesByQuery=0,cumulative_errors=0}
   [junit4]   2> 2003447 INFO  (searcherExecutor-4129-thread-1-processing-x:collection1) [    x:collection1] o.a.s.h.c.SpellCheckComponent Loading spell index for spellchecker: multipleFields
   [junit4]   2> 2003447 INFO  (searcherExecutor-4129-thread-1-processing-x:collection1) [    x:collection1] o.a.s.h.c.SpellCheckComponent Loading spell index for spellchecker: jarowinkler
   [junit4]   2> 2003447 INFO  (searcherExecutor-4129-thread-1-processing-x:collection1) [    x:collection1] o.a.s.h.c.SpellCheckComponent Loading spell index for spellchecker: external
   [junit4]   2> 2003447 INFO  (searcherExecutor-4129-thread-1-processing-x:collection1) [    x:collection1] o.a.s.h.c.SpellCheckComponent Loading spell index for spellchecker: freq
   [junit4]   2> 2003448 INFO  (searcherExecutor-4129-thread-1-processing-x:collection1) [    x:collection1] o.a.s.h.c.SpellCheckComponent Loading spell index for spellchecker: fqcn
   [junit4]   2> 2003448 INFO  (TEST-TestArbitraryIndexDir.testLoadNewIndexDir-seed#[761573F5FF0B5D42]) [    x:collection1] o.a.s.c.SolrCore [collection1] Closing main searcher on request.
   [junit4]   2> 2003452 INFO  (searcherExecutor-4129-thread-1-processing-x:collection1) [    x:collection1] o.a.s.h.c.SpellCheckComponent Loading spell index for spellchecker: perDict
   [junit4]   2> 2003453 INFO  (searcherExecutor-4129-thread-1-processing-x:collection1) [    x:collection1] o.a.s.c.SolrCore [collection1] Registered new searcher Searcher@331978cd[collection1] main{ExitableDirectoryReader(UninvertingDirectoryReader(Uninverting(_0(6.3.0):c1)))}
   [junit4]   2> 2003453 INFO  (searcherExecutor-4129-thread-1-processing-x:collection1) [    x:collection1] o.a.s.h.c.SpellCheckComponent Loading spell index for spellchecker: default
   [junit4]   2> 2003456 INFO  (searcherExecutor-4129-thread-1-processing-x:collection1) [    x:collection1] o.a.s.h.c.SpellCheckComponent Loading spell index for spellchecker: direct
   [junit4]   2> 2003456 INFO  (searcherExecutor-4129-thread-1-processing-x:collection1) [    x:collection1] o.a.s.h.c.SpellCheckComponent Loading spell index for spellchecker: wordbreak
   [junit4]   2> 2003456 INFO  (searcherExecutor-4129-thread-1-processing-x:collection1) [    x:collection1] o.a.s.h.c.SpellCheckComponent Loading spell index for spellchecker: multipleFields
   [junit4]   2> 2003456 INFO  (searcherExecutor-4129-thread-1-processing-x:collection1) [    x:collection1] o.a.s.h.c.SpellCheckComponent Loading spell index for spellchecker: jarowinkler
   [junit4]   2> 2003457 INFO  (searcherExecutor-4129-thread-1-processing-x:collection1) [    x:collection1] o.a.s.h.c.SpellCheckComponent Loading spell index for spellchecker: external
   [junit4]   2> 2003457 INFO  (searcherExecutor-4129-thread-1-processing-x:collection1) [    x:collection1] o.a.s.h.c.SpellCheckComponent Loading spell index for spellchecker: freq
   [junit4]   2> 2003457 INFO  (searcherExecutor-4129-thread-1-processing-x:collection1) [    x:collection1] o.a.s.h.c.SpellCheckComponent Loading spell index for spellchecker: fqcn
   [junit4]   2> 2003462 INFO  (TEST-TestArbitraryIndexDir.testLoadNewIndexDir-seed#[761573F5FF0B5D42]) [    x:collection1] o.a.s.c.S.Request [collection1]  webapp=null path=null params={q=id:2&qt=standard&start=0&rows=20&version=2.2} hits=0 status=0 QTime=0
   [junit4]   2> 2003462 ERROR (TEST-TestArbitraryIndexDir.testLoadNewIndexDir-seed#[761573F5FF0B5D42]) [    x:collection1] o.a.s.SolrTestCaseJ4 REQUEST FAILED: xpath=*[count(//doc)=1]
   [junit4]   2> 	xml response was: <?xml version="1.0" encoding="UTF-8"?>
   [junit4]   2> <response>
   [junit4]   2> <lst name="responseHeader"><int name="status">0</int><int name="QTime">0</int></lst><result name="response" numFound="0" start="0"></result>
   [junit4]   2> </response>
   [junit4]   2> 
   [junit4]   2> 	request was:q=id:2&qt=standard&start=0&rows=20&version=2.2
   [junit4]   2> 2003476 ERROR (TEST-TestArbitraryIndexDir.testLoadNewIndexDir-seed#[761573F5FF0B5D42]) [    x:collection1] o.a.s.SolrTestCaseJ4 REQUEST FAILED: q=id:2&qt=standard&start=0&rows=20&version=2.2:java.lang.RuntimeException: REQUEST FAILED: xpath=*[count(//doc)=1]
   [junit4]   2> 	xml response was: <?xml version="1.0" encoding="UTF-8"?>
   [junit4]   2> <response>
   [junit4]   2> <lst name="responseHeader"><int name="status">0</int><int name="QTime">0</int></lst><result name="response" numFound="0" start="0"></result>
   [junit4]   2> </response>
   [junit4]   2> 
   [junit4]   2> 	request was:q=id:2&qt=standard&start=0&rows=20&version=2.2
   [junit4]   2> 	at org.apache.solr.SolrTestCaseJ4.assertQ(SolrTestCaseJ4.java:776)
   [junit4]   2> 	at org.apache.solr.core.TestArbitraryIndexDir.testLoadNewIndexDir(TestArbitraryIndexDir.java:107)
   [junit4]   2> 	at sun.reflect.NativeMethodAccessorImpl.invoke0(Native Method)
   [junit4]   2> 	at sun.reflect.NativeMethodAccessorImpl.invoke(NativeMethodAccessorImpl.java:62)
   [junit4]   2> 	at sun.reflect.DelegatingMethodAccessorImpl.invoke(DelegatingMethodAccessorImpl.java:43)
   [junit4]   2> 	at java.lang.reflect.Method.invoke(Method.java:498)
   [junit4]   2> 	at com.carrotsearch.randomizedtesting.RandomizedRunner.invoke(RandomizedRunner.java:1764)
   [junit4]   2> 	at com.carrotsearch.randomizedtesting.RandomizedRunner$8.evaluate(RandomizedRunner.java:871)
   [junit4]   2> 	at com.carrotsearch.randomizedtesting.RandomizedRunner$9.evaluate(RandomizedRunner.java:907)
   [junit4]   2> 	at com.carrotsearch.randomizedtesting.RandomizedRunner$10.evaluate(RandomizedRunner.java:921)
   [junit4]   2> 	at com.carrotsearch.randomizedtesting.rules.SystemPropertiesRestoreRule$1.evaluate(SystemPropertiesRestoreRule.java:57)
   [junit4]   2> 	at com.carrotsearch.randomizedtesting.rules.SystemPropertiesRestoreRule$1.evaluate(SystemPropertiesRestoreRule.java:57)
   [junit4]   2> 	at org.apache.lucene.util.TestRuleSetupTeardownChained$1.evaluate(TestRuleSetupTeardownChained.java:49)
   [junit4]   2> 	at org.apache.lucene.util.AbstractBeforeAfterRule$1.evaluate(AbstractBeforeAfterRule.java:45)
   [junit4]   2> 	at org.apache.lucene.util.TestRuleThreadAndTestName$1.evaluate(TestRuleThreadAndTestName.java:48)
   [junit4]   2> 	at org.apache.lucene.util.TestRuleIgnoreAfterMaxFailures$1.evaluate(TestRuleIgnoreAfterMaxFailures.java:64)
   [junit4]   2> 	at org.apache.lucene.util.TestRuleMarkFailure$1.evaluate(TestRuleMarkFailure.java:47)
   [junit4]   2> 	at com.carrotsearch.randomizedtesting.rules.StatementAdapter.evaluate(StatementAdapter.java:36)
   [junit4]   2> 	at com.carrotsearch.randomizedtesting.ThreadLeakControl$StatementRunner.run(ThreadLeakControl.java:367)
   [junit4]   2> 	at com.carrotsearch.randomizedtesting.ThreadLeakControl.forkTimeoutingTask(ThreadLeakControl.java:809)
   [junit4]   2> 	at com.carrotsearch.randomizedtesting.ThreadLeakControl$3.evaluate(ThreadLeakControl.java:460)
   [junit4]   2> 	at com.carrotsearch.randomizedtesting.RandomizedRunner.runSingleTest(RandomizedRunner.java:880)
   [junit4]   2> 	at com.carrotsearch.randomizedtesting.RandomizedRunner$5.evaluate(RandomizedRunner.java:781)
   [junit4]   2> 	at com.carrotsearch.randomizedtesting.RandomizedRunner$6.evaluate(RandomizedRunner.java:816)
   [junit4]   2> 	at com.carrotsearch.randomizedtesting.RandomizedRunner$7.evaluate(RandomizedRunner.java:827)
   [junit4]   2> 	at com.carrotsearch.randomizedtesting.rules.StatementAdapter.evaluate(StatementAdapter.java:36)
   [junit4]   2> 	at com.carrotsearch.randomizedtesting.rules.SystemPropertiesRestoreRule$1.evaluate(SystemPropertiesRestoreRule.java:57)
   [junit4]   2> 	at org.apache.lucene.util.AbstractBeforeAfterRule$1.evaluate(AbstractBeforeAfterRule.java:45)
   [junit4]   2> 	at com.carrotsearch.randomizedtesting.rules.StatementAdapter.evaluate(StatementAdapter.java:36)
   [junit4]   2> 	at org.apache.lucene.util.TestRuleStoreClassName$1.evaluate(TestRuleStoreClassName.java:41)
   [junit4]   2> 	at com.carrotsearch.randomizedtesting.rules.NoShadowingOrOverridesOnMethodsRule$1.evaluate(NoShadowingOrOverridesOnMethodsRule.java:40)
   [junit4]   2> 	at com.carrotsearch.randomizedtesting.rules.NoShadowingOrOverridesOnMethodsRule$1.evaluate(NoShadowingOrOverridesOnMethodsRule.java:40)
   [junit4]   2> 	at com.carrotsearch.randomizedtesting.rules.StatementAdapter.evaluate(StatementAdapter.java:36)
   [junit4]   2> 	at com.carrotsearch.randomizedtesting.rules.StatementAdapter.evaluate(StatementAdapter.java:36)
   [junit4]   2> 	at com.carrotsearch.randomizedtesting.rules.StatementAdapter.evaluate(StatementAdapter.java:36)
   [junit4]   2> 	at org.apache.lucene.util.TestRuleAssertionsRequired$1.evaluate(TestRuleAssertionsRequired.java:53)
   [junit4]   2> 	at org.apache.lucene.util.TestRuleMarkFailure$1.evaluate(TestRuleMarkFailure.java:47)
   [junit4]   2> 	at org.apache.lucene.util.TestRuleIgnoreAfterMaxFailures$1.evaluate(TestRuleIgnoreAfterMaxFailures.java:64)
   [junit4]   2> 	at org.apache.lucene.util.TestRuleIgnoreTestSuites$1.evaluate(TestRuleIgnoreTestSuites.java:54)
   [junit4]   2> 	at com.carrotsearch.randomizedtesting.rules.StatementAdapter.evaluate(StatementAdapter.java:36)
   [junit4]   2> 	at com.carrotsearch.randomizedtesting.ThreadLeakControl$StatementRunner.run(ThreadLeakControl.java:367)
   [junit4]   2> 	at java.lang.Thread.run(Thread.java:745)
   [junit4]   2> 
   [junit4]   2> 2003477 INFO  (TEST-TestArbitraryIndexDir.testLoadNewIndexDir-seed#[761573F5FF0B5D42]) [    x:collection1] o.a.s.SolrTestCaseJ4 ###Ending testLoadNewIndexDir
   [junit4]   2> NOTE: reproduce with: ant test  -Dtestcase=TestArbitraryIndexDir -Dtests.method=testLoadNewIndexDir -Dtests.seed=761573F5FF0B5D42 -Dtests.multiplier=2 -Dtests.slow=true -Dtests.locale=sr-Latn -Dtests.timezone=America/Los_Angeles -Dtests.asserts=true -Dtests.file.encoding=US-ASCII
   [junit4] ERROR   1.49s J2 | TestArbitraryIndexDir.testLoadNewIndexDir <<<
   [junit4]    > Throwable #1: java.lang.RuntimeException: Exception during query
   [junit4]    > 	at __randomizedtesting.SeedInfo.seed([761573F5FF0B5D42:9F4FC8CD6192CDEA]:0)
   [junit4]    > 	at org.apache.solr.SolrTestCaseJ4.assertQ(SolrTestCaseJ4.java:783)
   [junit4]    > 	at org.apache.solr.core.TestArbitraryIndexDir.testLoadNewIndexDir(TestArbitraryIndexDir.java:107)
   [junit4]    > 	at java.lang.Thread.run(Thread.java:745)
   [junit4]    > Caused by: java.lang.RuntimeException: REQUEST FAILED: xpath=*[count(//doc)=1]
   [junit4]    > 	xml response was: <?xml version="1.0" encoding="UTF-8"?>
   [junit4]    > <response>
   [junit4]    > <lst name="responseHeader"><int name="status">0</int><int name="QTime">0</int></lst><result name="response" numFound="0" start="0"></result>
   [junit4]    > </response>
   [junit4]    > 	request was:q=id:2&qt=standard&start=0&rows=20&version=2.2
   [junit4]    > 	at org.apache.solr.SolrTestCaseJ4.assertQ(SolrTestCaseJ4.java:776)
   [junit4]    > 	... 41 more
   [junit4]   2> 2003480 INFO  (SUITE-TestArbitraryIndexDir-seed#[761573F5FF0B5D42]-worker) [    x:collection1] o.a.s.SolrTestCaseJ4 ###deleteCore
   [junit4]   2> 2003480 INFO  (SUITE-TestArbitraryIndexDir-seed#[761573F5FF0B5D42]-worker) [    x:collection1] o.a.s.c.CoreContainer Shutting down CoreContainer instance=6982006
   [junit4]   2> 2003493 INFO  (searcherExecutor-4129-thread-1-processing-x:collection1) [    x:collection1] o.a.s.h.c.SpellCheckComponent Loading spell index for spellchecker: perDict
   [junit4]   2> 2003494 INFO  (searcherExecutor-4129-thread-1-processing-x:collection1) [    x:collection1] o.a.s.c.SolrCore [collection1] Registered new searcher Searcher@60c4bb16[collection1] main{ExitableDirectoryReader(UninvertingDirectoryReader(Uninverting(_0(6.3.0):c1)))}
   [junit4]   2> 2003495 INFO  (coreCloseExecutor-4133-thread-1-processing-x:collection1) [    x:collection1] o.a.s.c.SolrCore [collection1]  CLOSING SolrCore org.apache.solr.core.SolrCore@7647df5b
   [junit4]   2> 2003495 INFO  (coreCloseExecutor-4133-thread-1-processing-x:collection1) [    x:collection1] o.a.s.u.DirectUpdateHandler2 closing DirectUpdateHandler2{commits=0,autocommits=0,soft autocommits=0,optimizes=0,rollbacks=0,expungeDeletes=0,docsPending=0,adds=0,deletesById=0,deletesByQuery=0,errors=0,cumulative_adds=0,cumulative_deletesById=0,cumulative_deletesByQuery=0,cumulative_errors=0}
   [junit4]   2> 2003495 INFO  (coreCloseExecutor-4133-thread-1-processing-x:collection1) [    x:collection1] o.a.s.u.SolrCoreState Closing SolrCoreState
   [junit4]   2> 2003495 INFO  (coreCloseExecutor-4133-thread-1-processing-x:collection1) [    x:collection1] o.a.s.u.DefaultSolrCoreState SolrCoreState ref count has reached 0 - closing IndexWriter
   [junit4]   2> 2003495 INFO  (coreCloseExecutor-4133-thread-1-processing-x:collection1) [    x:collection1] o.a.s.u.DefaultSolrCoreState closing IndexWriter with IndexWriterCloser
   [junit4]   2> 2003504 INFO  (coreCloseExecutor-4133-thread-1-processing-x:collection1) [    x:collection1] o.a.s.c.SolrCore [collection1] Closing main searcher on request.
   [junit4]   2> 2003530 INFO  (coreCloseExecutor-4133-thread-1-processing-x:collection1) [    x:collection1] o.a.s.c.CachingDirectoryFactory Closing MockFSDirectoryFactory - 4 directories currently being tracked
   [junit4]   2> 2003531 INFO  (coreCloseExecutor-4133-thread-1-processing-x:collection1) [    x:collection1] o.a.s.c.CachingDirectoryFactory looking to close /x1/jenkins/jenkins-slave/workspace/Lucene-Solr-Tests-6.x/solr/build/solr-core/test/J2/temp/solr.core.TestArbitraryIndexDir_761573F5FF0B5D42-001/init-core-data-001/snapshot_metadata [CachedDir<<refCount=0;path=/x1/jenkins/jenkins-slave/workspace/Lucene-Solr-Tests-6.x/solr/build/solr-core/test/J2/temp/solr.core.TestArbitraryIndexDir_761573F5FF0B5D42-001/init-core-data-001/snapshot_metadata;done=false>>]
   [junit4]   2> 2003531 INFO  (coreCloseExecutor-4133-thread-1-processing-x:collection1) [    x:collection1] o.a.s.c.CachingDirectoryFactory Closing directory, CoreContainer#isShutdown=true
   [junit4]   2> 2003531 INFO  (coreCloseExecutor-4133-thread-1-processing-x:collection1) [    x:collection1] o.a.s.c.CachingDirectoryFactory Closing directory: /x1/jenkins/jenkins-slave/workspace/Lucene-Solr-Tests-6.x/solr/build/solr-core/test/J2/temp/solr.core.TestArbitraryIndexDir_761573F5FF0B5D42-001/init-core-data-001/snapshot_metadata
   [junit4]   2> 2003531 INFO  (coreCloseExecutor-4133-thread-1-processing-x:collection1) [    x:collection1] o.a.s.c.CachingDirectoryFactory looking to close /x1/jenkins/jenkins-slave/workspace/Lucene-Solr-Tests-6.x/solr/build/solr-core/test/J2/temp/solr.core.TestArbitraryIndexDir_761573F5FF0B5D42-001/init-core-data-001 [CachedDir<<refCount=0;path=/x1/jenkins/jenkins-slave/workspace/Lucene-Solr-Tests-6.x/solr/build/solr-core/test/J2/temp/solr.core.TestArbitraryIndexDir_761573F5FF0B5D42-001/init-core-data-001;done=false>>]
   [junit4]   2> 2003531 INFO  (coreCloseExecutor-4133-thread-1-processing-x:collection1) [    x:collection1] o.a.s.c.CachingDirectoryFactory Closing directory, CoreContainer#isShutdown=true
   [junit4]   2> 2003531 INFO  (coreCloseExecutor-4133-thread-1-processing-x:collection1) [    x:collection1] o.a.s.c.CachingDirectoryFactory Closing directory: /x1/jenkins/jenkins-slave/workspace/Lucene-Solr-Tests-6.x/solr/build/solr-core/test/J2/temp/solr.core.TestArbitraryIndexDir_761573F5FF0B5D42-001/init-core-data-001
   [junit4]   2> 2003531 INFO  (coreCloseExecutor-4133-thread-1-processing-x:collection1) [    x:collection1] o.a.s.c.CachingDirectoryFactory looking to close /x1/jenkins/jenkins-slave/workspace/Lucene-Solr-Tests-6.x/solr/build/solr-core/test/J2/temp/solr.core.TestArbitraryIndexDir_761573F5FF0B5D42-001/init-core-data-001/index_temp [CachedDir<<refCount=0;path=/x1/jenkins/jenkins-slave/workspace/Lucene-Solr-Tests-6.x/solr/build/solr-core/test/J2/temp/solr.core.TestArbitraryIndexDir_761573F5FF0B5D42-001/init-core-data-001/index_temp;done=false>>]
   [junit4]   2> 2003531 INFO  (coreCloseExecutor-4133-thread-1-processing-x:collection1) [    x:collection1] o.a.s.c.CachingDirectoryFactory Closing directory, CoreContainer#isShutdown=true
   [junit4]   2> 2003531 INFO  (coreCloseExecutor-4133-thread-1-processing-x:collection1) [    x:collection1] o.a.s.c.CachingDirectoryFactory Closing directory: /x1/jenkins/jenkins-slave/workspace/Lucene-Solr-Tests-6.x/solr/build/solr-core/test/J2/temp/solr.core.TestArbitraryIndexDir_761573F5FF0B5D42-001/init-core-data-001/index_temp
   [junit4]   2> 2003535 INFO  (coreCloseExecutor-4133-thread-1-processing-x:collection1) [    x:collection1] o.a.s.c.CachingDirectoryFactory looking to close /x1/jenkins/jenkins-slave/workspace/Lucene-Solr-Tests-6.x/solr/build/solr-core/test/J2/temp/solr.core.TestArbitraryIndexDir_761573F5FF0B5D42-001/init-core-data-001/index [CachedDir<<refCount=0;path=/x1/jenkins/jenkins-slave/workspace/Lucene-Solr-Tests-6.x/solr/build/solr-core/test/J2/temp/solr.core.TestArbitraryIndexDir_761573F5FF0B5D42-001/init-core-data-001/index;done=false>>]
   [junit4]   2> 2003535 INFO  (coreCloseExecutor-4133-thread-1-processing-x:collection1) [    x:collection1] o.a.s.c.CachingDirectoryFactory Closing directory, CoreContainer#isShutdown=true
   [junit4]   2> 2003536 INFO  (coreCloseExecutor-4133-thread-1-processing-x:collection1) [    x:collection1] o.a.s.c.CachingDirectoryFactory Closing directory: /x1/jenkins/jenkins-slave/workspace/Lucene-Solr-Tests-6.x/solr/build/solr-core/test/J2/temp/solr.core.TestArbitraryIndexDir_761573F5FF0B5D42-001/init-core-data-001/index
   [junit4]   2> NOTE: leaving temporary files on disk at: /x1/jenkins/jenkins-slave/workspace/Lucene-Solr-Tests-6.x/solr/build/solr-core/test/J2/temp/solr.core.TestArbitraryIndexDir_761573F5FF0B5D42-001
   [junit4]   2> NOTE: test params are: codec=CheapBastard, sim=RandomSimilarity(queryNorm=false,coord=crazy): {}, locale=sr-Latn, timezone=America/Los_Angeles
   [junit4]   2> NOTE: Linux 3.13.0-85-generic amd64/Oracle Corporation 1.8.0_102 (64-bit)/cpus=4,threads=1,free=175589104,total=527433728
   [junit4]   2> NOTE: All tests run in this JVM: [TestFilteredDocIdSet, DirectoryFactoryTest, HdfsRecoveryZkTest, TestPHPSerializedResponseWriter, TestAddFieldRealTimeGet, TermVectorComponentDistributedTest, TestSearchPerf, CoreAdminCreateDiscoverTest, TestGroupingSearch, PrimitiveFieldTypeTest, AssignTest, TestJmxIntegration, ChangedSchemaMergeTest, TestSort, TestShardHandlerFactory, TestFuzzyAnalyzedSuggestions, CdcrReplicationHandlerTest, TestSolrFieldCacheMBean, PluginInfoTest, CollectionsAPIAsyncDistributedZkTest, TestSolrJ, DirectUpdateHandlerOptimizeTest, TestAnalyzeInfixSuggestions, SSLMigrationTest, TestExclusionRuleCollectionAccess, OverseerStatusTest, OverseerCollectionConfigSetProcessorTest, ScriptEngineTest, TestCSVResponseWriter, TestZkChroot, TestJmxMonitoredMap, ForceLeaderTest, MergeStrategyTest, TestSchemaNameResource, TestBlobHandler, SearchHandlerTest, ParsingFieldUpdateProcessorsTest, TestRequestForwarding, TestReplicationHandlerBackup, TestFieldCacheSortRandom, InfoHandlerTest, RuleEngineTest, TestExtendedDismaxParser, TestElisionMultitermQuery, OverseerTest, TestRecoveryHdfs, TestFieldCacheReopen, SuggesterTSTTest, TestIndexSearcher, BlockDirectoryTest, TestScoreJoinQPNoScore, TestSolrXml, TestJsonFacets, TestSimpleQParserPlugin, TestAuthenticationFramework, RequestHandlersTest, CloneFieldUpdateProcessorFactoryTest, DocValuesMultiTest, HdfsThreadLeakTest, CloudMLTQParserTest, TestRecovery, UnloadDistributedZkTest, CircularListTest, XmlUpdateRequestHandlerTest, SliceStateTest, TestSolrIndexConfig, LeaderElectionTest, CustomCollectionTest, DirectUpdateHandlerTest, TestAuthorizationFramework, TestXIncludeConfig, TestPostingsSolrHighlighter, SampleTest, TolerantUpdateProcessorTest, BadComponentTest, TestDFISimilarityFactory, AutoCommitTest, TestConfigSetImmutable, TestCharFilters, ReplicationFactorTest, TestObjectReleaseTracker, QueryResultKeyTest, CurrencyFieldXmlFileTest, TestWriterPerf, TestInitParams, TestSQLHandler, TestMiniSolrCloudCluster, TestManagedResourceStorage, TestSha256AuthenticationProvider, LukeRequestHandlerTest, TestReload, DateMathParserTest, TestCustomDocTransformer, DistributedFacetPivotLargeTest, CoreAdminHandlerTest, TestShortCircuitedRequests, TestSchemaVersionResource, LeaderInitiatedRecoveryOnCommitTest, TestSolrQueryParser, CollectionReloadTest, TestSolrDeletionPolicy1, RecoveryZkTest, TestRandomFaceting, TestDistributedSearch, SoftAutoCommitTest, SuggesterTest, TestTrie, SpatialFilterTest, SuggesterWFSTTest, NoCacheHeaderTest, WordBreakSolrSpellCheckerTest, SolrCoreCheckLockOnStartupTest, FieldMutatingUpdateProcessorTest, TestAtomicUpdateErrorCases, QueryEqualityTest, DefaultValueUpdateProcessorTest, StatelessScriptUpdateProcessorFactoryTest, DistanceFunctionTest, DebugComponentTest, CacheHeaderTest, DirectSolrSpellCheckerTest, DocumentAnalysisRequestHandlerTest, TestOmitPositions, TestValueSourceCache, MoreLikeThisHandlerTest, FieldAnalysisRequestHandlerTest, TestArbitraryIndexDir]
   [junit4] Completed [330/632 (1!)] on J2 in 1.57s, 1 test, 1 error <<< FAILURES!

[...truncated 61230 lines...]



Mime
View raw message