lucene-dev mailing list archives

Site index · List index
Message view « Date » · « Thread »
Top « Date » · « Thread »
From Policeman Jenkins Server <jenk...@thetaphi.de>
Subject [JENKINS] Lucene-Solr-5.5-Linux (32bit/jdk1.7.0_80) - Build # 361 - Still Unstable!
Date Thu, 01 Sep 2016 07:51:39 GMT
Build: http://jenkins.thetaphi.de/job/Lucene-Solr-5.5-Linux/361/
Java: 32bit/jdk1.7.0_80 -client -XX:+UseG1GC

3 tests failed.
FAILED:  junit.framework.TestSuite.org.apache.solr.handler.TestSolrConfigHandlerCloud

Error Message:
ObjectTracker found 4 object(s) that were not released!!! [MockDirectoryWrapper, MDCAwareThreadPoolExecutor, MDCAwareThreadPoolExecutor, MockDirectoryWrapper]

Stack Trace:
java.lang.AssertionError: ObjectTracker found 4 object(s) that were not released!!! [MockDirectoryWrapper, MDCAwareThreadPoolExecutor, MDCAwareThreadPoolExecutor, MockDirectoryWrapper]
	at __randomizedtesting.SeedInfo.seed([1918B175AA10C50C]:0)
	at org.junit.Assert.fail(Assert.java:93)
	at org.junit.Assert.assertTrue(Assert.java:43)
	at org.junit.Assert.assertNull(Assert.java:551)
	at org.apache.solr.SolrTestCaseJ4.afterClass(SolrTestCaseJ4.java:238)
	at sun.reflect.GeneratedMethodAccessor20.invoke(Unknown Source)
	at sun.reflect.DelegatingMethodAccessorImpl.invoke(DelegatingMethodAccessorImpl.java:43)
	at java.lang.reflect.Method.invoke(Method.java:606)
	at com.carrotsearch.randomizedtesting.RandomizedRunner.invoke(RandomizedRunner.java:1764)
	at com.carrotsearch.randomizedtesting.RandomizedRunner$7.evaluate(RandomizedRunner.java:834)
	at com.carrotsearch.randomizedtesting.rules.StatementAdapter.evaluate(StatementAdapter.java:36)
	at com.carrotsearch.randomizedtesting.rules.SystemPropertiesRestoreRule$1.evaluate(SystemPropertiesRestoreRule.java:57)
	at org.apache.lucene.util.AbstractBeforeAfterRule$1.evaluate(AbstractBeforeAfterRule.java:45)
	at com.carrotsearch.randomizedtesting.rules.StatementAdapter.evaluate(StatementAdapter.java:36)
	at org.apache.lucene.util.TestRuleStoreClassName$1.evaluate(TestRuleStoreClassName.java:41)
	at com.carrotsearch.randomizedtesting.rules.NoShadowingOrOverridesOnMethodsRule$1.evaluate(NoShadowingOrOverridesOnMethodsRule.java:40)
	at com.carrotsearch.randomizedtesting.rules.NoShadowingOrOverridesOnMethodsRule$1.evaluate(NoShadowingOrOverridesOnMethodsRule.java:40)
	at com.carrotsearch.randomizedtesting.rules.StatementAdapter.evaluate(StatementAdapter.java:36)
	at com.carrotsearch.randomizedtesting.rules.StatementAdapter.evaluate(StatementAdapter.java:36)
	at com.carrotsearch.randomizedtesting.rules.StatementAdapter.evaluate(StatementAdapter.java:36)
	at org.apache.lucene.util.TestRuleAssertionsRequired$1.evaluate(TestRuleAssertionsRequired.java:53)
	at org.apache.lucene.util.TestRuleMarkFailure$1.evaluate(TestRuleMarkFailure.java:47)
	at org.apache.lucene.util.TestRuleIgnoreAfterMaxFailures$1.evaluate(TestRuleIgnoreAfterMaxFailures.java:64)
	at org.apache.lucene.util.TestRuleIgnoreTestSuites$1.evaluate(TestRuleIgnoreTestSuites.java:54)
	at com.carrotsearch.randomizedtesting.rules.StatementAdapter.evaluate(StatementAdapter.java:36)
	at com.carrotsearch.randomizedtesting.ThreadLeakControl$StatementRunner.run(ThreadLeakControl.java:367)
	at java.lang.Thread.run(Thread.java:745)


FAILED:  org.apache.lucene.spatial.util.TestGeoUtils.testGeoRelations

Error Message:
1 incorrect hits (see above)

Stack Trace:
java.lang.AssertionError: 1 incorrect hits (see above)
	at __randomizedtesting.SeedInfo.seed([393E79DA9C1D8F90:FB1D6D6FE8EAF92E]:0)
	at org.junit.Assert.fail(Assert.java:93)
	at org.apache.lucene.spatial.util.TestGeoUtils.testGeoRelations(TestGeoUtils.java:543)
	at sun.reflect.NativeMethodAccessorImpl.invoke0(Native Method)
	at sun.reflect.NativeMethodAccessorImpl.invoke(NativeMethodAccessorImpl.java:57)
	at sun.reflect.DelegatingMethodAccessorImpl.invoke(DelegatingMethodAccessorImpl.java:43)
	at java.lang.reflect.Method.invoke(Method.java:606)
	at com.carrotsearch.randomizedtesting.RandomizedRunner.invoke(RandomizedRunner.java:1764)
	at com.carrotsearch.randomizedtesting.RandomizedRunner$8.evaluate(RandomizedRunner.java:871)
	at com.carrotsearch.randomizedtesting.RandomizedRunner$9.evaluate(RandomizedRunner.java:907)
	at com.carrotsearch.randomizedtesting.RandomizedRunner$10.evaluate(RandomizedRunner.java:921)
	at org.apache.lucene.util.TestRuleSetupTeardownChained$1.evaluate(TestRuleSetupTeardownChained.java:49)
	at org.apache.lucene.util.AbstractBeforeAfterRule$1.evaluate(AbstractBeforeAfterRule.java:45)
	at org.apache.lucene.util.TestRuleThreadAndTestName$1.evaluate(TestRuleThreadAndTestName.java:48)
	at org.apache.lucene.util.TestRuleIgnoreAfterMaxFailures$1.evaluate(TestRuleIgnoreAfterMaxFailures.java:64)
	at org.apache.lucene.util.TestRuleMarkFailure$1.evaluate(TestRuleMarkFailure.java:47)
	at com.carrotsearch.randomizedtesting.rules.StatementAdapter.evaluate(StatementAdapter.java:36)
	at com.carrotsearch.randomizedtesting.ThreadLeakControl$StatementRunner.run(ThreadLeakControl.java:367)
	at com.carrotsearch.randomizedtesting.ThreadLeakControl.forkTimeoutingTask(ThreadLeakControl.java:809)
	at com.carrotsearch.randomizedtesting.ThreadLeakControl$3.evaluate(ThreadLeakControl.java:460)
	at com.carrotsearch.randomizedtesting.RandomizedRunner.runSingleTest(RandomizedRunner.java:880)
	at com.carrotsearch.randomizedtesting.RandomizedRunner$5.evaluate(RandomizedRunner.java:781)
	at com.carrotsearch.randomizedtesting.RandomizedRunner$6.evaluate(RandomizedRunner.java:816)
	at com.carrotsearch.randomizedtesting.RandomizedRunner$7.evaluate(RandomizedRunner.java:827)
	at org.apache.lucene.util.AbstractBeforeAfterRule$1.evaluate(AbstractBeforeAfterRule.java:45)
	at com.carrotsearch.randomizedtesting.rules.StatementAdapter.evaluate(StatementAdapter.java:36)
	at org.apache.lucene.util.TestRuleStoreClassName$1.evaluate(TestRuleStoreClassName.java:41)
	at com.carrotsearch.randomizedtesting.rules.NoShadowingOrOverridesOnMethodsRule$1.evaluate(NoShadowingOrOverridesOnMethodsRule.java:40)
	at com.carrotsearch.randomizedtesting.rules.NoShadowingOrOverridesOnMethodsRule$1.evaluate(NoShadowingOrOverridesOnMethodsRule.java:40)
	at com.carrotsearch.randomizedtesting.rules.StatementAdapter.evaluate(StatementAdapter.java:36)
	at com.carrotsearch.randomizedtesting.rules.StatementAdapter.evaluate(StatementAdapter.java:36)
	at com.carrotsearch.randomizedtesting.rules.StatementAdapter.evaluate(StatementAdapter.java:36)
	at org.apache.lucene.util.TestRuleAssertionsRequired$1.evaluate(TestRuleAssertionsRequired.java:53)
	at org.apache.lucene.util.TestRuleMarkFailure$1.evaluate(TestRuleMarkFailure.java:47)
	at org.apache.lucene.util.TestRuleIgnoreAfterMaxFailures$1.evaluate(TestRuleIgnoreAfterMaxFailures.java:64)
	at org.apache.lucene.util.TestRuleIgnoreTestSuites$1.evaluate(TestRuleIgnoreTestSuites.java:54)
	at com.carrotsearch.randomizedtesting.rules.StatementAdapter.evaluate(StatementAdapter.java:36)
	at com.carrotsearch.randomizedtesting.ThreadLeakControl$StatementRunner.run(ThreadLeakControl.java:367)
	at java.lang.Thread.run(Thread.java:745)


FAILED:  org.apache.solr.schema.TestManagedSchemaAPI.test

Error Message:
Error from server at http://127.0.0.1:35763/solr/testschemaapi_shard1_replica2: ERROR: [doc=2] unknown field 'myNewField1'

Stack Trace:
org.apache.solr.client.solrj.impl.CloudSolrClient$RouteException: Error from server at http://127.0.0.1:35763/solr/testschemaapi_shard1_replica2: ERROR: [doc=2] unknown field 'myNewField1'
	at __randomizedtesting.SeedInfo.seed([1918B175AA10C50C:914C8EAF04ECA8F4]:0)
	at org.apache.solr.client.solrj.impl.CloudSolrClient.directUpdate(CloudSolrClient.java:653)
	at org.apache.solr.client.solrj.impl.CloudSolrClient.sendRequest(CloudSolrClient.java:1002)
	at org.apache.solr.client.solrj.impl.CloudSolrClient.requestWithRetryOnStaleState(CloudSolrClient.java:891)
	at org.apache.solr.client.solrj.impl.CloudSolrClient.request(CloudSolrClient.java:827)
	at org.apache.solr.schema.TestManagedSchemaAPI.testAddFieldAndDocument(TestManagedSchemaAPI.java:101)
	at org.apache.solr.schema.TestManagedSchemaAPI.test(TestManagedSchemaAPI.java:69)
	at sun.reflect.NativeMethodAccessorImpl.invoke0(Native Method)
	at sun.reflect.NativeMethodAccessorImpl.invoke(NativeMethodAccessorImpl.java:57)
	at sun.reflect.DelegatingMethodAccessorImpl.invoke(DelegatingMethodAccessorImpl.java:43)
	at java.lang.reflect.Method.invoke(Method.java:606)
	at com.carrotsearch.randomizedtesting.RandomizedRunner.invoke(RandomizedRunner.java:1764)
	at com.carrotsearch.randomizedtesting.RandomizedRunner$8.evaluate(RandomizedRunner.java:871)
	at com.carrotsearch.randomizedtesting.RandomizedRunner$9.evaluate(RandomizedRunner.java:907)
	at com.carrotsearch.randomizedtesting.RandomizedRunner$10.evaluate(RandomizedRunner.java:921)
	at com.carrotsearch.randomizedtesting.rules.SystemPropertiesRestoreRule$1.evaluate(SystemPropertiesRestoreRule.java:57)
	at org.apache.lucene.util.TestRuleSetupTeardownChained$1.evaluate(TestRuleSetupTeardownChained.java:49)
	at org.apache.lucene.util.AbstractBeforeAfterRule$1.evaluate(AbstractBeforeAfterRule.java:45)
	at org.apache.lucene.util.TestRuleThreadAndTestName$1.evaluate(TestRuleThreadAndTestName.java:48)
	at org.apache.lucene.util.TestRuleIgnoreAfterMaxFailures$1.evaluate(TestRuleIgnoreAfterMaxFailures.java:64)
	at org.apache.lucene.util.TestRuleMarkFailure$1.evaluate(TestRuleMarkFailure.java:47)
	at com.carrotsearch.randomizedtesting.rules.StatementAdapter.evaluate(StatementAdapter.java:36)
	at com.carrotsearch.randomizedtesting.ThreadLeakControl$StatementRunner.run(ThreadLeakControl.java:367)
	at com.carrotsearch.randomizedtesting.ThreadLeakControl.forkTimeoutingTask(ThreadLeakControl.java:809)
	at com.carrotsearch.randomizedtesting.ThreadLeakControl$3.evaluate(ThreadLeakControl.java:460)
	at com.carrotsearch.randomizedtesting.RandomizedRunner.runSingleTest(RandomizedRunner.java:880)
	at com.carrotsearch.randomizedtesting.RandomizedRunner$5.evaluate(RandomizedRunner.java:781)
	at com.carrotsearch.randomizedtesting.RandomizedRunner$6.evaluate(RandomizedRunner.java:816)
	at com.carrotsearch.randomizedtesting.RandomizedRunner$7.evaluate(RandomizedRunner.java:827)
	at com.carrotsearch.randomizedtesting.rules.StatementAdapter.evaluate(StatementAdapter.java:36)
	at com.carrotsearch.randomizedtesting.rules.SystemPropertiesRestoreRule$1.evaluate(SystemPropertiesRestoreRule.java:57)
	at org.apache.lucene.util.AbstractBeforeAfterRule$1.evaluate(AbstractBeforeAfterRule.java:45)
	at com.carrotsearch.randomizedtesting.rules.StatementAdapter.evaluate(StatementAdapter.java:36)
	at org.apache.lucene.util.TestRuleStoreClassName$1.evaluate(TestRuleStoreClassName.java:41)
	at com.carrotsearch.randomizedtesting.rules.NoShadowingOrOverridesOnMethodsRule$1.evaluate(NoShadowingOrOverridesOnMethodsRule.java:40)
	at com.carrotsearch.randomizedtesting.rules.NoShadowingOrOverridesOnMethodsRule$1.evaluate(NoShadowingOrOverridesOnMethodsRule.java:40)
	at com.carrotsearch.randomizedtesting.rules.StatementAdapter.evaluate(StatementAdapter.java:36)
	at com.carrotsearch.randomizedtesting.rules.StatementAdapter.evaluate(StatementAdapter.java:36)
	at com.carrotsearch.randomizedtesting.rules.StatementAdapter.evaluate(StatementAdapter.java:36)
	at org.apache.lucene.util.TestRuleAssertionsRequired$1.evaluate(TestRuleAssertionsRequired.java:53)
	at org.apache.lucene.util.TestRuleMarkFailure$1.evaluate(TestRuleMarkFailure.java:47)
	at org.apache.lucene.util.TestRuleIgnoreAfterMaxFailures$1.evaluate(TestRuleIgnoreAfterMaxFailures.java:64)
	at org.apache.lucene.util.TestRuleIgnoreTestSuites$1.evaluate(TestRuleIgnoreTestSuites.java:54)
	at com.carrotsearch.randomizedtesting.rules.StatementAdapter.evaluate(StatementAdapter.java:36)
	at com.carrotsearch.randomizedtesting.ThreadLeakControl$StatementRunner.run(ThreadLeakControl.java:367)
	at java.lang.Thread.run(Thread.java:745)
Caused by: org.apache.solr.client.solrj.impl.HttpSolrClient$RemoteSolrException: Error from server at http://127.0.0.1:35763/solr/testschemaapi_shard1_replica2: ERROR: [doc=2] unknown field 'myNewField1'
	at org.apache.solr.client.solrj.impl.HttpSolrClient.executeMethod(HttpSolrClient.java:577)
	at org.apache.solr.client.solrj.impl.HttpSolrClient.request(HttpSolrClient.java:241)
	at org.apache.solr.client.solrj.impl.HttpSolrClient.request(HttpSolrClient.java:230)
	at org.apache.solr.client.solrj.impl.LBHttpSolrClient.doRequest(LBHttpSolrClient.java:372)
	at org.apache.solr.client.solrj.impl.LBHttpSolrClient.request(LBHttpSolrClient.java:325)
	at org.apache.solr.client.solrj.impl.CloudSolrClient$2.call(CloudSolrClient.java:628)
	at org.apache.solr.client.solrj.impl.CloudSolrClient$2.call(CloudSolrClient.java:625)
	at java.util.concurrent.FutureTask.run(FutureTask.java:262)
	at org.apache.solr.common.util.ExecutorUtil$MDCAwareThreadPoolExecutor$1.run(ExecutorUtil.java:231)
	at java.util.concurrent.ThreadPoolExecutor.runWorker(ThreadPoolExecutor.java:1145)
	at java.util.concurrent.ThreadPoolExecutor$Worker.run(ThreadPoolExecutor.java:615)
	... 1 more




Build Log:
[...truncated 8822 lines...]
   [junit4] Suite: org.apache.lucene.spatial.util.TestGeoUtils
   [junit4]   1> doc=2171 matched but should not with distance error 0.020673674480758183 on iteration 112
   [junit4]   1>   lon=-90.46704322043414 lat=-88.17946309351726 distanceMeters=280054.6624017913 vs radiusMeters=274264.90347447805
   [junit4]   2> NOTE: reproduce with: ant test  -Dtestcase=TestGeoUtils -Dtests.method=testGeoRelations -Dtests.seed=393E79DA9C1D8F90 -Dtests.multiplier=3 -Dtests.slow=true -Dtests.locale=en-GB -Dtests.timezone=America/Indiana/Indianapolis -Dtests.asserts=true -Dtests.file.encoding=ISO-8859-1
   [junit4] FAILURE 1.67s J0 | TestGeoUtils.testGeoRelations <<<
   [junit4]    > Throwable #1: java.lang.AssertionError: 1 incorrect hits (see above)
   [junit4]    > 	at __randomizedtesting.SeedInfo.seed([393E79DA9C1D8F90:FB1D6D6FE8EAF92E]:0)
   [junit4]    > 	at org.apache.lucene.spatial.util.TestGeoUtils.testGeoRelations(TestGeoUtils.java:543)
   [junit4]    > 	at java.lang.Thread.run(Thread.java:745)
   [junit4]   2> NOTE: test params are: codec=Asserting(Lucene54): {}, docValues:{}, sim=RandomSimilarity(queryNorm=false,coord=yes): {}, locale=en-GB, timezone=America/Indiana/Indianapolis
   [junit4]   2> NOTE: Linux 4.4.0-31-generic i386/Oracle Corporation 1.7.0_80 (32-bit)/cpus=12,threads=1,free=208920176,total=279969792
   [junit4]   2> NOTE: All tests run in this JVM: [QueryEqualsHashCodeTest, TestTermQueryPrefixGridStrategy, CompositeStrategyTest, TestGeoUtils]
   [junit4] Completed [5/25 (1!)] on J0 in 1.72s, 9 tests, 1 failure <<< FAILURES!

[...truncated 2022 lines...]
   [junit4] Suite: org.apache.solr.handler.TestSolrConfigHandlerCloud
   [junit4]   2> Creating dataDir: /home/jenkins/workspace/Lucene-Solr-5.5-Linux/solr/build/solr-core/test/J0/temp/solr.handler.TestSolrConfigHandlerCloud_1918B175AA10C50C-001/init-core-data-001
   [junit4]   2> 289553 INFO  (SUITE-TestSolrConfigHandlerCloud-seed#[1918B175AA10C50C]-worker) [    ] o.a.s.SolrTestCaseJ4 Randomized ssl (false) and clientAuth (false)
   [junit4]   2> 289553 INFO  (SUITE-TestSolrConfigHandlerCloud-seed#[1918B175AA10C50C]-worker) [    ] o.a.s.BaseDistributedSearchTestCase Setting hostContext system property: /
   [junit4]   2> 289555 INFO  (TEST-TestSolrConfigHandlerCloud.test-seed#[1918B175AA10C50C]) [    ] o.a.s.c.ZkTestServer STARTING ZK TEST SERVER
   [junit4]   2> 289555 INFO  (Thread-1573) [    ] o.a.s.c.ZkTestServer client port:0.0.0.0/0.0.0.0:0
   [junit4]   2> 289555 INFO  (Thread-1573) [    ] o.a.s.c.ZkTestServer Starting server
   [junit4]   2> 289655 INFO  (TEST-TestSolrConfigHandlerCloud.test-seed#[1918B175AA10C50C]) [    ] o.a.s.c.ZkTestServer start zk server on port:36524
   [junit4]   2> 289655 INFO  (TEST-TestSolrConfigHandlerCloud.test-seed#[1918B175AA10C50C]) [    ] o.a.s.c.c.SolrZkClient Using default ZkCredentialsProvider
   [junit4]   2> 289656 INFO  (TEST-TestSolrConfigHandlerCloud.test-seed#[1918B175AA10C50C]) [    ] o.a.s.c.c.ConnectionManager Waiting for client to connect to ZooKeeper
   [junit4]   2> 289657 INFO  (zkCallback-385-thread-1) [    ] o.a.s.c.c.ConnectionManager Watcher org.apache.solr.common.cloud.ConnectionManager@d3d822 name:ZooKeeperConnection Watcher:127.0.0.1:36524 got event WatchedEvent state:SyncConnected type:None path:null path:null type:None
   [junit4]   2> 289657 INFO  (TEST-TestSolrConfigHandlerCloud.test-seed#[1918B175AA10C50C]) [    ] o.a.s.c.c.ConnectionManager Client is connected to ZooKeeper
   [junit4]   2> 289657 INFO  (TEST-TestSolrConfigHandlerCloud.test-seed#[1918B175AA10C50C]) [    ] o.a.s.c.c.SolrZkClient Using default ZkACLProvider
   [junit4]   2> 289657 INFO  (TEST-TestSolrConfigHandlerCloud.test-seed#[1918B175AA10C50C]) [    ] o.a.s.c.c.SolrZkClient makePath: /solr
   [junit4]   2> 289658 INFO  (TEST-TestSolrConfigHandlerCloud.test-seed#[1918B175AA10C50C]) [    ] o.a.s.c.c.SolrZkClient Using default ZkCredentialsProvider
   [junit4]   2> 289660 INFO  (TEST-TestSolrConfigHandlerCloud.test-seed#[1918B175AA10C50C]) [    ] o.a.s.c.c.ConnectionManager Waiting for client to connect to ZooKeeper
   [junit4]   2> 289660 INFO  (zkCallback-386-thread-1) [    ] o.a.s.c.c.ConnectionManager Watcher org.apache.solr.common.cloud.ConnectionManager@1ed1b4 name:ZooKeeperConnection Watcher:127.0.0.1:36524/solr got event WatchedEvent state:SyncConnected type:None path:null path:null type:None
   [junit4]   2> 289660 INFO  (TEST-TestSolrConfigHandlerCloud.test-seed#[1918B175AA10C50C]) [    ] o.a.s.c.c.ConnectionManager Client is connected to ZooKeeper
   [junit4]   2> 289661 INFO  (TEST-TestSolrConfigHandlerCloud.test-seed#[1918B175AA10C50C]) [    ] o.a.s.c.c.SolrZkClient Using default ZkACLProvider
   [junit4]   2> 289661 INFO  (TEST-TestSolrConfigHandlerCloud.test-seed#[1918B175AA10C50C]) [    ] o.a.s.c.c.SolrZkClient makePath: /collections/collection1
   [junit4]   2> 289661 INFO  (TEST-TestSolrConfigHandlerCloud.test-seed#[1918B175AA10C50C]) [    ] o.a.s.c.c.SolrZkClient makePath: /collections/collection1/shards
   [junit4]   2> 289662 INFO  (TEST-TestSolrConfigHandlerCloud.test-seed#[1918B175AA10C50C]) [    ] o.a.s.c.c.SolrZkClient makePath: /collections/control_collection
   [junit4]   2> 289662 INFO  (TEST-TestSolrConfigHandlerCloud.test-seed#[1918B175AA10C50C]) [    ] o.a.s.c.c.SolrZkClient makePath: /collections/control_collection/shards
   [junit4]   2> 289663 INFO  (TEST-TestSolrConfigHandlerCloud.test-seed#[1918B175AA10C50C]) [    ] o.a.s.c.AbstractZkTestCase put /home/jenkins/workspace/Lucene-Solr-5.5-Linux/solr/core/src/test-files/solr/collection1/conf/solrconfig-tlog.xml to /configs/conf1/solrconfig.xml
   [junit4]   2> 289663 INFO  (TEST-TestSolrConfigHandlerCloud.test-seed#[1918B175AA10C50C]) [    ] o.a.s.c.c.SolrZkClient makePath: /configs/conf1/solrconfig.xml
   [junit4]   2> 289664 INFO  (TEST-TestSolrConfigHandlerCloud.test-seed#[1918B175AA10C50C]) [    ] o.a.s.c.AbstractZkTestCase put /home/jenkins/workspace/Lucene-Solr-5.5-Linux/solr/core/src/test-files/solr/collection1/conf/schema.xml to /configs/conf1/schema.xml
   [junit4]   2> 289664 INFO  (TEST-TestSolrConfigHandlerCloud.test-seed#[1918B175AA10C50C]) [    ] o.a.s.c.c.SolrZkClient makePath: /configs/conf1/schema.xml
   [junit4]   2> 289665 INFO  (TEST-TestSolrConfigHandlerCloud.test-seed#[1918B175AA10C50C]) [    ] o.a.s.c.AbstractZkTestCase put /home/jenkins/workspace/Lucene-Solr-5.5-Linux/solr/core/src/test-files/solr/collection1/conf/solrconfig.snippet.randomindexconfig.xml to /configs/conf1/solrconfig.snippet.randomindexconfig.xml
   [junit4]   2> 289665 INFO  (TEST-TestSolrConfigHandlerCloud.test-seed#[1918B175AA10C50C]) [    ] o.a.s.c.c.SolrZkClient makePath: /configs/conf1/solrconfig.snippet.randomindexconfig.xml
   [junit4]   2> 289666 INFO  (TEST-TestSolrConfigHandlerCloud.test-seed#[1918B175AA10C50C]) [    ] o.a.s.c.AbstractZkTestCase put /home/jenkins/workspace/Lucene-Solr-5.5-Linux/solr/core/src/test-files/solr/collection1/conf/stopwords.txt to /configs/conf1/stopwords.txt
   [junit4]   2> 289666 INFO  (TEST-TestSolrConfigHandlerCloud.test-seed#[1918B175AA10C50C]) [    ] o.a.s.c.c.SolrZkClient makePath: /configs/conf1/stopwords.txt
   [junit4]   2> 289667 INFO  (TEST-TestSolrConfigHandlerCloud.test-seed#[1918B175AA10C50C]) [    ] o.a.s.c.AbstractZkTestCase put /home/jenkins/workspace/Lucene-Solr-5.5-Linux/solr/core/src/test-files/solr/collection1/conf/protwords.txt to /configs/conf1/protwords.txt
   [junit4]   2> 289668 INFO  (TEST-TestSolrConfigHandlerCloud.test-seed#[1918B175AA10C50C]) [    ] o.a.s.c.c.SolrZkClient makePath: /configs/conf1/protwords.txt
   [junit4]   2> 289668 INFO  (TEST-TestSolrConfigHandlerCloud.test-seed#[1918B175AA10C50C]) [    ] o.a.s.c.AbstractZkTestCase put /home/jenkins/workspace/Lucene-Solr-5.5-Linux/solr/core/src/test-files/solr/collection1/conf/currency.xml to /configs/conf1/currency.xml
   [junit4]   2> 289668 INFO  (TEST-TestSolrConfigHandlerCloud.test-seed#[1918B175AA10C50C]) [    ] o.a.s.c.c.SolrZkClient makePath: /configs/conf1/currency.xml
   [junit4]   2> 289669 INFO  (TEST-TestSolrConfigHandlerCloud.test-seed#[1918B175AA10C50C]) [    ] o.a.s.c.AbstractZkTestCase put /home/jenkins/workspace/Lucene-Solr-5.5-Linux/solr/core/src/test-files/solr/collection1/conf/enumsConfig.xml to /configs/conf1/enumsConfig.xml
   [junit4]   2> 289669 INFO  (TEST-TestSolrConfigHandlerCloud.test-seed#[1918B175AA10C50C]) [    ] o.a.s.c.c.SolrZkClient makePath: /configs/conf1/enumsConfig.xml
   [junit4]   2> 289670 INFO  (TEST-TestSolrConfigHandlerCloud.test-seed#[1918B175AA10C50C]) [    ] o.a.s.c.AbstractZkTestCase put /home/jenkins/workspace/Lucene-Solr-5.5-Linux/solr/core/src/test-files/solr/collection1/conf/open-exchange-rates.json to /configs/conf1/open-exchange-rates.json
   [junit4]   2> 289670 INFO  (TEST-TestSolrConfigHandlerCloud.test-seed#[1918B175AA10C50C]) [    ] o.a.s.c.c.SolrZkClient makePath: /configs/conf1/open-exchange-rates.json
   [junit4]   2> 289670 INFO  (TEST-TestSolrConfigHandlerCloud.test-seed#[1918B175AA10C50C]) [    ] o.a.s.c.AbstractZkTestCase put /home/jenkins/workspace/Lucene-Solr-5.5-Linux/solr/core/src/test-files/solr/collection1/conf/mapping-ISOLatin1Accent.txt to /configs/conf1/mapping-ISOLatin1Accent.txt
   [junit4]   2> 289670 INFO  (TEST-TestSolrConfigHandlerCloud.test-seed#[1918B175AA10C50C]) [    ] o.a.s.c.c.SolrZkClient makePath: /configs/conf1/mapping-ISOLatin1Accent.txt
   [junit4]   2> 289671 INFO  (TEST-TestSolrConfigHandlerCloud.test-seed#[1918B175AA10C50C]) [    ] o.a.s.c.AbstractZkTestCase put /home/jenkins/workspace/Lucene-Solr-5.5-Linux/solr/core/src/test-files/solr/collection1/conf/old_synonyms.txt to /configs/conf1/old_synonyms.txt
   [junit4]   2> 289671 INFO  (TEST-TestSolrConfigHandlerCloud.test-seed#[1918B175AA10C50C]) [    ] o.a.s.c.c.SolrZkClient makePath: /configs/conf1/old_synonyms.txt
   [junit4]   2> 289672 INFO  (TEST-TestSolrConfigHandlerCloud.test-seed#[1918B175AA10C50C]) [    ] o.a.s.c.AbstractZkTestCase put /home/jenkins/workspace/Lucene-Solr-5.5-Linux/solr/core/src/test-files/solr/collection1/conf/synonyms.txt to /configs/conf1/synonyms.txt
   [junit4]   2> 289672 INFO  (TEST-TestSolrConfigHandlerCloud.test-seed#[1918B175AA10C50C]) [    ] o.a.s.c.c.SolrZkClient makePath: /configs/conf1/synonyms.txt
   [junit4]   2> 289726 INFO  (TEST-TestSolrConfigHandlerCloud.test-seed#[1918B175AA10C50C]) [    ] o.a.s.SolrTestCaseJ4 Writing core.properties file to /home/jenkins/workspace/Lucene-Solr-5.5-Linux/solr/build/solr-core/test/J0/temp/solr.handler.TestSolrConfigHandlerCloud_1918B175AA10C50C-001/control-001/cores/collection1
   [junit4]   2> 289727 INFO  (TEST-TestSolrConfigHandlerCloud.test-seed#[1918B175AA10C50C]) [    ] o.e.j.s.Server jetty-9.2.13.v20150730
   [junit4]   2> 289728 INFO  (TEST-TestSolrConfigHandlerCloud.test-seed#[1918B175AA10C50C]) [    ] o.e.j.s.h.ContextHandler Started o.e.j.s.ServletContextHandler@6453e2{/,null,AVAILABLE}
   [junit4]   2> 289730 INFO  (TEST-TestSolrConfigHandlerCloud.test-seed#[1918B175AA10C50C]) [    ] o.e.j.s.ServerConnector Started ServerConnector@1299ebc{HTTP/1.1}{127.0.0.1:33918}
   [junit4]   2> 289730 INFO  (TEST-TestSolrConfigHandlerCloud.test-seed#[1918B175AA10C50C]) [    ] o.e.j.s.Server Started @291097ms
   [junit4]   2> 289730 INFO  (TEST-TestSolrConfigHandlerCloud.test-seed#[1918B175AA10C50C]) [    ] o.a.s.c.s.e.JettySolrRunner Jetty properties: {hostPort=33918, coreRootDirectory=/home/jenkins/workspace/Lucene-Solr-5.5-Linux/solr/build/solr-core/test/J0/../../../../../../../../../home/jenkins/workspace/Lucene-Solr-5.5-Linux/solr/build/solr-core/test/J0/temp/solr.handler.TestSolrConfigHandlerCloud_1918B175AA10C50C-001/control-001/cores, hostContext=/, solr.data.dir=/home/jenkins/workspace/Lucene-Solr-5.5-Linux/solr/build/solr-core/test/J0/temp/solr.handler.TestSolrConfigHandlerCloud_1918B175AA10C50C-001/tempDir-001/control/data}
   [junit4]   2> 289730 INFO  (TEST-TestSolrConfigHandlerCloud.test-seed#[1918B175AA10C50C]) [    ] o.a.s.s.SolrDispatchFilter SolrDispatchFilter.init(): sun.misc.Launcher$AppClassLoader@192e317
   [junit4]   2> 289730 INFO  (TEST-TestSolrConfigHandlerCloud.test-seed#[1918B175AA10C50C]) [    ] o.a.s.c.SolrResourceLoader new SolrResourceLoader for directory: '/home/jenkins/workspace/Lucene-Solr-5.5-Linux/solr/build/solr-core/test/J0/temp/solr.handler.TestSolrConfigHandlerCloud_1918B175AA10C50C-001/control-001'
   [junit4]   2> 289730 INFO  (TEST-TestSolrConfigHandlerCloud.test-seed#[1918B175AA10C50C]) [    ] o.a.s.c.SolrResourceLoader JNDI not configured for solr (NoInitialContextEx)
   [junit4]   2> 289730 INFO  (TEST-TestSolrConfigHandlerCloud.test-seed#[1918B175AA10C50C]) [    ] o.a.s.c.SolrResourceLoader solr home defaulted to 'solr/' (could not find system property or JNDI)
   [junit4]   2> 289730 INFO  (TEST-TestSolrConfigHandlerCloud.test-seed#[1918B175AA10C50C]) [    ] o.a.s.c.c.SolrZkClient Using default ZkCredentialsProvider
   [junit4]   2> 289731 INFO  (TEST-TestSolrConfigHandlerCloud.test-seed#[1918B175AA10C50C]) [    ] o.a.s.c.c.ConnectionManager Waiting for client to connect to ZooKeeper
   [junit4]   2> 289731 INFO  (zkCallback-387-thread-1) [    ] o.a.s.c.c.ConnectionManager Watcher org.apache.solr.common.cloud.ConnectionManager@24b7c5 name:ZooKeeperConnection Watcher:127.0.0.1:36524/solr got event WatchedEvent state:SyncConnected type:None path:null path:null type:None
   [junit4]   2> 289732 INFO  (TEST-TestSolrConfigHandlerCloud.test-seed#[1918B175AA10C50C]) [    ] o.a.s.c.c.ConnectionManager Client is connected to ZooKeeper
   [junit4]   2> 289732 INFO  (TEST-TestSolrConfigHandlerCloud.test-seed#[1918B175AA10C50C]) [    ] o.a.s.c.c.SolrZkClient Using default ZkACLProvider
   [junit4]   2> 289732 INFO  (TEST-TestSolrConfigHandlerCloud.test-seed#[1918B175AA10C50C]) [    ] o.a.s.s.SolrDispatchFilter Loading solr.xml from SolrHome (not found in ZooKeeper)
   [junit4]   2> 289732 INFO  (TEST-TestSolrConfigHandlerCloud.test-seed#[1918B175AA10C50C]) [    ] o.a.s.c.SolrXmlConfig Loading container configuration from /home/jenkins/workspace/Lucene-Solr-5.5-Linux/solr/build/solr-core/test/J0/temp/solr.handler.TestSolrConfigHandlerCloud_1918B175AA10C50C-001/control-001/solr.xml
   [junit4]   2> 289744 INFO  (TEST-TestSolrConfigHandlerCloud.test-seed#[1918B175AA10C50C]) [    ] o.a.s.c.CorePropertiesLocator Config-defined core root directory: /home/jenkins/workspace/Lucene-Solr-5.5-Linux/solr/build/solr-core/test/J0/../../../../../../../../../home/jenkins/workspace/Lucene-Solr-5.5-Linux/solr/build/solr-core/test/J0/temp/solr.handler.TestSolrConfigHandlerCloud_1918B175AA10C50C-001/control-001/cores
   [junit4]   2> 289744 INFO  (TEST-TestSolrConfigHandlerCloud.test-seed#[1918B175AA10C50C]) [    ] o.a.s.c.CoreContainer New CoreContainer 7842888
   [junit4]   2> 289744 INFO  (TEST-TestSolrConfigHandlerCloud.test-seed#[1918B175AA10C50C]) [    ] o.a.s.c.CoreContainer Loading cores into CoreContainer [instanceDir=/home/jenkins/workspace/Lucene-Solr-5.5-Linux/solr/build/solr-core/test/J0/temp/solr.handler.TestSolrConfigHandlerCloud_1918B175AA10C50C-001/control-001]
   [junit4]   2> 289744 WARN  (TEST-TestSolrConfigHandlerCloud.test-seed#[1918B175AA10C50C]) [    ] o.a.s.c.CoreContainer Couldn't add files from /home/jenkins/workspace/Lucene-Solr-5.5-Linux/solr/build/solr-core/test/J0/temp/solr.handler.TestSolrConfigHandlerCloud_1918B175AA10C50C-001/control-001/lib to classpath: /home/jenkins/workspace/Lucene-Solr-5.5-Linux/solr/build/solr-core/test/J0/temp/solr.handler.TestSolrConfigHandlerCloud_1918B175AA10C50C-001/control-001/lib
   [junit4]   2> 289744 INFO  (TEST-TestSolrConfigHandlerCloud.test-seed#[1918B175AA10C50C]) [    ] o.a.s.h.c.HttpShardHandlerFactory created with socketTimeout : 90000,urlScheme : ,connTimeout : 15000,maxConnectionsPerHost : 20,maxConnections : 10000,corePoolSize : 0,maximumPoolSize : 2147483647,maxThreadIdleTime : 5,sizeOfQueue : -1,fairnessPolicy : false,useRetries : false,connectionsEvictorSleepDelay : 5000,maxConnectionIdleTime : 40000,
   [junit4]   2> 289745 INFO  (TEST-TestSolrConfigHandlerCloud.test-seed#[1918B175AA10C50C]) [    ] o.a.s.u.UpdateShardHandler Creating UpdateShardHandler HTTP client with params: socketTimeout=340000&connTimeout=45000&retry=true
   [junit4]   2> 289746 INFO  (TEST-TestSolrConfigHandlerCloud.test-seed#[1918B175AA10C50C]) [    ] o.a.s.l.LogWatcher SLF4J impl is org.slf4j.impl.Log4jLoggerFactory
   [junit4]   2> 289746 INFO  (TEST-TestSolrConfigHandlerCloud.test-seed#[1918B175AA10C50C]) [    ] o.a.s.l.LogWatcher Registering Log Listener [Log4j (org.slf4j.impl.Log4jLoggerFactory)]
   [junit4]   2> 289746 INFO  (TEST-TestSolrConfigHandlerCloud.test-seed#[1918B175AA10C50C]) [    ] o.a.s.c.ZkContainer Zookeeper client=127.0.0.1:36524/solr
   [junit4]   2> 289746 INFO  (TEST-TestSolrConfigHandlerCloud.test-seed#[1918B175AA10C50C]) [    ] o.a.s.c.ZkController zkHost includes chroot
   [junit4]   2> 289746 INFO  (TEST-TestSolrConfigHandlerCloud.test-seed#[1918B175AA10C50C]) [    ] o.a.s.c.c.SolrZkClient Using default ZkCredentialsProvider
   [junit4]   2> 289746 INFO  (TEST-TestSolrConfigHandlerCloud.test-seed#[1918B175AA10C50C]) [    ] o.a.s.c.c.ConnectionManager Waiting for client to connect to ZooKeeper
   [junit4]   2> 289747 INFO  (zkCallback-390-thread-1) [    ] o.a.s.c.c.ConnectionManager Watcher org.apache.solr.common.cloud.ConnectionManager@43025f name:ZooKeeperConnection Watcher:127.0.0.1:36524 got event WatchedEvent state:SyncConnected type:None path:null path:null type:None
   [junit4]   2> 289747 INFO  (TEST-TestSolrConfigHandlerCloud.test-seed#[1918B175AA10C50C]) [    ] o.a.s.c.c.ConnectionManager Client is connected to ZooKeeper
   [junit4]   2> 289748 INFO  (TEST-TestSolrConfigHandlerCloud.test-seed#[1918B175AA10C50C]) [    ] o.a.s.c.c.SolrZkClient Using default ZkACLProvider
   [junit4]   2> 289748 INFO  (TEST-TestSolrConfigHandlerCloud.test-seed#[1918B175AA10C50C]) [n:127.0.0.1:33918_    ] o.a.s.c.ZkController Added new OnReconnect listener org.apache.solr.cloud.ZkController$6@143f739
   [junit4]   2> 289748 INFO  (TEST-TestSolrConfigHandlerCloud.test-seed#[1918B175AA10C50C]) [n:127.0.0.1:33918_    ] o.a.s.c.c.ConnectionManager Waiting for client to connect to ZooKeeper
   [junit4]   2> 289749 INFO  (zkCallback-391-thread-1-processing-n:127.0.0.1:33918_) [n:127.0.0.1:33918_    ] o.a.s.c.c.ConnectionManager Watcher org.apache.solr.common.cloud.ConnectionManager@13eff94 name:ZooKeeperConnection Watcher:127.0.0.1:36524/solr got event WatchedEvent state:SyncConnected type:None path:null path:null type:None
   [junit4]   2> 289749 INFO  (TEST-TestSolrConfigHandlerCloud.test-seed#[1918B175AA10C50C]) [n:127.0.0.1:33918_    ] o.a.s.c.c.ConnectionManager Client is connected to ZooKeeper
   [junit4]   2> 289750 INFO  (TEST-TestSolrConfigHandlerCloud.test-seed#[1918B175AA10C50C]) [n:127.0.0.1:33918_    ] o.a.s.c.c.SolrZkClient makePath: /overseer/queue
   [junit4]   2> 289752 INFO  (TEST-TestSolrConfigHandlerCloud.test-seed#[1918B175AA10C50C]) [n:127.0.0.1:33918_    ] o.a.s.c.c.SolrZkClient makePath: /overseer/collection-queue-work
   [junit4]   2> 289753 INFO  (TEST-TestSolrConfigHandlerCloud.test-seed#[1918B175AA10C50C]) [n:127.0.0.1:33918_    ] o.a.s.c.c.SolrZkClient makePath: /overseer/collection-map-running
   [junit4]   2> 289753 INFO  (TEST-TestSolrConfigHandlerCloud.test-seed#[1918B175AA10C50C]) [n:127.0.0.1:33918_    ] o.a.s.c.c.SolrZkClient makePath: /overseer/collection-map-completed
   [junit4]   2> 289754 INFO  (TEST-TestSolrConfigHandlerCloud.test-seed#[1918B175AA10C50C]) [n:127.0.0.1:33918_    ] o.a.s.c.c.SolrZkClient makePath: /overseer/collection-map-failure
   [junit4]   2> 289755 INFO  (TEST-TestSolrConfigHandlerCloud.test-seed#[1918B175AA10C50C]) [n:127.0.0.1:33918_    ] o.a.s.c.c.SolrZkClient makePath: /live_nodes
   [junit4]   2> 289755 INFO  (TEST-TestSolrConfigHandlerCloud.test-seed#[1918B175AA10C50C]) [n:127.0.0.1:33918_    ] o.a.s.c.c.SolrZkClient makePath: /aliases.json
   [junit4]   2> 289756 INFO  (TEST-TestSolrConfigHandlerCloud.test-seed#[1918B175AA10C50C]) [n:127.0.0.1:33918_    ] o.a.s.c.c.SolrZkClient makePath: /clusterstate.json
   [junit4]   2> 289756 INFO  (TEST-TestSolrConfigHandlerCloud.test-seed#[1918B175AA10C50C]) [n:127.0.0.1:33918_    ] o.a.s.c.c.SolrZkClient makePath: /security.json
   [junit4]   2> 289757 INFO  (TEST-TestSolrConfigHandlerCloud.test-seed#[1918B175AA10C50C]) [n:127.0.0.1:33918_    ] o.a.s.c.ZkController Register node as live in ZooKeeper:/live_nodes/127.0.0.1:33918_
   [junit4]   2> 289757 INFO  (TEST-TestSolrConfigHandlerCloud.test-seed#[1918B175AA10C50C]) [n:127.0.0.1:33918_    ] o.a.s.c.c.SolrZkClient makePath: /live_nodes/127.0.0.1:33918_
   [junit4]   2> 289758 INFO  (TEST-TestSolrConfigHandlerCloud.test-seed#[1918B175AA10C50C]) [n:127.0.0.1:33918_    ] o.a.s.c.c.SolrZkClient makePath: /overseer_elect
   [junit4]   2> 289758 INFO  (TEST-TestSolrConfigHandlerCloud.test-seed#[1918B175AA10C50C]) [n:127.0.0.1:33918_    ] o.a.s.c.c.SolrZkClient makePath: /overseer_elect/election
   [junit4]   2> 289759 INFO  (TEST-TestSolrConfigHandlerCloud.test-seed#[1918B175AA10C50C]) [n:127.0.0.1:33918_    ] o.a.s.c.Overseer Overseer (id=null) closing
   [junit4]   2> 289759 INFO  (TEST-TestSolrConfigHandlerCloud.test-seed#[1918B175AA10C50C]) [n:127.0.0.1:33918_    ] o.a.s.c.LeaderElector Joined leadership election with path: /overseer_elect/election/96515778942402564-127.0.0.1:33918_-n_0000000000
   [junit4]   2> 289759 INFO  (TEST-TestSolrConfigHandlerCloud.test-seed#[1918B175AA10C50C]) [n:127.0.0.1:33918_    ] o.a.s.c.OverseerElectionContext I am going to be the leader 127.0.0.1:33918_
   [junit4]   2> 289759 INFO  (TEST-TestSolrConfigHandlerCloud.test-seed#[1918B175AA10C50C]) [n:127.0.0.1:33918_    ] o.a.s.c.c.SolrZkClient makePath: /overseer_elect/leader
   [junit4]   2> 289760 INFO  (TEST-TestSolrConfigHandlerCloud.test-seed#[1918B175AA10C50C]) [n:127.0.0.1:33918_    ] o.a.s.c.Overseer Overseer (id=96515778942402564-127.0.0.1:33918_-n_0000000000) starting
   [junit4]   2> 289760 INFO  (TEST-TestSolrConfigHandlerCloud.test-seed#[1918B175AA10C50C]) [n:127.0.0.1:33918_    ] o.a.s.c.c.SolrZkClient makePath: /overseer/queue-work
   [junit4]   2> 289764 INFO  (TEST-TestSolrConfigHandlerCloud.test-seed#[1918B175AA10C50C]) [n:127.0.0.1:33918_    ] o.a.s.c.OverseerAutoReplicaFailoverThread Starting OverseerAutoReplicaFailoverThread autoReplicaFailoverWorkLoopDelay=10000 autoReplicaFailoverWaitAfterExpiration=30000 autoReplicaFailoverBadNodeExpiration=60000
   [junit4]   2> 289764 INFO  (OverseerCollectionConfigSetProcessor-96515778942402564-127.0.0.1:33918_-n_0000000000) [n:127.0.0.1:33918_    ] o.a.s.c.OverseerTaskProcessor Process current queue of overseer operations
   [junit4]   2> 289764 INFO  (TEST-TestSolrConfigHandlerCloud.test-seed#[1918B175AA10C50C]) [n:127.0.0.1:33918_    ] o.a.s.c.c.ZkStateReader Updating cluster state from ZooKeeper... 
   [junit4]   2> 289764 INFO  (OverseerStateUpdate-96515778942402564-127.0.0.1:33918_-n_0000000000) [n:127.0.0.1:33918_    ] o.a.s.c.Overseer Starting to work on the main queue
   [junit4]   2> 289826 INFO  (TEST-TestSolrConfigHandlerCloud.test-seed#[1918B175AA10C50C]) [n:127.0.0.1:33918_    ] o.a.s.c.CoreContainer Security conf doesn't exist. Skipping setup for authorization module.
   [junit4]   2> 289826 INFO  (TEST-TestSolrConfigHandlerCloud.test-seed#[1918B175AA10C50C]) [n:127.0.0.1:33918_    ] o.a.s.c.CoreContainer No authentication plugin used.
   [junit4]   2> 289826 INFO  (TEST-TestSolrConfigHandlerCloud.test-seed#[1918B175AA10C50C]) [n:127.0.0.1:33918_    ] o.a.s.c.CorePropertiesLocator Looking for core definitions underneath /home/jenkins/workspace/Lucene-Solr-5.5-Linux/solr/build/solr-core/test/J0/../../../../../../../../../home/jenkins/workspace/Lucene-Solr-5.5-Linux/solr/build/solr-core/test/J0/temp/solr.handler.TestSolrConfigHandlerCloud_1918B175AA10C50C-001/control-001/cores
   [junit4]   2> 289827 INFO  (TEST-TestSolrConfigHandlerCloud.test-seed#[1918B175AA10C50C]) [n:127.0.0.1:33918_    ] o.a.s.c.CoreDescriptor Created CoreDescriptor: {schema=schema.xml, shard=, dataDir=data/, name=collection1, configSetProperties=configsetprops.json, loadOnStartup=true, collection=control_collection, transient=false, coreNodeName=, config=solrconfig.xml}
   [junit4]   2> 289827 INFO  (TEST-TestSolrConfigHandlerCloud.test-seed#[1918B175AA10C50C]) [n:127.0.0.1:33918_    ] o.a.s.c.CorePropertiesLocator Found core collection1 in /home/jenkins/workspace/Lucene-Solr-5.5-Linux/solr/build/solr-core/test/J0/../../../../../../../../../home/jenkins/workspace/Lucene-Solr-5.5-Linux/solr/build/solr-core/test/J0/temp/solr.handler.TestSolrConfigHandlerCloud_1918B175AA10C50C-001/control-001/cores/collection1
   [junit4]   2> 289827 INFO  (TEST-TestSolrConfigHandlerCloud.test-seed#[1918B175AA10C50C]) [n:127.0.0.1:33918_    ] o.a.s.c.CorePropertiesLocator Found 1 core definitions
   [junit4]   2> 289828 INFO  (TEST-TestSolrConfigHandlerCloud.test-seed#[1918B175AA10C50C]) [n:127.0.0.1:33918_    ] o.a.s.s.SolrDispatchFilter user.dir=/home/jenkins/workspace/Lucene-Solr-5.5-Linux/solr/build/solr-core/test/J0
   [junit4]   2> 289828 INFO  (TEST-TestSolrConfigHandlerCloud.test-seed#[1918B175AA10C50C]) [n:127.0.0.1:33918_    ] o.a.s.s.SolrDispatchFilter SolrDispatchFilter.init() done
   [junit4]   2> 289828 INFO  (coreLoadExecutor-1609-thread-1-processing-n:127.0.0.1:33918_) [n:127.0.0.1:33918_ c:control_collection   x:collection1] o.a.s.c.ZkController publishing state=down
   [junit4]   2> 289828 INFO  (coreLoadExecutor-1609-thread-1-processing-n:127.0.0.1:33918_) [n:127.0.0.1:33918_ c:control_collection   x:collection1] o.a.s.c.ZkController numShards not found on descriptor - reading it from system property
   [junit4]   2> 289828 INFO  (coreLoadExecutor-1609-thread-1-processing-n:127.0.0.1:33918_) [n:127.0.0.1:33918_ c:control_collection   x:collection1] o.a.s.c.ZkController Collection control_collection not visible yet, but flagging it so a watch is registered when it becomes visible
   [junit4]   2> 289828 INFO  (coreLoadExecutor-1609-thread-1-processing-n:127.0.0.1:33918_) [n:127.0.0.1:33918_ c:control_collection   x:collection1] o.a.s.c.c.ZkStateReader addZkWatch [control_collection]
   [junit4]   2> 289829 INFO  (OverseerStateUpdate-96515778942402564-127.0.0.1:33918_-n_0000000000) [n:127.0.0.1:33918_    ] o.a.s.c.Overseer processMessage: queueSize: 1, message = {
   [junit4]   2>   "node_name":"127.0.0.1:33918_",
   [junit4]   2>   "base_url":"http://127.0.0.1:33918",
   [junit4]   2>   "collection":"control_collection",
   [junit4]   2>   "state":"down",
   [junit4]   2>   "roles":null,
   [junit4]   2>   "core":"collection1",
   [junit4]   2>   "shard":null,
   [junit4]   2>   "operation":"state",
   [junit4]   2>   "numShards":"1"} current state version: 0
   [junit4]   2> 289829 INFO  (coreLoadExecutor-1609-thread-1-processing-n:127.0.0.1:33918_) [n:127.0.0.1:33918_ c:control_collection   x:collection1] o.a.s.c.c.ZkStateReader Deleting data for [control_collection]
   [junit4]   2> 289829 INFO  (OverseerStateUpdate-96515778942402564-127.0.0.1:33918_-n_0000000000) [n:127.0.0.1:33918_    ] o.a.s.c.o.ReplicaMutator Update state numShards=1 message={
   [junit4]   2>   "node_name":"127.0.0.1:33918_",
   [junit4]   2>   "base_url":"http://127.0.0.1:33918",
   [junit4]   2>   "collection":"control_collection",
   [junit4]   2>   "state":"down",
   [junit4]   2>   "roles":null,
   [junit4]   2>   "core":"collection1",
   [junit4]   2>   "shard":null,
   [junit4]   2>   "operation":"state",
   [junit4]   2>   "numShards":"1"}
   [junit4]   2> 289829 INFO  (OverseerStateUpdate-96515778942402564-127.0.0.1:33918_-n_0000000000) [n:127.0.0.1:33918_    ] o.a.s.c.o.ClusterStateMutator building a new cName: control_collection
   [junit4]   2> 289829 INFO  (coreLoadExecutor-1609-thread-1-processing-n:127.0.0.1:33918_) [n:127.0.0.1:33918_ c:control_collection   x:collection1] o.a.s.c.ZkController look for our core node name
   [junit4]   2> 289829 INFO  (OverseerStateUpdate-96515778942402564-127.0.0.1:33918_-n_0000000000) [n:127.0.0.1:33918_    ] o.a.s.c.o.ReplicaMutator Assigning new node to shard shard=shard1
   [junit4]   2> 289830 INFO  (zkCallback-391-thread-1-processing-n:127.0.0.1:33918_) [n:127.0.0.1:33918_    ] o.a.s.c.c.ZkStateReader A cluster state change: [WatchedEvent state:SyncConnected type:NodeDataChanged path:/clusterstate.json], has occurred - updating... (live nodes size: [1])
   [junit4]   2> 290830 INFO  (coreLoadExecutor-1609-thread-1-processing-n:127.0.0.1:33918_) [n:127.0.0.1:33918_ c:control_collection   x:collection1] o.a.s.c.ZkController waiting to find shard id in clusterstate for collection1
   [junit4]   2> 290830 INFO  (coreLoadExecutor-1609-thread-1-processing-n:127.0.0.1:33918_) [n:127.0.0.1:33918_ c:control_collection   x:collection1] o.a.s.c.ZkController Check for collection zkNode:control_collection
   [junit4]   2> 290830 INFO  (coreLoadExecutor-1609-thread-1-processing-n:127.0.0.1:33918_) [n:127.0.0.1:33918_ c:control_collection   x:collection1] o.a.s.c.ZkController Collection zkNode exists
   [junit4]   2> 290830 INFO  (coreLoadExecutor-1609-thread-1-processing-n:127.0.0.1:33918_) [n:127.0.0.1:33918_ c:control_collection   x:collection1] o.a.s.c.c.ZkStateReader Load collection config from: [/collections/control_collection]
   [junit4]   2> 290831 INFO  (coreLoadExecutor-1609-thread-1-processing-n:127.0.0.1:33918_) [n:127.0.0.1:33918_ c:control_collection   x:collection1] o.a.s.c.c.ZkStateReader path=[/collections/control_collection] [configName]=[conf1] specified config exists in ZooKeeper
   [junit4]   2> 290831 INFO  (coreLoadExecutor-1609-thread-1-processing-n:127.0.0.1:33918_) [n:127.0.0.1:33918_ c:control_collection   x:collection1] o.a.s.c.SolrResourceLoader new SolrResourceLoader for directory: '/home/jenkins/workspace/Lucene-Solr-5.5-Linux/solr/build/solr-core/test/J0/temp/solr.handler.TestSolrConfigHandlerCloud_1918B175AA10C50C-001/control-001/cores/collection1'
   [junit4]   2> 290831 INFO  (coreLoadExecutor-1609-thread-1-processing-n:127.0.0.1:33918_) [n:127.0.0.1:33918_ c:control_collection   x:collection1] o.a.s.c.SolrResourceLoader JNDI not configured for solr (NoInitialContextEx)
   [junit4]   2> 290831 INFO  (coreLoadExecutor-1609-thread-1-processing-n:127.0.0.1:33918_) [n:127.0.0.1:33918_ c:control_collection   x:collection1] o.a.s.c.SolrResourceLoader solr home defaulted to 'solr/' (could not find system property or JNDI)
   [junit4]   2> 290832 INFO  (coreLoadExecutor-1609-thread-1-processing-n:127.0.0.1:33918_) [n:127.0.0.1:33918_ c:control_collection   x:collection1] o.a.s.c.Config loaded config solrconfig.xml with version 0 
   [junit4]   2> 290837 INFO  (coreLoadExecutor-1609-thread-1-processing-n:127.0.0.1:33918_) [n:127.0.0.1:33918_ c:control_collection   x:collection1] o.a.s.c.SolrConfig current version of requestparams : -1
   [junit4]   2> 290850 INFO  (coreLoadExecutor-1609-thread-1-processing-n:127.0.0.1:33918_) [n:127.0.0.1:33918_ c:control_collection   x:collection1] o.a.s.c.SolrConfig Using Lucene MatchVersion: 5.5.3
   [junit4]   2> 290875 INFO  (coreLoadExecutor-1609-thread-1-processing-n:127.0.0.1:33918_) [n:127.0.0.1:33918_ c:control_collection   x:collection1] o.a.s.c.SolrConfig Loaded SolrConfig: solrconfig.xml
   [junit4]   2> 290882 INFO  (coreLoadExecutor-1609-thread-1-processing-n:127.0.0.1:33918_) [n:127.0.0.1:33918_ c:control_collection   x:collection1] o.a.s.s.IndexSchema [collection1] Schema name=test
   [junit4]   2> 291082 INFO  (coreLoadExecutor-1609-thread-1-processing-n:127.0.0.1:33918_) [n:127.0.0.1:33918_ c:control_collection   x:collection1] o.a.s.s.OpenExchangeRatesOrgProvider Initialized with rates=open-exchange-rates.json, refreshInterval=1440.
   [junit4]   2> 291089 INFO  (coreLoadExecutor-1609-thread-1-processing-n:127.0.0.1:33918_) [n:127.0.0.1:33918_ c:control_collection   x:collection1] o.a.s.s.IndexSchema default search field in schema is text
   [junit4]   2> 291091 INFO  (coreLoadExecutor-1609-thread-1-processing-n:127.0.0.1:33918_) [n:127.0.0.1:33918_ c:control_collection   x:collection1] o.a.s.s.IndexSchema unique key field: id
   [junit4]   2> 291097 INFO  (coreLoadExecutor-1609-thread-1-processing-n:127.0.0.1:33918_) [n:127.0.0.1:33918_ c:control_collection   x:collection1] o.a.s.s.FileExchangeRateProvider Reloading exchange rates from file currency.xml
   [junit4]   2> 291099 INFO  (coreLoadExecutor-1609-thread-1-processing-n:127.0.0.1:33918_) [n:127.0.0.1:33918_ c:control_collection   x:collection1] o.a.s.s.FileExchangeRateProvider Reloading exchange rates from file currency.xml
   [junit4]   2> 291101 INFO  (coreLoadExecutor-1609-thread-1-processing-n:127.0.0.1:33918_) [n:127.0.0.1:33918_ c:control_collection   x:collection1] o.a.s.s.OpenExchangeRatesOrgProvider Reloading exchange rates from open-exchange-rates.json
   [junit4]   2> 291102 INFO  (coreLoadExecutor-1609-thread-1-processing-n:127.0.0.1:33918_) [n:127.0.0.1:33918_ c:control_collection   x:collection1] o.a.s.s.OpenExchangeRatesOrgProvider Reloading exchange rates from open-exchange-rates.json
   [junit4]   2> 291103 INFO  (coreLoadExecutor-1609-thread-1-processing-n:127.0.0.1:33918_) [n:127.0.0.1:33918_ c:control_collection   x:collection1] o.a.s.c.ConfigSetProperties Did not find ConfigSet properties, assuming default properties: Can't find resource 'configsetprops.json' in classpath or '/configs/conf1', cwd=/home/jenkins/workspace/Lucene-Solr-5.5-Linux/solr/build/solr-core/test/J0
   [junit4]   2> 291103 INFO  (coreLoadExecutor-1609-thread-1-processing-n:127.0.0.1:33918_) [n:127.0.0.1:33918_ c:control_collection   x:collection1] o.a.s.c.CoreContainer Creating SolrCore 'collection1' using configuration from collection control_collection
   [junit4]   2> 291103 INFO  (coreLoadExecutor-1609-thread-1-processing-n:127.0.0.1:33918_) [n:127.0.0.1:33918_ c:control_collection s:shard1 r:core_node1 x:collection1] o.a.s.c.SolrCore org.apache.solr.core.MockDirectoryFactory
   [junit4]   2> 291103 INFO  (coreLoadExecutor-1609-thread-1-processing-n:127.0.0.1:33918_) [n:127.0.0.1:33918_ c:control_collection s:shard1 r:core_node1 x:collection1] o.a.s.c.SolrCore [[collection1] ] Opening new SolrCore at [/home/jenkins/workspace/Lucene-Solr-5.5-Linux/solr/build/solr-core/test/J0/temp/solr.handler.TestSolrConfigHandlerCloud_1918B175AA10C50C-001/control-001/cores/collection1], dataDir=[/home/jenkins/workspace/Lucene-Solr-5.5-Linux/solr/build/solr-core/test/J0/../../../../../../../../../home/jenkins/workspace/Lucene-Solr-5.5-Linux/solr/build/solr-core/test/J0/temp/solr.handler.TestSolrConfigHandlerCloud_1918B175AA10C50C-001/control-001/cores/collection1/data/]
   [junit4]   2> 291103 INFO  (coreLoadExecutor-1609-thread-1-processing-n:127.0.0.1:33918_) [n:127.0.0.1:33918_ c:control_collection s:shard1 r:core_node1 x:collection1] o.a.s.c.JmxMonitoredMap JMX monitoring is enabled. Adding Solr mbeans to JMX Server: com.sun.jmx.mbeanserver.JmxMBeanServer@1ffb47
   [junit4]   2> 291104 INFO  (coreLoadExecutor-1609-thread-1-processing-n:127.0.0.1:33918_) [n:127.0.0.1:33918_ c:control_collection s:shard1 r:core_node1 x:collection1] o.a.s.c.CachingDirectoryFactory return new directory for /home/jenkins/workspace/Lucene-Solr-5.5-Linux/solr/build/solr-core/test/J0/../../../../../../../../../home/jenkins/workspace/Lucene-Solr-5.5-Linux/solr/build/solr-core/test/J0/temp/solr.handler.TestSolrConfigHandlerCloud_1918B175AA10C50C-001/control-001/cores/collection1/data
   [junit4]   2> 291104 INFO  (coreLoadExecutor-1609-thread-1-processing-n:127.0.0.1:33918_) [n:127.0.0.1:33918_ c:control_collection s:shard1 r:core_node1 x:collection1] o.a.s.c.SolrCore New index directory detected: old=null new=/home/jenkins/workspace/Lucene-Solr-5.5-Linux/solr/build/solr-core/test/J0/../../../../../../../../../home/jenkins/workspace/Lucene-Solr-5.5-Linux/solr/build/solr-core/test/J0/temp/solr.handler.TestSolrConfigHandlerCloud_1918B175AA10C50C-001/control-001/cores/collection1/data/index/
   [junit4]   2> 291104 WARN  (coreLoadExecutor-1609-thread-1-processing-n:127.0.0.1:33918_) [n:127.0.0.1:33918_ c:control_collection s:shard1 r:core_node1 x:collection1] o.a.s.c.SolrCore [collection1] Solr index directory '/home/jenkins/workspace/Lucene-Solr-5.5-Linux/solr/build/solr-core/test/J0/../../../../../../../../../home/jenkins/workspace/Lucene-Solr-5.5-Linux/solr/build/solr-core/test/J0/temp/solr.handler.TestSolrConfigHandlerCloud_1918B175AA10C50C-001/control-001/cores/collection1/data/index' doesn't exist. Creating new index...
   [junit4]   2> 291104 INFO  (coreLoadExecutor-1609-thread-1-processing-n:127.0.0.1:33918_) [n:127.0.0.1:33918_ c:control_collection s:shard1 r:core_node1 x:collection1] o.a.s.c.CachingDirectoryFactory return new directory for /home/jenkins/workspace/Lucene-Solr-5.5-Linux/solr/build/solr-core/test/J0/../../../../../../../../../home/jenkins/workspace/Lucene-Solr-5.5-Linux/solr/build/solr-core/test/J0/temp/solr.handler.TestSolrConfigHandlerCloud_1918B175AA10C50C-001/control-001/cores/collection1/data/index
   [junit4]   2> 291104 INFO  (coreLoadExecutor-1609-thread-1-processing-n:127.0.0.1:33918_) [n:127.0.0.1:33918_ c:control_collection s:shard1 r:core_node1 x:collection1] o.a.s.u.RandomMergePolicy RandomMergePolicy wrapping class org.apache.lucene.index.LogDocMergePolicy: [LogDocMergePolicy: minMergeSize=1000, mergeFactor=16, maxMergeSize=9223372036854775807, maxMergeSizeForForcedMerge=9223372036854775807, calibrateSizeByDeletes=true, maxMergeDocs=2147483647, maxCFSSegmentSizeMB=8.796093022207999E12, noCFSRatio=0.44211260082137227]
   [junit4]   2> 291105 INFO  (coreLoadExecutor-1609-thread-1-processing-n:127.0.0.1:33918_) [n:127.0.0.1:33918_ c:control_collection s:shard1 r:core_node1 x:collection1] o.a.s.c.SolrDeletionPolicy SolrDeletionPolicy.onCommit: commits: num=1
   [junit4]   2> 	commit{dir=MockDirectoryWrapper(RAMDirectory@bcfac9 lockFactory=org.apache.lucene.store.SingleInstanceLockFactory@f4df05),segFN=segments_1,generation=1}
   [junit4]   2> 291105 INFO  (coreLoadExecutor-1609-thread-1-processing-n:127.0.0.1:33918_) [n:127.0.0.1:33918_ c:control_collection s:shard1 r:core_node1 x:collection1] o.a.s.c.SolrDeletionPolicy newest commit generation = 1
   [junit4]   2> 291105 INFO  (OldIndexDirectoryCleanupThreadForCore-collection1) [n:127.0.0.1:33918_ c:control_collection s:shard1 r:core_node1 x:collection1] o.a.s.c.SolrCore Looking for old index directories to cleanup for core collection1 in /home/jenkins/workspace/Lucene-Solr-5.5-Linux/solr/build/solr-core/test/J0/../../../../../../../../../home/jenkins/workspace/Lucene-Solr-5.5-Linux/solr/build/solr-core/test/J0/temp/solr.handler.TestSolrConfigHandlerCloud_1918B175AA10C50C-001/control-001/cores/collection1/data/
   [junit4]   2> 291105 WARN  (OldIndexDirectoryCleanupThreadForCore-collection1) [n:127.0.0.1:33918_ c:control_collection s:shard1 r:core_node1 x:collection1] o.a.s.c.DirectoryFactory /home/jenkins/workspace/Lucene-Solr-5.5-Linux/solr/build/solr-core/test/J0/../../../../../../../../../home/jenkins/workspace/Lucene-Solr-5.5-Linux/solr/build/solr-core/test/J0/temp/solr.handler.TestSolrConfigHandlerCloud_1918B175AA10C50C-001/control-001/cores/collection1/data/ does not point to a valid data directory; skipping clean-up of old index directories.
   [junit4]   2> 291108 INFO  (coreLoadExecutor-1609-thread-1-processing-n:127.0.0.1:33918_) [n:127.0.0.1:33918_ c:control_collection s:shard1 r:core_node1 x:collection1] o.a.s.u.p.UpdateRequestProcessorChain creating updateRequestProcessorChain "nodistrib"
   [junit4]   2> 291108 INFO  (coreLoadExecutor-1609-thread-1-processing-n:127.0.0.1:33918_) [n:127.0.0.1:33918_ c:control_collection s:shard1 r:core_node1 x:collection1] o.a.s.u.p.UpdateRequestProcessorChain creating updateRequestProcessorChain "dedupe"
   [junit4]   2> 291108 INFO  (coreLoadExecutor-1609-thread-1-processing-n:127.0.0.1:33918_) [n:127.0.0.1:33918_ c:control_collection s:shard1 r:core_node1 x:collection1] o.a.s.u.p.UpdateRequestProcessorChain inserting DistributedUpdateProcessorFactory into updateRequestProcessorChain "dedupe"
   [junit4]   2> 291108 INFO  (coreLoadExecutor-1609-thread-1-processing-n:127.0.0.1:33918_) [n:127.0.0.1:33918_ c:control_collection s:shard1 r:core_node1 x:collection1] o.a.s.u.p.UpdateRequestProcessorChain creating updateRequestProcessorChain "stored_sig"
   [junit4]   2> 291108 INFO  (coreLoadExecutor-1609-thread-1-processing-n:127.0.0.1:33918_) [n:127.0.0.1:33918_ c:control_collection s:shard1 r:core_node1 x:collection1] o.a.s.u.p.UpdateRequestProcessorChain inserting DistributedUpdateProcessorFactory into updateRequestProcessorChain "stored_sig"
   [junit4]   2> 291108 INFO  (coreLoadExecutor-1609-thread-1-processing-n:127.0.0.1:33918_) [n:127.0.0.1:33918_ c:control_collection s:shard1 r:core_node1 x:collection1] o.a.s.u.p.UpdateRequestProcessorChain creating updateRequestProcessorChain "distrib-dup-test-chain-explicit"
   [junit4]   2> 291108 INFO  (coreLoadExecutor-1609-thread-1-processing-n:127.0.0.1:33918_) [n:127.0.0.1:33918_ c:control_collection s:shard1 r:core_node1 x:collection1] o.a.s.u.p.UpdateRequestProcessorChain creating updateRequestProcessorChain "distrib-dup-test-chain-implicit"
   [junit4]   2> 291108 INFO  (coreLoadExecutor-1609-thread-1-processing-n:127.0.0.1:33918_) [n:127.0.0.1:33918_ c:control_collection s:shard1 r:core_node1 x:collection1] o.a.s.u.p.UpdateRequestProcessorChain inserting DistributedUpdateProcessorFactory into updateRequestProcessorChain "distrib-dup-test-chain-implicit"
   [junit4]   2> 291108 INFO  (coreLoadExecutor-1609-thread-1-processing-n:127.0.0.1:33918_) [n:127.0.0.1:33918_ c:control_collection s:shard1 r:core_node1 x:collection1] o.a.s.c.SolrCore no updateRequestProcessorChain defined as default, creating implicit default
   [junit4]   2> 291108 WARN  (coreLoadExecutor-1609-thread-1-processing-n:127.0.0.1:33918_) [n:127.0.0.1:33918_ c:control_collection s:shard1 r:core_node1 x:collection1] o.a.s.c.RequestHandlers INVALID paramSet a in requestHandler {type = requestHandler,name = /dump,class = DumpRequestHandler,args = {defaults={a=A,b=B}}}
   [junit4]   2> 291110 INFO  (coreLoadExecutor-1609-thread-1-processing-n:127.0.0.1:33918_) [n:127.0.0.1:33918_ c:control_collection s:shard1 r:core_node1 x:collection1] o.a.s.h.l.XMLLoader xsltCacheLifetimeSeconds=60
   [junit4]   2> 291111 INFO  (coreLoadExecutor-1609-thread-1-processing-n:127.0.0.1:33918_) [n:127.0.0.1:33918_ c:control_collection s:shard1 r:core_node1 x:collection1] o.a.s.h.l.XMLLoader xsltCacheLifetimeSeconds=60
   [junit4]   2> 291112 INFO  (coreLoadExecutor-1609-thread-1-processing-n:127.0.0.1:33918_) [n:127.0.0.1:33918_ c:control_collection s:shard1 r:core_node1 x:collection1] o.a.s.h.l.XMLLoader xsltCacheLifetimeSeconds=60
   [junit4]   2> 291113 INFO  (coreLoadExecutor-1609-thread-1-processing-n:127.0.0.1:33918_) [n:127.0.0.1:33918_ c:control_collection s:shard1 r:core_node1 x:collection1] o.a.s.h.l.XMLLoader xsltCacheLifetimeSeconds=60
   [junit4]   2> 291117 INFO  (coreLoadExecutor-1609-thread-1-processing-n:127.0.0.1:33918_) [n:127.0.0.1:33918_ c:control_collection s:shard1 r:core_node1 x:collection1] o.a.s.c.RequestHandlers Registered paths: /admin/file,/admin/ping,/update,/update/json/docs,/update/csv,/admin/luke,/admin/logging,/schema,/admin/properties,/replication,/get,/admin/threads,/config,/dump,/admin/segments,/admin/mbeans,/update/json,/admin/system,standard,/admin/plugins
   [junit4]   2> 291118 INFO  (coreLoadExecutor-1609-thread-1-processing-n:127.0.0.1:33918_) [n:127.0.0.1:33918_ c:control_collection s:shard1 r:core_node1 x:collection1] o.a.s.c.SolrCore Using default statsCache cache: org.apache.solr.search.stats.LocalStatsCache
   [junit4]   2> 291118 INFO  (coreLoadExecutor-1609-thread-1-processing-n:127.0.0.1:33918_) [n:127.0.0.1:33918_ c:control_collection s:shard1 r:core_node1 x:collection1] o.a.s.u.UpdateHandler Using UpdateLog implementation: org.apache.solr.update.UpdateLog
   [junit4]   2> 291118 INFO  (coreLoadExecutor-1609-thread-1-processing-n:127.0.0.1:33918_) [n:127.0.0.1:33918_ c:control_collection s:shard1 r:core_node1 x:collection1] o.a.s.u.UpdateLog Initializing UpdateLog: dataDir= defaultSyncLevel=FLUSH numRecordsToKeep=100 maxNumLogsToKeep=10 numVersionBuckets=65536
   [junit4]   2> 291120 INFO  (coreLoadExecutor-1609-thread-1-processing-n:127.0.0.1:33918_) [n:127.0.0.1:33918_ c:control_collection s:shard1 r:core_node1 x:collection1] o.a.s.u.CommitTracker Hard AutoCommit: disabled
   [junit4]   2> 291120 INFO  (coreLoadExecutor-1609-thread-1-processing-n:127.0.0.1:33918_) [n:127.0.0.1:33918_ c:control_collection s:shard1 r:core_node1 x:collection1] o.a.s.u.CommitTracker Soft AutoCommit: disabled
   [junit4]   2> 291120 INFO  (coreLoadExecutor-1609-thread-1-processing-n:127.0.0.1:33918_) [n:127.0.0.1:33918_ c:control_collection s:shard1 r:core_node1 x:collection1] o.a.s.u.RandomMergePolicy RandomMergePolicy wrapping class org.apache.lucene.index.LogDocMergePolicy: [LogDocMergePolicy: minMergeSize=1000, mergeFactor=12, maxMergeSize=9223372036854775807, maxMergeSizeForForcedMerge=9223372036854775807, calibrateSizeByDeletes=true, maxMergeDocs=2147483647, maxCFSSegmentSizeMB=8.796093022207999E12, noCFSRatio=0.6236106969231516]
   [junit4]   2> 291120 INFO  (coreLoadExecutor-1609-thread-1-processing-n:127.0.0.1:33918_) [n:127.0.0.1:33918_ c:control_collection s:shard1 r:core_node1 x:collection1] o.a.s.c.SolrDeletionPolicy SolrDeletionPolicy.onInit: commits: num=1
   [junit4]   2> 	commit{dir=MockDirectoryWrapper(RAMDirectory@bcfac9 lockFactory=org.apache.lucene.store.SingleInstanceLockFactory@f4df05),segFN=segments_1,generation=1}
   [junit4]   2> 291120 INFO  (coreLoadExecutor-1609-thread-1-processing-n:127.0.0.1:33918_) [n:127.0.0.1:33918_ c:control_collection s:shard1 r:core_node1 x:collection1] o.a.s.c.SolrDeletionPolicy newest commit generation = 1
   [junit4]   2> 291120 INFO  (coreLoadExecutor-1609-thread-1-processing-n:127.0.0.1:33918_) [n:127.0.0.1:33918_ c:control_collection s:shard1 r:core_node1 x:collection1] o.a.s.s.SolrIndexSearcher Opening Searcher@2e7e79[collection1] main
   [junit4]   2> 291120 INFO  (coreLoadExecutor-1609-thread-1-processing-n:127.0.0.1:33918_) [n:127.0.0.1:33918_ c:control_collection s:shard1 r:core_node1 x:collection1] o.a.s.c.c.ZkStateReader Load collection config from: [/collections/control_collection]
   [junit4]   2> 291121 INFO  (coreLoadExecutor-1609-thread-1-processing-n:127.0.0.1:33918_) [n:127.0.0.1:33918_ c:control_collection s:shard1 r:core_node1 x:collection1] o.a.s.c.c.ZkStateReader path=[/collections/control_collection] [configName]=[conf1] specified config exists in ZooKeeper
   [junit4]   2> 291121 INFO  (coreLoadExecutor-1609-thread-1-processing-n:127.0.0.1:33918_) [n:127.0.0.1:33918_ c:control_collection s:shard1 r:core_node1 x:collection1] o.a.s.r.ManagedResourceStorage Setting up ZooKeeper-based storage for the RestManager with znodeBase: /configs/conf1
   [junit4]   2> 291121 INFO  (coreLoadExecutor-1609-thread-1-processing-n:127.0.0.1:33918_) [n:127.0.0.1:33918_ c:control_collection s:shard1 r:core_node1 x:collection1] o.a.s.r.ManagedResourceStorage Configured ZooKeeperStorageIO with znodeBase: /configs/conf1
   [junit4]   2> 291121 INFO  (coreLoadExecutor-1609-thread-1-processing-n:127.0.0.1:33918_) [n:127.0.0.1:33918_ c:control_collection s:shard1 r:core_node1 x:collection1] o.a.s.r.RestManager Initializing RestManager with initArgs: {}
   [junit4]   2> 291121 INFO  (coreLoadExecutor-1609-thread-1-processing-n:127.0.0.1:33918_) [n:127.0.0.1:33918_ c:control_collection s:shard1 r:core_node1 x:collection1] o.a.s.r.ManagedResourceStorage Reading _rest_managed.json using ZooKeeperStorageIO:path=/configs/conf1
   [junit4]   2> 291122 INFO  (coreLoadExecutor-1609-thread-1-processing-n:127.0.0.1:33918_) [n:127.0.0.1:33918_ c:control_collection s:shard1 r:core_node1 x:collection1] o.a.s.r.ManagedResourceStorage No data found for znode /configs/conf1/_rest_managed.json
   [junit4]   2> 291122 INFO  (coreLoadExecutor-1609-thread-1-processing-n:127.0.0.1:33918_) [n:127.0.0.1:33918_ c:control_collection s:shard1 r:core_node1 x:collection1] o.a.s.r.ManagedResourceStorage Loaded null at path _rest_managed.json using ZooKeeperStorageIO:path=/configs/conf1
   [junit4]   2> 291122 INFO  (coreLoadExecutor-1609-thread-1-processing-n:127.0.0.1:33918_) [n:127.0.0.1:33918_ c:control_collection s:shard1 r:core_node1 x:collection1] o.a.s.r.RestManager Initializing 0 registered ManagedResources
   [junit4]   2> 291122 INFO  (coreLoadExecutor-1609-thread-1-processing-n:127.0.0.1:33918_) [n:127.0.0.1:33918_ c:control_collection s:shard1 r:core_node1 x:collection1] o.a.s.h.ReplicationHandler Commits will be reserved for  10000
   [junit4]   2> 291123 INFO  (searcherExecutor-1610-thread-1-processing-n:127.0.0.1:33918_ c:control_collection r:core_node1 x:collection1 s:shard1) [n:127.0.0.1:33918_ c:control_collection s:shard1 r:core_node1 x:collection1] o.a.s.c.SolrCore [collection1] Registered new searcher Searcher@2e7e79[collection1] main{ExitableDirectoryReader(UninvertingDirectoryReader())}
   [junit4]   2> 291123 INFO  (coreLoadExecutor-1609-thread-1-processing-n:127.0.0.1:33918_) [n:127.0.0.1:33918_ c:control_collection s:shard1 r:core_node1 x:collection1] o.a.s.u.UpdateLog Looking up max value of version field to seed version buckets
   [junit4]   2> 291123 INFO  (coreLoadExecutor-1609-thread-1-processing-n:127.0.0.1:33918_) [n:127.0.0.1:33918_ c:control_collection s:shard1 r:core_node1 x:collection1] o.a.s.u.VersionInfo Refreshing highest value of _version_ for 65536 version buckets from index
   [junit4]   2> 291123 INFO  (coreLoadExecutor-1609-thread-1-processing-n:127.0.0.1:33918_) [n:127.0.0.1:33918_ c:control_collection s:shard1 r:core_node1 x:collection1] o.a.s.u.VersionInfo No terms found for _version_, cannot seed version bucket highest value from index
   [junit4]   2> 291123 INFO  (coreLoadExecutor-1609-thread-1-processing-n:127.0.0.1:33918_) [n:127.0.0.1:33918_ c:control_collection s:shard1 r:core_node1 x:collection1] o.a.s.u.UpdateLog Could not find max version in index or recent updates, using new clock 1544252464721559552
   [junit4]   2> 291124 INFO  (coreLoadExecutor-1609-thread-1-processing-n:127.0.0.1:33918_) [n:127.0.0.1:33918_ c:control_collection s:shard1 r:core_node1 x:collection1] o.a.s.u.UpdateLog Took 1.0ms to seed version buckets with highest version 1544252464721559552
   [junit4]   2> 291125 INFO  (coreLoadExecutor-1609-thread-1-processing-n:127.0.0.1:33918_) [n:127.0.0.1:33918_ c:control_collection s:shard1 r:core_node1 x:collection1] o.a.s.c.ZkController watch zkdir /configs/conf1
   [junit4]   2> 291125 INFO  (coreLoadExecutor-1609-thread-1-processing-n:127.0.0.1:33918_) [n:127.0.0.1:33918_ c:control_collection s:shard1 r:core_node1 x:collection1] o.a.s.c.CoreContainer registering core: collection1
   [junit4]   2> 291125 INFO  (coreZkRegister-1603-thread-1-processing-n:127.0.0.1:33918_ c:control_collection r:core_node1 x:collection1 s:shard1) [n:127.0.0.1:33918_ c:control_collection s:shard1 r:core_node1 x:collection1] o.a.s.c.ZkController Register replica - core:collection1 address:http://127.0.0.1:33918 collection:control_collection shard:shard1
   [junit4]   2> 291126 INFO  (coreZkRegister-1603-thread-1-processing-n:127.0.0.1:33918_ c:control_collection r:core_node1 x:collection1 s:shard1) [n:127.0.0.1:33918_ c:control_collection s:shard1 r:core_node1 x:collection1] o.a.s.c.c.SolrZkClient makePath: /collections/control_collection/leader_elect/shard1/election
   [junit4]   2> 291127 INFO  (coreZkRegister-1603-thread-1-processing-n:127.0.0.1:33918_ c:control_collection r:core_node1 x:collection1 s:shard1) [n:127.0.0.1:33918_ c:control_collection s:shard1 r:core_node1 x:collection1] o.a.s.c.LeaderElector Joined leadership election with path: /collections/control_collection/leader_elect/shard1/election/96515778942402564-core_node1-n_0000000000
   [junit4]   2> 291127 INFO  (coreZkRegister-1603-thread-1-processing-n:127.0.0.1:33918_ c:control_collection r:core_node1 x:collection1 s:shard1) [n:127.0.0.1:33918_ c:control_collection s:shard1 r:core_node1 x:collection1] o.a.s.c.ShardLeaderElectionContext Running the leader process for shard=shard1 and weAreReplacement=false and leaderVoteWait=10000
   [junit4]   2> 291128 INFO  (coreZkRegister-1603-thread-1-processing-n:127.0.0.1:33918_ c:control_collection r:core_node1 x:collection1 s:shard1) [n:127.0.0.1:33918_ c:control_collection s:shard1 r:core_node1 x:collection1] o.a.s.c.ShardLeaderElectionContext Enough replicas found to continue.
   [junit4]   2> 291128 INFO  (coreZkRegister-1603-thread-1-processing-n:127.0.0.1:33918_ c:control_collection r:core_node1 x:collection1 s:shard1) [n:127.0.0.1:33918_ c:control_collection s:shard1 r:core_node1 x:collection1] o.a.s.c.ShardLeaderElectionContext I may be the new leader - try and sync
   [junit4]   2> 291128 INFO  (coreZkRegister-1603-thread-1-processing-n:127.0.0.1:33918_ c:control_collection r:core_node1 x:collection1 s:shard1) [n:127.0.0.1:33918_ c:control_collection s:shard1 r:core_node1 x:collection1] o.a.s.c.SyncStrategy Sync replicas to http://127.0.0.1:33918/collection1/
   [junit4]   2> 291128 INFO  (coreZkRegister-1603-thread-1-processing-n:127.0.0.1:33918_ c:control_collection r:core_node1 x:collection1 s:shard1) [n:127.0.0.1:33918_ c:control_collection s:shard1 r:core_node1 x:collection1] o.a.s.c.SyncStrategy Sync Success - now sync replicas to me
   [junit4]   2> 291128 INFO  (coreZkRegister-1603-thread-1-processing-n:127.0.0.1:33918_ c:control_collection r:core_node1 x:collection1 s:shard1) [n:127.0.0.1:33918_ c:control_collection s:shard1 r:core_node1 x:collection1] o.a.s.c.SyncStrategy http://127.0.0.1:33918/collection1/ has no replicas
   [junit4]   2> 291128 INFO  (OverseerStateUpdate-96515778942402564-127.0.0.1:33918_-n_0000000000) [n:127.0.0.1:33918_    ] o.a.s.c.Overseer processMessage: queueSize: 1, message = {
   [junit4]   2>   "operation":"leader",
   [junit4]   2>   "shard":"shard1",
   [junit4]   2>   "collection":"control_collection"} current state version: 1
   [junit4]   2> 291129 INFO  (coreZkRegister-1603-thread-1-processing-n:127.0.0.1:33918_ c:control_collection r:core_node1 x:collection1 s:shard1) [n:127.0.0.1:33918_ c:control_collection s:shard1 r:core_node1 x:collection1] o.a.s.c.c.SolrZkClient makePath: /collections/control_collection/leaders/shard1
   [junit4]   2> 291130 INFO  (coreZkRegister-1603-thread-1-processing-n:127.0.0.1:33918_ c:control_collection r:core_node1 x:collection1 s:shard1) [n:127.0.0.1:33918_ c:control_collection s:shard1 r:core_node1 x:collection1] o.a.s.c.ShardLeaderElectionContextBase Creating leader registration node /collections/control_collection/leaders/shard1/leader after winning as /collections/control_collection/leader_elect/shard1/election/96515778942402564-core_node1-n_0000000000
   [junit4]   2> 291132 INFO  (coreZkRegister-1603-thread-1-processing-n:127.0.0.1:33918_ c:control_collection r:core_node1 x:collection1 s:shard1) [n:127.0.0.1:33918_ c:control_collection s:shard1 r:core_node1 x:collection1] o.a.s.c.ShardLeaderElectionContext I am the new leader: http://127.0.0.1:33918/collection1/ shard1
   [junit4]   2> 291132 INFO  (OverseerStateUpdate-96515778942402564-127.0.0.1:33918_-n_0000000000) [n:127.0.0.1:33918_    ] o.a.s.c.Overseer processMessage: queueSize: 1, message = {
   [junit4]   2>   "operation":"leader",
   [junit4]   2>   "shard":"shard1",
   [junit4]   2>   "collection":"control_collection",
   [junit4]   2>   "base_url":"http://127.0.0.1:33918",
   [junit4]   2>   "core":"collection1",
   [junit4]   2>   "state":"active"} current state version: 1
   [junit4]   2> 291233 INFO  (zkCallback-391-thread-1-processing-n:127.0.0.1:33918_) [n:127.0.0.1:33918_    ] o.a.s.c.c.ZkStateReader A cluster state change: [WatchedEvent state:SyncConnected type:NodeDataChanged path:/clusterstate.json], has occurred - updating... (live nodes size: [1])
   [junit4]   2> 291282 INFO  (coreZkRegister-1603-thread-1-processing-n:127.0.0.1:33918_ c:control_collection r:core_node1 x:collection1 s:shard1) [n:127.0.0.1:33918_ c:control_collection s:shard1 r:core_node1 x:collection1] o.a.s.c.ZkController We are http://127.0.0.1:33918/collection1/ and leader is http://127.0.0.1:33918/collection1/
   [junit4]   2> 291282 INFO  (coreZkRegister-1603-thread-1-processing-n:127.0.0.1:33918_ c:control_collection r:core_node1 x:collection1 s:shard1) [n:127.0.0.1:33918_ c:control_collection s:shard1 r:core_node1 x:collection1] o.a.s.c.ZkController No LogReplay needed for core=collection1 baseURL=http://127.0.0.1:33918
   [junit4]   2> 291282 INFO  (coreZkRegister-1603-thread-1-processing-n:127.0.0.1:33918_ c:control_collection r:core_node1 x:collection1 s:shard1) [n:127.0.0.1:33918_ c:control_collection s:shard1 r:core_node1 x:collection1] o.a.s.c.ZkController I am the leader, no recovery necessary
   [junit4]   2> 291282 INFO  (coreZkRegister-1603-thread-1-processing-n:127.0.0.1:33918_ c:control_collection r:core_node1 x:collection1 s:shard1) [n:127.0.0.1:33918_ c:control_collection s:shard1 r:core_node1 x:collection1] o.a.s.c.ZkController publishing state=active
   [junit4]   2> 291282 INFO  (coreZkRegister-1603-thread-1-processing-n:127.0.0.1:33918_ c:control_collection r:core_node1 x:collection1 s:shard1) [n:127.0.0.1:33918_ c:control_collection s:shard1 r:core_node1 x:collection1] o.a.s.c.ZkController numShards not found on descriptor - reading it from system property
   [junit4]   2> 291284 INFO  (OverseerStateUpdate-96515778942402564-127.0.0.1:33918_-n_0000000000) [n:127.0.0.1:33918_    ] o.a.s.c.Overseer processMessage: queueSize: 1, message = {
   [junit4]   2>   "core_node_name":"core_node1",
   [junit4]   2>   "node_name":"127.0.0.1:33918_",
   [junit4]   2>   "base_url":"http://127.0.0.1:33918",
   [junit4]   2>   "collection":"control_collection",
   [junit4]   2>   "state":"active",
   [junit4]   2>   "roles":null,
   [junit4]   2>   "core":"collection1",
   [junit4]   2>   "shard":"shard1",
   [junit4]   2>   "operation":"state",
   [junit4]   2>   "numShards":"1"} current state version: 2
   [junit4]   2> 291284 INFO  (OverseerStateUpdate-96515778942402564-127.0.0.1:33918_-n_0000000000) [n:127.0.0.1:33918_    ] o.a.s.c.o.ReplicaMutator Update state numShards=1 message={
   [junit4]   2>   "core_node_name":"core_node1",
   [junit4]   2>   "node_name":"127.0.0.1:33918_",
   [junit4]   2>   "base_url":"http://127.0.0.1:33918",
   [junit4]   2>   "collection":"control_collection",
   [junit4]   2>   "state":"active",
   [junit4]   2>   "roles":null,
   [junit4]   2>   "core":"collection1",
   [junit4]   2>   "shard":"shard1",
   [junit4]   2>   "operation":"state",
   [junit4]   2>   "numShards":"1"}
   [junit4]   2> 291329 INFO  (TEST-TestSolrConfigHandlerCloud.test-seed#[1918B175AA10C50C]) [    ] o.a.s.c.c.SolrZkClient Using default ZkCredentialsProvider
   [junit4]   2> 291329 INFO  (TEST-TestSolrConfigHandlerCloud.test-seed#[1918B175AA10C50C]) [    ] o.a.s.c.c.ConnectionManager Waiting for client to connect to ZooKeeper
   [junit4]   2> 291330 INFO  (zkCallback-393-thread-1) [    ] o.a.s.c.c.ConnectionManager Watcher org.apache.solr.common.cloud.ConnectionManager@1f87588 name:ZooKeeperConnection Watcher:127.0.0.1:36524/solr got event WatchedEvent state:SyncConnected type:None path:null path:null type:None
   [junit4]   2> 291330 INFO  (TEST-TestSolrConfigHandlerCloud.test-seed#[1918B175AA10C50C]) [    ] o.a.s.c.c.ConnectionManager Client is connected to ZooKeeper
   [junit4]   2> 291330 INFO  (TEST-TestSolrConfigHandlerCloud.test-seed#[1918B175AA10C50C]) [    ] o.a.s.c.c.SolrZkClient Using default ZkACLProvider
   [junit4]   2> 291330 INFO  (TEST-TestSolrConfigHandlerCloud.test-seed#[1918B175AA10C50C]) [    ] o.a.s.c.c.ZkStateReader Updating cluster state from ZooKeeper... 
   [junit4]   2> 291331 INFO  (TEST-TestSolrConfigHandlerCloud.test-seed#[1918B175AA10C50C]) [    ] o.a.s.c.ChaosMonkey monkey: init - expire sessions:false cause connection loss:false
   [junit4]   2> 291386 INFO  (zkCallback-393-thread-1) [    ] o.a.s.c.c.ZkStateReader A cluster state change: [WatchedEvent state:SyncConnected type:NodeDataChanged path:/clusterstate.json], has occurred - updating... (live nodes size: [1])
   [junit4]   2> 291386 INFO  (zkCallback-391-thread-1-processing-n:127.0.0.1:33918_) [n:127.0.0.1:33918_    ] o.a.s.c.c.ZkStateReader A cluster state change: [WatchedEvent state:SyncConnected type:NodeDataChanged path:/clusterstate.json], has occurred - updating... (live nodes size: [1])
   [junit4]   2> 291417 INFO  (TEST-TestSolrConfigHandlerCloud.test-seed#[1918B175AA10C50C]) [    ] o.a.s.SolrTestCaseJ4 Writing core.properties file to /home/jenkins/workspace/Lucene-Solr-5.5-Linux/solr/build/solr-core/test/J0/temp/solr.handler.TestSolrConfigHandlerCloud_1918B175AA10C50C-001/shard-1-001/cores/collection1
   [junit4]   2> 291418 INFO  (TEST-TestSolrConfigHandlerCloud.test-seed#[1918B175AA10C50C]) [    ] o.a.s.c.AbstractFullDistribZkTestBase create jetty 1 in directory /home/jenkins/workspace/Lucene-Solr-5.5-Linux/solr/build/solr-core/test/J0/temp/solr.handler.TestSolrConfigHandlerCloud_1918B175AA10C50C-001/shard-1-001
   [junit4]   2> 291418 INFO  (TEST-TestSolrConfigHandlerCloud.test-seed#[1918B175AA10C50C]) [    ] o.e.j.s.Server jetty-9.2.13.v20150730
   [junit4]   2> 291420 INFO  (TEST-TestSolrConfigHandlerCloud.test-seed#[1918B175AA10C50C]) [    ] o.e.j.s.h.ContextHandler Started o.e.j.s.ServletContextHandler@9628d5{/,null,AVAILABLE}
   [junit4]   2> 291420 INFO  (TEST-TestSolrConfigHandlerCloud.test-seed#[1918B175AA10C50C]) [    ] o.e.j.s.ServerConnector Started ServerConnector@951462{HTTP/1.1}{127.0.0.1:35765}
   [junit4]   2> 291420 INFO  (TEST-TestSolrConfigHandlerCloud.test-seed#[1918B175AA10C50C]) [    ] o.e.j.s.Server Started @292787ms
   [junit4]   2> 291420 INFO  (TEST-TestSolrConfigHandlerCloud.test-seed#[1918B175AA10C50C]) [    ] o.a.s.c.s.e.JettySolrRunner Jetty properties: {hostPort=35765, coreRootDirectory=/home/jenkins/workspace/Lucene-Solr-5.5-Linux/solr/build/solr-core/test/J0/../../../../../../../../../home/jenkins/workspace/Lucene-Solr-5.5-Linux/solr/build/solr-core/test/J0/temp/solr.handler.TestSolrConfigHandlerCloud_1918B175AA10C50C-001/shard-1-001/cores, hostContext=/, solrconfig=solrconfig.xml, solr.data.dir=/home/jenkins/workspace/Lucene-Solr-5.5-Linux/solr/build/solr-core/test/J0/temp/solr.handler.TestSolrConfigHandlerCloud_1918B175AA10C50C-001/tempDir-001/jetty1}
   [junit4]   2> 291421 INFO  (TEST-TestSolrConfigHandlerCloud.test-seed#[1918B175AA10C50C]) [    ] o.a.s.s.SolrDispatchFilter SolrDispatchFilter.init(): sun.misc.Launcher$AppClassLoader@192e317
   [junit4]   2> 291421 INFO  (TEST-TestSolrConfigHandlerCloud.test-seed#[1918B175AA10C50C]) [    ] o.a.s.c.SolrResourceLoader new SolrResourceLoader for directory: '/home/jenkins/workspace/Lucene-Solr-5.5-Linux/solr/build/solr-core/test/J0/temp/solr.handler.TestSolrConfigHandlerCloud_1918B175AA10C50C-001/shard-1-001'
   [junit4]   2> 291421 INFO  (TEST-TestSolrConfigHandlerCloud.test-seed#[1918B175AA10C50C]) [    ] o.a.s.c.SolrResourceLoader JNDI not configured for solr (NoInitialContextEx)
   [junit4]   2> 291421 INFO  (TEST-TestSolrConfigHandlerCloud.test-seed#[1918B175AA10C50C]) [    ] o.a.s.c.SolrResourceLoader solr home defaulted to 'solr/' (could not find system property or JNDI)
   [junit4]   2> 291421 INFO  (TEST-TestSolrConfigHandlerCloud.test-seed#[1918B175AA10C50C]) [    ] o.a.s.c.c.SolrZkClient Using default ZkCredentialsProvider
   [junit4]   2> 291422 INFO  (TEST-TestSolrConfigHandlerCloud.test-seed#[1918B175AA10C50C]) [    ] o.a.s.c.c.ConnectionManager Waiting for client to connect to ZooKeeper
   [junit4]   2> 291422 INFO  (zkCallback-394-thread-1) [    ] o.a.s.c.c.ConnectionManager Watcher org.apache.solr.common.cloud.ConnectionManager@1f7eb0f name:ZooKeeperConnection Watcher:127.0.0.1:36524/solr got event WatchedEvent state:SyncConnected type:None path:null path:null type:None
   [junit4]   2> 291422 INFO  (TEST-TestSolrConfigHandlerCloud.test-seed#[1918B175AA10C50C]) [    ] o.a.s.c.c.ConnectionManager Client is connected to ZooKeeper
   [junit4]   2> 291423 INFO  (TEST-TestSolrConfigHandlerCloud.test-seed#[1918B175AA10C50C]) [    ] o.a.s.c.c.SolrZkClient Using default ZkACLProvider
   [junit4]   2> 291424 INFO  (TEST-TestSolrConfigHandlerCloud.test-seed#[1918B175AA10C50C]) [    ] o.a.s.s.SolrDispatchFilter Loading solr.xml from SolrHome (not found in ZooKeeper)
   [junit4]   2> 291424 INFO  (TEST-TestSolrConfigHandlerCloud.test-seed#[1918B175AA10C50C]) [    ] o.a.s.c.SolrXmlConfig Loading container configuration from /home/jenkins/workspace/Lucene-Solr-5.5-Linux/solr/build/solr-core/test/J0/temp/solr.handler.TestSolrConfigHandlerCloud_1918B175AA10C50C-001/shard-1-001/solr.xml
   [junit4]   2> 291475 INFO  (TEST-TestSolrConfigHandlerCloud.test-seed#[1918B175AA10C50C]) [    ] o.a.s.c.CorePropertiesLocator Config-defined core root directory: /home/jenkins/workspace/Lucene-Solr-5.5-Linux/solr/build/solr-core/test/J0/../../../../../../../../../home/jenkins/workspace/Lucene-Solr-5.5-Linux/solr/build/solr-core/test/J0/temp/solr.handler.TestSolrConfigHandlerCloud_1918B175AA10C50C-001/shard-1-001/cores
   [junit4]   2> 291475 INFO  (TEST-TestSolrConfigHandlerCloud.test-seed#[1918B175AA10C50C]) [    ] o.a.s.c.CoreContainer New CoreContainer 9567134
   [junit4]   2> 291475 INFO  (TEST-TestSolrConfigHandlerCloud.test-seed#[1918B175AA10C50C]) [    ] o.a.s.c.CoreContainer Loading cores into CoreContainer [instanceDir=/home/jenkins/workspace/Lucene-Solr-5.5-Linux/solr/build/solr-core/test/J0/temp/solr.handler.TestSolrConfigHandlerCloud_1918B175AA10C50C-001/shard-1-001]
   [junit4]   2> 291475 WARN  (TEST-TestSolrConfigHandlerCloud.test-seed#[1918B175AA10C50C]) [    ] o.a.s.c.CoreContainer Couldn't add files from /home/jenkins/workspace/Lucene-Solr-5.5-Linux/solr/build/solr-core/test/J0/temp/solr.handler.TestSolrConfigHandlerCloud_1918B175AA10C50C-001/shard-1-001/lib to classpath: /home/jenkins/workspace/Lucene-Solr-5.5-Linux/solr/build/solr-core/test/J0/temp/solr.handler.TestSolrConfigHandlerCloud_1918B175AA10C50C-001/shard-1-001/lib
   [junit4]   2> 291476 INFO  (TEST-TestSolrConfigHandlerCloud.test-seed#[1918B175AA10C50C]) [    ] o.a.s.h.c.HttpShardHandlerFactory created with socketTimeout : 90000,urlScheme : ,connTimeout : 15000,maxConnectionsPerHost : 20,maxConnections : 10000,corePoolSize : 0,maximumPoolSize : 2147483647,maxThreadIdleTime : 5,sizeOfQueue : -1,fairnessPolicy : false,useRetries : false,connectionsEvictorSleepDelay : 5000,maxConnectionIdleTime : 40000,
   [junit4]   2> 291477 INFO  (TEST-TestSolrConfigHandlerCloud.test-seed#[1918B175AA10C50C]) [    ] o.a.s.u.UpdateShardHandler Creating UpdateShardHandler HTTP client with params: socketTimeout=340000&connTimeout=45000&retry=true
   [junit4]   2> 291478 INFO  (TEST-TestSolrConfigHandlerCloud.test-seed#[1918B175AA10C50C]) [    ] o.a.s.l.LogWatcher SLF4J impl is org.slf4j.impl.Log4jLoggerFactory
   [junit4]   2> 291478 INFO  (TEST-TestSolrConfigHandlerCloud.test-seed#[1918B175AA10C50C]) [    ] o.a.s.l.LogWatcher Registering Log Listener [Log4j (org.slf4j.impl.Log4jLoggerFactory)]
   [junit4]   2> 291478 INFO  (TEST-TestSolrConfigHandlerCloud.test-seed#[1918B175AA10C50C]) [    ] o.a.s.c.ZkContainer Zookeeper client=127.0.0.1:36524/solr
   [junit4]   2> 291478 INFO  (TEST-TestSolrConfigHandlerCloud.test-seed#[1918B175AA10C50C]) [    ] o.a.s.c.ZkController zkHost includes chroot
   [junit4]   2> 291478 INFO  (TEST-TestSolrConfigHandlerCloud.test-seed#[1918B175AA10C50C]) [    ] o.a.s.c.c.SolrZkClient Using default ZkCredentialsProvider
   [junit4]   2> 291478 INFO  (TEST-TestSolrConfigHandlerCloud.test-seed#[1918B175AA10C50C]) [    ] o.a.s.c.c.ConnectionManager Waiting for client to connect to ZooKeeper
   [junit4]   2> 291480 INFO  (zkCallback-397-thread-1) [    ] o.a.s.c.c.ConnectionManager Watcher org.apache.solr.common.cloud.ConnectionManager@885ea2 name:ZooKeeperConnection Watcher:127.0.0.1:36524 got event WatchedEvent state:SyncConnected type:None path:null path:null type:None
   [junit4]   2> 291480 INFO  (TEST-TestSolrConfigHandlerCloud.test-seed#[1918B175AA10C50C]) [    ] o.a.s.c.c.ConnectionManager Client is connected to ZooKeeper
   [junit4]   2> 291480 INFO  (TEST-TestSolrConfigHandlerCloud.test-seed#[1918B175AA10C50C]) [    ] o.a.s.c.c.SolrZkClient Using default ZkACLProvider
   [junit4]   2> 291481 INFO  (TEST-TestSolrConfigHandlerCloud.test-seed#[1918B175AA10C50C]) [n:127.0.0.1:35765_    ] o.a.s.c.ZkController Added new OnReconnect listener org.apache.solr.cloud.ZkController$6@19f7378
   [junit4]   2> 291481 INFO  (TEST-TestSolrConfigHandlerCloud.test-seed#[1918B175AA10C50C]) [n:127.0.0.1:35765_    ] o.a.s.c.c.ConnectionManager Waiting for client to connect to ZooKeeper
   [junit4]   2> 291482 INFO  (zkCallback-398-thread-1-processing-n:127.0.0.1:35765_) [n:127.0.0.1:35765_    ] o.a.s.c.c.ConnectionManager Watcher org.apache.solr.common.cloud.ConnectionManager@ef7d2d name:ZooKeeperConnection Watcher:127.0.0.1:36524/solr got event WatchedEvent state:SyncConnected type:None path:null path:null type:None
   [junit4]   2> 291482 INFO  (TEST-TestSolrConfigHandlerCloud.test-seed#[1918B175AA10C50C]) [n:127.0.0.1:35765_    ] o.a.s.c.c.ConnectionManager Client is connected to ZooKeeper
   [junit4]   2> 291484 INFO  (TEST-TestSolrConfigHandlerCloud.test-seed#[1918B175AA10C50C]) [n:127.0.0.1:35765_    ] o.a.s.c.c.ZkStateReader Updating cluster state from ZooKeeper... 
   [junit4]   2> 292486 INFO  (TEST-TestSolrConfigHandlerCloud.test-seed#[1918B175AA10C50C]) [n:127.0.0.1:35765_    ] o.a.s.c.ZkController Register node as live in ZooKeeper:/live_nodes/127.0.0.1:35765_
   [junit4]   2> 292486 INFO  (TEST-TestSolrConfigHandlerCloud.test-seed#[1918B175AA10C50C]) [n:127.0.0.1:35765_    ] o.a.s.c.c.SolrZkClient makePath: /live_nodes/127.0.0.1:35765_
   [junit4]   2> 292487 INFO  (zkCallback-398-thread-1-processing-n:127.0.0.1:35765_) [n:127.0.0.1:35765_    ] o.a.s.c.c.ZkStateReader A live node change: [WatchedEvent state:SyncConnected type:NodeChildrenChanged path:/live_nodes], has occurred - updating... (live nodes size: [1])
   [junit4]   2> 292487 INFO  (zkCallback-393-thread-1) [    ] o.a.s.c.c.ZkStateReader A live node change: [WatchedEvent state:SyncConnected type:NodeChildrenChanged path:/live_nodes], has occurred - updating... (live nodes size: [1])
   [junit4]   2> 292487 INFO  (zkCallback-391-thread-1-processing-n:127.0.0.1:33918_) [n:127.0.0.1:33918_    ] o.a.s.c.c.ZkStateReader A live node change: [WatchedEvent state:SyncConnected type:NodeChildrenChanged path:/live_nodes], has occurred - updating... (live nodes size: [1])
   [junit4]   2> 292488 INFO  (TEST-TestSolrConfigHandlerCloud.test-seed#[1918B175AA10C50C]) [n:127.0.0.1:35765_    ] o.a.s.c.Overseer Overseer (id=null) closing
   [junit4]   2> 292488 INFO  (TEST-TestSolrConfigHandlerCloud.test-seed#[1918B175AA10C50C]) [n:127.0.0.1:35765_    ] o.a.s.c.LeaderElector Joined leadership election with path: /overseer_elect/election/96515778942402568-127.0.0.1:35765_-n_0000000001
   [junit4]   2> 292489 INFO  (TEST-TestSolrConfigHandlerCloud.test-seed#[1918B175AA10C50C]) [n:127.0.0.1:35765_    ] o.a.s.c.LeaderElector Watching path /overseer_elect/election/96515778942402564-127.0.0.1:33918_-n_0000000000 to know if I could be the leader
   [junit4]   2> 292563 INFO  (TEST-TestSolrConfigHandlerCloud.test-seed#[1918B175AA10C50C]) [n:127.0.0.1:35765_    ] o.a.s.c.CoreContainer Security conf doesn't exist. Skipping setup for authorization module.
   [junit4]   2> 292563 INFO  (TEST-TestSolrConfigHandlerCloud.test-seed#[1918B175AA10C50C]) [n:127.0.0.1:35765_    ] o.a.s.c.CoreContainer No authentication plugin used.
   [junit4]   2> 292564 INFO  (TEST-TestSolrConfigHandlerCloud.test-seed#[1918B175AA10C50C]) [n:127.0.0.1:35765_    ] o.a.s.c.CorePropertiesLocator Looking for core definitions underneath /home/jenkins/workspace/Lucene-Solr-5.5-Linux/solr/build/solr-core/test/J0/../../../../../../../../../home/jenkins/workspace/Lucene-Solr-5.5-Linux/solr/build/solr-core/test/J0/temp/solr.handler.TestSolrConfigHandlerCloud_1918B175AA10C50C-001/shard-1-001/cores
   [junit4]   2> 292564 INFO  (TEST-TestSolrConfigHandlerCloud.test-seed#[1918B175AA10C50C]) [n:127.0.0.1:35765_    ] o.a.s.c.CoreDescriptor Created CoreDescriptor: {dataDir=data/, loadOnStartup=true, config=solrconfig.xml, transient=false, name=collection1, schema=schema.xml, configSetProperties=configsetprops.json, coreNodeName=, shard=, collection=collection1}
   [junit4]   2> 292564 INFO  (TEST-TestSolrConfigHandlerCloud.test-seed#[1918B175AA10C50C]) [n:127.0.0.1:35765_    ] o.a.s.c.CorePropertiesLocator Found core collection1 in /home/jenkins/workspace/Lucene-Solr-5.5-Linux/solr/build/solr-core/test/J0/../../../../../../../../../home/jenkins/workspace/Lucene-Solr-5.5-Linux/solr/build/solr-core/test/J0/temp/solr.handler.TestSolrConfigHandlerCloud_1918B175AA10C50C-001/shard-1-001/cores/collection1
   [junit4]   2> 292564 INFO  (TEST-TestSolrConfigHandlerCloud.test-seed#[1918B175AA10C50C]) [n:127.0.0.1:35765_    ] o.a.s.c.CorePropertiesLocator Found 1 core definitions
   [junit4]   2> 292565 INFO  (TEST-TestSolrConfigHandlerCloud.test-seed#[1918B175AA10C50C]) [n:127.0.0.1:35765_    ] o.a.s.s.SolrDispatchFilter user.dir=/home/jenkins/workspace/Lucene-Solr-5.5-Linux/solr/build/solr-core/test/J0
   [junit4]   2> 292565 INFO  (TEST-TestSolrConfigHandlerCloud.test-seed#[1918B175AA10C50C]) [n:127.0.0.1:35765_    ] o.a.s.s.SolrDispatchFilter SolrDispatchFilter.init() done
   [junit4]   2> 292565 INFO  (coreLoadExecutor-1620-thread-1-processing-n:127.0.0.1:35765_) [n:127.0.0.1:35765_ c:collection1   x:collection1] o.a.s.c.ZkController publishing state=down
   [junit4]   2> 292565 INFO  (coreLoadExecutor-1620-thread-1-processing-n:127.0.0.1:35765_) [n:127.0.0.1:35765_ c:collection1   x:collection1] o.a.s.c.ZkController numShards not found on descriptor - reading it from system property
   [junit4]   2> 292566 INFO  (coreLoadExecutor-1620-thread-1-processing-n:127.0.0.1:35765_) [n:127.0.0.1:35765_ c:collection1   x:collection1] o.a.s.c.ZkController Collection collection1 not visible yet, but flagging it so a watch is registered when it becomes visible
   [junit4]   2> 292566 INFO  (coreLoadExecutor-1620-thread-1-processing-n:127.0.0.1:35765_) [n:127.0.0.1:35765_ c:collection1   x:collection1] o.a.s.c.c.ZkStateReader addZkWatch [collection1]
   [junit4]   2> 292566 INFO  (OverseerStateUpdate-96515778942402564-127.0.0.1:33918_-n_0000000000) [n:127.0.0.1:33918_    ] o.a.s.c.Overseer processMessage: queueSize: 1, message = {
   [junit4]   2>   "node_name":"127.0.0.1:35765_",
   [junit4]   2>   "base_url":"http://127.0.0.1:35765",
   [junit4]   2>   "collection":"collection1",
   [junit4]   2>   "state":"down",
   [junit4]   2>   "roles":null,
   [junit4]   2>   "core":"collection1",
   [junit4]   2>   "shard":null,
   [junit4]   2>   "operation":"state",
   [junit4]   2>   "numShards":"2"} current state version: 3
   [junit4]   2> 292566 INFO  (coreLoadExecutor-1620-thread-1-processing-n:127.0.0.1:35765_) [n:127.0.0.1:35765_ c:collection1   x:collection1] o.a.s.c.c.ZkStateReader Deleting data for [collection1]
   [junit4]   2> 292566 INFO  (OverseerStateUpdate-96515778942402564-127.0.0.1:33918_-n_0000000000) [n:127.0.0.1:33918_    ] o.a.s.c.o.ReplicaMutator Update state numShards=2 message={
   [junit4]   2>   "node_name":"127.0.0.1:35765_",
   [junit4]   2>   "base_url":"http://127.0.0.1:35765",
   [junit4]   2>   "collection":"collection1",
   [junit4]   2>   "state":"down",
   [junit4]   2>   "roles":null,
   [junit4]   2>   "core":"collection1",
   [junit4]   2>   "shard":null,
   [junit4]   2>   "operation":"state",
   [junit4]   2>   "numShards":"2"}
   [junit4]   2> 292566 INFO  (OverseerStateUpdate-96515778942402564-127.0.0.1:33918_-n_0000000000) [n:127.0.0.1:33918_    ] o.a.s.c.o.ClusterStateMutator building a new cName: collection1
   [junit4]   2> 292566 INFO  (OverseerStateUpdate-96515778942402564-127.0.0.1:33918_-n_0000000000) [n:127.0.0.1:33918_    ] o.a.s.c.o.ReplicaMutator Assigning new node to shard shard=shard1
   [junit4]   2> 292567 INFO  (coreLoadExecutor-1620-thread-1-processing-n:127.0.0.1:35765_) [n:127.0.0.1:35765_ c:collection1   x:collection1] o.a.s.c.ZkController look for our core node name
   [junit4]   2> 292668 INFO  (zkCallback-393-thread-1) [    ] o.a.s.c.c.ZkStateReader A cluster state change: [WatchedEvent state:SyncConnected type:NodeDataChanged path:/clusterstate.json], has occurred - updating... (live nodes size: [2])
   [junit4]   2> 292668 INFO  (zkCallback-391-thread-2-processing-n:127.0.0.1:33918_) [n:127.0.0.1:33918_    ] o.a.s.c.c.ZkStateReader A cluster state change: [WatchedEvent state:SyncConnected type:NodeDataChanged path:/clusterstate.json], has occurred - updating... (live nodes size: [2])
   [junit4]   2> 292668 INFO  (zkCallback-398-thread-1-processi

[...truncated too long message...]

d.LeaderElector$ElectionWatcher.process(LeaderElector.java:349)
   [junit4]   2> 	at org.apache.solr.common.cloud.SolrZkClient$3$1.run(SolrZkClient.java:264)
   [junit4]   2> 	at java.util.concurrent.Executors$RunnableAdapter.call(Executors.java:471)
   [junit4]   2> 	at java.util.concurrent.FutureTask.run(FutureTask.java:262)
   [junit4]   2> 	at org.apache.solr.common.util.ExecutorUtil$MDCAwareThreadPoolExecutor$1.run(ExecutorUtil.java:231)
   [junit4]   2> 	at java.util.concurrent.ThreadPoolExecutor.runWorker(ThreadPoolExecutor.java:1145)
   [junit4]   2> 	at java.util.concurrent.ThreadPoolExecutor$Worker.run(ThreadPoolExecutor.java:615)
   [junit4]   2> 	at java.lang.Thread.run(Thread.java:745)
   [junit4]   2> 2041773 INFO  (jetty-launcher-26501-thread-2) [    ] o.e.j.s.h.ContextHandler Stopped o.e.j.s.ServletContextHandler@16e00e{/solr,null,UNAVAILABLE}
   [junit4]   2> 2041774 INFO  (TEST-TestManagedSchemaAPI.test-seed#[1918B175AA10C50C]) [    ] o.a.s.c.ZkTestServer connecting to 127.0.0.1:39750 39750
   [junit4]   2> 2041829 INFO  (Thread-4681) [    ] o.a.s.c.ZkTestServer connecting to 127.0.0.1:39750 39750
   [junit4]   2> 2041830 WARN  (Thread-4681) [    ] o.a.s.c.ZkTestServer Watch limit violations: 
   [junit4]   2> Maximum concurrent create/delete watches above limit:
   [junit4]   2> 
   [junit4]   2> 	6	/solr/configs/conf1/managed-schema
   [junit4]   2> 	6	/solr/configs/conf1
   [junit4]   2> 	3	/solr/aliases.json
   [junit4]   2> 	2	/solr/security.json
   [junit4]   2> 
   [junit4]   2> Maximum concurrent data watches above limit:
   [junit4]   2> 
   [junit4]   2> 	3	/solr/clusterstate.json
   [junit4]   2> 	2	/solr/collections/testschemaapi/state.json
   [junit4]   2> 
   [junit4]   2> Maximum concurrent children watches above limit:
   [junit4]   2> 
   [junit4]   2> 	9	/solr/overseer/collection-queue-work
   [junit4]   2> 	7	/solr/overseer/queue
   [junit4]   2> 	3	/solr/live_nodes
   [junit4]   2> 	3	/solr/collections
   [junit4]   2> 	3	/solr/overseer/queue-work
   [junit4]   2> 
   [junit4]   2> 2041830 INFO  (TEST-TestManagedSchemaAPI.test-seed#[1918B175AA10C50C]) [    ] o.a.s.SolrTestCaseJ4 ###Ending test
   [junit4]   2> NOTE: reproduce with: ant test  -Dtestcase=TestManagedSchemaAPI -Dtests.method=test -Dtests.seed=1918B175AA10C50C -Dtests.multiplier=3 -Dtests.slow=true -Dtests.locale=nl -Dtests.timezone=Asia/Jayapura -Dtests.asserts=true -Dtests.file.encoding=UTF-8
   [junit4] ERROR   13.3s J2 | TestManagedSchemaAPI.test <<<
   [junit4]    > Throwable #1: org.apache.solr.client.solrj.impl.CloudSolrClient$RouteException: Error from server at http://127.0.0.1:35763/solr/testschemaapi_shard1_replica2: ERROR: [doc=2] unknown field 'myNewField1'
   [junit4]    > 	at __randomizedtesting.SeedInfo.seed([1918B175AA10C50C:914C8EAF04ECA8F4]:0)
   [junit4]    > 	at org.apache.solr.client.solrj.impl.CloudSolrClient.directUpdate(CloudSolrClient.java:653)
   [junit4]    > 	at org.apache.solr.client.solrj.impl.CloudSolrClient.sendRequest(CloudSolrClient.java:1002)
   [junit4]    > 	at org.apache.solr.client.solrj.impl.CloudSolrClient.requestWithRetryOnStaleState(CloudSolrClient.java:891)
   [junit4]    > 	at org.apache.solr.client.solrj.impl.CloudSolrClient.request(CloudSolrClient.java:827)
   [junit4]    > 	at org.apache.solr.schema.TestManagedSchemaAPI.testAddFieldAndDocument(TestManagedSchemaAPI.java:101)
   [junit4]    > 	at org.apache.solr.schema.TestManagedSchemaAPI.test(TestManagedSchemaAPI.java:69)
   [junit4]    > 	at java.lang.Thread.run(Thread.java:745)
   [junit4]    > Caused by: org.apache.solr.client.solrj.impl.HttpSolrClient$RemoteSolrException: Error from server at http://127.0.0.1:35763/solr/testschemaapi_shard1_replica2: ERROR: [doc=2] unknown field 'myNewField1'
   [junit4]    > 	at org.apache.solr.client.solrj.impl.HttpSolrClient.executeMethod(HttpSolrClient.java:577)
   [junit4]    > 	at org.apache.solr.client.solrj.impl.HttpSolrClient.request(HttpSolrClient.java:241)
   [junit4]    > 	at org.apache.solr.client.solrj.impl.HttpSolrClient.request(HttpSolrClient.java:230)
   [junit4]    > 	at org.apache.solr.client.solrj.impl.LBHttpSolrClient.doRequest(LBHttpSolrClient.java:372)
   [junit4]    > 	at org.apache.solr.client.solrj.impl.LBHttpSolrClient.request(LBHttpSolrClient.java:325)
   [junit4]    > 	at org.apache.solr.client.solrj.impl.CloudSolrClient$2.call(CloudSolrClient.java:628)
   [junit4]    > 	at org.apache.solr.client.solrj.impl.CloudSolrClient$2.call(CloudSolrClient.java:625)
   [junit4]    > 	at java.util.concurrent.FutureTask.run(FutureTask.java:262)
   [junit4]    > 	at org.apache.solr.common.util.ExecutorUtil$MDCAwareThreadPoolExecutor$1.run(ExecutorUtil.java:231)
   [junit4]    > 	at java.util.concurrent.ThreadPoolExecutor.runWorker(ThreadPoolExecutor.java:1145)
   [junit4]    > 	at java.util.concurrent.ThreadPoolExecutor$Worker.run(ThreadPoolExecutor.java:615)
   [junit4]    > 	... 1 more
   [junit4]   2> 2041832 INFO  (SUITE-TestManagedSchemaAPI-seed#[1918B175AA10C50C]-worker) [    ] o.a.s.SolrTestCaseJ4 ###deleteCore
   [junit4]   2> NOTE: leaving temporary files on disk at: /home/jenkins/workspace/Lucene-Solr-5.5-Linux/solr/build/solr-core/test/J2/temp/solr.schema.TestManagedSchemaAPI_1918B175AA10C50C-001
   [junit4]   2> Sep 01, 2016 7:41:04 AM com.carrotsearch.randomizedtesting.ThreadLeakControl checkThreadLeaks
   [junit4]   2> WARNING: Will linger awaiting termination of 1 leaked thread(s).
   [junit4]   2> NOTE: test params are: codec=Lucene54, sim=RandomSimilarity(queryNorm=true,coord=yes): {}, locale=nl, timezone=Asia/Jayapura
   [junit4]   2> NOTE: Linux 4.4.0-31-generic i386/Oracle Corporation 1.7.0_80 (32-bit)/cpus=12,threads=1,free=247742696,total=536870912
   [junit4]   2> NOTE: All tests run in this JVM: [TestRawTransformer, TestSolrCloudWithKerberosAlt, SSLMigrationTest, CurrencyFieldXmlFileTest, TestSolrJ, TestClassicSimilarityFactory, TestSolrXml, FullSolrCloudDistribCmdsTest, AtomicUpdatesTest, FieldMutatingUpdateProcessorTest, BJQParserTest, ReplicationFactorTest, RuleEngineTest, BadComponentTest, TestJettySolrRunner, TestCoreDiscovery, DistributedFacetPivotLongTailTest, SortSpecParsingTest, TestClusterStateMutator, CollectionReloadTest, HdfsDirectoryFactoryTest, TestFreeTextSuggestions, DeleteReplicaTest, DataDrivenBlockJoinTest, PrimitiveFieldTypeTest, SliceStateTest, TestSolr4Spatial2, TestDownShardTolerantSearch, TestSuggestSpellingConverter, SolrTestCaseJ4Test, TestRecovery, TestUseDocValuesAsStored2, TestObjectReleaseTracker, StatelessScriptUpdateProcessorFactoryTest, HdfsUnloadDistributedZkTest, TestReversedWildcardFilterFactory, TestInitParams, TestAuthorizationFramework, TestSchemaResource, TestStressRecovery, HttpPartitionTest, TestExpandComponent, TestOverriddenPrefixQueryForCustomFieldType, TestTolerantSearch, CursorMarkTest, CoreAdminCreateDiscoverTest, BlockJoinFacetSimpleTest, TestConfigSetImmutable, PeerSyncReplicationTest, JavabinLoaderTest, TestUniqueKeyFieldResource, TestManagedResource, TestChildDocTransformer, CoreSorterTest, TestSearchPerf, TestSweetSpotSimilarityFactory, TestSearcherReuse, TestFieldCollectionResource, TestCSVResponseWriter, BitVectorTest, CheckHdfsIndexTest, DirectUpdateHandlerTest, TestReRankQParserPlugin, DistributedDebugComponentTest, TestMinMaxOnMultiValuedField, TestConfigReload, DistributedQueueTest, TestDistribIDF, TestElisionMultitermQuery, BlockDirectoryTest, IgnoreCommitOptimizeUpdateProcessorFactoryTest, LeaderElectionTest, OverseerRolesTest, OverseerTest, TestSha256AuthenticationProvider, LukeRequestHandlerTest, TestBulkSchemaConcurrent, RegexBoostProcessorTest, TestGroupingSearch, SampleTest, TestPerFieldSimilarityWithDefaultOverride, TestNamedUpdateProcessors, TestLeaderInitiatedRecoveryThread, TestTestInjection, StatsComponentTest, TestJsonRequest, ConfigSetsAPITest, DistributedSuggestComponentTest, TestBulkSchemaAPI, TestJmxMonitoredMap, LeaderInitiatedRecoveryOnShardRestartTest, BasicDistributedZk2Test, UnloadDistributedZkTest, OpenCloseCoreStressTest, ShardRoutingTest, RecoveryZkTest, TestRandomFaceting, TestZkChroot, TestRandomDVFaceting, ShardRoutingCustomTest, TestDistributedSearch, TestStressVersions, TestRangeQuery, TestSolr4Spatial, BadIndexSchemaTest, TestSort, HighlighterTest, CurrencyFieldOpenExchangeTest, SignatureUpdateProcessorFactoryTest, CoreAdminHandlerTest, SuggesterTest, SolrCoreCheckLockOnStartupTest, QueryEqualityTest, DocValuesMultiTest, DistanceFunctionTest, StandardRequestHandlerTest, TermsComponentTest, RequestHandlersTest, TestIndexingPerformance, FieldAnalysisRequestHandlerTest, IndexSchemaTest, ReturnFieldsTest, BinaryUpdateRequestHandlerTest, SearchHandlerTest, HighlighterConfigTest, SOLR749Test, UpdateParamsTest, AlternateDirectoryTest, TestSolrIndexConfig, TestMergePolicyConfig, TestSolrDeletionPolicy2, MultiTermTest, MinimalSchemaTest, TestConfig, TestFuzzyAnalyzedSuggestions, TestSolrCoreProperties, TestPostingsSolrHighlighter, DirectSolrConnectionTest, TestLuceneMatchVersion, TestCharFilters, TestCodecSupport, SynonymTokenizerTest, TestXIncludeConfig, EchoParamsTest, TestBM25SimilarityFactory, TimeZoneUtilsTest, ScriptEngineTest, TestFastLRUCache, ChaosMonkeyNothingIsSafeTest, CollectionsAPIAsyncDistributedZkTest, DistribCursorPagingTest, MultiThreadedOCPTest, RestartWhileUpdatingTest, RollingRestartTest, TestCollectionAPI, TestMiniSolrCloudClusterBase, TestMiniSolrCloudClusterSSL, TestOnReconnectListenerSupport, TestRandomRequestDistribution, TestReplicaProperties, TestShortCircuitedRequests, TestStressLiveNodes, CachingDirectoryFactoryTest, TestConfigOverlay, TestConfigSetProperties, TestConfigSets, TestDynamicLoading, TestReqParamsAPI, TestRestoreCore, DistributedQueryComponentOptimizationTest, TestDynamicFieldResource, TestFieldTypeResource, TestSchemaSimilarityResource, BadCopyFieldTest, SpatialRPTFieldTypeTest, TestManagedSchemaAPI]
   [junit4] Completed [527/575 (2!)] on J2 in 14.05s, 1 test, 1 error <<< FAILURES!

[...truncated 49270 lines...]


Mime
View raw message