lucene-dev mailing list archives

Site index · List index
Message view « Date » · « Thread »
Top « Date » · « Thread »
From Policeman Jenkins Server <jenk...@thetaphi.de>
Subject [JENKINS] Lucene-Solr-6.x-Solaris (64bit/jdk1.8.0) - Build # 372 - Still Unstable!
Date Sat, 03 Sep 2016 00:17:21 GMT
Build: http://jenkins.thetaphi.de/job/Lucene-Solr-6.x-Solaris/372/
Java: 64bit/jdk1.8.0 -XX:+UseCompressedOops -XX:+UseG1GC

6 tests failed.
FAILED:  org.apache.solr.cloud.TestHdfsCloudBackupRestore.test

Error Message:
Error from server at http://127.0.0.1:33217/solr: Could not backup all replicas

Stack Trace:
org.apache.solr.client.solrj.impl.HttpSolrClient$RemoteSolrException: Error from server at http://127.0.0.1:33217/solr: Could not backup all replicas
	at __randomizedtesting.SeedInfo.seed([2389893824BCF3D:8A6CA7492CB7A2C5]:0)
	at org.apache.solr.client.solrj.impl.HttpSolrClient.executeMethod(HttpSolrClient.java:592)
	at org.apache.solr.client.solrj.impl.HttpSolrClient.request(HttpSolrClient.java:261)
	at org.apache.solr.client.solrj.impl.HttpSolrClient.request(HttpSolrClient.java:250)
	at org.apache.solr.client.solrj.impl.LBHttpSolrClient.doRequest(LBHttpSolrClient.java:405)
	at org.apache.solr.client.solrj.impl.LBHttpSolrClient.request(LBHttpSolrClient.java:357)
	at org.apache.solr.client.solrj.impl.CloudSolrClient.sendRequest(CloudSolrClient.java:1280)
	at org.apache.solr.client.solrj.impl.CloudSolrClient.requestWithRetryOnStaleState(CloudSolrClient.java:1050)
	at org.apache.solr.client.solrj.impl.CloudSolrClient.request(CloudSolrClient.java:992)
	at org.apache.solr.client.solrj.SolrRequest.process(SolrRequest.java:149)
	at org.apache.solr.client.solrj.SolrRequest.process(SolrRequest.java:166)
	at org.apache.solr.cloud.AbstractCloudBackupRestoreTestCase.testBackupAndRestore(AbstractCloudBackupRestoreTestCase.java:204)
	at org.apache.solr.cloud.AbstractCloudBackupRestoreTestCase.test(AbstractCloudBackupRestoreTestCase.java:126)
	at sun.reflect.NativeMethodAccessorImpl.invoke0(Native Method)
	at sun.reflect.NativeMethodAccessorImpl.invoke(NativeMethodAccessorImpl.java:62)
	at sun.reflect.DelegatingMethodAccessorImpl.invoke(DelegatingMethodAccessorImpl.java:43)
	at java.lang.reflect.Method.invoke(Method.java:498)
	at com.carrotsearch.randomizedtesting.RandomizedRunner.invoke(RandomizedRunner.java:1764)
	at com.carrotsearch.randomizedtesting.RandomizedRunner$8.evaluate(RandomizedRunner.java:871)
	at com.carrotsearch.randomizedtesting.RandomizedRunner$9.evaluate(RandomizedRunner.java:907)
	at com.carrotsearch.randomizedtesting.RandomizedRunner$10.evaluate(RandomizedRunner.java:921)
	at com.carrotsearch.randomizedtesting.rules.SystemPropertiesRestoreRule$1.evaluate(SystemPropertiesRestoreRule.java:57)
	at org.apache.lucene.util.TestRuleSetupTeardownChained$1.evaluate(TestRuleSetupTeardownChained.java:49)
	at org.apache.lucene.util.AbstractBeforeAfterRule$1.evaluate(AbstractBeforeAfterRule.java:45)
	at org.apache.lucene.util.TestRuleThreadAndTestName$1.evaluate(TestRuleThreadAndTestName.java:48)
	at org.apache.lucene.util.TestRuleIgnoreAfterMaxFailures$1.evaluate(TestRuleIgnoreAfterMaxFailures.java:64)
	at org.apache.lucene.util.TestRuleMarkFailure$1.evaluate(TestRuleMarkFailure.java:47)
	at com.carrotsearch.randomizedtesting.rules.StatementAdapter.evaluate(StatementAdapter.java:36)
	at com.carrotsearch.randomizedtesting.ThreadLeakControl$StatementRunner.run(ThreadLeakControl.java:367)
	at com.carrotsearch.randomizedtesting.ThreadLeakControl.forkTimeoutingTask(ThreadLeakControl.java:809)
	at com.carrotsearch.randomizedtesting.ThreadLeakControl$3.evaluate(ThreadLeakControl.java:460)
	at com.carrotsearch.randomizedtesting.RandomizedRunner.runSingleTest(RandomizedRunner.java:880)
	at com.carrotsearch.randomizedtesting.RandomizedRunner$5.evaluate(RandomizedRunner.java:781)
	at com.carrotsearch.randomizedtesting.RandomizedRunner$6.evaluate(RandomizedRunner.java:816)
	at com.carrotsearch.randomizedtesting.RandomizedRunner$7.evaluate(RandomizedRunner.java:827)
	at com.carrotsearch.randomizedtesting.rules.StatementAdapter.evaluate(StatementAdapter.java:36)
	at com.carrotsearch.randomizedtesting.rules.SystemPropertiesRestoreRule$1.evaluate(SystemPropertiesRestoreRule.java:57)
	at org.apache.lucene.util.AbstractBeforeAfterRule$1.evaluate(AbstractBeforeAfterRule.java:45)
	at com.carrotsearch.randomizedtesting.rules.StatementAdapter.evaluate(StatementAdapter.java:36)
	at org.apache.lucene.util.TestRuleStoreClassName$1.evaluate(TestRuleStoreClassName.java:41)
	at com.carrotsearch.randomizedtesting.rules.NoShadowingOrOverridesOnMethodsRule$1.evaluate(NoShadowingOrOverridesOnMethodsRule.java:40)
	at com.carrotsearch.randomizedtesting.rules.NoShadowingOrOverridesOnMethodsRule$1.evaluate(NoShadowingOrOverridesOnMethodsRule.java:40)
	at com.carrotsearch.randomizedtesting.rules.StatementAdapter.evaluate(StatementAdapter.java:36)
	at com.carrotsearch.randomizedtesting.rules.StatementAdapter.evaluate(StatementAdapter.java:36)
	at com.carrotsearch.randomizedtesting.rules.StatementAdapter.evaluate(StatementAdapter.java:36)
	at org.apache.lucene.util.TestRuleAssertionsRequired$1.evaluate(TestRuleAssertionsRequired.java:53)
	at org.apache.lucene.util.TestRuleMarkFailure$1.evaluate(TestRuleMarkFailure.java:47)
	at org.apache.lucene.util.TestRuleIgnoreAfterMaxFailures$1.evaluate(TestRuleIgnoreAfterMaxFailures.java:64)
	at org.apache.lucene.util.TestRuleIgnoreTestSuites$1.evaluate(TestRuleIgnoreTestSuites.java:54)
	at com.carrotsearch.randomizedtesting.rules.StatementAdapter.evaluate(StatementAdapter.java:36)
	at com.carrotsearch.randomizedtesting.ThreadLeakControl$StatementRunner.run(ThreadLeakControl.java:367)
	at java.lang.Thread.run(Thread.java:745)


FAILED:  org.apache.solr.cloud.hdfs.StressHdfsTest.test

Error Message:
Data directory exists after collection removal : hdfs://solaris-vm:45999/solr_hdfs_home/delete_data_dir/core_node1/data

Stack Trace:
java.lang.AssertionError: Data directory exists after collection removal : hdfs://solaris-vm:45999/solr_hdfs_home/delete_data_dir/core_node1/data
	at __randomizedtesting.SeedInfo.seed([2389893824BCF3D:8A6CA7492CB7A2C5]:0)
	at org.junit.Assert.fail(Assert.java:93)
	at org.junit.Assert.assertTrue(Assert.java:43)
	at org.junit.Assert.assertFalse(Assert.java:68)
	at org.apache.solr.cloud.hdfs.StressHdfsTest.createAndDeleteCollection(StressHdfsTest.java:236)
	at org.apache.solr.cloud.hdfs.StressHdfsTest.test(StressHdfsTest.java:103)
	at sun.reflect.NativeMethodAccessorImpl.invoke0(Native Method)
	at sun.reflect.NativeMethodAccessorImpl.invoke(NativeMethodAccessorImpl.java:62)
	at sun.reflect.DelegatingMethodAccessorImpl.invoke(DelegatingMethodAccessorImpl.java:43)
	at java.lang.reflect.Method.invoke(Method.java:498)
	at com.carrotsearch.randomizedtesting.RandomizedRunner.invoke(RandomizedRunner.java:1764)
	at com.carrotsearch.randomizedtesting.RandomizedRunner$8.evaluate(RandomizedRunner.java:871)
	at com.carrotsearch.randomizedtesting.RandomizedRunner$9.evaluate(RandomizedRunner.java:907)
	at com.carrotsearch.randomizedtesting.RandomizedRunner$10.evaluate(RandomizedRunner.java:921)
	at org.apache.solr.BaseDistributedSearchTestCase$ShardsRepeatRule$ShardsFixedStatement.callStatement(BaseDistributedSearchTestCase.java:992)
	at org.apache.solr.BaseDistributedSearchTestCase$ShardsRepeatRule$ShardsStatement.evaluate(BaseDistributedSearchTestCase.java:967)
	at com.carrotsearch.randomizedtesting.rules.SystemPropertiesRestoreRule$1.evaluate(SystemPropertiesRestoreRule.java:57)
	at org.apache.lucene.util.TestRuleSetupTeardownChained$1.evaluate(TestRuleSetupTeardownChained.java:49)
	at org.apache.lucene.util.AbstractBeforeAfterRule$1.evaluate(AbstractBeforeAfterRule.java:45)
	at org.apache.lucene.util.TestRuleThreadAndTestName$1.evaluate(TestRuleThreadAndTestName.java:48)
	at org.apache.lucene.util.TestRuleIgnoreAfterMaxFailures$1.evaluate(TestRuleIgnoreAfterMaxFailures.java:64)
	at org.apache.lucene.util.TestRuleMarkFailure$1.evaluate(TestRuleMarkFailure.java:47)
	at com.carrotsearch.randomizedtesting.rules.StatementAdapter.evaluate(StatementAdapter.java:36)
	at com.carrotsearch.randomizedtesting.ThreadLeakControl$StatementRunner.run(ThreadLeakControl.java:367)
	at com.carrotsearch.randomizedtesting.ThreadLeakControl.forkTimeoutingTask(ThreadLeakControl.java:809)
	at com.carrotsearch.randomizedtesting.ThreadLeakControl$3.evaluate(ThreadLeakControl.java:460)
	at com.carrotsearch.randomizedtesting.RandomizedRunner.runSingleTest(RandomizedRunner.java:880)
	at com.carrotsearch.randomizedtesting.RandomizedRunner$5.evaluate(RandomizedRunner.java:781)
	at com.carrotsearch.randomizedtesting.RandomizedRunner$6.evaluate(RandomizedRunner.java:816)
	at com.carrotsearch.randomizedtesting.RandomizedRunner$7.evaluate(RandomizedRunner.java:827)
	at com.carrotsearch.randomizedtesting.rules.StatementAdapter.evaluate(StatementAdapter.java:36)
	at com.carrotsearch.randomizedtesting.rules.SystemPropertiesRestoreRule$1.evaluate(SystemPropertiesRestoreRule.java:57)
	at org.apache.lucene.util.AbstractBeforeAfterRule$1.evaluate(AbstractBeforeAfterRule.java:45)
	at com.carrotsearch.randomizedtesting.rules.StatementAdapter.evaluate(StatementAdapter.java:36)
	at org.apache.lucene.util.TestRuleStoreClassName$1.evaluate(TestRuleStoreClassName.java:41)
	at com.carrotsearch.randomizedtesting.rules.NoShadowingOrOverridesOnMethodsRule$1.evaluate(NoShadowingOrOverridesOnMethodsRule.java:40)
	at com.carrotsearch.randomizedtesting.rules.NoShadowingOrOverridesOnMethodsRule$1.evaluate(NoShadowingOrOverridesOnMethodsRule.java:40)
	at com.carrotsearch.randomizedtesting.rules.StatementAdapter.evaluate(StatementAdapter.java:36)
	at com.carrotsearch.randomizedtesting.rules.StatementAdapter.evaluate(StatementAdapter.java:36)
	at com.carrotsearch.randomizedtesting.rules.StatementAdapter.evaluate(StatementAdapter.java:36)
	at org.apache.lucene.util.TestRuleAssertionsRequired$1.evaluate(TestRuleAssertionsRequired.java:53)
	at org.apache.lucene.util.TestRuleMarkFailure$1.evaluate(TestRuleMarkFailure.java:47)
	at org.apache.lucene.util.TestRuleIgnoreAfterMaxFailures$1.evaluate(TestRuleIgnoreAfterMaxFailures.java:64)
	at org.apache.lucene.util.TestRuleIgnoreTestSuites$1.evaluate(TestRuleIgnoreTestSuites.java:54)
	at com.carrotsearch.randomizedtesting.rules.StatementAdapter.evaluate(StatementAdapter.java:36)
	at com.carrotsearch.randomizedtesting.ThreadLeakControl$StatementRunner.run(ThreadLeakControl.java:367)
	at java.lang.Thread.run(Thread.java:745)


FAILED:  org.apache.solr.index.hdfs.CheckHdfsIndexTest.doTest

Error Message:
Error from server at http://127.0.0.1:38758/si_at/collection1: File /solr_hdfs_home/control_collection/core_node1/data/index/pending_segments_2 could only be replicated to 0 nodes instead of minReplication (=1).  There are 2 datanode(s) running and no node(s) are excluded in this operation.  at org.apache.hadoop.hdfs.server.blockmanagement.BlockManager.chooseTarget4NewBlock(BlockManager.java:1552)  at org.apache.hadoop.hdfs.server.namenode.FSNamesystem.getNewBlockTargets(FSNamesystem.java:3107)  at org.apache.hadoop.hdfs.server.namenode.FSNamesystem.getAdditionalBlock(FSNamesystem.java:3031)  at org.apache.hadoop.hdfs.server.namenode.NameNodeRpcServer.addBlock(NameNodeRpcServer.java:724)  at org.apache.hadoop.hdfs.protocolPB.ClientNamenodeProtocolServerSideTranslatorPB.addBlock(ClientNamenodeProtocolServerSideTranslatorPB.java:492)  at org.apache.hadoop.hdfs.protocol.proto.ClientNamenodeProtocolProtos$ClientNamenodeProtocol$2.callBlockingMethod(ClientNamenodeProtocolProtos.java)  at org.apache.hadoop.ipc.ProtobufRpcEngine$Server$ProtoBufRpcInvoker.call(ProtobufRpcEngine.java:616)  at org.apache.hadoop.ipc.RPC$Server.call(RPC.java:969)  at org.apache.hadoop.ipc.Server$Handler$1.run(Server.java:2049)  at org.apache.hadoop.ipc.Server$Handler$1.run(Server.java:2045)  at java.security.AccessController.doPrivileged(Native Method)  at javax.security.auth.Subject.doAs(Subject.java:422)  at org.apache.hadoop.security.UserGroupInformation.doAs(UserGroupInformation.java:1657)  at org.apache.hadoop.ipc.Server$Handler.run(Server.java:2045) 

Stack Trace:
org.apache.solr.client.solrj.impl.HttpSolrClient$RemoteSolrException: Error from server at http://127.0.0.1:38758/si_at/collection1: File /solr_hdfs_home/control_collection/core_node1/data/index/pending_segments_2 could only be replicated to 0 nodes instead of minReplication (=1).  There are 2 datanode(s) running and no node(s) are excluded in this operation.
	at org.apache.hadoop.hdfs.server.blockmanagement.BlockManager.chooseTarget4NewBlock(BlockManager.java:1552)
	at org.apache.hadoop.hdfs.server.namenode.FSNamesystem.getNewBlockTargets(FSNamesystem.java:3107)
	at org.apache.hadoop.hdfs.server.namenode.FSNamesystem.getAdditionalBlock(FSNamesystem.java:3031)
	at org.apache.hadoop.hdfs.server.namenode.NameNodeRpcServer.addBlock(NameNodeRpcServer.java:724)
	at org.apache.hadoop.hdfs.protocolPB.ClientNamenodeProtocolServerSideTranslatorPB.addBlock(ClientNamenodeProtocolServerSideTranslatorPB.java:492)
	at org.apache.hadoop.hdfs.protocol.proto.ClientNamenodeProtocolProtos$ClientNamenodeProtocol$2.callBlockingMethod(ClientNamenodeProtocolProtos.java)
	at org.apache.hadoop.ipc.ProtobufRpcEngine$Server$ProtoBufRpcInvoker.call(ProtobufRpcEngine.java:616)
	at org.apache.hadoop.ipc.RPC$Server.call(RPC.java:969)
	at org.apache.hadoop.ipc.Server$Handler$1.run(Server.java:2049)
	at org.apache.hadoop.ipc.Server$Handler$1.run(Server.java:2045)
	at java.security.AccessController.doPrivileged(Native Method)
	at javax.security.auth.Subject.doAs(Subject.java:422)
	at org.apache.hadoop.security.UserGroupInformation.doAs(UserGroupInformation.java:1657)
	at org.apache.hadoop.ipc.Server$Handler.run(Server.java:2045)

	at __randomizedtesting.SeedInfo.seed([2389893824BCF3D:A57C2037EFF0DC84]:0)
	at org.apache.solr.client.solrj.impl.HttpSolrClient.executeMethod(HttpSolrClient.java:592)
	at org.apache.solr.client.solrj.impl.HttpSolrClient.request(HttpSolrClient.java:261)
	at org.apache.solr.client.solrj.impl.HttpSolrClient.request(HttpSolrClient.java:250)
	at org.apache.solr.client.solrj.SolrRequest.process(SolrRequest.java:149)
	at org.apache.solr.client.solrj.SolrClient.commit(SolrClient.java:484)
	at org.apache.solr.client.solrj.SolrClient.commit(SolrClient.java:463)
	at org.apache.solr.cloud.AbstractFullDistribZkTestBase.commit(AbstractFullDistribZkTestBase.java:1529)
	at org.apache.solr.index.hdfs.CheckHdfsIndexTest.doTest(CheckHdfsIndexTest.java:101)
	at sun.reflect.NativeMethodAccessorImpl.invoke0(Native Method)
	at sun.reflect.NativeMethodAccessorImpl.invoke(NativeMethodAccessorImpl.java:62)
	at sun.reflect.DelegatingMethodAccessorImpl.invoke(DelegatingMethodAccessorImpl.java:43)
	at java.lang.reflect.Method.invoke(Method.java:498)
	at com.carrotsearch.randomizedtesting.RandomizedRunner.invoke(RandomizedRunner.java:1764)
	at com.carrotsearch.randomizedtesting.RandomizedRunner$8.evaluate(RandomizedRunner.java:871)
	at com.carrotsearch.randomizedtesting.RandomizedRunner$9.evaluate(RandomizedRunner.java:907)
	at com.carrotsearch.randomizedtesting.RandomizedRunner$10.evaluate(RandomizedRunner.java:921)
	at org.apache.solr.BaseDistributedSearchTestCase$ShardsRepeatRule$ShardsFixedStatement.callStatement(BaseDistributedSearchTestCase.java:992)
	at org.apache.solr.BaseDistributedSearchTestCase$ShardsRepeatRule$ShardsStatement.evaluate(BaseDistributedSearchTestCase.java:967)
	at com.carrotsearch.randomizedtesting.rules.SystemPropertiesRestoreRule$1.evaluate(SystemPropertiesRestoreRule.java:57)
	at org.apache.lucene.util.TestRuleSetupTeardownChained$1.evaluate(TestRuleSetupTeardownChained.java:49)
	at org.apache.lucene.util.AbstractBeforeAfterRule$1.evaluate(AbstractBeforeAfterRule.java:45)
	at org.apache.lucene.util.TestRuleThreadAndTestName$1.evaluate(TestRuleThreadAndTestName.java:48)
	at org.apache.lucene.util.TestRuleIgnoreAfterMaxFailures$1.evaluate(TestRuleIgnoreAfterMaxFailures.java:64)
	at org.apache.lucene.util.TestRuleMarkFailure$1.evaluate(TestRuleMarkFailure.java:47)
	at com.carrotsearch.randomizedtesting.rules.StatementAdapter.evaluate(StatementAdapter.java:36)
	at com.carrotsearch.randomizedtesting.ThreadLeakControl$StatementRunner.run(ThreadLeakControl.java:367)
	at com.carrotsearch.randomizedtesting.ThreadLeakControl.forkTimeoutingTask(ThreadLeakControl.java:809)
	at com.carrotsearch.randomizedtesting.ThreadLeakControl$3.evaluate(ThreadLeakControl.java:460)
	at com.carrotsearch.randomizedtesting.RandomizedRunner.runSingleTest(RandomizedRunner.java:880)
	at com.carrotsearch.randomizedtesting.RandomizedRunner$5.evaluate(RandomizedRunner.java:781)
	at com.carrotsearch.randomizedtesting.RandomizedRunner$6.evaluate(RandomizedRunner.java:816)
	at com.carrotsearch.randomizedtesting.RandomizedRunner$7.evaluate(RandomizedRunner.java:827)
	at com.carrotsearch.randomizedtesting.rules.StatementAdapter.evaluate(StatementAdapter.java:36)
	at com.carrotsearch.randomizedtesting.rules.SystemPropertiesRestoreRule$1.evaluate(SystemPropertiesRestoreRule.java:57)
	at org.apache.lucene.util.AbstractBeforeAfterRule$1.evaluate(AbstractBeforeAfterRule.java:45)
	at com.carrotsearch.randomizedtesting.rules.StatementAdapter.evaluate(StatementAdapter.java:36)
	at org.apache.lucene.util.TestRuleStoreClassName$1.evaluate(TestRuleStoreClassName.java:41)
	at com.carrotsearch.randomizedtesting.rules.NoShadowingOrOverridesOnMethodsRule$1.evaluate(NoShadowingOrOverridesOnMethodsRule.java:40)
	at com.carrotsearch.randomizedtesting.rules.NoShadowingOrOverridesOnMethodsRule$1.evaluate(NoShadowingOrOverridesOnMethodsRule.java:40)
	at com.carrotsearch.randomizedtesting.rules.StatementAdapter.evaluate(StatementAdapter.java:36)
	at com.carrotsearch.randomizedtesting.rules.StatementAdapter.evaluate(StatementAdapter.java:36)
	at com.carrotsearch.randomizedtesting.rules.StatementAdapter.evaluate(StatementAdapter.java:36)
	at org.apache.lucene.util.TestRuleAssertionsRequired$1.evaluate(TestRuleAssertionsRequired.java:53)
	at org.apache.lucene.util.TestRuleMarkFailure$1.evaluate(TestRuleMarkFailure.java:47)
	at org.apache.lucene.util.TestRuleIgnoreAfterMaxFailures$1.evaluate(TestRuleIgnoreAfterMaxFailures.java:64)
	at org.apache.lucene.util.TestRuleIgnoreTestSuites$1.evaluate(TestRuleIgnoreTestSuites.java:54)
	at com.carrotsearch.randomizedtesting.rules.StatementAdapter.evaluate(StatementAdapter.java:36)
	at com.carrotsearch.randomizedtesting.ThreadLeakControl$StatementRunner.run(ThreadLeakControl.java:367)
	at java.lang.Thread.run(Thread.java:745)


FAILED:  org.apache.solr.index.hdfs.CheckHdfsIndexTest.testChecksumsOnlyVerbose

Error Message:
File /solr/_0.nvd could only be replicated to 0 nodes instead of minReplication (=1).  There are 2 datanode(s) running and no node(s) are excluded in this operation.  at org.apache.hadoop.hdfs.server.blockmanagement.BlockManager.chooseTarget4NewBlock(BlockManager.java:1552)  at org.apache.hadoop.hdfs.server.namenode.FSNamesystem.getNewBlockTargets(FSNamesystem.java:3107)  at org.apache.hadoop.hdfs.server.namenode.FSNamesystem.getAdditionalBlock(FSNamesystem.java:3031)  at org.apache.hadoop.hdfs.server.namenode.NameNodeRpcServer.addBlock(NameNodeRpcServer.java:724)  at org.apache.hadoop.hdfs.protocolPB.ClientNamenodeProtocolServerSideTranslatorPB.addBlock(ClientNamenodeProtocolServerSideTranslatorPB.java:492)  at org.apache.hadoop.hdfs.protocol.proto.ClientNamenodeProtocolProtos$ClientNamenodeProtocol$2.callBlockingMethod(ClientNamenodeProtocolProtos.java)  at org.apache.hadoop.ipc.ProtobufRpcEngine$Server$ProtoBufRpcInvoker.call(ProtobufRpcEngine.java:616)  at org.apache.hadoop.ipc.RPC$Server.call(RPC.java:969)  at org.apache.hadoop.ipc.Server$Handler$1.run(Server.java:2049)  at org.apache.hadoop.ipc.Server$Handler$1.run(Server.java:2045)  at java.security.AccessController.doPrivileged(Native Method)  at javax.security.auth.Subject.doAs(Subject.java:422)  at org.apache.hadoop.security.UserGroupInformation.doAs(UserGroupInformation.java:1657)  at org.apache.hadoop.ipc.Server$Handler.run(Server.java:2045) 

Stack Trace:
org.apache.hadoop.ipc.RemoteException(java.io.IOException): File /solr/_0.nvd could only be replicated to 0 nodes instead of minReplication (=1).  There are 2 datanode(s) running and no node(s) are excluded in this operation.
	at org.apache.hadoop.hdfs.server.blockmanagement.BlockManager.chooseTarget4NewBlock(BlockManager.java:1552)
	at org.apache.hadoop.hdfs.server.namenode.FSNamesystem.getNewBlockTargets(FSNamesystem.java:3107)
	at org.apache.hadoop.hdfs.server.namenode.FSNamesystem.getAdditionalBlock(FSNamesystem.java:3031)
	at org.apache.hadoop.hdfs.server.namenode.NameNodeRpcServer.addBlock(NameNodeRpcServer.java:724)
	at org.apache.hadoop.hdfs.protocolPB.ClientNamenodeProtocolServerSideTranslatorPB.addBlock(ClientNamenodeProtocolServerSideTranslatorPB.java:492)
	at org.apache.hadoop.hdfs.protocol.proto.ClientNamenodeProtocolProtos$ClientNamenodeProtocol$2.callBlockingMethod(ClientNamenodeProtocolProtos.java)
	at org.apache.hadoop.ipc.ProtobufRpcEngine$Server$ProtoBufRpcInvoker.call(ProtobufRpcEngine.java:616)
	at org.apache.hadoop.ipc.RPC$Server.call(RPC.java:969)
	at org.apache.hadoop.ipc.Server$Handler$1.run(Server.java:2049)
	at org.apache.hadoop.ipc.Server$Handler$1.run(Server.java:2045)
	at java.security.AccessController.doPrivileged(Native Method)
	at javax.security.auth.Subject.doAs(Subject.java:422)
	at org.apache.hadoop.security.UserGroupInformation.doAs(UserGroupInformation.java:1657)
	at org.apache.hadoop.ipc.Server$Handler.run(Server.java:2045)

	at __randomizedtesting.SeedInfo.seed([2389893824BCF3D:C67408852E4EA8DF]:0)
	at org.apache.hadoop.ipc.Client.call(Client.java:1475)
	at org.apache.hadoop.ipc.Client.call(Client.java:1412)
	at org.apache.hadoop.ipc.ProtobufRpcEngine$Invoker.invoke(ProtobufRpcEngine.java:229)
	at com.sun.proxy.$Proxy56.addBlock(Unknown Source)
	at org.apache.hadoop.hdfs.protocolPB.ClientNamenodeProtocolTranslatorPB.addBlock(ClientNamenodeProtocolTranslatorPB.java:418)
	at sun.reflect.GeneratedMethodAccessor53.invoke(Unknown Source)
	at sun.reflect.DelegatingMethodAccessorImpl.invoke(DelegatingMethodAccessorImpl.java:43)
	at java.lang.reflect.Method.invoke(Method.java:498)
	at org.apache.hadoop.io.retry.RetryInvocationHandler.invokeMethod(RetryInvocationHandler.java:191)
	at org.apache.hadoop.io.retry.RetryInvocationHandler.invoke(RetryInvocationHandler.java:102)
	at com.sun.proxy.$Proxy60.addBlock(Unknown Source)
	at org.apache.hadoop.hdfs.DFSOutputStream$DataStreamer.locateFollowingBlock(DFSOutputStream.java:1459)
	at org.apache.hadoop.hdfs.DFSOutputStream$DataStreamer.nextBlockOutputStream(DFSOutputStream.java:1255)
	at org.apache.hadoop.hdfs.DFSOutputStream$DataStreamer.run(DFSOutputStream.java:449)
	Suppressed: org.apache.hadoop.ipc.RemoteException(java.io.IOException): File /solr/_0.nvm could only be replicated to 0 nodes instead of minReplication (=1).  There are 2 datanode(s) running and no node(s) are excluded in this operation.
	at org.apache.hadoop.hdfs.server.blockmanagement.BlockManager.chooseTarget4NewBlock(BlockManager.java:1552)
	at org.apache.hadoop.hdfs.server.namenode.FSNamesystem.getNewBlockTargets(FSNamesystem.java:3107)
	at org.apache.hadoop.hdfs.server.namenode.FSNamesystem.getAdditionalBlock(FSNamesystem.java:3031)
	at org.apache.hadoop.hdfs.server.namenode.NameNodeRpcServer.addBlock(NameNodeRpcServer.java:724)
	at org.apache.hadoop.hdfs.protocolPB.ClientNamenodeProtocolServerSideTranslatorPB.addBlock(ClientNamenodeProtocolServerSideTranslatorPB.java:492)
	at org.apache.hadoop.hdfs.protocol.proto.ClientNamenodeProtocolProtos$ClientNamenodeProtocol$2.callBlockingMethod(ClientNamenodeProtocolProtos.java)
	at org.apache.hadoop.ipc.ProtobufRpcEngine$Server$ProtoBufRpcInvoker.call(ProtobufRpcEngine.java:616)
	at org.apache.hadoop.ipc.RPC$Server.call(RPC.java:969)
	at org.apache.hadoop.ipc.Server$Handler$1.run(Server.java:2049)
	at org.apache.hadoop.ipc.Server$Handler$1.run(Server.java:2045)
	at java.security.AccessController.doPrivileged(Native Method)
	at javax.security.auth.Subject.doAs(Subject.java:422)
	at org.apache.hadoop.security.UserGroupInformation.doAs(UserGroupInformation.java:1657)
	at org.apache.hadoop.ipc.Server$Handler.run(Server.java:2045)

		... 14 more


FAILED:  junit.framework.TestSuite.org.apache.solr.store.hdfs.HdfsDirectoryTest

Error Message:
Timed out waiting for Mini HDFS Cluster to start

Stack Trace:
java.io.IOException: Timed out waiting for Mini HDFS Cluster to start
	at __randomizedtesting.SeedInfo.seed([2389893824BCF3D]:0)
	at org.apache.hadoop.hdfs.MiniDFSCluster.waitClusterUp(MiniDFSCluster.java:1203)
	at org.apache.hadoop.hdfs.MiniDFSCluster.initMiniDFSCluster(MiniDFSCluster.java:836)
	at org.apache.hadoop.hdfs.MiniDFSCluster.<init>(MiniDFSCluster.java:742)
	at org.apache.hadoop.hdfs.MiniDFSCluster.<init>(MiniDFSCluster.java:612)
	at org.apache.solr.cloud.hdfs.HdfsTestUtil.setupClass(HdfsTestUtil.java:99)
	at org.apache.solr.cloud.hdfs.HdfsTestUtil.setupClass(HdfsTestUtil.java:61)
	at org.apache.solr.store.hdfs.HdfsDirectoryTest.beforeClass(HdfsDirectoryTest.java:60)
	at sun.reflect.NativeMethodAccessorImpl.invoke0(Native Method)
	at sun.reflect.NativeMethodAccessorImpl.invoke(NativeMethodAccessorImpl.java:62)
	at sun.reflect.DelegatingMethodAccessorImpl.invoke(DelegatingMethodAccessorImpl.java:43)
	at java.lang.reflect.Method.invoke(Method.java:498)
	at com.carrotsearch.randomizedtesting.RandomizedRunner.invoke(RandomizedRunner.java:1764)
	at com.carrotsearch.randomizedtesting.RandomizedRunner$6.evaluate(RandomizedRunner.java:811)
	at com.carrotsearch.randomizedtesting.RandomizedRunner$7.evaluate(RandomizedRunner.java:827)
	at com.carrotsearch.randomizedtesting.rules.StatementAdapter.evaluate(StatementAdapter.java:36)
	at com.carrotsearch.randomizedtesting.rules.SystemPropertiesRestoreRule$1.evaluate(SystemPropertiesRestoreRule.java:57)
	at org.apache.lucene.util.AbstractBeforeAfterRule$1.evaluate(AbstractBeforeAfterRule.java:45)
	at com.carrotsearch.randomizedtesting.rules.StatementAdapter.evaluate(StatementAdapter.java:36)
	at org.apache.lucene.util.TestRuleStoreClassName$1.evaluate(TestRuleStoreClassName.java:41)
	at com.carrotsearch.randomizedtesting.rules.NoShadowingOrOverridesOnMethodsRule$1.evaluate(NoShadowingOrOverridesOnMethodsRule.java:40)
	at com.carrotsearch.randomizedtesting.rules.NoShadowingOrOverridesOnMethodsRule$1.evaluate(NoShadowingOrOverridesOnMethodsRule.java:40)
	at com.carrotsearch.randomizedtesting.rules.StatementAdapter.evaluate(StatementAdapter.java:36)
	at com.carrotsearch.randomizedtesting.rules.StatementAdapter.evaluate(StatementAdapter.java:36)
	at com.carrotsearch.randomizedtesting.rules.StatementAdapter.evaluate(StatementAdapter.java:36)
	at org.apache.lucene.util.TestRuleAssertionsRequired$1.evaluate(TestRuleAssertionsRequired.java:53)
	at org.apache.lucene.util.TestRuleMarkFailure$1.evaluate(TestRuleMarkFailure.java:47)
	at org.apache.lucene.util.TestRuleIgnoreAfterMaxFailures$1.evaluate(TestRuleIgnoreAfterMaxFailures.java:64)
	at org.apache.lucene.util.TestRuleIgnoreTestSuites$1.evaluate(TestRuleIgnoreTestSuites.java:54)
	at com.carrotsearch.randomizedtesting.rules.StatementAdapter.evaluate(StatementAdapter.java:36)
	at com.carrotsearch.randomizedtesting.ThreadLeakControl$StatementRunner.run(ThreadLeakControl.java:367)
	at java.lang.Thread.run(Thread.java:745)


FAILED:  junit.framework.TestSuite.org.apache.solr.update.TestHdfsUpdateLog

Error Message:
Timed out waiting for Mini HDFS Cluster to start

Stack Trace:
java.io.IOException: Timed out waiting for Mini HDFS Cluster to start
	at __randomizedtesting.SeedInfo.seed([2389893824BCF3D]:0)
	at org.apache.hadoop.hdfs.MiniDFSCluster.waitClusterUp(MiniDFSCluster.java:1203)
	at org.apache.hadoop.hdfs.MiniDFSCluster.initMiniDFSCluster(MiniDFSCluster.java:836)
	at org.apache.hadoop.hdfs.MiniDFSCluster.<init>(MiniDFSCluster.java:742)
	at org.apache.hadoop.hdfs.MiniDFSCluster.<init>(MiniDFSCluster.java:612)
	at org.apache.solr.cloud.hdfs.HdfsTestUtil.setupClass(HdfsTestUtil.java:99)
	at org.apache.solr.cloud.hdfs.HdfsTestUtil.setupClass(HdfsTestUtil.java:61)
	at org.apache.solr.update.TestHdfsUpdateLog.beforeClass(TestHdfsUpdateLog.java:52)
	at sun.reflect.NativeMethodAccessorImpl.invoke0(Native Method)
	at sun.reflect.NativeMethodAccessorImpl.invoke(NativeMethodAccessorImpl.java:62)
	at sun.reflect.DelegatingMethodAccessorImpl.invoke(DelegatingMethodAccessorImpl.java:43)
	at java.lang.reflect.Method.invoke(Method.java:498)
	at com.carrotsearch.randomizedtesting.RandomizedRunner.invoke(RandomizedRunner.java:1764)
	at com.carrotsearch.randomizedtesting.RandomizedRunner$6.evaluate(RandomizedRunner.java:811)
	at com.carrotsearch.randomizedtesting.RandomizedRunner$7.evaluate(RandomizedRunner.java:827)
	at com.carrotsearch.randomizedtesting.rules.StatementAdapter.evaluate(StatementAdapter.java:36)
	at com.carrotsearch.randomizedtesting.rules.SystemPropertiesRestoreRule$1.evaluate(SystemPropertiesRestoreRule.java:57)
	at org.apache.lucene.util.AbstractBeforeAfterRule$1.evaluate(AbstractBeforeAfterRule.java:45)
	at com.carrotsearch.randomizedtesting.rules.StatementAdapter.evaluate(StatementAdapter.java:36)
	at org.apache.lucene.util.TestRuleStoreClassName$1.evaluate(TestRuleStoreClassName.java:41)
	at com.carrotsearch.randomizedtesting.rules.NoShadowingOrOverridesOnMethodsRule$1.evaluate(NoShadowingOrOverridesOnMethodsRule.java:40)
	at com.carrotsearch.randomizedtesting.rules.NoShadowingOrOverridesOnMethodsRule$1.evaluate(NoShadowingOrOverridesOnMethodsRule.java:40)
	at com.carrotsearch.randomizedtesting.rules.StatementAdapter.evaluate(StatementAdapter.java:36)
	at com.carrotsearch.randomizedtesting.rules.StatementAdapter.evaluate(StatementAdapter.java:36)
	at com.carrotsearch.randomizedtesting.rules.StatementAdapter.evaluate(StatementAdapter.java:36)
	at org.apache.lucene.util.TestRuleAssertionsRequired$1.evaluate(TestRuleAssertionsRequired.java:53)
	at org.apache.lucene.util.TestRuleMarkFailure$1.evaluate(TestRuleMarkFailure.java:47)
	at org.apache.lucene.util.TestRuleIgnoreAfterMaxFailures$1.evaluate(TestRuleIgnoreAfterMaxFailures.java:64)
	at org.apache.lucene.util.TestRuleIgnoreTestSuites$1.evaluate(TestRuleIgnoreTestSuites.java:54)
	at com.carrotsearch.randomizedtesting.rules.StatementAdapter.evaluate(StatementAdapter.java:36)
	at com.carrotsearch.randomizedtesting.ThreadLeakControl$StatementRunner.run(ThreadLeakControl.java:367)
	at java.lang.Thread.run(Thread.java:745)




Build Log:
[...truncated 11345 lines...]
   [junit4] Suite: org.apache.solr.cloud.hdfs.StressHdfsTest
   [junit4]   2> Creating dataDir: /export/home/jenkins/workspace/Lucene-Solr-6.x-Solaris/solr/build/solr-core/test/J0/temp/solr.cloud.hdfs.StressHdfsTest_2389893824BCF3D-001/init-core-data-001
   [junit4]   2> 1205833 INFO  (SUITE-StressHdfsTest-seed#[2389893824BCF3D]-worker) [    ] o.a.s.SolrTestCaseJ4 Randomized ssl (false) and clientAuth (false) via: @org.apache.solr.SolrTestCaseJ4$SuppressSSL(bugUrl=https://issues.apache.org/jira/browse/SOLR-5776)
   [junit4]   2> 1205833 INFO  (SUITE-StressHdfsTest-seed#[2389893824BCF3D]-worker) [    ] o.a.s.BaseDistributedSearchTestCase Setting hostContext system property: /w_j/c
   [junit4]   1> Formatting using clusterid: testClusterID
   [junit4]   2> 1205864 WARN  (SUITE-StressHdfsTest-seed#[2389893824BCF3D]-worker) [    ] o.a.h.m.i.MetricsConfig Cannot locate configuration: tried hadoop-metrics2-namenode.properties,hadoop-metrics2.properties
   [junit4]   2> 1205871 WARN  (SUITE-StressHdfsTest-seed#[2389893824BCF3D]-worker) [    ] o.a.h.h.HttpRequestLog Jetty request log can only be enabled using Log4j
   [junit4]   2> 1205874 INFO  (SUITE-StressHdfsTest-seed#[2389893824BCF3D]-worker) [    ] o.m.log jetty-6.1.26
   [junit4]   2> 1205889 INFO  (SUITE-StressHdfsTest-seed#[2389893824BCF3D]-worker) [    ] o.m.log Extract jar:file:/export/home/jenkins/.ivy2/cache/org.apache.hadoop/hadoop-hdfs/tests/hadoop-hdfs-2.7.2-tests.jar!/webapps/hdfs to ./temp/Jetty_solaris.vm_57908_hdfs____.sbl8wf/webapp
   [junit4]   2> 1206388 INFO  (SUITE-StressHdfsTest-seed#[2389893824BCF3D]-worker) [    ] o.m.log Started HttpServer2$SelectChannelConnectorWithSafeStartup@solaris-vm:57908
   [junit4]   2> 1206498 WARN  (SUITE-StressHdfsTest-seed#[2389893824BCF3D]-worker) [    ] o.a.h.h.HttpRequestLog Jetty request log can only be enabled using Log4j
   [junit4]   2> 1206499 INFO  (SUITE-StressHdfsTest-seed#[2389893824BCF3D]-worker) [    ] o.m.log jetty-6.1.26
   [junit4]   2> 1206517 INFO  (SUITE-StressHdfsTest-seed#[2389893824BCF3D]-worker) [    ] o.m.log Extract jar:file:/export/home/jenkins/.ivy2/cache/org.apache.hadoop/hadoop-hdfs/tests/hadoop-hdfs-2.7.2-tests.jar!/webapps/datanode to ./temp/Jetty_localhost_33766_datanode____.acvflu/webapp
   [junit4]   2> 1207003 INFO  (SUITE-StressHdfsTest-seed#[2389893824BCF3D]-worker) [    ] o.m.log Started HttpServer2$SelectChannelConnectorWithSafeStartup@localhost:33766
   [junit4]   2> 1207108 WARN  (SUITE-StressHdfsTest-seed#[2389893824BCF3D]-worker) [    ] o.a.h.h.HttpRequestLog Jetty request log can only be enabled using Log4j
   [junit4]   2> 1207111 INFO  (SUITE-StressHdfsTest-seed#[2389893824BCF3D]-worker) [    ] o.m.log jetty-6.1.26
   [junit4]   2> 1207131 INFO  (SUITE-StressHdfsTest-seed#[2389893824BCF3D]-worker) [    ] o.m.log Extract jar:file:/export/home/jenkins/.ivy2/cache/org.apache.hadoop/hadoop-hdfs/tests/hadoop-hdfs-2.7.2-tests.jar!/webapps/datanode to ./temp/Jetty_localhost_43853_datanode____.b5nhk2/webapp
   [junit4]   2> 1207171 INFO  (IPC Server handler 2 on 45999) [    ] BlockStateChange BLOCK* processReport: from storage DS-2a1b2d34-3e5a-4dae-87de-797504ec6e0c node DatanodeRegistration(127.0.0.1:58432, datanodeUuid=511af26f-583e-455f-963f-50f74334d5da, infoPort=33665, infoSecurePort=0, ipcPort=32843, storageInfo=lv=-56;cid=testClusterID;nsid=724054018;c=0), blocks: 0, hasStaleStorage: true, processing time: 1 msecs
   [junit4]   2> 1207171 INFO  (IPC Server handler 2 on 45999) [    ] BlockStateChange BLOCK* processReport: from storage DS-45c8e2ef-2f2f-497b-802e-7866d93b2c73 node DatanodeRegistration(127.0.0.1:58432, datanodeUuid=511af26f-583e-455f-963f-50f74334d5da, infoPort=33665, infoSecurePort=0, ipcPort=32843, storageInfo=lv=-56;cid=testClusterID;nsid=724054018;c=0), blocks: 0, hasStaleStorage: false, processing time: 0 msecs
   [junit4]   2> 1207685 INFO  (SUITE-StressHdfsTest-seed#[2389893824BCF3D]-worker) [    ] o.m.log Started HttpServer2$SelectChannelConnectorWithSafeStartup@localhost:43853
   [junit4]   2> 1207803 INFO  (IPC Server handler 6 on 45999) [    ] BlockStateChange BLOCK* processReport: from storage DS-1e02e792-69a5-40fa-8193-c08699f0af3d node DatanodeRegistration(127.0.0.1:57347, datanodeUuid=93abcbae-62bb-4c85-b75d-e0c2acabedd0, infoPort=43514, infoSecurePort=0, ipcPort=39548, storageInfo=lv=-56;cid=testClusterID;nsid=724054018;c=0), blocks: 0, hasStaleStorage: true, processing time: 1 msecs
   [junit4]   2> 1207803 INFO  (IPC Server handler 6 on 45999) [    ] BlockStateChange BLOCK* processReport: from storage DS-beb17dd0-5355-4286-a471-5e56ad1b1031 node DatanodeRegistration(127.0.0.1:57347, datanodeUuid=93abcbae-62bb-4c85-b75d-e0c2acabedd0, infoPort=43514, infoSecurePort=0, ipcPort=39548, storageInfo=lv=-56;cid=testClusterID;nsid=724054018;c=0), blocks: 0, hasStaleStorage: false, processing time: 0 msecs
   [junit4]   2> 1207892 INFO  (TEST-StressHdfsTest.test-seed#[2389893824BCF3D]) [    ] o.a.s.c.ZkTestServer STARTING ZK TEST SERVER
   [junit4]   2> 1207893 INFO  (Thread-2834) [    ] o.a.s.c.ZkTestServer client port:0.0.0.0/0.0.0.0:0
   [junit4]   2> 1207893 INFO  (Thread-2834) [    ] o.a.s.c.ZkTestServer Starting server
   [junit4]   2> 1207993 INFO  (TEST-StressHdfsTest.test-seed#[2389893824BCF3D]) [    ] o.a.s.c.ZkTestServer start zk server on port:46888
   [junit4]   2> 1207993 INFO  (TEST-StressHdfsTest.test-seed#[2389893824BCF3D]) [    ] o.a.s.c.c.SolrZkClient Using default ZkCredentialsProvider
   [junit4]   2> 1207993 INFO  (TEST-StressHdfsTest.test-seed#[2389893824BCF3D]) [    ] o.a.s.c.c.ConnectionManager Waiting for client to connect to ZooKeeper
   [junit4]   2> 1207997 INFO  (zkCallback-8777-thread-1) [    ] o.a.s.c.c.ConnectionManager Watcher org.apache.solr.common.cloud.ConnectionManager@2a70ade9 name:ZooKeeperConnection Watcher:127.0.0.1:46888 got event WatchedEvent state:SyncConnected type:None path:null path:null type:None
   [junit4]   2> 1207997 INFO  (TEST-StressHdfsTest.test-seed#[2389893824BCF3D]) [    ] o.a.s.c.c.ConnectionManager Client is connected to ZooKeeper
   [junit4]   2> 1207998 INFO  (TEST-StressHdfsTest.test-seed#[2389893824BCF3D]) [    ] o.a.s.c.c.SolrZkClient Using default ZkACLProvider
   [junit4]   2> 1207998 INFO  (TEST-StressHdfsTest.test-seed#[2389893824BCF3D]) [    ] o.a.s.c.c.SolrZkClient makePath: /solr
   [junit4]   2> 1208001 INFO  (TEST-StressHdfsTest.test-seed#[2389893824BCF3D]) [    ] o.a.s.c.c.SolrZkClient Using default ZkCredentialsProvider
   [junit4]   2> 1208002 INFO  (TEST-StressHdfsTest.test-seed#[2389893824BCF3D]) [    ] o.a.s.c.c.ConnectionManager Waiting for client to connect to ZooKeeper
   [junit4]   2> 1208003 INFO  (zkCallback-8778-thread-1) [    ] o.a.s.c.c.ConnectionManager Watcher org.apache.solr.common.cloud.ConnectionManager@526fae62 name:ZooKeeperConnection Watcher:127.0.0.1:46888/solr got event WatchedEvent state:SyncConnected type:None path:null path:null type:None
   [junit4]   2> 1208004 INFO  (TEST-StressHdfsTest.test-seed#[2389893824BCF3D]) [    ] o.a.s.c.c.ConnectionManager Client is connected to ZooKeeper
   [junit4]   2> 1208004 INFO  (TEST-StressHdfsTest.test-seed#[2389893824BCF3D]) [    ] o.a.s.c.c.SolrZkClient Using default ZkACLProvider
   [junit4]   2> 1208004 INFO  (TEST-StressHdfsTest.test-seed#[2389893824BCF3D]) [    ] o.a.s.c.c.SolrZkClient makePath: /collections/collection1
   [junit4]   2> 1208007 INFO  (TEST-StressHdfsTest.test-seed#[2389893824BCF3D]) [    ] o.a.s.c.c.SolrZkClient makePath: /collections/collection1/shards
   [junit4]   2> 1208009 INFO  (TEST-StressHdfsTest.test-seed#[2389893824BCF3D]) [    ] o.a.s.c.c.SolrZkClient makePath: /collections/control_collection
   [junit4]   2> 1208011 INFO  (TEST-StressHdfsTest.test-seed#[2389893824BCF3D]) [    ] o.a.s.c.c.SolrZkClient makePath: /collections/control_collection/shards
   [junit4]   2> 1208013 INFO  (TEST-StressHdfsTest.test-seed#[2389893824BCF3D]) [    ] o.a.s.c.AbstractZkTestCase put /export/home/jenkins/workspace/Lucene-Solr-6.x-Solaris/solr/core/src/test-files/solr/collection1/conf/solrconfig-tlog.xml to /configs/conf1/solrconfig.xml
   [junit4]   2> 1208013 INFO  (TEST-StressHdfsTest.test-seed#[2389893824BCF3D]) [    ] o.a.s.c.c.SolrZkClient makePath: /configs/conf1/solrconfig.xml
   [junit4]   2> 1208017 INFO  (TEST-StressHdfsTest.test-seed#[2389893824BCF3D]) [    ] o.a.s.c.AbstractZkTestCase put /export/home/jenkins/workspace/Lucene-Solr-6.x-Solaris/solr/core/src/test-files/solr/collection1/conf/schema.xml to /configs/conf1/schema.xml
   [junit4]   2> 1208017 INFO  (TEST-StressHdfsTest.test-seed#[2389893824BCF3D]) [    ] o.a.s.c.c.SolrZkClient makePath: /configs/conf1/schema.xml
   [junit4]   2> 1208019 INFO  (TEST-StressHdfsTest.test-seed#[2389893824BCF3D]) [    ] o.a.s.c.AbstractZkTestCase put /export/home/jenkins/workspace/Lucene-Solr-6.x-Solaris/solr/core/src/test-files/solr/collection1/conf/solrconfig.snippet.randomindexconfig.xml to /configs/conf1/solrconfig.snippet.randomindexconfig.xml
   [junit4]   2> 1208019 INFO  (TEST-StressHdfsTest.test-seed#[2389893824BCF3D]) [    ] o.a.s.c.c.SolrZkClient makePath: /configs/conf1/solrconfig.snippet.randomindexconfig.xml
   [junit4]   2> 1208021 INFO  (TEST-StressHdfsTest.test-seed#[2389893824BCF3D]) [    ] o.a.s.c.AbstractZkTestCase put /export/home/jenkins/workspace/Lucene-Solr-6.x-Solaris/solr/core/src/test-files/solr/collection1/conf/stopwords.txt to /configs/conf1/stopwords.txt
   [junit4]   2> 1208022 INFO  (TEST-StressHdfsTest.test-seed#[2389893824BCF3D]) [    ] o.a.s.c.c.SolrZkClient makePath: /configs/conf1/stopwords.txt
   [junit4]   2> 1208024 INFO  (TEST-StressHdfsTest.test-seed#[2389893824BCF3D]) [    ] o.a.s.c.AbstractZkTestCase put /export/home/jenkins/workspace/Lucene-Solr-6.x-Solaris/solr/core/src/test-files/solr/collection1/conf/protwords.txt to /configs/conf1/protwords.txt
   [junit4]   2> 1208024 INFO  (TEST-StressHdfsTest.test-seed#[2389893824BCF3D]) [    ] o.a.s.c.c.SolrZkClient makePath: /configs/conf1/protwords.txt
   [junit4]   2> 1208026 INFO  (TEST-StressHdfsTest.test-seed#[2389893824BCF3D]) [    ] o.a.s.c.AbstractZkTestCase put /export/home/jenkins/workspace/Lucene-Solr-6.x-Solaris/solr/core/src/test-files/solr/collection1/conf/currency.xml to /configs/conf1/currency.xml
   [junit4]   2> 1208026 INFO  (TEST-StressHdfsTest.test-seed#[2389893824BCF3D]) [    ] o.a.s.c.c.SolrZkClient makePath: /configs/conf1/currency.xml
   [junit4]   2> 1208028 INFO  (TEST-StressHdfsTest.test-seed#[2389893824BCF3D]) [    ] o.a.s.c.AbstractZkTestCase put /export/home/jenkins/workspace/Lucene-Solr-6.x-Solaris/solr/core/src/test-files/solr/collection1/conf/enumsConfig.xml to /configs/conf1/enumsConfig.xml
   [junit4]   2> 1208028 INFO  (TEST-StressHdfsTest.test-seed#[2389893824BCF3D]) [    ] o.a.s.c.c.SolrZkClient makePath: /configs/conf1/enumsConfig.xml
   [junit4]   2> 1208031 INFO  (TEST-StressHdfsTest.test-seed#[2389893824BCF3D]) [    ] o.a.s.c.AbstractZkTestCase put /export/home/jenkins/workspace/Lucene-Solr-6.x-Solaris/solr/core/src/test-files/solr/collection1/conf/open-exchange-rates.json to /configs/conf1/open-exchange-rates.json
   [junit4]   2> 1208031 INFO  (TEST-StressHdfsTest.test-seed#[2389893824BCF3D]) [    ] o.a.s.c.c.SolrZkClient makePath: /configs/conf1/open-exchange-rates.json
   [junit4]   2> 1208033 INFO  (TEST-StressHdfsTest.test-seed#[2389893824BCF3D]) [    ] o.a.s.c.AbstractZkTestCase put /export/home/jenkins/workspace/Lucene-Solr-6.x-Solaris/solr/core/src/test-files/solr/collection1/conf/mapping-ISOLatin1Accent.txt to /configs/conf1/mapping-ISOLatin1Accent.txt
   [junit4]   2> 1208033 INFO  (TEST-StressHdfsTest.test-seed#[2389893824BCF3D]) [    ] o.a.s.c.c.SolrZkClient makePath: /configs/conf1/mapping-ISOLatin1Accent.txt
   [junit4]   2> 1208035 INFO  (TEST-StressHdfsTest.test-seed#[2389893824BCF3D]) [    ] o.a.s.c.AbstractZkTestCase put /export/home/jenkins/workspace/Lucene-Solr-6.x-Solaris/solr/core/src/test-files/solr/collection1/conf/old_synonyms.txt to /configs/conf1/old_synonyms.txt
   [junit4]   2> 1208035 INFO  (TEST-StressHdfsTest.test-seed#[2389893824BCF3D]) [    ] o.a.s.c.c.SolrZkClient makePath: /configs/conf1/old_synonyms.txt
   [junit4]   2> 1208037 INFO  (TEST-StressHdfsTest.test-seed#[2389893824BCF3D]) [    ] o.a.s.c.AbstractZkTestCase put /export/home/jenkins/workspace/Lucene-Solr-6.x-Solaris/solr/core/src/test-files/solr/collection1/conf/synonyms.txt to /configs/conf1/synonyms.txt
   [junit4]   2> 1208037 INFO  (TEST-StressHdfsTest.test-seed#[2389893824BCF3D]) [    ] o.a.s.c.c.SolrZkClient makePath: /configs/conf1/synonyms.txt
   [junit4]   2> 1208174 INFO  (TEST-StressHdfsTest.test-seed#[2389893824BCF3D]) [    ] o.a.s.SolrTestCaseJ4 Writing core.properties file to /export/home/jenkins/workspace/Lucene-Solr-6.x-Solaris/solr/build/solr-core/test/J0/temp/solr.cloud.hdfs.StressHdfsTest_2389893824BCF3D-001/control-001/cores/collection1
   [junit4]   2> 1208175 INFO  (TEST-StressHdfsTest.test-seed#[2389893824BCF3D]) [    ] o.e.j.s.Server jetty-9.3.8.v20160314
   [junit4]   2> 1208177 INFO  (TEST-StressHdfsTest.test-seed#[2389893824BCF3D]) [    ] o.e.j.s.h.ContextHandler Started o.e.j.s.ServletContextHandler@1dc1321{/w_j/c,null,AVAILABLE}
   [junit4]   2> 1208178 INFO  (TEST-StressHdfsTest.test-seed#[2389893824BCF3D]) [    ] o.e.j.s.ServerConnector Started ServerConnector@238e6b4e{HTTP/1.1,[http/1.1]}{127.0.0.1:46923}
   [junit4]   2> 1208178 INFO  (TEST-StressHdfsTest.test-seed#[2389893824BCF3D]) [    ] o.e.j.s.Server Started @1211117ms
   [junit4]   2> 1208178 INFO  (TEST-StressHdfsTest.test-seed#[2389893824BCF3D]) [    ] o.a.s.c.s.e.JettySolrRunner Jetty properties: {solr.data.dir=hdfs://solaris-vm:45999/hdfs__solaris-vm_45999__export_home_jenkins_workspace_Lucene-Solr-6.x-Solaris_solr_build_solr-core_test_J0_temp_solr.cloud.hdfs.StressHdfsTest_2389893824BCF3D-001_tempDir-002_control_data, hostContext=/w_j/c, hostPort=46923, coreRootDirectory=/export/home/jenkins/workspace/Lucene-Solr-6.x-Solaris/solr/build/solr-core/test/J0/../../../../../../../../../../export/home/jenkins/workspace/Lucene-Solr-6.x-Solaris/solr/build/solr-core/test/J0/temp/solr.cloud.hdfs.StressHdfsTest_2389893824BCF3D-001/control-001/cores}
   [junit4]   2> 1208178 INFO  (TEST-StressHdfsTest.test-seed#[2389893824BCF3D]) [    ] o.a.s.s.SolrDispatchFilter SolrDispatchFilter.init(): sun.misc.Launcher$AppClassLoader@6d06d69c
   [junit4]   2> 1208178 INFO  (TEST-StressHdfsTest.test-seed#[2389893824BCF3D]) [    ] o.a.s.c.SolrResourceLoader new SolrResourceLoader for directory: '/export/home/jenkins/workspace/Lucene-Solr-6.x-Solaris/solr/build/solr-core/test/J0/temp/solr.cloud.hdfs.StressHdfsTest_2389893824BCF3D-001/control-001'
   [junit4]   2> 1208178 INFO  (TEST-StressHdfsTest.test-seed#[2389893824BCF3D]) [    ] o.a.s.c.SolrResourceLoader JNDI not configured for solr (NoInitialContextEx)
   [junit4]   2> 1208178 INFO  (TEST-StressHdfsTest.test-seed#[2389893824BCF3D]) [    ] o.a.s.c.SolrResourceLoader solr home defaulted to 'solr/' (could not find system property or JNDI)
   [junit4]   2> 1208178 INFO  (TEST-StressHdfsTest.test-seed#[2389893824BCF3D]) [    ] o.a.s.c.c.SolrZkClient Using default ZkCredentialsProvider
   [junit4]   2> 1208179 INFO  (TEST-StressHdfsTest.test-seed#[2389893824BCF3D]) [    ] o.a.s.c.c.ConnectionManager Waiting for client to connect to ZooKeeper
   [junit4]   2> 1208180 INFO  (zkCallback-8779-thread-1) [    ] o.a.s.c.c.ConnectionManager Watcher org.apache.solr.common.cloud.ConnectionManager@7f2b0159 name:ZooKeeperConnection Watcher:127.0.0.1:46888/solr got event WatchedEvent state:SyncConnected type:None path:null path:null type:None
   [junit4]   2> 1208180 INFO  (TEST-StressHdfsTest.test-seed#[2389893824BCF3D]) [    ] o.a.s.c.c.ConnectionManager Client is connected to ZooKeeper
   [junit4]   2> 1208181 INFO  (TEST-StressHdfsTest.test-seed#[2389893824BCF3D]) [    ] o.a.s.c.c.SolrZkClient Using default ZkACLProvider
   [junit4]   2> 1208182 INFO  (TEST-StressHdfsTest.test-seed#[2389893824BCF3D]) [    ] o.a.s.s.SolrDispatchFilter Loading solr.xml from SolrHome (not found in ZooKeeper)
   [junit4]   2> 1208182 INFO  (TEST-StressHdfsTest.test-seed#[2389893824BCF3D]) [    ] o.a.s.c.SolrXmlConfig Loading container configuration from /export/home/jenkins/workspace/Lucene-Solr-6.x-Solaris/solr/build/solr-core/test/J0/temp/solr.cloud.hdfs.StressHdfsTest_2389893824BCF3D-001/control-001/solr.xml
   [junit4]   2> 1208186 INFO  (TEST-StressHdfsTest.test-seed#[2389893824BCF3D]) [    ] o.a.s.c.CorePropertiesLocator Config-defined core root directory: /export/home/jenkins/workspace/Lucene-Solr-6.x-Solaris/solr/build/solr-core/test/J0/../../../../../../../../../../export/home/jenkins/workspace/Lucene-Solr-6.x-Solaris/solr/build/solr-core/test/J0/temp/solr.cloud.hdfs.StressHdfsTest_2389893824BCF3D-001/control-001/cores
   [junit4]   2> 1208186 INFO  (TEST-StressHdfsTest.test-seed#[2389893824BCF3D]) [    ] o.a.s.c.CoreContainer New CoreContainer 1529499328
   [junit4]   2> 1208186 INFO  (TEST-StressHdfsTest.test-seed#[2389893824BCF3D]) [    ] o.a.s.c.CoreContainer Loading cores into CoreContainer [instanceDir=/export/home/jenkins/workspace/Lucene-Solr-6.x-Solaris/solr/build/solr-core/test/J0/temp/solr.cloud.hdfs.StressHdfsTest_2389893824BCF3D-001/control-001]
   [junit4]   2> 1208186 WARN  (TEST-StressHdfsTest.test-seed#[2389893824BCF3D]) [    ] o.a.s.c.CoreContainer Couldn't add files from /export/home/jenkins/workspace/Lucene-Solr-6.x-Solaris/solr/build/solr-core/test/J0/temp/solr.cloud.hdfs.StressHdfsTest_2389893824BCF3D-001/control-001/lib to classpath: /export/home/jenkins/workspace/Lucene-Solr-6.x-Solaris/solr/build/solr-core/test/J0/temp/solr.cloud.hdfs.StressHdfsTest_2389893824BCF3D-001/control-001/lib
   [junit4]   2> 1208186 INFO  (TEST-StressHdfsTest.test-seed#[2389893824BCF3D]) [    ] o.a.s.h.c.HttpShardHandlerFactory created with socketTimeout : 90000,urlScheme : ,connTimeout : 15000,maxConnectionsPerHost : 20,maxConnections : 10000,corePoolSize : 0,maximumPoolSize : 2147483647,maxThreadIdleTime : 5,sizeOfQueue : -1,fairnessPolicy : false,useRetries : false,connectionsEvictorSleepDelay : 5000,maxConnectionIdleTime : 40000,
   [junit4]   2> 1208188 INFO  (TEST-StressHdfsTest.test-seed#[2389893824BCF3D]) [    ] o.a.s.u.UpdateShardHandler Creating UpdateShardHandler HTTP client with params: socketTimeout=340000&connTimeout=45000&retry=true
   [junit4]   2> 1208188 INFO  (TEST-StressHdfsTest.test-seed#[2389893824BCF3D]) [    ] o.a.s.l.LogWatcher SLF4J impl is org.slf4j.impl.Log4jLoggerFactory
   [junit4]   2> 1208188 INFO  (TEST-StressHdfsTest.test-seed#[2389893824BCF3D]) [    ] o.a.s.l.LogWatcher Registering Log Listener [Log4j (org.slf4j.impl.Log4jLoggerFactory)]
   [junit4]   2> 1208188 INFO  (TEST-StressHdfsTest.test-seed#[2389893824BCF3D]) [    ] o.a.s.c.ZkContainer Zookeeper client=127.0.0.1:46888/solr
   [junit4]   2> 1208188 INFO  (TEST-StressHdfsTest.test-seed#[2389893824BCF3D]) [    ] o.a.s.c.ZkController zkHost includes chroot
   [junit4]   2> 1208188 INFO  (TEST-StressHdfsTest.test-seed#[2389893824BCF3D]) [    ] o.a.s.c.c.SolrZkClient Using default ZkCredentialsProvider
   [junit4]   2> 1208189 INFO  (TEST-StressHdfsTest.test-seed#[2389893824BCF3D]) [    ] o.a.s.c.c.ConnectionManager Waiting for client to connect to ZooKeeper
   [junit4]   2> 1208190 INFO  (zkCallback-8782-thread-1) [    ] o.a.s.c.c.ConnectionManager Watcher org.apache.solr.common.cloud.ConnectionManager@5d0cc46c name:ZooKeeperConnection Watcher:127.0.0.1:46888 got event WatchedEvent state:SyncConnected type:None path:null path:null type:None
   [junit4]   2> 1208190 INFO  (TEST-StressHdfsTest.test-seed#[2389893824BCF3D]) [    ] o.a.s.c.c.ConnectionManager Client is connected to ZooKeeper
   [junit4]   2> 1208190 INFO  (TEST-StressHdfsTest.test-seed#[2389893824BCF3D]) [    ] o.a.s.c.c.SolrZkClient Using default ZkACLProvider
   [junit4]   2> 1208192 INFO  (TEST-StressHdfsTest.test-seed#[2389893824BCF3D]) [n:127.0.0.1:46923_w_j%2Fc    ] o.a.s.c.ZkController Added new OnReconnect listener org.apache.solr.cloud.ZkController$$Lambda$76/1724403089@14290bc7
   [junit4]   2> 1208192 INFO  (TEST-StressHdfsTest.test-seed#[2389893824BCF3D]) [n:127.0.0.1:46923_w_j%2Fc    ] o.a.s.c.c.ConnectionManager Waiting for client to connect to ZooKeeper
   [junit4]   2> 1208194 INFO  (zkCallback-8783-thread-1-processing-n:127.0.0.1:46923_w_j%2Fc) [n:127.0.0.1:46923_w_j%2Fc    ] o.a.s.c.c.ConnectionManager Watcher org.apache.solr.common.cloud.ConnectionManager@478b50e3 name:ZooKeeperConnection Watcher:127.0.0.1:46888/solr got event WatchedEvent state:SyncConnected type:None path:null path:null type:None
   [junit4]   2> 1208194 INFO  (TEST-StressHdfsTest.test-seed#[2389893824BCF3D]) [n:127.0.0.1:46923_w_j%2Fc    ] o.a.s.c.c.ConnectionManager Client is connected to ZooKeeper
   [junit4]   2> 1208195 INFO  (TEST-StressHdfsTest.test-seed#[2389893824BCF3D]) [n:127.0.0.1:46923_w_j%2Fc    ] o.a.s.c.c.SolrZkClient makePath: /overseer/queue
   [junit4]   2> 1208197 INFO  (TEST-StressHdfsTest.test-seed#[2389893824BCF3D]) [n:127.0.0.1:46923_w_j%2Fc    ] o.a.s.c.c.SolrZkClient makePath: /overseer/collection-queue-work
   [junit4]   2> 1208201 INFO  (TEST-StressHdfsTest.test-seed#[2389893824BCF3D]) [n:127.0.0.1:46923_w_j%2Fc    ] o.a.s.c.c.SolrZkClient makePath: /overseer/collection-map-running
   [junit4]   2> 1208204 INFO  (TEST-StressHdfsTest.test-seed#[2389893824BCF3D]) [n:127.0.0.1:46923_w_j%2Fc    ] o.a.s.c.c.SolrZkClient makePath: /overseer/collection-map-completed
   [junit4]   2> 1208207 INFO  (TEST-StressHdfsTest.test-seed#[2389893824BCF3D]) [n:127.0.0.1:46923_w_j%2Fc    ] o.a.s.c.c.SolrZkClient makePath: /overseer/collection-map-failure
   [junit4]   2> 1208210 INFO  (TEST-StressHdfsTest.test-seed#[2389893824BCF3D]) [n:127.0.0.1:46923_w_j%2Fc    ] o.a.s.c.c.SolrZkClient makePath: /live_nodes
   [junit4]   2> 1208212 INFO  (TEST-StressHdfsTest.test-seed#[2389893824BCF3D]) [n:127.0.0.1:46923_w_j%2Fc    ] o.a.s.c.c.SolrZkClient makePath: /aliases.json
   [junit4]   2> 1208214 INFO  (TEST-StressHdfsTest.test-seed#[2389893824BCF3D]) [n:127.0.0.1:46923_w_j%2Fc    ] o.a.s.c.c.SolrZkClient makePath: /clusterstate.json
   [junit4]   2> 1208216 INFO  (TEST-StressHdfsTest.test-seed#[2389893824BCF3D]) [n:127.0.0.1:46923_w_j%2Fc    ] o.a.s.c.c.SolrZkClient makePath: /security.json
   [junit4]   2> 1208218 INFO  (TEST-StressHdfsTest.test-seed#[2389893824BCF3D]) [n:127.0.0.1:46923_w_j%2Fc    ] o.a.s.c.c.ZkStateReader Updating cluster state from ZooKeeper... 
   [junit4]   2> 1208219 INFO  (TEST-StressHdfsTest.test-seed#[2389893824BCF3D]) [n:127.0.0.1:46923_w_j%2Fc    ] o.a.s.c.c.ZkStateReader Loaded empty cluster properties
   [junit4]   2> 1208220 INFO  (TEST-StressHdfsTest.test-seed#[2389893824BCF3D]) [n:127.0.0.1:46923_w_j%2Fc    ] o.a.s.c.c.ZkStateReader Updated live nodes from ZooKeeper... (0) -> (0)
   [junit4]   2> 1208225 INFO  (TEST-StressHdfsTest.test-seed#[2389893824BCF3D]) [n:127.0.0.1:46923_w_j%2Fc    ] o.a.s.c.c.SolrZkClient makePath: /overseer_elect
   [junit4]   2> 1208227 INFO  (TEST-StressHdfsTest.test-seed#[2389893824BCF3D]) [n:127.0.0.1:46923_w_j%2Fc    ] o.a.s.c.c.SolrZkClient makePath: /overseer_elect/election
   [junit4]   2> 1208229 INFO  (TEST-StressHdfsTest.test-seed#[2389893824BCF3D]) [n:127.0.0.1:46923_w_j%2Fc    ] o.a.s.c.Overseer Overseer (id=null) closing
   [junit4]   2> 1208230 INFO  (TEST-StressHdfsTest.test-seed#[2389893824BCF3D]) [n:127.0.0.1:46923_w_j%2Fc    ] o.a.s.c.LeaderElector Joined leadership election with path: /overseer_elect/election/96525259480301572-127.0.0.1:46923_w_j%2Fc-n_0000000000
   [junit4]   2> 1208230 INFO  (TEST-StressHdfsTest.test-seed#[2389893824BCF3D]) [n:127.0.0.1:46923_w_j%2Fc    ] o.a.s.c.OverseerElectionContext I am going to be the leader 127.0.0.1:46923_w_j%2Fc
   [junit4]   2> 1208230 INFO  (TEST-StressHdfsTest.test-seed#[2389893824BCF3D]) [n:127.0.0.1:46923_w_j%2Fc    ] o.a.s.c.c.SolrZkClient makePath: /overseer_elect/leader
   [junit4]   2> 1208232 INFO  (TEST-StressHdfsTest.test-seed#[2389893824BCF3D]) [n:127.0.0.1:46923_w_j%2Fc    ] o.a.s.c.Overseer Overseer (id=96525259480301572-127.0.0.1:46923_w_j%2Fc-n_0000000000) starting
   [junit4]   2> 1208235 INFO  (TEST-StressHdfsTest.test-seed#[2389893824BCF3D]) [n:127.0.0.1:46923_w_j%2Fc    ] o.a.s.c.c.SolrZkClient makePath: /overseer/queue-work
   [junit4]   2> 1208244 INFO  (TEST-StressHdfsTest.test-seed#[2389893824BCF3D]) [n:127.0.0.1:46923_w_j%2Fc    ] o.a.s.c.OverseerAutoReplicaFailoverThread Starting OverseerAutoReplicaFailoverThread autoReplicaFailoverWorkLoopDelay=10000 autoReplicaFailoverWaitAfterExpiration=10000 autoReplicaFailoverBadNodeExpiration=60000
   [junit4]   2> 1208244 INFO  (OverseerCollectionConfigSetProcessor-96525259480301572-127.0.0.1:46923_w_j%2Fc-n_0000000000) [n:127.0.0.1:46923_w_j%2Fc    ] o.a.s.c.OverseerTaskProcessor Process current queue of overseer operations
   [junit4]   2> 1208244 INFO  (TEST-StressHdfsTest.test-seed#[2389893824BCF3D]) [n:127.0.0.1:46923_w_j%2Fc    ] o.a.s.c.ZkController Register node as live in ZooKeeper:/live_nodes/127.0.0.1:46923_w_j%2Fc
   [junit4]   2> 1208244 INFO  (OverseerStateUpdate-96525259480301572-127.0.0.1:46923_w_j%2Fc-n_0000000000) [n:127.0.0.1:46923_w_j%2Fc    ] o.a.s.c.Overseer Starting to work on the main queue
   [junit4]   2> 1208244 INFO  (TEST-StressHdfsTest.test-seed#[2389893824BCF3D]) [n:127.0.0.1:46923_w_j%2Fc    ] o.a.s.c.c.SolrZkClient makePath: /live_nodes/127.0.0.1:46923_w_j%2Fc
   [junit4]   2> 1208252 INFO  (OverseerStateUpdate-96525259480301572-127.0.0.1:46923_w_j%2Fc-n_0000000000) [n:127.0.0.1:46923_w_j%2Fc    ] o.a.s.c.c.ZkStateReader Updated live nodes from ZooKeeper... (0) -> (1)
   [junit4]   2> 1208252 INFO  (zkCallback-8783-thread-1-processing-n:127.0.0.1:46923_w_j%2Fc) [n:127.0.0.1:46923_w_j%2Fc    ] o.a.s.c.c.ZkStateReader A live node change: [WatchedEvent state:SyncConnected type:NodeChildrenChanged path:/live_nodes], has occurred - updating... (live nodes size: [1])
   [junit4]   2> 1208253 INFO  (zkCallback-8783-thread-1-processing-n:127.0.0.1:46923_w_j%2Fc) [n:127.0.0.1:46923_w_j%2Fc    ] o.a.s.c.c.ZkStateReader Updated live nodes from ZooKeeper... (1) -> (1)
   [junit4]   2> 1208270 INFO  (TEST-StressHdfsTest.test-seed#[2389893824BCF3D]) [n:127.0.0.1:46923_w_j%2Fc    ] o.a.s.c.CoreContainer Security conf doesn't exist. Skipping setup for authorization module.
   [junit4]   2> 1208271 INFO  (TEST-StressHdfsTest.test-seed#[2389893824BCF3D]) [n:127.0.0.1:46923_w_j%2Fc    ] o.a.s.c.CoreContainer No authentication plugin used.
   [junit4]   2> 1208272 INFO  (TEST-StressHdfsTest.test-seed#[2389893824BCF3D]) [n:127.0.0.1:46923_w_j%2Fc    ] o.a.s.c.CorePropertiesLocator Looking for core definitions underneath /export/home/jenkins/workspace/Lucene-Solr-6.x-Solaris/solr/build/solr-core/test/J0/../../../../../../../../../../export/home/jenkins/workspace/Lucene-Solr-6.x-Solaris/solr/build/solr-core/test/J0/temp/solr.cloud.hdfs.StressHdfsTest_2389893824BCF3D-001/control-001/cores
   [junit4]   2> 1208273 INFO  (TEST-StressHdfsTest.test-seed#[2389893824BCF3D]) [n:127.0.0.1:46923_w_j%2Fc    ] o.a.s.c.CoreDescriptor Created CoreDescriptor: {name=collection1, config=solrconfig.xml, transient=false, schema=schema.xml, loadOnStartup=true, configSetProperties=configsetprops.json, collection=control_collection, coreNodeName=, dataDir=data/, shard=}
   [junit4]   2> 1208273 INFO  (TEST-StressHdfsTest.test-seed#[2389893824BCF3D]) [n:127.0.0.1:46923_w_j%2Fc    ] o.a.s.c.CorePropertiesLocator Found core collection1 in /export/home/jenkins/workspace/Lucene-Solr-6.x-Solaris/solr/build/solr-core/test/J0/../../../../../../../../../../export/home/jenkins/workspace/Lucene-Solr-6.x-Solaris/solr/build/solr-core/test/J0/temp/solr.cloud.hdfs.StressHdfsTest_2389893824BCF3D-001/control-001/cores/collection1
   [junit4]   2> 1208273 INFO  (TEST-StressHdfsTest.test-seed#[2389893824BCF3D]) [n:127.0.0.1:46923_w_j%2Fc    ] o.a.s.c.CorePropertiesLocator Found 1 core definitions
   [junit4]   2> 1208276 INFO  (coreLoadExecutor-6685-thread-1-processing-n:127.0.0.1:46923_w_j%2Fc) [n:127.0.0.1:46923_w_j%2Fc c:control_collection   x:collection1] o.a.s.c.ZkController publishing state=down
   [junit4]   2> 1208276 INFO  (coreLoadExecutor-6685-thread-1-processing-n:127.0.0.1:46923_w_j%2Fc) [n:127.0.0.1:46923_w_j%2Fc c:control_collection   x:collection1] o.a.s.c.ZkController numShards not found on descriptor - reading it from system property
   [junit4]   2> 1208277 INFO  (coreLoadExecutor-6685-thread-1-processing-n:127.0.0.1:46923_w_j%2Fc) [n:127.0.0.1:46923_w_j%2Fc c:control_collection   x:collection1] o.a.s.c.ZkController Collection control_collection not visible yet, but flagging it so a watch is registered when it becomes visible
   [junit4]   2> 1208278 INFO  (TEST-StressHdfsTest.test-seed#[2389893824BCF3D]) [n:127.0.0.1:46923_w_j%2Fc    ] o.a.s.s.SolrDispatchFilter user.dir=/export/home/jenkins/workspace/Lucene-Solr-6.x-Solaris/solr/build/solr-core/test/J0
   [junit4]   2> 1208278 INFO  (coreLoadExecutor-6685-thread-1-processing-n:127.0.0.1:46923_w_j%2Fc) [n:127.0.0.1:46923_w_j%2Fc c:control_collection   x:collection1] o.a.s.c.c.ZkStateReader Deleting data for [control_collection]
   [junit4]   2> 1208278 INFO  (TEST-StressHdfsTest.test-seed#[2389893824BCF3D]) [n:127.0.0.1:46923_w_j%2Fc    ] o.a.s.s.SolrDispatchFilter SolrDispatchFilter.init() done
   [junit4]   2> 1208279 INFO  (OverseerStateUpdate-96525259480301572-127.0.0.1:46923_w_j%2Fc-n_0000000000) [n:127.0.0.1:46923_w_j%2Fc    ] o.a.s.c.Overseer processMessage: queueSize: 1, message = {
   [junit4]   2>   "core":"collection1",
   [junit4]   2>   "roles":null,
   [junit4]   2>   "base_url":"http://127.0.0.1:46923/w_j/c",
   [junit4]   2>   "node_name":"127.0.0.1:46923_w_j%2Fc",
   [junit4]   2>   "numShards":"1",
   [junit4]   2>   "state":"down",
   [junit4]   2>   "shard":null,
   [junit4]   2>   "collection":"control_collection",
   [junit4]   2>   "operation":"state"} current state version: 0
   [junit4]   2> 1208279 INFO  (OverseerStateUpdate-96525259480301572-127.0.0.1:46923_w_j%2Fc-n_0000000000) [n:127.0.0.1:46923_w_j%2Fc    ] o.a.s.c.o.ReplicaMutator Update state numShards=1 message={
   [junit4]   2>   "core":"collection1",
   [junit4]   2>   "roles":null,
   [junit4]   2>   "base_url":"http://127.0.0.1:46923/w_j/c",
   [junit4]   2>   "node_name":"127.0.0.1:46923_w_j%2Fc",
   [junit4]   2>   "numShards":"1",
   [junit4]   2>   "state":"down",
   [junit4]   2>   "shard":null,
   [junit4]   2>   "collection":"control_collection",
   [junit4]   2>   "operation":"state"}
   [junit4]   2> 1208279 INFO  (coreLoadExecutor-6685-thread-1-processing-n:127.0.0.1:46923_w_j%2Fc) [n:127.0.0.1:46923_w_j%2Fc c:control_collection   x:collection1] o.a.s.c.ZkController look for our core node name
   [junit4]   2> 1208280 INFO  (OverseerStateUpdate-96525259480301572-127.0.0.1:46923_w_j%2Fc-n_0000000000) [n:127.0.0.1:46923_w_j%2Fc    ] o.a.s.c.o.ClusterStateMutator building a new cName: control_collection
   [junit4]   2> 1208281 INFO  (OverseerStateUpdate-96525259480301572-127.0.0.1:46923_w_j%2Fc-n_0000000000) [n:127.0.0.1:46923_w_j%2Fc    ] o.a.s.c.o.ReplicaMutator Assigning new node to shard shard=shard1
   [junit4]   2> 1208283 INFO  (zkCallback-8783-thread-1-processing-n:127.0.0.1:46923_w_j%2Fc) [n:127.0.0.1:46923_w_j%2Fc    ] o.a.s.c.c.ZkStateReader A cluster state change: [WatchedEvent state:SyncConnected type:NodeDataChanged path:/clusterstate.json], has occurred - updating... (live nodes size: [1])
   [junit4]   2> 1209282 INFO  (coreLoadExecutor-6685-thread-1-processing-n:127.0.0.1:46923_w_j%2Fc) [n:127.0.0.1:46923_w_j%2Fc c:control_collection   x:collection1] o.a.s.c.ZkController waiting to find shard id in clusterstate for collection1
   [junit4]   2> 1209282 INFO  (coreLoadExecutor-6685-thread-1-processing-n:127.0.0.1:46923_w_j%2Fc) [n:127.0.0.1:46923_w_j%2Fc c:control_collection   x:collection1] o.a.s.c.ZkController Check for collection zkNode:control_collection
   [junit4]   2> 1209282 INFO  (coreLoadExecutor-6685-thread-1-processing-n:127.0.0.1:46923_w_j%2Fc) [n:127.0.0.1:46923_w_j%2Fc c:control_collection   x:collection1] o.a.s.c.ZkController Collection zkNode exists
   [junit4]   2> 1209282 INFO  (coreLoadExecutor-6685-thread-1-processing-n:127.0.0.1:46923_w_j%2Fc) [n:127.0.0.1:46923_w_j%2Fc c:control_collection   x:collection1] o.a.s.c.c.ZkStateReader Load collection config from: [/collections/control_collection]
   [junit4]   2> 1209283 INFO  (coreLoadExecutor-6685-thread-1-processing-n:127.0.0.1:46923_w_j%2Fc) [n:127.0.0.1:46923_w_j%2Fc c:control_collection   x:collection1] o.a.s.c.c.ZkStateReader path=[/collections/control_collection] [configName]=[conf1] specified config exists in ZooKeeper
   [junit4]   2> 1209283 INFO  (coreLoadExecutor-6685-thread-1-processing-n:127.0.0.1:46923_w_j%2Fc) [n:127.0.0.1:46923_w_j%2Fc c:control_collection   x:collection1] o.a.s.c.SolrResourceLoader new SolrResourceLoader for directory: '/export/home/jenkins/workspace/Lucene-Solr-6.x-Solaris/solr/build/solr-core/test/J0/temp/solr.cloud.hdfs.StressHdfsTest_2389893824BCF3D-001/control-001/cores/collection1'
   [junit4]   2> 1209283 INFO  (coreLoadExecutor-6685-thread-1-processing-n:127.0.0.1:46923_w_j%2Fc) [n:127.0.0.1:46923_w_j%2Fc c:control_collection   x:collection1] o.a.s.c.SolrResourceLoader JNDI not configured for solr (NoInitialContextEx)
   [junit4]   2> 1209283 INFO  (coreLoadExecutor-6685-thread-1-processing-n:127.0.0.1:46923_w_j%2Fc) [n:127.0.0.1:46923_w_j%2Fc c:control_collection   x:collection1] o.a.s.c.SolrResourceLoader solr home defaulted to 'solr/' (could not find system property or JNDI)
   [junit4]   2> 1209285 INFO  (coreLoadExecutor-6685-thread-1-processing-n:127.0.0.1:46923_w_j%2Fc) [n:127.0.0.1:46923_w_j%2Fc c:control_collection   x:collection1] o.a.s.c.Config loaded config solrconfig.xml with version 0 
   [junit4]   2> 1209291 INFO  (coreLoadExecutor-6685-thread-1-processing-n:127.0.0.1:46923_w_j%2Fc) [n:127.0.0.1:46923_w_j%2Fc c:control_collection   x:collection1] o.a.s.c.SolrConfig current version of requestparams : -1
   [junit4]   2> 1209293 WARN  (coreLoadExecutor-6685-thread-1-processing-n:127.0.0.1:46923_w_j%2Fc) [n:127.0.0.1:46923_w_j%2Fc c:control_collection   x:collection1] o.a.s.c.Config Beginning with Solr 5.5, <mergePolicy> is deprecated, use <mergePolicyFactory> instead.
   [junit4]   2> 1209293 INFO  (coreLoadExecutor-6685-thread-1-processing-n:127.0.0.1:46923_w_j%2Fc) [n:127.0.0.1:46923_w_j%2Fc c:control_collection   x:collection1] o.a.s.c.SolrConfig Using Lucene MatchVersion: 6.3.0
   [junit4]   2> 1209299 INFO  (coreLoadExecutor-6685-thread-1-processing-n:127.0.0.1:46923_w_j%2Fc) [n:127.0.0.1:46923_w_j%2Fc c:control_collection   x:collection1] o.a.s.c.SolrConfig Loaded SolrConfig: solrconfig.xml
   [junit4]   2> 1209305 INFO  (coreLoadExecutor-6685-thread-1-processing-n:127.0.0.1:46923_w_j%2Fc) [n:127.0.0.1:46923_w_j%2Fc c:control_collection   x:collection1] o.a.s.s.IndexSchema [collection1] Schema name=test
   [junit4]   2> 1209358 INFO  (coreLoadExecutor-6685-thread-1-processing-n:127.0.0.1:46923_w_j%2Fc) [n:127.0.0.1:46923_w_j%2Fc c:control_collection   x:collection1] o.a.s.s.OpenExchangeRatesOrgProvider Initialized with rates=open-exchange-rates.json, refreshInterval=1440.
   [junit4]   2> 1209386 INFO  (coreLoadExecutor-6685-thread-1-processing-n:127.0.0.1:46923_w_j%2Fc) [n:127.0.0.1:46923_w_j%2Fc c:control_collection   x:collection1] o.a.s.s.IndexSchema default search field in schema is text
   [junit4]   2> 1209387 INFO  (coreLoadExecutor-6685-thread-1-processing-n:127.0.0.1:46923_w_j%2Fc) [n:127.0.0.1:46923_w_j%2Fc c:control_collection   x:collection1] o.a.s.s.IndexSchema unique key field: id
   [junit4]   2> 1209397 INFO  (coreLoadExecutor-6685-thread-1-processing-n:127.0.0.1:46923_w_j%2Fc) [n:127.0.0.1:46923_w_j%2Fc c:control_collection   x:collection1] o.a.s.s.FileExchangeRateProvider Reloading exchange rates from file currency.xml
   [junit4]   2> 1209400 INFO  (coreLoadExecutor-6685-thread-1-processing-n:127.0.0.1:46923_w_j%2Fc) [n:127.0.0.1:46923_w_j%2Fc c:control_collection   x:collection1] o.a.s.s.FileExchangeRateProvider Reloading exchange rates from file currency.xml
   [junit4]   2> 1209402 INFO  (coreLoadExecutor-6685-thread-1-processing-n:127.0.0.1:46923_w_j%2Fc) [n:127.0.0.1:46923_w_j%2Fc c:control_collection   x:collection1] o.a.s.s.OpenExchangeRatesOrgProvider Reloading exchange rates from open-exchange-rates.json
   [junit4]   2> 1209402 INFO  (coreLoadExecutor-6685-thread-1-processing-n:127.0.0.1:46923_w_j%2Fc) [n:127.0.0.1:46923_w_j%2Fc c:control_collection   x:collection1] o.a.s.s.OpenExchangeRatesOrgProvider Reloading exchange rates from open-exchange-rates.json
   [junit4]   2> 1209404 INFO  (coreLoadExecutor-6685-thread-1-processing-n:127.0.0.1:46923_w_j%2Fc) [n:127.0.0.1:46923_w_j%2Fc c:control_collection   x:collection1] o.a.s.c.ConfigSetProperties Did not find ConfigSet properties, assuming default properties: Can't find resource 'configsetprops.json' in classpath or '/configs/conf1', cwd=/export/home/jenkins/workspace/Lucene-Solr-6.x-Solaris/solr/build/solr-core/test/J0
   [junit4]   2> 1209404 INFO  (coreLoadExecutor-6685-thread-1-processing-n:127.0.0.1:46923_w_j%2Fc) [n:127.0.0.1:46923_w_j%2Fc c:control_collection   x:collection1] o.a.s.c.CoreContainer Creating SolrCore 'collection1' using configuration from collection control_collection
   [junit4]   2> 1209405 INFO  (coreLoadExecutor-6685-thread-1-processing-n:127.0.0.1:46923_w_j%2Fc) [n:127.0.0.1:46923_w_j%2Fc c:control_collection s:shard1 r:core_node1 x:collection1] o.a.s.c.SolrCore org.apache.solr.core.HdfsDirectoryFactory
   [junit4]   2> 1209421 INFO  (coreLoadExecutor-6685-thread-1-processing-n:127.0.0.1:46923_w_j%2Fc) [n:127.0.0.1:46923_w_j%2Fc c:control_collection s:shard1 r:core_node1 x:collection1] o.a.s.c.HdfsDirectoryFactory solr.hdfs.home=hdfs://solaris-vm:45999/solr_hdfs_home
   [junit4]   2> 1209421 INFO  (coreLoadExecutor-6685-thread-1-processing-n:127.0.0.1:46923_w_j%2Fc) [n:127.0.0.1:46923_w_j%2Fc c:control_collection s:shard1 r:core_node1 x:collection1] o.a.s.c.HdfsDirectoryFactory Solr Kerberos Authentication disabled
   [junit4]   2> 1209421 INFO  (coreLoadExecutor-6685-thread-1-processing-n:127.0.0.1:46923_w_j%2Fc) [n:127.0.0.1:46923_w_j%2Fc c:control_collection s:shard1 r:core_node1 x:collection1] o.a.s.c.SolrCore [[collection1] ] Opening new SolrCore at [/export/home/jenkins/workspace/Lucene-Solr-6.x-Solaris/solr/build/solr-core/test/J0/temp/solr.cloud.hdfs.StressHdfsTest_2389893824BCF3D-001/control-001/cores/collection1], dataDir=[hdfs://solaris-vm:45999/solr_hdfs_home/control_collection/core_node1/data/]
   [junit4]   2> 1209422 INFO  (coreLoadExecutor-6685-thread-1-processing-n:127.0.0.1:46923_w_j%2Fc) [n:127.0.0.1:46923_w_j%2Fc c:control_collection s:shard1 r:core_node1 x:collection1] o.a.s.c.JmxMonitoredMap JMX monitoring is enabled. Adding Solr mbeans to JMX Server: com.sun.jmx.mbeanserver.JmxMBeanServer@695396fb
   [junit4]   2> 1209422 INFO  (coreLoadExecutor-6685-thread-1-processing-n:127.0.0.1:46923_w_j%2Fc) [n:127.0.0.1:46923_w_j%2Fc c:control_collection s:shard1 r:core_node1 x:collection1] o.a.s.c.HdfsDirectoryFactory creating directory factory for path hdfs://solaris-vm:45999/solr_hdfs_home/control_collection/core_node1/data/snapshot_metadata
   [junit4]   2> 1209435 INFO  (coreLoadExecutor-6685-thread-1-processing-n:127.0.0.1:46923_w_j%2Fc) [n:127.0.0.1:46923_w_j%2Fc c:control_collection s:shard1 r:core_node1 x:collection1] o.a.s.c.HdfsDirectoryFactory Number of slabs of block cache [1] with direct memory allocation set to [true]
   [junit4]   2> 1209435 INFO  (coreLoadExecutor-6685-thread-1-processing-n:127.0.0.1:46923_w_j%2Fc) [n:127.0.0.1:46923_w_j%2Fc c:control_collection s:shard1 r:core_node1 x:collection1] o.a.s.c.HdfsDirectoryFactory Block cache target memory usage, slab size of [8388608] will allocate [1] slabs and use ~[8388608] bytes
   [junit4]   2> 1209435 INFO  (coreLoadExecutor-6685-thread-1-processing-n:127.0.0.1:46923_w_j%2Fc) [n:127.0.0.1:46923_w_j%2Fc c:control_collection s:shard1 r:core_node1 x:collection1] o.a.s.c.HdfsDirectoryFactory Creating new global HDFS BlockCache
   [junit4]   2> 1209499 INFO  (coreLoadExecutor-6685-thread-1-processing-n:127.0.0.1:46923_w_j%2Fc) [n:127.0.0.1:46923_w_j%2Fc c:control_collection s:shard1 r:core_node1 x:collection1] o.a.s.s.b.BlockDirectory Block cache on write is disabled
   [junit4]   2> 1209499 INFO  (coreLoadExecutor-6685-thread-1-processing-n:127.0.0.1:46923_w_j%2Fc) [n:127.0.0.1:46923_w_j%2Fc c:control_collection s:shard1 r:core_node1 x:collection1] o.a.s.c.CachingDirectoryFactory return new directory for hdfs://solaris-vm:45999/solr_hdfs_home/control_collection/core_node1/data/snapshot_metadata
   [junit4]   2> 1209499 INFO  (coreLoadExecutor-6685-thread-1-processing-n:127.0.0.1:46923_w_j%2Fc) [n:127.0.0.1:46923_w_j%2Fc c:control_collection s:shard1 r:core_node1 x:collection1] o.a.s.c.s.SolrSnapshotMetaDataManager Loading from snapshot metadata file...
   [junit4]   2> 1209508 INFO  (coreLoadExecutor-6685-thread-1-processing-n:127.0.0.1:46923_w_j%2Fc) [n:127.0.0.1:46923_w_j%2Fc c:control_collection s:shard1 r:core_node1 x:collection1] o.a.s.c.HdfsDirectoryFactory creating directory factory for path hdfs://solaris-vm:45999/solr_hdfs_home/control_collection/core_node1/data
   [junit4]   2> 1209523 INFO  (coreLoadExecutor-6685-thread-1-processing-n:127.0.0.1:46923_w_j%2Fc) [n:127.0.0.1:46923_w_j%2Fc c:control_collection s:shard1 r:core_node1 x:collection1] o.a.s.c.CachingDirectoryFactory return new directory for hdfs://solaris-vm:45999/solr_hdfs_home/control_collection/core_node1/data
   [junit4]   2> 1209525 INFO  (coreLoadExecutor-6685-thread-1-processing-n:127.0.0.1:46923_w_j%2Fc) [n:127.0.0.1:46923_w_j%2Fc c:control_collection s:shard1 r:core_node1 x:collection1] o.a.s.c.SolrCore New index directory detected: old=null new=hdfs://solaris-vm:45999/solr_hdfs_home/control_collection/core_node1/data/index/
   [junit4]   2> 1209535 WARN  (coreLoadExecutor-6685-thread-1-processing-n:127.0.0.1:46923_w_j%2Fc) [n:127.0.0.1:46923_w_j%2Fc c:control_collection s:shard1 r:core_node1 x:collection1] o.a.s.c.SolrCore [collection1] Solr index directory 'hdfs:/solaris-vm:45999/solr_hdfs_home/control_collection/core_node1/data/index' doesn't exist. Creating new index...
   [junit4]   2> 1209536 INFO  (coreLoadExecutor-6685-thread-1-processing-n:127.0.0.1:46923_w_j%2Fc) [n:127.0.0.1:46923_w_j%2Fc c:control_collection s:shard1 r:core_node1 x:collection1] o.a.s.c.HdfsDirectoryFactory creating directory factory for path hdfs://solaris-vm:45999/solr_hdfs_home/control_collection/core_node1/data/index
   [junit4]   2> 1209543 INFO  (coreLoadExecutor-6685-thread-1-processing-n:127.0.0.1:46923_w_j%2Fc) [n:127.0.0.1:46923_w_j%2Fc c:control_collection s:shard1 r:core_node1 x:collection1] o.a.s.c.HdfsDirectoryFactory Number of slabs of block cache [1] with direct memory allocation set to [true]
   [junit4]   2> 1209543 INFO  (coreLoadExecutor-6685-thread-1-processing-n:127.0.0.1:46923_w_j%2Fc) [n:127.0.0.1:46923_w_j%2Fc c:control_collection s:shard1 r:core_node1 x:collection1] o.a.s.c.HdfsDirectoryFactory Block cache target memory usage, slab size of [8388608] will allocate [1] slabs and use ~[8388608] bytes
   [junit4]   2> 1209551 INFO  (coreLoadExecutor-6685-thread-1-processing-n:127.0.0.1:46923_w_j%2Fc) [n:127.0.0.1:46923_w_j%2Fc c:control_collection s:shard1 r:core_node1 x:collection1] o.a.s.s.b.BlockDirectory Block cache on write is disabled
   [junit4]   2> 1209551 INFO  (coreLoadExecutor-6685-thread-1-processing-n:127.0.0.1:46923_w_j%2Fc) [n:127.0.0.1:46923_w_j%2Fc c:control_collection s:shard1 r:core_node1 x:collection1] o.a.s.c.CachingDirectoryFactory return new directory for hdfs://solaris-vm:45999/solr_hdfs_home/control_collection/core_node1/data/index
   [junit4]   2> 1209551 INFO  (coreLoadExecutor-6685-thread-1-processing-n:127.0.0.1:46923_w_j%2Fc) [n:127.0.0.1:46923_w_j%2Fc c:control_collection s:shard1 r:core_node1 x:collection1] o.a.s.u.RandomMergePolicy RandomMergePolicy wrapping class org.apache.lucene.index.LogByteSizeMergePolicy: [LogByteSizeMergePolicy: minMergeSize=1677721, mergeFactor=23, maxMergeSize=2147483648, maxMergeSizeForForcedMerge=9223372036854775807, calibrateSizeByDeletes=true, maxMergeDocs=2147483647, maxCFSSegmentSizeMB=8.796093022207999E12, noCFSRatio=0.0]
   [junit4]   2> 1209593 INFO  (IPC Server handler 9 on 45999) [    ] BlockStateChange BLOCK* addStoredBlock: blockMap updated: 127.0.0.1:58432 is added to blk_1073741825_1001{UCState=UNDER_CONSTRUCTION, truncateBlock=null, primaryNodeIndex=-1, replicas=[ReplicaUC[[DISK]DS-beb17dd0-5355-4286-a471-5e56ad1b1031:NORMAL:127.0.0.1:57347|RBW], ReplicaUC[[DISK]DS-45c8e2ef-2f2f-497b-802e-7866d93b2c73:NORMAL:127.0.0.1:58432|RBW]]} size 0
   [junit4]   2> 1209597 INFO  (IPC Server handler 0 on 45999) [    ] BlockStateChange BLOCK* addStoredBlock: blockMap updated: 127.0.0.1:57347 is added to blk_1073741825_1001 size 71
   [junit4]   2> 1209622 INFO  (coreLoadExecutor-6685-thread-1-processing-n:127.0.0.1:46923_w_j%2Fc) [n:127.0.0.1:46923_w_j%2Fc c:control_collection s:shard1 r:core_node1 x:collection1] o.a.s.c.SolrDeletionPolicy SolrDeletionPolicy.onCommit: commits: num=1
   [junit4]   2> 	commit{dir=NRTCachingDirectory(BlockDirectory(HdfsDirectory@hdfs://solaris-vm:45999/solr_hdfs_home/control_collection/core_node1/data/index lockFactory=org.apache.lucene.store.SingleInstanceLockFactory@7bdd0e23); maxCacheMB=192.0 maxMergeSizeMB=16.0),segFN=segments_1,generation=1}
   [junit4]   2> 1209622 INFO  (coreLoadExecutor-6685-thread-1-processing-n:127.0.0.1:46923_w_j%2Fc) [n:127.0.0.1:46923_w_j%2Fc c:control_collection s:shard1 r:core_node1 x:collection1] o.a.s.c.SolrDeletionPolicy newest commit generation = 1
   [junit4]   2> 1209628 INFO  (coreLoadExecutor-6685-thread-1-processing-n:127.0.0.1:46923_w_j%2Fc) [n:127.0.0.1:46923_w_j%2Fc c:control_collection s:shard1 r:core_node1 x:collection1] o.a.s.u.p.UpdateRequestProcessorChain creating updateRequestProcessorChain "nodistrib"
   [junit4]   2> 1209629 INFO  (coreLoadExecutor-6685-thread-1-processing-n:127.0.0.1:46923_w_j%2Fc) [n:127.0.0.1:46923_w_j%2Fc c:control_collection s:shard1 r:core_node1 x:collection1] o.a.s.u.p.UpdateRequestProcessorChain creating updateRequestProcessorChain "dedupe"
   [junit4]   2> 1209629 INFO  (coreLoadExecutor-6685-thread-1-processing-n:127.0.0.1:46923_w_j%2Fc) [n:127.0.0.1:46923_w_j%2Fc c:control_collection s:shard1 r:core_node1 x:collection1] o.a.s.u.p.UpdateRequestProcessorChain inserting DistributedUpdateProcessorFactory into updateRequestProcessorChain "dedupe"
   [junit4]   2> 1209629 INFO  (coreLoadExecutor-6685-thread-1-processing-n:127.0.0.1:46923_w_j%2Fc) [n:127.0.0.1:46923_w_j%2Fc c:control_collection s:shard1 r:core_node1 x:collection1] o.a.s.u.p.UpdateRequestProcessorChain creating updateRequestProcessorChain "stored_sig"
   [junit4]   2> 1209629 INFO  (coreLoadExecutor-6685-thread-1-processing-n:127.0.0.1:46923_w_j%2Fc) [n:127.0.0.1:46923_w_j%2Fc c:control_collection s:shard1 r:core_node1 x:collection1] o.a.s.u.p.UpdateRequestProcessorChain inserting DistributedUpdateProcessorFactory into updateRequestProcessorChain "stored_sig"
   [junit4]   2> 1209629 INFO  (coreLoadExecutor-6685-thread-1-processing-n:127.0.0.1:46923_w_j%2Fc) [n:127.0.0.1:46923_w_j%2Fc c:control_collection s:shard1 r:core_node1 x:collection1] o.a.s.u.p.UpdateRequestProcessorChain creating updateRequestProcessorChain "distrib-dup-test-chain-explicit"
   [junit4]   2> 1209629 INFO  (coreLoadExecutor-6685-thread-1-processing-n:127.0.0.1:46923_w_j%2Fc) [n:127.0.0.1:46923_w_j%2Fc c:control_collection s:shard1 r:core_node1 x:collection1] o.a.s.u.p.UpdateRequestProcessorChain creating updateRequestProcessorChain "distrib-dup-test-chain-implicit"
   [junit4]   2> 1209629 INFO  (coreLoadExecutor-6685-thread-1-processing-n:127.0.0.1:46923_w_j%2Fc) [n:127.0.0.1:46923_w_j%2Fc c:control_collection s:shard1 r:core_node1 x:collection1] o.a.s.u.p.UpdateRequestProcessorChain inserting DistributedUpdateProcessorFactory into updateRequestProcessorChain "distrib-dup-test-chain-implicit"
   [junit4]   2> 1209629 INFO  (coreLoadExecutor-6685-thread-1-processing-n:127.0.0.1:46923_w_j%2Fc) [n:127.0.0.1:46923_w_j%2Fc c:control_collection s:shard1 r:core_node1 x:collection1] o.a.s.c.SolrCore no updateRequestProcessorChain defined as default, creating implicit default
   [junit4]   2> 1209629 WARN  (coreLoadExecutor-6685-thread-1-processing-n:127.0.0.1:46923_w_j%2Fc) [n:127.0.0.1:46923_w_j%2Fc c:control_collection s:shard1 r:core_node1 x:collection1] o.a.s.c.RequestHandlers INVALID paramSet a in requestHandler {type = requestHandler,name = /dump,class = DumpRequestHandler,args = {defaults={a=A,b=B}}}
   [junit4]   2> 1209631 INFO  (coreLoadExecutor-6685-thread-1-processing-n:127.0.0.1:46923_w_j%2Fc) [n:127.0.0.1:46923_w_j%2Fc c:control_collection s:shard1 r:core_node1 x:collection1] o.a.s.h.l.XMLLoader xsltCacheLifetimeSeconds=60
   [junit4]   2> 1209632 INFO  (coreLoadExecutor-6685-thread-1-processing-n:127.0.0.1:46923_w_j%2Fc) [n:127.0.0.1:46923_w_j%2Fc c:control_collection s:shard1 r:core_node1 x:collection1] o.a.s.h.l.XMLLoader xsltCacheLifetimeSeconds=60
   [junit4]   2> 1209633 INFO  (coreLoadExecutor-6685-thread-1-processing-n:127.0.0.1:46923_w_j%2Fc) [n:127.0.0.1:46923_w_j%2Fc c:control_collection s:shard1 r:core_node1 x:collection1] o.a.s.h.l.XMLLoader xsltCacheLifetimeSeconds=60
   [junit4]   2> 1209634 INFO  (coreLoadExecutor-6685-thread-1-processing-n:127.0.0.1:46923_w_j%2Fc) [n:127.0.0.1:46923_w_j%2Fc c:control_collection s:shard1 r:core_node1 x:collection1] o.a.s.h.l.XMLLoader xsltCacheLifetimeSeconds=60
   [junit4]   2> 1209634 INFO  (OldIndexDirectoryCleanupThreadForCore-collection1) [n:127.0.0.1:46923_w_j%2Fc c:control_collection s:shard1 r:core_node1 x:collection1] o.a.s.c.SolrCore Looking for old index directories to cleanup for core collection1 in hdfs://solaris-vm:45999/solr_hdfs_home/control_collection/core_node1/data/
   [junit4]   2> 1209643 INFO  (coreLoadExecutor-6685-thread-1-processing-n:127.0.0.1:46923_w_j%2Fc) [n:127.0.0.1:46923_w_j%2Fc c:control_collection s:shard1 r:core_node1 x:collection1] o.a.s.c.RequestHandlers Registered paths: /admin/mbeans,standard,/update/json/docs,/admin/luke,/export,/get,/admin/properties,/update/json,/admin/threads,/dump,/update/csv,/sql,/graph,/admin/segments,/admin/system,/replication,/config,/stream,/schema,/admin/plugins,/admin/logging,/admin/ping,/update,/admin/file,/terms
   [junit4]   2> 1209643 INFO  (coreLoadExecutor-6685-thread-1-processing-n:127.0.0.1:46923_w_j%2Fc) [n:127.0.0.1:46923_w_j%2Fc c:control_collection s:shard1 r:core_node1 x:collection1] o.a.s.c.SolrCore Using default statsCache cache: org.apache.solr.search.stats.LocalStatsCache
   [junit4]   2> 1209652 INFO  (coreLoadExecutor-6685-thread-1-processing-n:127.0.0.1:46923_w_j%2Fc) [n:127.0.0.1:46923_w_j%2Fc c:control_collection s:shard1 r:core_node1 x:collection1] o.a.s.u.UpdateHandler Using UpdateLog implementation: org.apache.solr.update.HdfsUpdateLog
   [junit4]   2> 1209652 INFO  (coreLoadExecutor-6685-thread-1-processing-n:127.0.0.1:46923_w_j%2Fc) [n:127.0.0.1:46923_w_j%2Fc c:control_collection s:shard1 r:core_node1 x:collection1] o.a.s.u.UpdateLog Initializing UpdateLog: dataDir= defaultSyncLevel=FLUSH numRecordsToKeep=100 maxNumLogsToKeep=10 numVersionBuckets=65536
   [junit4]   2> 1209652 INFO  (coreLoadExecutor-6685-thread-1-processing-n:127.0.0.1:46923_w_j%2Fc) [n:127.0.0.1:46923_w_j%2Fc c:control_collection s:shard1 r:core_node1 x:collection1] o.a.s.u.HdfsUpdateLog Initializing HdfsUpdateLog: tlogDfsReplication=2
   [junit4]   2> 1209671 INFO  (coreLoadExecutor-6685-thread-1-processing-n:127.0.0.1:46923_w_j%2Fc) [n:127.0.0.1:46923_w_j%2Fc c:control_collection s:shard1 r:core_node1 x:collection1] o.a.s.u.CommitTracker Hard AutoCommit: disabled
   [junit4]   2> 1209671 INFO  (coreLoadExecutor-6685-thread-1-processing-n:127.0.0.1:46923_w_j%2Fc) [n:127.0.0.1:46923_w_j%2Fc c:control_collection s:shard1 r:core_node1 x:collection1] o.a.s.u.CommitTracker Soft AutoCommit: disabled
   [junit4]   2> 1209674 INFO  (coreLoadExecutor-6685-thread-1-processing-n:127.0.0.1:46923_w_j%2Fc) [n:127.0.0.1:46923_w_j%2Fc c:control_collection s:shard1 r:core_node1 x:collection1] o.a.s.u.RandomMergePolicy RandomMergePolicy wrapping class org.apache.lucene.index.TieredMergePolicy: [TieredMergePolicy: maxMergeAtOnce=50, maxMergeAtOnceExplicit=24, maxMergedSegmentMB=43.9375, floorSegmentMB=0.4716796875, forceMergeDeletesPctAllowed=14.1847797497656, segmentsPerTier=45.0, maxCFSSegmentSizeMB=8.796093022207999E12, noCFSRatio=0.0
   [junit4]   2> 1209766 INFO  (coreLoadExecutor-6685-thread-1-processing-n:127.0.0.1:46923_w_j%2Fc) [n:127.0.0.1:46923_w_j%2Fc c:control_collection s:shard1 r:core_node1 x:collection1] o.a.s.c.SolrDeletionPolicy SolrDeletionPolicy.onInit: commits: num=1
   [junit4]   2> 	commit{dir=NRTCachingDirectory(BlockDirectory(HdfsDirectory@hdfs://solaris-vm:45999/solr_hdfs_home/control_collection/core_node1/data/index lockFactory=org.apache.lucene.store.SingleInstanceLockFactory@7bdd0e23); maxCacheMB=192.0 maxMergeSizeMB=16.0),segFN=segments_1,generation=1}
   [junit4]   2> 1209766 INFO  (coreLoadExecutor-6685-thread-1-processing-n:127.0.0.1:46923_w_j%2Fc) [n:127.0.0.1:46923_w_j%2Fc c:control_collection s:shard1 r:core_node1 x:collection1] o.a.s.c.SolrDeletionPolicy newest commit generation = 1
   [junit4]   2> 1209766 INFO  (coreLoadExecutor-6685-thread-1-processing-n:127.0.0.1:46923_w_j%2Fc) [n:127.0.0.1:46923_w_j%2Fc c:control_collection s:shard1 r:core_node1 x:collection1] o.a.s.s.SolrIndexSearcher Opening [Searcher@313c2c08[collection1] main]
   [junit4]   2> 1209766 INFO  (coreLoadExecutor-6685-thread-1-processing-n:127.0.0.1:46923_w_j%2Fc) [n:127.0.0.1:46923_w_j%2Fc c:control_collection s:shard1 r:core_node1 x:collection1] o.a.s.c.c.ZkStateReader Load collection config from: [/collections/control_collection]
   [junit4]   2> 1209767 INFO  (coreLoadExecutor-6685-thread-1-processing-n:127.0.0.1:46923_w_j%2Fc) [n:127.0.0.1:46923_w_j%2Fc c:control_collection s:shard1 r:core_node1 x:collection1] o.a.s.c.c.ZkStateReader path=[/collections/control_collection] [configName]=[conf1] specified config exists in ZooKeeper
   [junit4]   2> 1209769 INFO  (coreLoadExecutor-6685-thread-1-processing-n:127.0.0.1:46923_w_j%2Fc) [n:127.0.0.1:46923_w_j%2Fc c:control_collection s:shard1 r:core_node1 x:collection1] o.a.s.r.ManagedResourceStorage Setting up ZooKeeper-based storage for the RestManager with znodeBase: /configs/conf1
   [junit4]   2> 1209769 INFO  (coreLoadExecutor-6685-thread-1-processing-n:127.0.0.1:46923_w_j%2Fc) [n:127.0.0.1:46923_w_j%2Fc c:control_collection s:shard1 r:core_node1 x:collection1] o.a.s.r.ManagedResourceStorage Configured ZooKeeperStorageIO with znodeBase: /configs/conf1
   [junit4]   2> 1209769 INFO  (coreLoadExecutor-6685-thread-1-processing-n:127.0.0.1:46923_w_j%2Fc) [n:127.0.0.1:46923_w_j%2Fc c:control_collection s:shard1 r:core_node1 x:collection1] o.a.s.r.RestManager Initializing RestManager with initArgs: {}
   [junit4]   2> 1209769 INFO  (coreLoadExecutor-6685-thread-1-processing-n:127.0.0.1:46923_w_j%2Fc) [n:127.0.0.1:46923_w_j%2Fc c:control_collection s:shard1 r:core_node1 x:collection1] o.a.s.r.ManagedResourceStorage Reading _rest_managed.json using ZooKeeperStorageIO:path=/configs/conf1
   [junit4]   2> 1209770 INFO  (coreLoadExecutor-6685-thread-1-processing-n:127.0.0.1:46923_w_j%2Fc) [n:127.0.0.1:46923_w_j%2Fc c:control_collection s:shard1 r:core_node1 x:collection1] o.a.s.r.ManagedResourceStorage No data found for znode /configs/conf1/_rest_managed.json
   [junit4]   2> 1209770 INFO  (coreLoadExecutor-6685-thread-1-processing-n:127.0.0.1:46923_w_j%2Fc) [n:127.0.0.1:46923_w_j%2Fc c:control_collection s:shard1 r:core_node1 x:collection1] o.a.s.r.ManagedResourceStorage Loaded null at path _rest_managed.json using ZooKeeperStorageIO:path=/configs/conf1
   [junit4]   2> 1209770 INFO  (coreLoadExecutor-6685-thread-1-processing-n:127.0.0.1:46923_w_j%2Fc) [n:127.0.0.1:46923_w_j%2Fc c:control_collection s:shard1 r:core_node1 x:collection1] o.a.s.r.RestManager Initializing 0 registered ManagedResources
   [junit4]   2> 1209773 INFO  (coreLoadExecutor-6685-thread-1-processing-n:127.0.0.1:46923_w_j%2Fc) [n:127.0.0.1:46923_w_j%2Fc c:control_collection s:shard1 r:core_node1 x:collection1] o.a.s.h.ReplicationHandler Commits will be reserved for  10000
   [junit4]   2> 1209775 INFO  (searcherExecutor-6686-thread-1-processing-n:127.0.0.1:46923_w_j%2Fc x:collection1 s:shard1 c:control_collection r:core_node1) [n:127.0.0.1:46923_w_j%2Fc c:control_collection s:shard1 r:core_node1 x:collection1] o.a.s.c.SolrCore [collection1] Registered new searcher Searcher@313c2c08[collection1] main{ExitableDirectoryReader(UninvertingDirectoryReader())}
   [junit4]   2> 1209776 INFO  (coreLoadExecutor-6685-thread-1-processing-n:127.0.0.1:46923_w_j%2Fc) [n:127.0.0.1:46923_w_j%2Fc c:control_collection s:shard1 r:core_node1 x:collection1] o.a.s.u.UpdateLog Looking up max value of version field to seed version buckets
   [junit4]   2> 1209776 INFO  (coreLoadExecutor-6685-thread-1-processing-n:127.0.0.1:46923_w_j%2Fc) [n:127.0.0.1:46923_w_j%2Fc c:control_collection s:shard1 r:core_node1 x:collection1] o.a.s.u.VersionInfo Refreshing highest value of _version_ for 65536 version buckets from index
   [junit4]   2> 1209776 INFO  (coreLoadExecutor-6685-thread-1-processing-n:127.0.0.1:46923_w_j%2Fc) [n:127.0.0.1:46923_w_j%2Fc c:control_collection s:shard1 r:core_node1 x:collection1] o.a.s.u.VersionInfo No terms found for _version_, cannot seed version bucket highest value from index
   [junit4]   2> 1209776 INFO  (coreLoadExecutor-6685-thread-1-processing-n:127.0.0.1:46923_w_j%2Fc) [n:127.0.0.1:46923_w_j%2Fc c:control_collection s:shard1 r:core_node1 x:collection1] o.a.s.u.UpdateLog Could not find max version in index or recent updates, using new clock 1544404153658245120
   [junit4]   2> 1209778 INFO  (coreLoadExecutor-6685-thread-1-processing-n:127.0.0.1:46923_w_j%2Fc) [n:127.0.0.1:46923_w_j%2Fc c:control_collection s:shard1 r:core_node1 x:collection1] o.a.s.u.UpdateLog Took 1.0ms to seed version buckets with highest version 1544404153658245120
   [junit4]   2> 1209778 INFO  (coreLoadExecutor-6685-thread-1-processing-n:127.0.0.1:46923_w_j%2Fc) [n:127.0.0.1:46923_w_j%2Fc c:control_collection s:shard1 r:core_node1 x:collection1] o.a.s.c.ZkController watch zkdir /configs/conf1
   [junit4]   2> 1209779 INFO  (coreLoadExecutor-6685-thread-1-processing-n:127.0.0.1:46923_w_j%2Fc) [n:127.0.0.1:46923_w_j%2Fc c:control_collection s:shard1 r:core_node1 x:collection1] o.a.s.c.CoreContainer registering core: collection1
   [junit4]   2> 1209780 INFO  (coreZkRegister-6678-thread-1-processing-n:127.0.0.1:46923_w_j%2Fc x:collection1 s:shard1 c:control_collection r:core_node1) [n:127.0.0.1:46923_w_j%2Fc c:control_collection s:shard1 r:core_node1 x:collection1] o.a.s.c.ZkController Register replica - core:collection1 address:http://127.0.0.1:46923/w_j/c collection:control_collection shard:shard1
   [junit4]   2> 1209781 INFO  (coreZkRegister-6678-thread-1-processing-n:127.0.0.1:46923_w_j%2Fc x:collection1 s:shard1 c:control_collection r:core_node1) [n:127.0.0.1:46923_w_j%2Fc c:control_collection s:shard1 r:core_node1 x:collection1] o.a.s.c.c.SolrZkClient makePath: /collections/control_collection/leader_elect/shard1/election
   [junit4]   2> 1209783 INFO  (TEST-StressHdfsTest.t

[...truncated too long message...]


   [junit4]   2> 	at com.carrotsearch.randomizedtesting.rules.NoShadowingOrOverridesOnMethodsRule$1.evaluate(NoShadowingOrOverridesOnMethodsRule.java:40)
   [junit4]   2> 	at com.carrotsearch.randomizedtesting.rules.StatementAdapter.evaluate(StatementAdapter.java:36)
   [junit4]   2> 	at com.carrotsearch.randomizedtesting.rules.StatementAdapter.evaluate(StatementAdapter.java:36)
   [junit4]   2> 	at com.carrotsearch.randomizedtesting.rules.StatementAdapter.evaluate(StatementAdapter.java:36)
   [junit4]   2> 	at org.apache.lucene.util.TestRuleAssertionsRequired$1.evaluate(TestRuleAssertionsRequired.java:53)
   [junit4]   2> 	at org.apache.lucene.util.TestRuleMarkFailure$1.evaluate(TestRuleMarkFailure.java:47)
   [junit4]   2> 	at org.apache.lucene.util.TestRuleIgnoreAfterMaxFailures$1.evaluate(TestRuleIgnoreAfterMaxFailures.java:64)
   [junit4]   2> 	at org.apache.lucene.util.TestRuleIgnoreTestSuites$1.evaluate(TestRuleIgnoreTestSuites.java:54)
   [junit4]   2> 	at com.carrotsearch.randomizedtesting.rules.StatementAdapter.evaluate(StatementAdapter.java:36)
   [junit4]   2> 	at com.carrotsearch.randomizedtesting.ThreadLeakControl$StatementRunner.run(ThreadLeakControl.java:367)
   [junit4]   2> 	at java.lang.Thread.run(Thread.java:745)
   [junit4]   2> Caused by: java.lang.NullPointerException
   [junit4]   2> 	at org.apache.hadoop.hdfs.server.blockmanagement.BlocksMap.size(BlocksMap.java:203)
   [junit4]   2> 	at org.apache.hadoop.hdfs.server.blockmanagement.BlockManager.getTotalBlocks(BlockManager.java:3370)
   [junit4]   2> 	at org.apache.hadoop.hdfs.server.namenode.FSNamesystem.getBlocksTotal(FSNamesystem.java:5729)
   [junit4]   2> 	... 59 more
   [junit4]   2> 3266882 INFO  (SUITE-TestHdfsUpdateLog-seed#[2389893824BCF3D]-worker) [    ] o.a.s.SolrTestCaseJ4 ###deleteCore
   [junit4]   2> 3266888 INFO  (SUITE-TestHdfsUpdateLog-seed#[2389893824BCF3D]-worker) [    ] o.a.s.SolrTestCaseJ4 ###deleteCore
   [junit4]   2> Sep 02, 2016 11:57:12 PM com.carrotsearch.randomizedtesting.ThreadLeakControl checkThreadLeaks
   [junit4]   2> WARNING: Will linger awaiting termination of 25 leaked thread(s).
   [junit4]   2> NOTE: test params are: codec=Asserting(Lucene62): {}, docValues:{}, maxPointsInLeafNode=1274, maxMBSortInHeap=6.246667681088006, sim=RandomSimilarity(queryNorm=false,coord=crazy): {}, locale=hi-IN, timezone=Mexico/BajaSur
   [junit4]   2> NOTE: SunOS 5.11 amd64/Oracle Corporation 1.8.0_102 (64-bit)/cpus=3,threads=1,free=180864960,total=536870912
   [junit4]   2> NOTE: All tests run in this JVM: [TestStressRecovery, TestFoldingMultitermQuery, DeleteLastCustomShardedReplicaTest, CloudMLTQParserTest, DistributedMLTComponentTest, TestQuerySenderListener, RequestLoggingTest, RankQueryTest, TestConfigSetsAPI, FieldMutatingUpdateProcessorTest, FieldAnalysisRequestHandlerTest, RuleEngineTest, TestQueryTypes, ConcurrentDeleteAndCreateCollectionTest, DistanceUnitsTest, TestFilteredDocIdSet, TestBackupRepositoryFactory, TestMiniSolrCloudCluster, CollectionsAPIDistributedZkTest, HdfsWriteToMultipleCollectionsTest, ConjunctionSolrSpellCheckerTest, CachingDirectoryFactoryTest, ConnectionManagerTest, BaseCdcrDistributedZkTest, TestIndexSearcher, PluginInfoTest, TestExactSharedStatsCache, TestCollapseQParserPlugin, CloneFieldUpdateProcessorFactoryTest, TestManagedResource, TestBinaryField, TestOnReconnectListenerSupport, TestQueryUtils, DefaultValueUpdateProcessorTest, TestRestoreCore, SolrPluginUtilsTest, TestNumericTerms32, FacetPivotSmallTest, TestFieldCacheSortRandom, TestLMJelinekMercerSimilarityFactory, TestUtils, OverseerStatusTest, FileBasedSpellCheckerTest, JavabinLoaderTest, HLLSerializationTest, TestJsonFacets, TestXmlQParser, OpenCloseCoreStressTest, TestPHPSerializedResponseWriter, TestClusterStateMutator, TestSolrQueryResponse, BasicDistributedZk2Test, SpellPossibilityIteratorTest, DistributedFacetPivotLargeTest, TestCrossCoreJoin, TestRecovery, TestCSVResponseWriter, BasicZkTest, CdcrReplicationDistributedZkTest, CloudExitableDirectoryReaderTest, TestConfigSets, BlockCacheTest, TestFastWriter, ResponseLogComponentTest, DebugComponentTest, DistributedFacetPivotWhiteBoxTest, TestShortCircuitedRequests, TermVectorComponentDistributedTest, OverseerModifyCollectionTest, TestConfigReload, TestManagedSchemaAPI, SuggesterWFSTTest, DateMathParserTest, HdfsChaosMonkeySafeLeaderTest, TestUniqueKeyFieldResource, TolerantUpdateProcessorTest, TestStressCloudBlindAtomicUpdates, TestCollationFieldDocValues, DistributedIntervalFacetingTest, HdfsSyncSliceTest, ZkSolrClientTest, ForceLeaderTest, StatsComponentTest, TestSearcherReuse, TestSolrCoreProperties, VMParamsZkACLAndCredentialsProvidersTest, TestImplicitCoreProperties, AtomicUpdatesTest, MinimalSchemaTest, TestSchemaVersionResource, BigEndianAscendingWordSerializerTest, TestFreeTextSuggestions, CopyFieldTest, TestFieldResource, ShowFileRequestHandlerTest, DistributedQueryComponentOptimizationTest, DirectoryFactoryTest, TlogReplayBufferedWhileIndexingTest, MultiTermTest, TestJoin, CoreAdminCreateDiscoverTest, TestFastOutputStream, TestReversedWildcardFilterFactory, ShardRoutingCustomTest, TestBM25SimilarityFactory, DeleteReplicaTest, TestMacros, TestDistributedMissingSort, TestMaxScoreQueryParser, SolrIndexSplitterTest, SharedFSAutoReplicaFailoverTest, AnalysisErrorHandlingTest, TestPerFieldSimilarity, NotRequiredUniqueKeyTest, TestSuggestSpellingConverter, SynonymTokenizerTest, TestBlendedInfixSuggestions, TestRecoveryHdfs, RAMDirectoryFactoryTest, SuggesterTest, PKIAuthenticationIntegrationTest, TestReloadAndDeleteDocs, TestFiltering, TestRandomFaceting, UpdateRequestProcessorFactoryTest, TestRealTimeGet, SimpleCollectionCreateDeleteTest, LeaderElectionIntegrationTest, TestSolrCloudWithDelegationTokens, TestReplicationHandlerBackup, BufferStoreTest, SolrCmdDistributorTest, SpellCheckCollatorTest, TestBinaryResponseWriter, TestTestInjection, HdfsDirectoryFactoryTest, TestCollationField, TestHashQParserPlugin, OpenExchangeRatesOrgProviderTest, TestRTimerTree, HdfsLockFactoryTest, CustomCollectionTest, TestSolrXml, TestDefaultSearchFieldResource, FileUtilsTest, NoCacheHeaderTest, AutoCommitTest, LeaderFailoverAfterPartitionTest, AsyncCallRequestStatusResponseTest, TestCustomSort, ExplicitHLLTest, TestLocalFSCloudBackupRestore, TestDistributedGrouping, TestHashPartitioner, TestStressVersions, DistributedTermsComponentTest, SolrCoreTest, PeerSyncTest, DirectUpdateHandlerTest, SoftAutoCommitTest, SuggesterTSTTest, TestTrie, WordBreakSolrSpellCheckerTest, TestAtomicUpdateErrorCases, TestRemoteStreaming, SolrInfoMBeanTest, IndexBasedSpellCheckerTest, LukeRequestHandlerTest, DirectSolrSpellCheckerTest, TestOmitPositions, TermsComponentTest, RequestHandlersTest, TermVectorComponentTest, TestSolrQueryParser, IndexSchemaRuntimeFieldTest, RegexBoostProcessorTest, MBeansHandlerTest, TestAnalyzedSuggestions, BinaryUpdateRequestHandlerTest, SearchHandlerTest, PreAnalyzedFieldTest, TestSystemIdResolver, PrimUtilsTest, DateFieldTest, SpellingQueryConverterTest, TestSolrJ, TestLRUCache, ZkNodePropsTest, SliceStateTest, UUIDFieldTest, TestRTGBase, TestSimpleTrackingShardHandler, ConnectionReuseTest, TestJettySolrRunner, AliasIntegrationTest, AsyncMigrateRouteKeyTest, CdcrReplicationHandlerTest, CdcrRequestHandlerTest, CleanupOldIndexTest, CollectionStateFormat2Test, CollectionsAPIAsyncDistributedZkTest, CollectionsAPISolrJTest, DeleteNodeTest, DistribDocExpirationUpdateProcessorTest, HttpPartitionTest, OverseerTaskQueueTest, PeerSyncReplicationTest, SSLMigrationTest, SaslZkACLProviderTest, ShardSplitTest, TestConfigSetsAPIZkFailure, TestCryptoKeys, TestHdfsCloudBackupRestore, TestMiniSolrCloudClusterBase, TestRandomFlRTGCloud, TestRandomRequestDistribution, TestReplicaProperties, TestTolerantUpdateProcessorCloud, HdfsBasicDistributedZkTest, HdfsChaosMonkeyNothingIsSafeTest, HdfsCollectionsAPIDistributedZkTest, HdfsNNFailoverTest, ExitableDirectoryReaderTest, TestConfigOverlay, TestConfigSetImmutable, TestConfigSetProperties, TestInfoStreamLogging, TestInitParams, TestNRTOpen, TestShardHandlerFactory, TestSolrConfigHandler, TestBlobHandler, TestSolrConfigHandlerCloud, DistributedFacetPivotSmallAdvancedTest, DistributedSuggestComponentTest, TestDistributedStatsComponentCardinality, TestCloudManagedSchema, AnalyticsQueryTest, SortSpecParsingTest, TestInitQParser, TestQueryWrapperFilter, TestRandomCollapseQParserPlugin, TestPerFieldSimilarityWithDefaultOverride, TestDistribIDF, TestAuthorizationFramework, TestDocTermOrds, TestFieldCache, TestFieldCacheSanityChecker, TestFieldCacheWithThreads, TestUninvertingReader, AddBlockUpdateTest, DataDrivenBlockJoinTest, TestExceedMaxTermLength, TestHdfsUpdateLog]
   [junit4]   2> NOTE: reproduce with: ant test  -Dtestcase=TestHdfsUpdateLog -Dtests.seed=2389893824BCF3D -Dtests.slow=true -Dtests.locale=hi-IN -Dtests.timezone=Mexico/BajaSur -Dtests.asserts=true -Dtests.file.encoding=UTF-8
   [junit4] ERROR   0.00s J1 | TestHdfsUpdateLog (suite) <<<
   [junit4]    > Throwable #1: java.io.IOException: Timed out waiting for Mini HDFS Cluster to start
   [junit4]    > 	at __randomizedtesting.SeedInfo.seed([2389893824BCF3D]:0)
   [junit4]    > 	at org.apache.hadoop.hdfs.MiniDFSCluster.waitClusterUp(MiniDFSCluster.java:1203)
   [junit4]    > 	at org.apache.hadoop.hdfs.MiniDFSCluster.initMiniDFSCluster(MiniDFSCluster.java:836)
   [junit4]    > 	at org.apache.hadoop.hdfs.MiniDFSCluster.<init>(MiniDFSCluster.java:742)
   [junit4]    > 	at org.apache.hadoop.hdfs.MiniDFSCluster.<init>(MiniDFSCluster.java:612)
   [junit4]    > 	at org.apache.solr.cloud.hdfs.HdfsTestUtil.setupClass(HdfsTestUtil.java:99)
   [junit4]    > 	at org.apache.solr.cloud.hdfs.HdfsTestUtil.setupClass(HdfsTestUtil.java:61)
   [junit4]    > 	at org.apache.solr.update.TestHdfsUpdateLog.beforeClass(TestHdfsUpdateLog.java:52)
   [junit4]    > 	at java.lang.Thread.run(Thread.java:745)
   [junit4] Completed [626/631 (5!)] on J1 in 21.07s, 0 tests, 1 error <<< FAILURES!

[...truncated 60197 lines...]


Mime
View raw message