lucene-dev mailing list archives

Site index · List index
Message view « Date » · « Thread »
Top « Date » · « Thread »
From Policeman Jenkins Server <jenk...@thetaphi.de>
Subject [JENKINS] Lucene-Solr-master-Linux (32bit/jdk1.8.0_102) - Build # 17794 - Unstable!
Date Sat, 10 Sep 2016 10:41:39 GMT
Build: http://jenkins.thetaphi.de/job/Lucene-Solr-master-Linux/17794/
Java: 32bit/jdk1.8.0_102 -client -XX:+UseSerialGC

1 tests failed.
FAILED:  junit.framework.TestSuite.org.apache.solr.schema.TestManagedSchemaAPI

Error Message:
ObjectTracker found 10 object(s) that were not released!!! [TransactionLog, MockDirectoryWrapper, MockDirectoryWrapper, MockDirectoryWrapper, MDCAwareThreadPoolExecutor, MDCAwareThreadPoolExecutor, MockDirectoryWrapper, MockDirectoryWrapper, TransactionLog, MockDirectoryWrapper]

Stack Trace:
java.lang.AssertionError: ObjectTracker found 10 object(s) that were not released!!! [TransactionLog, MockDirectoryWrapper, MockDirectoryWrapper, MockDirectoryWrapper, MDCAwareThreadPoolExecutor, MDCAwareThreadPoolExecutor, MockDirectoryWrapper, MockDirectoryWrapper, TransactionLog, MockDirectoryWrapper]
	at __randomizedtesting.SeedInfo.seed([2C69E749B828036B]:0)
	at org.junit.Assert.fail(Assert.java:93)
	at org.junit.Assert.assertTrue(Assert.java:43)
	at org.junit.Assert.assertNull(Assert.java:551)
	at org.apache.solr.SolrTestCaseJ4.teardownTestCases(SolrTestCaseJ4.java:257)
	at sun.reflect.NativeMethodAccessorImpl.invoke0(Native Method)
	at sun.reflect.NativeMethodAccessorImpl.invoke(NativeMethodAccessorImpl.java:62)
	at sun.reflect.DelegatingMethodAccessorImpl.invoke(DelegatingMethodAccessorImpl.java:43)
	at java.lang.reflect.Method.invoke(Method.java:498)
	at com.carrotsearch.randomizedtesting.RandomizedRunner.invoke(RandomizedRunner.java:1764)
	at com.carrotsearch.randomizedtesting.RandomizedRunner$7.evaluate(RandomizedRunner.java:834)
	at com.carrotsearch.randomizedtesting.rules.StatementAdapter.evaluate(StatementAdapter.java:36)
	at com.carrotsearch.randomizedtesting.rules.SystemPropertiesRestoreRule$1.evaluate(SystemPropertiesRestoreRule.java:57)
	at org.apache.lucene.util.AbstractBeforeAfterRule$1.evaluate(AbstractBeforeAfterRule.java:45)
	at com.carrotsearch.randomizedtesting.rules.StatementAdapter.evaluate(StatementAdapter.java:36)
	at org.apache.lucene.util.TestRuleStoreClassName$1.evaluate(TestRuleStoreClassName.java:41)
	at com.carrotsearch.randomizedtesting.rules.NoShadowingOrOverridesOnMethodsRule$1.evaluate(NoShadowingOrOverridesOnMethodsRule.java:40)
	at com.carrotsearch.randomizedtesting.rules.NoShadowingOrOverridesOnMethodsRule$1.evaluate(NoShadowingOrOverridesOnMethodsRule.java:40)
	at com.carrotsearch.randomizedtesting.rules.StatementAdapter.evaluate(StatementAdapter.java:36)
	at com.carrotsearch.randomizedtesting.rules.StatementAdapter.evaluate(StatementAdapter.java:36)
	at com.carrotsearch.randomizedtesting.rules.StatementAdapter.evaluate(StatementAdapter.java:36)
	at org.apache.lucene.util.TestRuleAssertionsRequired$1.evaluate(TestRuleAssertionsRequired.java:53)
	at org.apache.lucene.util.TestRuleMarkFailure$1.evaluate(TestRuleMarkFailure.java:47)
	at org.apache.lucene.util.TestRuleIgnoreAfterMaxFailures$1.evaluate(TestRuleIgnoreAfterMaxFailures.java:64)
	at org.apache.lucene.util.TestRuleIgnoreTestSuites$1.evaluate(TestRuleIgnoreTestSuites.java:54)
	at com.carrotsearch.randomizedtesting.rules.StatementAdapter.evaluate(StatementAdapter.java:36)
	at com.carrotsearch.randomizedtesting.ThreadLeakControl$StatementRunner.run(ThreadLeakControl.java:367)
	at java.lang.Thread.run(Thread.java:745)




Build Log:
[...truncated 10568 lines...]
   [junit4] Suite: org.apache.solr.schema.TestManagedSchemaAPI
   [junit4]   2> Creating dataDir: /home/jenkins/workspace/Lucene-Solr-master-Linux/solr/build/solr-core/test/J1/temp/solr.schema.TestManagedSchemaAPI_2C69E749B828036B-001/init-core-data-001
   [junit4]   2> 7419 INFO  (SUITE-TestManagedSchemaAPI-seed#[2C69E749B828036B]-worker) [    ] o.a.s.SolrTestCaseJ4 Randomized ssl (true) and clientAuth (true) via: @org.apache.solr.util.RandomizeSSL(reason=, ssl=NaN, value=NaN, clientAuth=NaN)
   [junit4]   2> 7482 INFO  (SUITE-TestManagedSchemaAPI-seed#[2C69E749B828036B]-worker) [    ] o.a.s.c.ZkTestServer STARTING ZK TEST SERVER
   [junit4]   2> 7484 INFO  (Thread-22) [    ] o.a.s.c.ZkTestServer client port:0.0.0.0/0.0.0.0:0
   [junit4]   2> 7484 INFO  (Thread-22) [    ] o.a.s.c.ZkTestServer Starting server
   [junit4]   2> 7584 INFO  (SUITE-TestManagedSchemaAPI-seed#[2C69E749B828036B]-worker) [    ] o.a.s.c.ZkTestServer start zk server on port:44469
   [junit4]   2> 7593 INFO  (SUITE-TestManagedSchemaAPI-seed#[2C69E749B828036B]-worker) [    ] o.a.s.c.c.SolrZkClient Using default ZkCredentialsProvider
   [junit4]   2> 7626 INFO  (SUITE-TestManagedSchemaAPI-seed#[2C69E749B828036B]-worker) [    ] o.a.s.c.c.ConnectionManager Waiting for client to connect to ZooKeeper
   [junit4]   2> 7651 INFO  (zkCallback-6-thread-1) [    ] o.a.s.c.c.ConnectionManager Watcher org.apache.solr.common.cloud.ConnectionManager@1bec1b7 name:ZooKeeperConnection Watcher:127.0.0.1:44469 got event WatchedEvent state:SyncConnected type:None path:null path:null type:None
   [junit4]   2> 7651 INFO  (SUITE-TestManagedSchemaAPI-seed#[2C69E749B828036B]-worker) [    ] o.a.s.c.c.ConnectionManager Client is connected to ZooKeeper
   [junit4]   2> 7651 INFO  (SUITE-TestManagedSchemaAPI-seed#[2C69E749B828036B]-worker) [    ] o.a.s.c.c.SolrZkClient Using default ZkACLProvider
   [junit4]   2> 7653 INFO  (SUITE-TestManagedSchemaAPI-seed#[2C69E749B828036B]-worker) [    ] o.a.s.c.c.SolrZkClient makePath: /solr/solr.xml
   [junit4]   2> 7672 INFO  (SUITE-TestManagedSchemaAPI-seed#[2C69E749B828036B]-worker) [    ] o.a.s.c.c.SolrZkClient makePath: /solr/clusterprops.json
   [junit4]   2> 7689 INFO  (jetty-launcher-5-thread-2) [    ] o.e.j.s.Server jetty-9.3.8.v20160314
   [junit4]   2> 7690 INFO  (jetty-launcher-5-thread-1) [    ] o.e.j.s.Server jetty-9.3.8.v20160314
   [junit4]   2> 7690 INFO  (jetty-launcher-5-thread-2) [    ] o.e.j.s.h.ContextHandler Started o.e.j.s.ServletContextHandler@b7e46e{/solr,null,AVAILABLE}
   [junit4]   2> 7691 INFO  (jetty-launcher-5-thread-1) [    ] o.e.j.s.h.ContextHandler Started o.e.j.s.ServletContextHandler@317bf0{/solr,null,AVAILABLE}
   [junit4]   2> 7839 INFO  (jetty-launcher-5-thread-2) [    ] o.e.j.s.ServerConnector Started ServerConnector@117f975{SSL,[ssl, http/1.1]}{127.0.0.1:40366}
   [junit4]   2> 7839 INFO  (jetty-launcher-5-thread-1) [    ] o.e.j.s.ServerConnector Started ServerConnector@50c01b{SSL,[ssl, http/1.1]}{127.0.0.1:38822}
   [junit4]   2> 7839 INFO  (jetty-launcher-5-thread-2) [    ] o.e.j.s.Server Started @9063ms
   [junit4]   2> 7839 INFO  (jetty-launcher-5-thread-1) [    ] o.e.j.s.Server Started @9063ms
   [junit4]   2> 7839 INFO  (jetty-launcher-5-thread-2) [    ] o.a.s.c.s.e.JettySolrRunner Jetty properties: {hostContext=/solr, hostPort=40366}
   [junit4]   2> 7839 INFO  (jetty-launcher-5-thread-1) [    ] o.a.s.c.s.e.JettySolrRunner Jetty properties: {hostContext=/solr, hostPort=38822}
   [junit4]   2> 7839 INFO  (jetty-launcher-5-thread-2) [    ] o.a.s.s.SolrDispatchFilter SolrDispatchFilter.init(): sun.misc.Launcher$AppClassLoader@1d16e93
   [junit4]   2> 7839 INFO  (jetty-launcher-5-thread-2) [    ] o.a.s.c.SolrResourceLoader new SolrResourceLoader for directory: '/home/jenkins/workspace/Lucene-Solr-master-Linux/solr/build/solr-core/test/J1/temp/solr.schema.TestManagedSchemaAPI_2C69E749B828036B-001/tempDir-001/node2'
   [junit4]   2> 7839 INFO  (jetty-launcher-5-thread-1) [    ] o.a.s.s.SolrDispatchFilter SolrDispatchFilter.init(): sun.misc.Launcher$AppClassLoader@1d16e93
   [junit4]   2> 7839 INFO  (jetty-launcher-5-thread-2) [    ] o.a.s.c.SolrResourceLoader JNDI not configured for solr (NoInitialContextEx)
   [junit4]   2> 7839 INFO  (jetty-launcher-5-thread-1) [    ] o.a.s.c.SolrResourceLoader new SolrResourceLoader for directory: '/home/jenkins/workspace/Lucene-Solr-master-Linux/solr/build/solr-core/test/J1/temp/solr.schema.TestManagedSchemaAPI_2C69E749B828036B-001/tempDir-001/node1'
   [junit4]   2> 7839 INFO  (jetty-launcher-5-thread-2) [    ] o.a.s.c.SolrResourceLoader solr home defaulted to 'solr/' (could not find system property or JNDI)
   [junit4]   2> 7840 INFO  (jetty-launcher-5-thread-1) [    ] o.a.s.c.SolrResourceLoader JNDI not configured for solr (NoInitialContextEx)
   [junit4]   2> 7840 INFO  (jetty-launcher-5-thread-1) [    ] o.a.s.c.SolrResourceLoader solr home defaulted to 'solr/' (could not find system property or JNDI)
   [junit4]   2> 7840 INFO  (jetty-launcher-5-thread-2) [    ] o.a.s.c.c.SolrZkClient Using default ZkCredentialsProvider
   [junit4]   2> 7840 INFO  (jetty-launcher-5-thread-1) [    ] o.a.s.c.c.SolrZkClient Using default ZkCredentialsProvider
   [junit4]   2> 7840 INFO  (jetty-launcher-5-thread-2) [    ] o.a.s.c.c.ConnectionManager Waiting for client to connect to ZooKeeper
   [junit4]   2> 7846 INFO  (jetty-launcher-5-thread-1) [    ] o.a.s.c.c.ConnectionManager Waiting for client to connect to ZooKeeper
   [junit4]   2> 7848 INFO  (zkCallback-7-thread-1) [    ] o.a.s.c.c.ConnectionManager Watcher org.apache.solr.common.cloud.ConnectionManager@276ac9 name:ZooKeeperConnection Watcher:127.0.0.1:44469/solr got event WatchedEvent state:SyncConnected type:None path:null path:null type:None
   [junit4]   2> 7848 INFO  (jetty-launcher-5-thread-2) [    ] o.a.s.c.c.ConnectionManager Client is connected to ZooKeeper
   [junit4]   2> 7848 INFO  (zkCallback-8-thread-1) [    ] o.a.s.c.c.ConnectionManager Watcher org.apache.solr.common.cloud.ConnectionManager@16c5eaa name:ZooKeeperConnection Watcher:127.0.0.1:44469/solr got event WatchedEvent state:SyncConnected type:None path:null path:null type:None
   [junit4]   2> 7848 INFO  (jetty-launcher-5-thread-1) [    ] o.a.s.c.c.ConnectionManager Client is connected to ZooKeeper
   [junit4]   2> 7848 INFO  (jetty-launcher-5-thread-2) [    ] o.a.s.c.c.SolrZkClient Using default ZkACLProvider
   [junit4]   2> 7849 INFO  (jetty-launcher-5-thread-1) [    ] o.a.s.c.c.SolrZkClient Using default ZkACLProvider
   [junit4]   2> 7849 INFO  (jetty-launcher-5-thread-2) [    ] o.a.s.s.SolrDispatchFilter solr.xml found in ZooKeeper. Loading...
   [junit4]   2> 7849 INFO  (jetty-launcher-5-thread-1) [    ] o.a.s.s.SolrDispatchFilter solr.xml found in ZooKeeper. Loading...
   [junit4]   2> 7865 INFO  (jetty-launcher-5-thread-2) [    ] o.a.s.c.CorePropertiesLocator Config-defined core root directory: /home/jenkins/workspace/Lucene-Solr-master-Linux/solr/build/solr-core/test/J1/temp/solr.schema.TestManagedSchemaAPI_2C69E749B828036B-001/tempDir-001/node2/.
   [junit4]   2> 7865 INFO  (jetty-launcher-5-thread-2) [    ] o.a.s.c.CoreContainer New CoreContainer 23271819
   [junit4]   2> 7865 INFO  (jetty-launcher-5-thread-2) [    ] o.a.s.c.CoreContainer Loading cores into CoreContainer [instanceDir=/home/jenkins/workspace/Lucene-Solr-master-Linux/solr/build/solr-core/test/J1/temp/solr.schema.TestManagedSchemaAPI_2C69E749B828036B-001/tempDir-001/node2]
   [junit4]   2> 7865 WARN  (jetty-launcher-5-thread-2) [    ] o.a.s.c.CoreContainer Couldn't add files from /home/jenkins/workspace/Lucene-Solr-master-Linux/solr/build/solr-core/test/J1/temp/solr.schema.TestManagedSchemaAPI_2C69E749B828036B-001/tempDir-001/node2/lib to classpath: /home/jenkins/workspace/Lucene-Solr-master-Linux/solr/build/solr-core/test/J1/temp/solr.schema.TestManagedSchemaAPI_2C69E749B828036B-001/tempDir-001/node2/lib
   [junit4]   2> 7865 INFO  (jetty-launcher-5-thread-2) [    ] o.a.s.h.c.HttpShardHandlerFactory created with socketTimeout : 90000,urlScheme : https,connTimeout : 15000,maxConnectionsPerHost : 20,maxConnections : 10000,corePoolSize : 0,maximumPoolSize : 2147483647,maxThreadIdleTime : 5,sizeOfQueue : -1,fairnessPolicy : false,
   [junit4]   2> 7865 INFO  (jetty-launcher-5-thread-1) [    ] o.a.s.c.CorePropertiesLocator Config-defined core root directory: /home/jenkins/workspace/Lucene-Solr-master-Linux/solr/build/solr-core/test/J1/temp/solr.schema.TestManagedSchemaAPI_2C69E749B828036B-001/tempDir-001/node1/.
   [junit4]   2> 7865 INFO  (jetty-launcher-5-thread-1) [    ] o.a.s.c.CoreContainer New CoreContainer 29016920
   [junit4]   2> 7865 INFO  (jetty-launcher-5-thread-1) [    ] o.a.s.c.CoreContainer Loading cores into CoreContainer [instanceDir=/home/jenkins/workspace/Lucene-Solr-master-Linux/solr/build/solr-core/test/J1/temp/solr.schema.TestManagedSchemaAPI_2C69E749B828036B-001/tempDir-001/node1]
   [junit4]   2> 7866 WARN  (jetty-launcher-5-thread-1) [    ] o.a.s.c.CoreContainer Couldn't add files from /home/jenkins/workspace/Lucene-Solr-master-Linux/solr/build/solr-core/test/J1/temp/solr.schema.TestManagedSchemaAPI_2C69E749B828036B-001/tempDir-001/node1/lib to classpath: /home/jenkins/workspace/Lucene-Solr-master-Linux/solr/build/solr-core/test/J1/temp/solr.schema.TestManagedSchemaAPI_2C69E749B828036B-001/tempDir-001/node1/lib
   [junit4]   2> 7866 INFO  (jetty-launcher-5-thread-1) [    ] o.a.s.h.c.HttpShardHandlerFactory created with socketTimeout : 90000,urlScheme : https,connTimeout : 15000,maxConnectionsPerHost : 20,maxConnections : 10000,corePoolSize : 0,maximumPoolSize : 2147483647,maxThreadIdleTime : 5,sizeOfQueue : -1,fairnessPolicy : false,
   [junit4]   2> 7867 INFO  (jetty-launcher-5-thread-2) [    ] o.a.s.u.UpdateShardHandler Created UpdateShardHandler HTTP client with params: socketTimeout=340000&connTimeout=45000&maxConnections=100000&maxConnectionsPerHost=100000
   [junit4]   2> 7867 INFO  (jetty-launcher-5-thread-2) [    ] o.a.s.l.LogWatcher SLF4J impl is org.slf4j.impl.Log4jLoggerFactory
   [junit4]   2> 7867 INFO  (jetty-launcher-5-thread-2) [    ] o.a.s.l.LogWatcher Registering Log Listener [Log4j (org.slf4j.impl.Log4jLoggerFactory)]
   [junit4]   2> 7867 INFO  (jetty-launcher-5-thread-2) [    ] o.a.s.c.ZkContainer Zookeeper client=127.0.0.1:44469/solr
   [junit4]   2> 7868 INFO  (jetty-launcher-5-thread-1) [    ] o.a.s.u.UpdateShardHandler Created UpdateShardHandler HTTP client with params: socketTimeout=340000&connTimeout=45000&maxConnections=100000&maxConnectionsPerHost=100000
   [junit4]   2> 7871 INFO  (jetty-launcher-5-thread-1) [    ] o.a.s.l.LogWatcher SLF4J impl is org.slf4j.impl.Log4jLoggerFactory
   [junit4]   2> 7871 INFO  (jetty-launcher-5-thread-1) [    ] o.a.s.l.LogWatcher Registering Log Listener [Log4j (org.slf4j.impl.Log4jLoggerFactory)]
   [junit4]   2> 7871 INFO  (jetty-launcher-5-thread-1) [    ] o.a.s.c.ZkContainer Zookeeper client=127.0.0.1:44469/solr
   [junit4]   2> 7879 INFO  (jetty-launcher-5-thread-2) [    ] o.a.s.c.ZkController zkHost includes chroot
   [junit4]   2> 7879 INFO  (jetty-launcher-5-thread-1) [    ] o.a.s.c.ZkController zkHost includes chroot
   [junit4]   2> 7880 INFO  (jetty-launcher-5-thread-2) [    ] o.a.s.c.c.SolrZkClient Using default ZkCredentialsProvider
   [junit4]   2> 7880 INFO  (jetty-launcher-5-thread-1) [    ] o.a.s.c.c.SolrZkClient Using default ZkCredentialsProvider
   [junit4]   2> 7881 INFO  (jetty-launcher-5-thread-1) [    ] o.a.s.c.c.ConnectionManager Waiting for client to connect to ZooKeeper
   [junit4]   2> 7881 INFO  (jetty-launcher-5-thread-2) [    ] o.a.s.c.c.ConnectionManager Waiting for client to connect to ZooKeeper
   [junit4]   2> 7883 INFO  (zkCallback-14-thread-1) [    ] o.a.s.c.c.ConnectionManager Watcher org.apache.solr.common.cloud.ConnectionManager@12bf424 name:ZooKeeperConnection Watcher:127.0.0.1:44469 got event WatchedEvent state:SyncConnected type:None path:null path:null type:None
   [junit4]   2> 7883 INFO  (jetty-launcher-5-thread-1) [    ] o.a.s.c.c.ConnectionManager Client is connected to ZooKeeper
   [junit4]   2> 7883 INFO  (jetty-launcher-5-thread-1) [    ] o.a.s.c.c.SolrZkClient Using default ZkACLProvider
   [junit4]   2> 7883 INFO  (zkCallback-13-thread-1) [    ] o.a.s.c.c.ConnectionManager Watcher org.apache.solr.common.cloud.ConnectionManager@1b8b333 name:ZooKeeperConnection Watcher:127.0.0.1:44469 got event WatchedEvent state:SyncConnected type:None path:null path:null type:None
   [junit4]   2> 7884 INFO  (jetty-launcher-5-thread-2) [    ] o.a.s.c.c.ConnectionManager Client is connected to ZooKeeper
   [junit4]   2> 7884 INFO  (jetty-launcher-5-thread-2) [    ] o.a.s.c.c.SolrZkClient Using default ZkACLProvider
   [junit4]   2> 7887 INFO  (jetty-launcher-5-thread-1) [n:127.0.0.1:38822_solr    ] o.a.s.c.ZkController Added new OnReconnect listener org.apache.solr.cloud.ZkController$$Lambda$69/22847917@8850fa
   [junit4]   2> 7887 INFO  (jetty-launcher-5-thread-2) [n:127.0.0.1:40366_solr    ] o.a.s.c.ZkController Added new OnReconnect listener org.apache.solr.cloud.ZkController$$Lambda$69/22847917@134278f
   [junit4]   2> 7888 INFO  (jetty-launcher-5-thread-1) [n:127.0.0.1:38822_solr    ] o.a.s.c.c.ConnectionManager Waiting for client to connect to ZooKeeper
   [junit4]   2> 7888 INFO  (jetty-launcher-5-thread-2) [n:127.0.0.1:40366_solr    ] o.a.s.c.c.ConnectionManager Waiting for client to connect to ZooKeeper
   [junit4]   2> 7890 INFO  (zkCallback-16-thread-1-processing-n:127.0.0.1:38822_solr) [n:127.0.0.1:38822_solr    ] o.a.s.c.c.ConnectionManager Watcher org.apache.solr.common.cloud.ConnectionManager@110c16 name:ZooKeeperConnection Watcher:127.0.0.1:44469/solr got event WatchedEvent state:SyncConnected type:None path:null path:null type:None
   [junit4]   2> 7890 INFO  (jetty-launcher-5-thread-1) [n:127.0.0.1:38822_solr    ] o.a.s.c.c.ConnectionManager Client is connected to ZooKeeper
   [junit4]   2> 7892 INFO  (zkCallback-15-thread-1-processing-n:127.0.0.1:40366_solr) [n:127.0.0.1:40366_solr    ] o.a.s.c.c.ConnectionManager Watcher org.apache.solr.common.cloud.ConnectionManager@9be6d6 name:ZooKeeperConnection Watcher:127.0.0.1:44469/solr got event WatchedEvent state:SyncConnected type:None path:null path:null type:None
   [junit4]   2> 7892 INFO  (jetty-launcher-5-thread-2) [n:127.0.0.1:40366_solr    ] o.a.s.c.c.ConnectionManager Client is connected to ZooKeeper
   [junit4]   2> 7897 INFO  (jetty-launcher-5-thread-1) [n:127.0.0.1:38822_solr    ] o.a.s.c.c.SolrZkClient makePath: /overseer/queue
   [junit4]   2> 7897 INFO  (jetty-launcher-5-thread-2) [n:127.0.0.1:40366_solr    ] o.a.s.c.c.SolrZkClient makePath: /overseer/queue
   [junit4]   2> 7900 INFO  (jetty-launcher-5-thread-2) [n:127.0.0.1:40366_solr    ] o.a.s.c.c.SolrZkClient makePath: /overseer/collection-queue-work
   [junit4]   2> 7900 INFO  (jetty-launcher-5-thread-1) [n:127.0.0.1:38822_solr    ] o.a.s.c.c.SolrZkClient makePath: /overseer/collection-queue-work
   [junit4]   2> 7905 INFO  (jetty-launcher-5-thread-1) [n:127.0.0.1:38822_solr    ] o.a.s.c.c.SolrZkClient makePath: /overseer/collection-map-running
   [junit4]   2> 7905 INFO  (jetty-launcher-5-thread-2) [n:127.0.0.1:40366_solr    ] o.a.s.c.c.SolrZkClient makePath: /overseer/collection-map-running
   [junit4]   2> 7908 INFO  (jetty-launcher-5-thread-2) [n:127.0.0.1:40366_solr    ] o.a.s.c.c.SolrZkClient makePath: /overseer/collection-map-completed
   [junit4]   2> 7908 INFO  (jetty-launcher-5-thread-1) [n:127.0.0.1:38822_solr    ] o.a.s.c.c.SolrZkClient makePath: /overseer/collection-map-completed
   [junit4]   2> 7910 INFO  (jetty-launcher-5-thread-1) [n:127.0.0.1:38822_solr    ] o.a.s.c.c.SolrZkClient makePath: /overseer/collection-map-failure
   [junit4]   2> 7910 INFO  (jetty-launcher-5-thread-2) [n:127.0.0.1:40366_solr    ] o.a.s.c.c.SolrZkClient makePath: /overseer/collection-map-failure
   [junit4]   2> 7921 INFO  (jetty-launcher-5-thread-1) [n:127.0.0.1:38822_solr    ] o.a.s.c.c.SolrZkClient makePath: /live_nodes
   [junit4]   2> 7921 INFO  (jetty-launcher-5-thread-2) [n:127.0.0.1:40366_solr    ] o.a.s.c.c.SolrZkClient makePath: /live_nodes
   [junit4]   2> 7923 INFO  (jetty-launcher-5-thread-2) [n:127.0.0.1:40366_solr    ] o.a.s.c.c.SolrZkClient makePath: /collections
   [junit4]   2> 7923 INFO  (jetty-launcher-5-thread-1) [n:127.0.0.1:38822_solr    ] o.a.s.c.c.SolrZkClient makePath: /collections
   [junit4]   2> 7924 INFO  (jetty-launcher-5-thread-2) [n:127.0.0.1:40366_solr    ] o.a.s.c.c.SolrZkClient makePath: /aliases.json
   [junit4]   2> 7924 INFO  (jetty-launcher-5-thread-1) [n:127.0.0.1:38822_solr    ] o.a.s.c.c.SolrZkClient makePath: /aliases.json
   [junit4]   2> 7925 INFO  (jetty-launcher-5-thread-2) [n:127.0.0.1:40366_solr    ] o.a.s.c.c.SolrZkClient makePath: /clusterstate.json
   [junit4]   2> 7925 INFO  (jetty-launcher-5-thread-1) [n:127.0.0.1:38822_solr    ] o.a.s.c.c.SolrZkClient makePath: /clusterstate.json
   [junit4]   2> 7927 INFO  (jetty-launcher-5-thread-1) [n:127.0.0.1:38822_solr    ] o.a.s.c.c.SolrZkClient makePath: /security.json
   [junit4]   2> 7927 INFO  (jetty-launcher-5-thread-2) [n:127.0.0.1:40366_solr    ] o.a.s.c.c.SolrZkClient makePath: /security.json
   [junit4]   2> 7928 INFO  (jetty-launcher-5-thread-1) [n:127.0.0.1:38822_solr    ] o.a.s.c.c.ZkStateReader Updating cluster state from ZooKeeper... 
   [junit4]   2> 7929 INFO  (jetty-launcher-5-thread-2) [n:127.0.0.1:40366_solr    ] o.a.s.c.c.ZkStateReader Updating cluster state from ZooKeeper... 
   [junit4]   2> 7929 INFO  (jetty-launcher-5-thread-1) [n:127.0.0.1:38822_solr    ] o.a.s.c.c.ZkStateReader Loaded cluster properties: {urlScheme=https}
   [junit4]   2> 7930 INFO  (jetty-launcher-5-thread-2) [n:127.0.0.1:40366_solr    ] o.a.s.c.c.ZkStateReader Loaded cluster properties: {urlScheme=https}
   [junit4]   2> 7933 INFO  (jetty-launcher-5-thread-2) [n:127.0.0.1:40366_solr    ] o.a.s.c.c.ZkStateReader Updated live nodes from ZooKeeper... (0) -> (0)
   [junit4]   2> 7933 INFO  (jetty-launcher-5-thread-1) [n:127.0.0.1:38822_solr    ] o.a.s.c.c.ZkStateReader Updated live nodes from ZooKeeper... (0) -> (0)
   [junit4]   2> 7948 INFO  (jetty-launcher-5-thread-2) [n:127.0.0.1:40366_solr    ] o.a.s.c.c.SolrZkClient makePath: /overseer_elect
   [junit4]   2> 7948 INFO  (jetty-launcher-5-thread-1) [n:127.0.0.1:38822_solr    ] o.a.s.c.c.SolrZkClient makePath: /overseer_elect
   [junit4]   2> 7950 INFO  (jetty-launcher-5-thread-1) [n:127.0.0.1:38822_solr    ] o.a.s.c.c.SolrZkClient makePath: /overseer_elect/election
   [junit4]   2> 7950 INFO  (jetty-launcher-5-thread-2) [n:127.0.0.1:40366_solr    ] o.a.s.c.c.SolrZkClient makePath: /overseer_elect/election
   [junit4]   2> 7951 INFO  (jetty-launcher-5-thread-2) [n:127.0.0.1:40366_solr    ] o.a.s.c.Overseer Overseer (id=null) closing
   [junit4]   2> 7951 INFO  (jetty-launcher-5-thread-1) [n:127.0.0.1:38822_solr    ] o.a.s.c.Overseer Overseer (id=null) closing
   [junit4]   2> 7953 INFO  (jetty-launcher-5-thread-2) [n:127.0.0.1:40366_solr    ] o.a.s.c.LeaderElector Joined leadership election with path: /overseer_elect/election/96567387194589190-127.0.0.1:40366_solr-n_0000000000
   [junit4]   2> 7953 INFO  (jetty-launcher-5-thread-1) [n:127.0.0.1:38822_solr    ] o.a.s.c.LeaderElector Joined leadership election with path: /overseer_elect/election/96567387194589189-127.0.0.1:38822_solr-n_0000000001
   [junit4]   2> 7954 INFO  (jetty-launcher-5-thread-2) [n:127.0.0.1:40366_solr    ] o.a.s.c.OverseerElectionContext I am going to be the leader 127.0.0.1:40366_solr
   [junit4]   2> 7955 INFO  (jetty-launcher-5-thread-1) [n:127.0.0.1:38822_solr    ] o.a.s.c.LeaderElector Watching path /overseer_elect/election/96567387194589190-127.0.0.1:40366_solr-n_0000000000 to know if I could be the leader
   [junit4]   2> 7956 INFO  (jetty-launcher-5-thread-1) [n:127.0.0.1:38822_solr    ] o.a.s.c.ZkController Register node as live in ZooKeeper:/live_nodes/127.0.0.1:38822_solr
   [junit4]   2> 7956 INFO  (jetty-launcher-5-thread-2) [n:127.0.0.1:40366_solr    ] o.a.s.c.c.SolrZkClient makePath: /overseer_elect/leader
   [junit4]   2> 7956 INFO  (jetty-launcher-5-thread-1) [n:127.0.0.1:38822_solr    ] o.a.s.c.c.SolrZkClient makePath: /live_nodes/127.0.0.1:38822_solr
   [junit4]   2> 7959 INFO  (jetty-launcher-5-thread-2) [n:127.0.0.1:40366_solr    ] o.a.s.c.Overseer Overseer (id=96567387194589190-127.0.0.1:40366_solr-n_0000000000) starting
   [junit4]   2> 7959 INFO  (zkCallback-15-thread-1-processing-n:127.0.0.1:40366_solr) [n:127.0.0.1:40366_solr    ] o.a.s.c.c.ZkStateReader A live node change: [WatchedEvent state:SyncConnected type:NodeChildrenChanged path:/live_nodes], has occurred - updating... (live nodes size: [0])
   [junit4]   2> 7959 INFO  (zkCallback-16-thread-1-processing-n:127.0.0.1:38822_solr) [n:127.0.0.1:38822_solr    ] o.a.s.c.c.ZkStateReader A live node change: [WatchedEvent state:SyncConnected type:NodeChildrenChanged path:/live_nodes], has occurred - updating... (live nodes size: [0])
   [junit4]   2> 7960 INFO  (zkCallback-15-thread-1-processing-n:127.0.0.1:40366_solr) [n:127.0.0.1:40366_solr    ] o.a.s.c.c.ZkStateReader Updated live nodes from ZooKeeper... (0) -> (1)
   [junit4]   2> 7960 INFO  (zkCallback-16-thread-1-processing-n:127.0.0.1:38822_solr) [n:127.0.0.1:38822_solr    ] o.a.s.c.c.ZkStateReader Updated live nodes from ZooKeeper... (0) -> (1)
   [junit4]   2> 7965 INFO  (jetty-launcher-5-thread-2) [n:127.0.0.1:40366_solr    ] o.a.s.c.c.SolrZkClient makePath: /overseer/queue-work
   [junit4]   2> 8011 INFO  (jetty-launcher-5-thread-2) [n:127.0.0.1:40366_solr    ] o.a.s.c.OverseerAutoReplicaFailoverThread Starting OverseerAutoReplicaFailoverThread autoReplicaFailoverWorkLoopDelay=10000 autoReplicaFailoverWaitAfterExpiration=30000 autoReplicaFailoverBadNodeExpiration=60000
   [junit4]   2> 8057 INFO  (jetty-launcher-5-thread-1) [n:127.0.0.1:38822_solr    ] o.a.s.c.CoreContainer Security conf doesn't exist. Skipping setup for authorization module.
   [junit4]   2> 8057 INFO  (jetty-launcher-5-thread-1) [n:127.0.0.1:38822_solr    ] o.a.s.c.CoreContainer No authentication plugin used.
   [junit4]   2> 8058 INFO  (jetty-launcher-5-thread-1) [n:127.0.0.1:38822_solr    ] o.a.s.c.CorePropertiesLocator Looking for core definitions underneath /home/jenkins/workspace/Lucene-Solr-master-Linux/solr/build/solr-core/test/J1/temp/solr.schema.TestManagedSchemaAPI_2C69E749B828036B-001/tempDir-001/node1/.
   [junit4]   2> 8058 INFO  (jetty-launcher-5-thread-1) [n:127.0.0.1:38822_solr    ] o.a.s.c.CorePropertiesLocator Found 0 core definitions
   [junit4]   2> 8061 INFO  (OverseerCollectionConfigSetProcessor-96567387194589190-127.0.0.1:40366_solr-n_0000000000) [n:127.0.0.1:40366_solr    ] o.a.s.c.OverseerTaskProcessor Process current queue of overseer operations
   [junit4]   2> 8062 INFO  (jetty-launcher-5-thread-2) [n:127.0.0.1:40366_solr    ] o.a.s.c.ZkController Publish node=127.0.0.1:40366_solr as DOWN
   [junit4]   2> 8063 INFO  (OverseerStateUpdate-96567387194589190-127.0.0.1:40366_solr-n_0000000000) [n:127.0.0.1:40366_solr    ] o.a.s.c.Overseer Starting to work on the main queue
   [junit4]   2> 8064 INFO  (jetty-launcher-5-thread-1) [n:127.0.0.1:38822_solr    ] o.a.s.s.SolrDispatchFilter user.dir=/home/jenkins/workspace/Lucene-Solr-master-Linux/solr/build/solr-core/test/J1
   [junit4]   2> 8064 INFO  (jetty-launcher-5-thread-1) [n:127.0.0.1:38822_solr    ] o.a.s.s.SolrDispatchFilter SolrDispatchFilter.init() done
   [junit4]   2> 8065 INFO  (jetty-launcher-5-thread-2) [n:127.0.0.1:40366_solr    ] o.a.s.c.ZkController Register node as live in ZooKeeper:/live_nodes/127.0.0.1:40366_solr
   [junit4]   2> 8065 INFO  (jetty-launcher-5-thread-2) [n:127.0.0.1:40366_solr    ] o.a.s.c.c.SolrZkClient makePath: /live_nodes/127.0.0.1:40366_solr
   [junit4]   2> 8065 INFO  (OverseerStateUpdate-96567387194589190-127.0.0.1:40366_solr-n_0000000000) [n:127.0.0.1:40366_solr    ] o.a.s.c.c.ZkStateReader Updated live nodes from ZooKeeper... (1) -> (1)
   [junit4]   2> 8067 INFO  (zkCallback-15-thread-1-processing-n:127.0.0.1:40366_solr) [n:127.0.0.1:40366_solr    ] o.a.s.c.c.ZkStateReader A live node change: [WatchedEvent state:SyncConnected type:NodeChildrenChanged path:/live_nodes], has occurred - updating... (live nodes size: [1])
   [junit4]   2> 8067 INFO  (zkCallback-16-thread-1-processing-n:127.0.0.1:38822_solr) [n:127.0.0.1:38822_solr    ] o.a.s.c.c.ZkStateReader A live node change: [WatchedEvent state:SyncConnected type:NodeChildrenChanged path:/live_nodes], has occurred - updating... (live nodes size: [1])
   [junit4]   2> 8068 INFO  (zkCallback-15-thread-1-processing-n:127.0.0.1:40366_solr) [n:127.0.0.1:40366_solr    ] o.a.s.c.c.ZkStateReader Updated live nodes from ZooKeeper... (1) -> (2)
   [junit4]   2> 8068 INFO  (zkCallback-16-thread-1-processing-n:127.0.0.1:38822_solr) [n:127.0.0.1:38822_solr    ] o.a.s.c.c.ZkStateReader Updated live nodes from ZooKeeper... (1) -> (2)
   [junit4]   2> 8071 INFO  (OverseerStateUpdate-96567387194589190-127.0.0.1:40366_solr-n_0000000000) [n:127.0.0.1:40366_solr    ] o.a.s.c.Overseer processMessage: queueSize: 1, message = {
   [junit4]   2>   "operation":"downnode",
   [junit4]   2>   "node_name":"127.0.0.1:40366_solr"} current state version: 0
   [junit4]   2> 8076 INFO  (OverseerStateUpdate-96567387194589190-127.0.0.1:40366_solr-n_0000000000) [n:127.0.0.1:40366_solr    ] o.a.s.c.o.NodeMutator DownNode state invoked for node: 127.0.0.1:40366_solr
   [junit4]   2> 8107 INFO  (jetty-launcher-5-thread-2) [n:127.0.0.1:40366_solr    ] o.a.s.c.CoreContainer Security conf doesn't exist. Skipping setup for authorization module.
   [junit4]   2> 8107 INFO  (jetty-launcher-5-thread-2) [n:127.0.0.1:40366_solr    ] o.a.s.c.CoreContainer No authentication plugin used.
   [junit4]   2> 8107 INFO  (jetty-launcher-5-thread-2) [n:127.0.0.1:40366_solr    ] o.a.s.c.CorePropertiesLocator Looking for core definitions underneath /home/jenkins/workspace/Lucene-Solr-master-Linux/solr/build/solr-core/test/J1/temp/solr.schema.TestManagedSchemaAPI_2C69E749B828036B-001/tempDir-001/node2/.
   [junit4]   2> 8107 INFO  (jetty-launcher-5-thread-2) [n:127.0.0.1:40366_solr    ] o.a.s.c.CorePropertiesLocator Found 0 core definitions
   [junit4]   2> 8109 INFO  (jetty-launcher-5-thread-2) [n:127.0.0.1:40366_solr    ] o.a.s.s.SolrDispatchFilter user.dir=/home/jenkins/workspace/Lucene-Solr-master-Linux/solr/build/solr-core/test/J1
   [junit4]   2> 8109 INFO  (jetty-launcher-5-thread-2) [n:127.0.0.1:40366_solr    ] o.a.s.s.SolrDispatchFilter SolrDispatchFilter.init() done
   [junit4]   2> 8109 INFO  (SUITE-TestManagedSchemaAPI-seed#[2C69E749B828036B]-worker) [    ] o.a.s.c.c.SolrZkClient Using default ZkCredentialsProvider
   [junit4]   2> 8109 INFO  (SUITE-TestManagedSchemaAPI-seed#[2C69E749B828036B]-worker) [    ] o.a.s.c.c.ConnectionManager Waiting for client to connect to ZooKeeper
   [junit4]   2> 8111 INFO  (zkCallback-19-thread-1) [    ] o.a.s.c.c.ConnectionManager Watcher org.apache.solr.common.cloud.ConnectionManager@1c036ba name:ZooKeeperConnection Watcher:127.0.0.1:44469 got event WatchedEvent state:SyncConnected type:None path:null path:null type:None
   [junit4]   2> 8111 INFO  (SUITE-TestManagedSchemaAPI-seed#[2C69E749B828036B]-worker) [    ] o.a.s.c.c.ConnectionManager Client is connected to ZooKeeper
   [junit4]   2> 8111 INFO  (SUITE-TestManagedSchemaAPI-seed#[2C69E749B828036B]-worker) [    ] o.a.s.c.c.SolrZkClient Using default ZkACLProvider
   [junit4]   2> 8121 INFO  (SUITE-TestManagedSchemaAPI-seed#[2C69E749B828036B]-worker) [    ] o.a.s.c.c.SolrZkClient Using default ZkCredentialsProvider
   [junit4]   2> 8121 INFO  (SUITE-TestManagedSchemaAPI-seed#[2C69E749B828036B]-worker) [    ] o.a.s.c.c.ConnectionManager Waiting for client to connect to ZooKeeper
   [junit4]   2> 8123 INFO  (zkCallback-22-thread-1) [    ] o.a.s.c.c.ConnectionManager Watcher org.apache.solr.common.cloud.ConnectionManager@165bca6 name:ZooKeeperConnection Watcher:127.0.0.1:44469/solr got event WatchedEvent state:SyncConnected type:None path:null path:null type:None
   [junit4]   2> 8123 INFO  (SUITE-TestManagedSchemaAPI-seed#[2C69E749B828036B]-worker) [    ] o.a.s.c.c.ConnectionManager Client is connected to ZooKeeper
   [junit4]   2> 8123 INFO  (SUITE-TestManagedSchemaAPI-seed#[2C69E749B828036B]-worker) [    ] o.a.s.c.c.SolrZkClient Using default ZkACLProvider
   [junit4]   2> 8123 INFO  (SUITE-TestManagedSchemaAPI-seed#[2C69E749B828036B]-worker) [    ] o.a.s.c.c.ZkStateReader Updating cluster state from ZooKeeper... 
   [junit4]   2> 8124 INFO  (SUITE-TestManagedSchemaAPI-seed#[2C69E749B828036B]-worker) [    ] o.a.s.c.c.ZkStateReader Loaded cluster properties: {urlScheme=https}
   [junit4]   2> 8124 INFO  (SUITE-TestManagedSchemaAPI-seed#[2C69E749B828036B]-worker) [    ] o.a.s.c.c.ZkStateReader Updated live nodes from ZooKeeper... (0) -> (2)
   [junit4]   2> 8136 INFO  (SUITE-TestManagedSchemaAPI-seed#[2C69E749B828036B]-worker) [    ] o.a.s.c.c.SolrZkClient makePath: /configs/conf1/solrconfig.xml
   [junit4]   2> 8139 INFO  (SUITE-TestManagedSchemaAPI-seed#[2C69E749B828036B]-worker) [    ] o.a.s.c.c.SolrZkClient makePath: /configs/conf1/managed-schema
   [junit4]   2> 8148 INFO  (TEST-TestManagedSchemaAPI.test-seed#[2C69E749B828036B]) [    ] o.a.s.SolrTestCaseJ4 ###Starting test
   [junit4]   2> 8311 INFO  (qtp5342393-67) [n:127.0.0.1:40366_solr    ] o.a.s.h.a.CollectionsHandler Invoked Collection Action :create with params replicationFactor=2&collection.configName=conf1&name=testschemaapi&action=CREATE&numShards=1&wt=javabin&version=2 and sendToOCPQueue=true
   [junit4]   2> 8322 INFO  (OverseerCollectionConfigSetProcessor-96567387194589190-127.0.0.1:40366_solr-n_0000000000) [n:127.0.0.1:40366_solr    ] o.a.s.c.OverseerTaskProcessor Overseer Collection Message Handler: Get the message id:/overseer/collection-queue-work/qn-0000000000 message:{
   [junit4]   2>   "name":"testschemaapi",
   [junit4]   2>   "fromApi":"true",
   [junit4]   2>   "replicationFactor":"2",
   [junit4]   2>   "collection.configName":"conf1",
   [junit4]   2>   "numShards":"1",
   [junit4]   2>   "stateFormat":"2",
   [junit4]   2>   "operation":"create"}
   [junit4]   2> 8323 INFO  (OverseerThreadFactory-36-thread-1-processing-n:127.0.0.1:40366_solr) [n:127.0.0.1:40366_solr    ] o.a.s.c.OverseerCollectionMessageHandler OverseerCollectionMessageHandler.processMessage : create , {
   [junit4]   2>   "name":"testschemaapi",
   [junit4]   2>   "fromApi":"true",
   [junit4]   2>   "replicationFactor":"2",
   [junit4]   2>   "collection.configName":"conf1",
   [junit4]   2>   "numShards":"1",
   [junit4]   2>   "stateFormat":"2",
   [junit4]   2>   "operation":"create"}
   [junit4]   2> 8324 INFO  (OverseerThreadFactory-36-thread-1-processing-n:127.0.0.1:40366_solr) [n:127.0.0.1:40366_solr    ] o.a.s.c.CreateCollectionCmd Create collection testschemaapi
   [junit4]   2> 8327 INFO  (OverseerThreadFactory-36-thread-1-processing-n:127.0.0.1:40366_solr) [n:127.0.0.1:40366_solr    ] o.a.s.c.OverseerCollectionMessageHandler creating collections conf node /collections/testschemaapi 
   [junit4]   2> 8327 INFO  (OverseerThreadFactory-36-thread-1-processing-n:127.0.0.1:40366_solr) [n:127.0.0.1:40366_solr    ] o.a.s.c.c.SolrZkClient makePath: /collections/testschemaapi
   [junit4]   2> 8329 INFO  (zkCallback-15-thread-1-processing-n:127.0.0.1:40366_solr) [n:127.0.0.1:40366_solr    ] o.a.s.c.c.ZkStateReader A collections change: [WatchedEvent state:SyncConnected type:NodeChildrenChanged path:/collections], has occurred - updating...
   [junit4]   2> 8329 INFO  (zkCallback-16-thread-1-processing-n:127.0.0.1:38822_solr) [n:127.0.0.1:38822_solr    ] o.a.s.c.c.ZkStateReader A collections change: [WatchedEvent state:SyncConnected type:NodeChildrenChanged path:/collections], has occurred - updating...
   [junit4]   2> 8329 INFO  (zkCallback-22-thread-1) [    ] o.a.s.c.c.ZkStateReader A collections change: [WatchedEvent state:SyncConnected type:NodeChildrenChanged path:/collections], has occurred - updating...
   [junit4]   2> 8332 INFO  (OverseerStateUpdate-96567387194589190-127.0.0.1:40366_solr-n_0000000000) [n:127.0.0.1:40366_solr    ] o.a.s.c.Overseer processMessage: queueSize: 1, message = {
   [junit4]   2>   "name":"testschemaapi",
   [junit4]   2>   "fromApi":"true",
   [junit4]   2>   "replicationFactor":"2",
   [junit4]   2>   "collection.configName":"conf1",
   [junit4]   2>   "numShards":"1",
   [junit4]   2>   "stateFormat":"2",
   [junit4]   2>   "operation":"create"} current state version: 0
   [junit4]   2> 8332 INFO  (OverseerStateUpdate-96567387194589190-127.0.0.1:40366_solr-n_0000000000) [n:127.0.0.1:40366_solr    ] o.a.s.c.o.ClusterStateMutator building a new cName: testschemaapi
   [junit4]   2> 8349 INFO  (OverseerStateUpdate-96567387194589190-127.0.0.1:40366_solr-n_0000000000) [n:127.0.0.1:40366_solr    ] o.a.s.c.o.ZkStateWriter going to create_collection /collections/testschemaapi/state.json
   [junit4]   2> 8434 INFO  (OverseerThreadFactory-36-thread-1-processing-n:127.0.0.1:40366_solr) [n:127.0.0.1:40366_solr    ] o.a.s.c.CreateCollectionCmd Creating SolrCores for new collection testschemaapi, shardNames [shard1] , replicationFactor : 2
   [junit4]   2> 8434 INFO  (OverseerThreadFactory-36-thread-1-processing-n:127.0.0.1:40366_solr) [n:127.0.0.1:40366_solr    ] o.a.s.c.CreateCollectionCmd Creating core testschemaapi_shard1_replica2 as part of shard shard1 of collection testschemaapi on 127.0.0.1:38822_solr
   [junit4]   2> 8437 INFO  (OverseerThreadFactory-36-thread-1-processing-n:127.0.0.1:40366_solr) [n:127.0.0.1:40366_solr    ] o.a.s.c.CreateCollectionCmd Creating core testschemaapi_shard1_replica1 as part of shard shard1 of collection testschemaapi on 127.0.0.1:40366_solr
   [junit4]   2> 8451 INFO  (qtp5342393-78) [n:127.0.0.1:40366_solr    ] o.a.s.h.a.CoreAdminOperation core create command qt=/admin/cores&collection.configName=conf1&name=testschemaapi_shard1_replica1&action=CREATE&numShards=1&collection=testschemaapi&shard=shard1&wt=javabin&version=2
   [junit4]   2> 8453 INFO  (qtp5342393-78) [n:127.0.0.1:40366_solr    ] o.a.s.c.CoreDescriptor Created CoreDescriptor: {name=testschemaapi_shard1_replica1, collection.configName=conf1, config=solrconfig.xml, transient=false, schema=schema.xml, loadOnStartup=true, configSetProperties=configsetprops.json, collection=testschemaapi, numShards=1, dataDir=data/, shard=shard1}
   [junit4]   2> 8454 INFO  (qtp5342393-78) [n:127.0.0.1:40366_solr c:testschemaapi s:shard1  x:testschemaapi_shard1_replica1] o.a.s.c.ZkController publishing state=down
   [junit4]   2> 8455 INFO  (qtp5342393-78) [n:127.0.0.1:40366_solr c:testschemaapi s:shard1  x:testschemaapi_shard1_replica1] o.a.s.c.ZkController Registering watch for collection testschemaapi
   [junit4]   2> 8456 INFO  (OverseerStateUpdate-96567387194589190-127.0.0.1:40366_solr-n_0000000000) [n:127.0.0.1:40366_solr    ] o.a.s.c.Overseer processMessage: queueSize: 1, message = {
   [junit4]   2>   "core":"testschemaapi_shard1_replica1",
   [junit4]   2>   "roles":null,
   [junit4]   2>   "base_url":"https://127.0.0.1:40366/solr",
   [junit4]   2>   "node_name":"127.0.0.1:40366_solr",
   [junit4]   2>   "numShards":"1",
   [junit4]   2>   "state":"down",
   [junit4]   2>   "shard":"shard1",
   [junit4]   2>   "collection":"testschemaapi",
   [junit4]   2>   "operation":"state"} current state version: 0
   [junit4]   2> 8459 INFO  (qtp5342393-78) [n:127.0.0.1:40366_solr c:testschemaapi s:shard1  x:testschemaapi_shard1_replica1] o.a.s.c.c.ZkStateReader Add data for [testschemaapi] ver [0]
   [junit4]   2> 8459 INFO  (OverseerStateUpdate-96567387194589190-127.0.0.1:40366_solr-n_0000000000) [n:127.0.0.1:40366_solr    ] o.a.s.c.o.ReplicaMutator Update state numShards=1 message={
   [junit4]   2>   "core":"testschemaapi_shard1_replica1",
   [junit4]   2>   "roles":null,
   [junit4]   2>   "base_url":"https://127.0.0.1:40366/solr",
   [junit4]   2>   "node_name":"127.0.0.1:40366_solr",
   [junit4]   2>   "numShards":"1",
   [junit4]   2>   "state":"down",
   [junit4]   2>   "shard":"shard1",
   [junit4]   2>   "collection":"testschemaapi",
   [junit4]   2>   "operation":"state"}
   [junit4]   2> 8460 INFO  (qtp5342393-78) [n:127.0.0.1:40366_solr c:testschemaapi s:shard1  x:testschemaapi_shard1_replica1] o.a.s.c.ZkController look for our core node name
   [junit4]   2> 8548 INFO  (qtp19951933-71) [n:127.0.0.1:38822_solr    ] o.a.s.h.a.CoreAdminOperation core create command qt=/admin/cores&collection.configName=conf1&name=testschemaapi_shard1_replica2&action=CREATE&numShards=1&collection=testschemaapi&shard=shard1&wt=javabin&version=2
   [junit4]   2> 8549 INFO  (qtp19951933-71) [n:127.0.0.1:38822_solr    ] o.a.s.c.CoreDescriptor Created CoreDescriptor: {name=testschemaapi_shard1_replica2, collection.configName=conf1, config=solrconfig.xml, transient=false, schema=schema.xml, loadOnStartup=true, configSetProperties=configsetprops.json, collection=testschemaapi, numShards=1, dataDir=data/, shard=shard1}
   [junit4]   2> 8549 INFO  (qtp19951933-71) [n:127.0.0.1:38822_solr c:testschemaapi s:shard1  x:testschemaapi_shard1_replica2] o.a.s.c.ZkController publishing state=down
   [junit4]   2> 8551 INFO  (qtp19951933-71) [n:127.0.0.1:38822_solr c:testschemaapi s:shard1  x:testschemaapi_shard1_replica2] o.a.s.c.ZkController Registering watch for collection testschemaapi
   [junit4]   2> 8551 INFO  (OverseerStateUpdate-96567387194589190-127.0.0.1:40366_solr-n_0000000000) [n:127.0.0.1:40366_solr    ] o.a.s.c.Overseer processMessage: queueSize: 1, message = {
   [junit4]   2>   "core":"testschemaapi_shard1_replica2",
   [junit4]   2>   "roles":null,
   [junit4]   2>   "base_url":"https://127.0.0.1:38822/solr",
   [junit4]   2>   "node_name":"127.0.0.1:38822_solr",
   [junit4]   2>   "numShards":"1",
   [junit4]   2>   "state":"down",
   [junit4]   2>   "shard":"shard1",
   [junit4]   2>   "collection":"testschemaapi",
   [junit4]   2>   "operation":"state"} current state version: 0
   [junit4]   2> 8551 INFO  (qtp19951933-71) [n:127.0.0.1:38822_solr c:testschemaapi s:shard1  x:testschemaapi_shard1_replica2] o.a.s.c.c.ZkStateReader Add data for [testschemaapi] ver [0]
   [junit4]   2> 8551 INFO  (OverseerStateUpdate-96567387194589190-127.0.0.1:40366_solr-n_0000000000) [n:127.0.0.1:40366_solr    ] o.a.s.c.o.ReplicaMutator Update state numShards=1 message={
   [junit4]   2>   "core":"testschemaapi_shard1_replica2",
   [junit4]   2>   "roles":null,
   [junit4]   2>   "base_url":"https://127.0.0.1:38822/solr",
   [junit4]   2>   "node_name":"127.0.0.1:38822_solr",
   [junit4]   2>   "numShards":"1",
   [junit4]   2>   "state":"down",
   [junit4]   2>   "shard":"shard1",
   [junit4]   2>   "collection":"testschemaapi",
   [junit4]   2>   "operation":"state"}
   [junit4]   2> 8551 INFO  (qtp19951933-71) [n:127.0.0.1:38822_solr c:testschemaapi s:shard1  x:testschemaapi_shard1_replica2] o.a.s.c.ZkController look for our core node name
   [junit4]   2> 8654 INFO  (OverseerStateUpdate-96567387194589190-127.0.0.1:40366_solr-n_0000000000) [n:127.0.0.1:40366_solr    ] o.a.s.c.o.ZkStateWriter going to update_collection /collections/testschemaapi/state.json version: 0
   [junit4]   2> 8658 INFO  (zkCallback-16-thread-1-processing-n:127.0.0.1:38822_solr) [n:127.0.0.1:38822_solr    ] o.a.s.c.c.ZkStateReader A cluster state change: [WatchedEvent state:SyncConnected type:NodeDataChanged path:/collections/testschemaapi/state.json] for collection [testschemaapi] has occurred - updating... (live nodes size: [2])
   [junit4]   2> 8658 INFO  (zkCallback-15-thread-1-processing-n:127.0.0.1:40366_solr) [n:127.0.0.1:40366_solr    ] o.a.s.c.c.ZkStateReader A cluster state change: [WatchedEvent state:SyncConnected type:NodeDataChanged path:/collections/testschemaapi/state.json] for collection [testschemaapi] has occurred - updating... (live nodes size: [2])
   [junit4]   2> 8659 INFO  (zkCallback-16-thread-1-processing-n:127.0.0.1:38822_solr) [n:127.0.0.1:38822_solr    ] o.a.s.c.c.ZkStateReader Updating data for [testschemaapi] from [0] to [1]
   [junit4]   2> 8659 INFO  (zkCallback-15-thread-1-processing-n:127.0.0.1:40366_solr) [n:127.0.0.1:40366_solr    ] o.a.s.c.c.ZkStateReader Updating data for [testschemaapi] from [0] to [1]
   [junit4]   2> 9461 INFO  (qtp5342393-78) [n:127.0.0.1:40366_solr c:testschemaapi s:shard1  x:testschemaapi_shard1_replica1] o.a.s.c.ZkController waiting to find shard id in clusterstate for testschemaapi_shard1_replica1
   [junit4]   2> 9461 INFO  (qtp5342393-78) [n:127.0.0.1:40366_solr c:testschemaapi s:shard1  x:testschemaapi_shard1_replica1] o.a.s.c.ZkController Check for collection zkNode:testschemaapi
   [junit4]   2> 9461 INFO  (qtp5342393-78) [n:127.0.0.1:40366_solr c:testschemaapi s:shard1  x:testschemaapi_shard1_replica1] o.a.s.c.ZkController Collection zkNode exists
   [junit4]   2> 9461 INFO  (qtp5342393-78) [n:127.0.0.1:40366_solr c:testschemaapi s:shard1  x:testschemaapi_shard1_replica1] o.a.s.c.c.ZkStateReader Load collection config from: [/collections/testschemaapi]
   [junit4]   2> 9462 INFO  (qtp5342393-78) [n:127.0.0.1:40366_solr c:testschemaapi s:shard1  x:testschemaapi_shard1_replica1] o.a.s.c.c.ZkStateReader path=[/collections/testschemaapi] [configName]=[conf1] specified config exists in ZooKeeper
   [junit4]   2> 9463 INFO  (qtp5342393-78) [n:127.0.0.1:40366_solr c:testschemaapi s:shard1  x:testschemaapi_shard1_replica1] o.a.s.c.SolrResourceLoader new SolrResourceLoader for directory: '/home/jenkins/workspace/Lucene-Solr-master-Linux/solr/build/solr-core/test/J1/temp/solr.schema.TestManagedSchemaAPI_2C69E749B828036B-001/tempDir-001/node2/testschemaapi_shard1_replica1'
   [junit4]   2> 9463 INFO  (qtp5342393-78) [n:127.0.0.1:40366_solr c:testschemaapi s:shard1  x:testschemaapi_shard1_replica1] o.a.s.c.SolrResourceLoader JNDI not configured for solr (NoInitialContextEx)
   [junit4]   2> 9463 INFO  (qtp5342393-78) [n:127.0.0.1:40366_solr c:testschemaapi s:shard1  x:testschemaapi_shard1_replica1] o.a.s.c.SolrResourceLoader solr home defaulted to 'solr/' (could not find system property or JNDI)
   [junit4]   2> 9465 INFO  (qtp5342393-78) [n:127.0.0.1:40366_solr c:testschemaapi s:shard1  x:testschemaapi_shard1_replica1] o.a.s.c.Config loaded config solrconfig.xml with version 0 
   [junit4]   2> 9471 INFO  (qtp5342393-78) [n:127.0.0.1:40366_solr c:testschemaapi s:shard1  x:testschemaapi_shard1_replica1] o.a.s.c.SolrConfig current version of requestparams : -1
   [junit4]   2> 9482 INFO  (qtp5342393-78) [n:127.0.0.1:40366_solr c:testschemaapi s:shard1  x:testschemaapi_shard1_replica1] o.a.s.c.SolrConfig Using Lucene MatchVersion: 7.0.0
   [junit4]   2> 9500 INFO  (qtp5342393-78) [n:127.0.0.1:40366_solr c:testschemaapi s:shard1  x:testschemaapi_shard1_replica1] o.a.s.c.SolrConfig Loaded SolrConfig: solrconfig.xml
   [junit4]   2> 9515 INFO  (qtp5342393-78) [n:127.0.0.1:40366_solr c:testschemaapi s:shard1  x:testschemaapi_shard1_replica1] o.a.s.s.IndexSchema [testschemaapi_shard1_replica1] Schema name=minimal
   [junit4]   2> 9527 INFO  (qtp5342393-78) [n:127.0.0.1:40366_solr c:testschemaapi s:shard1  x:testschemaapi_shard1_replica1] o.a.s.s.IndexSchema unique key field: id
   [junit4]   2> 9528 INFO  (qtp5342393-78) [n:127.0.0.1:40366_solr c:testschemaapi s:shard1  x:testschemaapi_shard1_replica1] o.a.s.c.ConfigSetProperties Did not find ConfigSet properties, assuming default properties: Can't find resource 'configsetprops.json' in classpath or '/configs/conf1', cwd=/home/jenkins/workspace/Lucene-Solr-master-Linux/solr/build/solr-core/test/J1
   [junit4]   2> 9529 INFO  (qtp5342393-78) [n:127.0.0.1:40366_solr c:testschemaapi s:shard1  x:testschemaapi_shard1_replica1] o.a.s.c.CoreContainer Creating SolrCore 'testschemaapi_shard1_replica1' using configuration from collection testschemaapi
   [junit4]   2> 9529 INFO  (qtp5342393-78) [n:127.0.0.1:40366_solr c:testschemaapi s:shard1 r:core_node1 x:testschemaapi_shard1_replica1] o.a.s.c.SolrCore org.apache.solr.core.MockDirectoryFactory
   [junit4]   2> 9529 INFO  (qtp5342393-78) [n:127.0.0.1:40366_solr c:testschemaapi s:shard1 r:core_node1 x:testschemaapi_shard1_replica1] o.a.s.c.SolrCore [[testschemaapi_shard1_replica1] ] Opening new SolrCore at [/home/jenkins/workspace/Lucene-Solr-master-Linux/solr/build/solr-core/test/J1/temp/solr.schema.TestManagedSchemaAPI_2C69E749B828036B-001/tempDir-001/node2/testschemaapi_shard1_replica1], dataDir=[/home/jenkins/workspace/Lucene-Solr-master-Linux/solr/build/solr-core/test/J1/temp/solr.schema.TestManagedSchemaAPI_2C69E749B828036B-001/tempDir-001/node2/./testschemaapi_shard1_replica1/data/]
   [junit4]   2> 9531 INFO  (qtp5342393-78) [n:127.0.0.1:40366_solr c:testschemaapi s:shard1 r:core_node1 x:testschemaapi_shard1_replica1] o.a.s.c.SolrCore JMX monitoring not detected for core: testschemaapi_shard1_replica1
   [junit4]   2> 9531 INFO  (qtp5342393-78) [n:127.0.0.1:40366_solr c:testschemaapi s:shard1 r:core_node1 x:testschemaapi_shard1_replica1] o.a.s.c.CachingDirectoryFactory return new directory for /home/jenkins/workspace/Lucene-Solr-master-Linux/solr/build/solr-core/test/J1/temp/solr.schema.TestManagedSchemaAPI_2C69E749B828036B-001/tempDir-001/node2/./testschemaapi_shard1_replica1/data/snapshot_metadata
   [junit4]   2> 9531 INFO  (qtp5342393-78) [n:127.0.0.1:40366_solr c:testschemaapi s:shard1 r:core_node1 x:testschemaapi_shard1_replica1] o.a.s.c.s.SolrSnapshotMetaDataManager Loading from snapshot metadata file...
   [junit4]   2> 9532 INFO  (qtp5342393-78) [n:127.0.0.1:40366_solr c:testschemaapi s:shard1 r:core_node1 x:testschemaapi_shard1_replica1] o.a.s.c.CachingDirectoryFactory return new directory for /home/jenkins/workspace/Lucene-Solr-master-Linux/solr/build/solr-core/test/J1/temp/solr.schema.TestManagedSchemaAPI_2C69E749B828036B-001/tempDir-001/node2/./testschemaapi_shard1_replica1/data
   [junit4]   2> 9532 INFO  (qtp5342393-78) [n:127.0.0.1:40366_solr c:testschemaapi s:shard1 r:core_node1 x:testschemaapi_shard1_replica1] o.a.s.c.SolrCore New index directory detected: old=null new=/home/jenkins/workspace/Lucene-Solr-master-Linux/solr/build/solr-core/test/J1/temp/solr.schema.TestManagedSchemaAPI_2C69E749B828036B-001/tempDir-001/node2/./testschemaapi_shard1_replica1/data/index/
   [junit4]   2> 9532 WARN  (qtp5342393-78) [n:127.0.0.1:40366_solr c:testschemaapi s:shard1 r:core_node1 x:testschemaapi_shard1_replica1] o.a.s.c.SolrCore [testschemaapi_shard1_replica1] Solr index directory '/home/jenkins/workspace/Lucene-Solr-master-Linux/solr/build/solr-core/test/J1/temp/solr.schema.TestManagedSchemaAPI_2C69E749B828036B-001/tempDir-001/node2/./testschemaapi_shard1_replica1/data/index' doesn't exist. Creating new index...
   [junit4]   2> 9532 INFO  (qtp5342393-78) [n:127.0.0.1:40366_solr c:testschemaapi s:shard1 r:core_node1 x:testschemaapi_shard1_replica1] o.a.s.c.CachingDirectoryFactory return new directory for /home/jenkins/workspace/Lucene-Solr-master-Linux/solr/build/solr-core/test/J1/temp/solr.schema.TestManagedSchemaAPI_2C69E749B828036B-001/tempDir-001/node2/./testschemaapi_shard1_replica1/data/index
   [junit4]   2> 9533 INFO  (qtp5342393-78) [n:127.0.0.1:40366_solr c:testschemaapi s:shard1 r:core_node1 x:testschemaapi_shard1_replica1] o.a.s.c.SolrDeletionPolicy SolrDeletionPolicy.onCommit: commits: num=1
   [junit4]   2> 	commit{dir=MockDirectoryWrapper(RAMDirectory@1ca7452 lockFactory=org.apache.lucene.store.SingleInstanceLockFactory@1bcfadc),segFN=segments_1,generation=1}
   [junit4]   2> 9533 INFO  (qtp5342393-78) [n:127.0.0.1:40366_solr c:testschemaapi s:shard1 r:core_node1 x:testschemaapi_shard1_replica1] o.a.s.c.SolrDeletionPolicy newest commit generation = 1
   [junit4]   2> 9534 INFO  (OldIndexDirectoryCleanupThreadForCore-testschemaapi_shard1_replica1) [n:127.0.0.1:40366_solr c:testschemaapi s:shard1 r:core_node1 x:testschemaapi_shard1_replica1] o.a.s.c.SolrCore Looking for old index directories to cleanup for core testschemaapi_shard1_replica1 in /home/jenkins/workspace/Lucene-Solr-master-Linux/solr/build/solr-core/test/J1/temp/solr.schema.TestManagedSchemaAPI_2C69E749B828036B-001/tempDir-001/node2/./testschemaapi_shard1_replica1/data/
   [junit4]   2> 9534 WARN  (OldIndexDirectoryCleanupThreadForCore-testschemaapi_shard1_replica1) [n:127.0.0.1:40366_solr c:testschemaapi s:shard1 r:core_node1 x:testschemaapi_shard1_replica1] o.a.s.c.DirectoryFactory /home/jenkins/workspace/Lucene-Solr-master-Linux/solr/build/solr-core/test/J1/temp/solr.schema.TestManagedSchemaAPI_2C69E749B828036B-001/tempDir-001/node2/./testschemaapi_shard1_replica1/data/ does not point to a valid data directory; skipping clean-up of old index directories.
   [junit4]   2> 9537 INFO  (qtp5342393-78) [n:127.0.0.1:40366_solr c:testschemaapi s:shard1 r:core_node1 x:testschemaapi_shard1_replica1] o.a.s.c.SolrCore no updateRequestProcessorChain defined as default, creating implicit default
   [junit4]   2> 9539 INFO  (qtp5342393-78) [n:127.0.0.1:40366_solr c:testschemaapi s:shard1 r:core_node1 x:testschemaapi_shard1_replica1] o.a.s.h.l.XMLLoader xsltCacheLifetimeSeconds=60
   [junit4]   2> 9540 INFO  (qtp5342393-78) [n:127.0.0.1:40366_solr c:testschemaapi s:shard1 r:core_node1 x:testschemaapi_shard1_replica1] o.a.s.h.l.XMLLoader xsltCacheLifetimeSeconds=60
   [junit4]   2> 9541 INFO  (qtp5342393-78) [n:127.0.0.1:40366_solr c:testschemaapi s:shard1 r:core_node1 x:testschemaapi_shard1_replica1] o.a.s.h.l.XMLLoader xsltCacheLifetimeSeconds=60
   [junit4]   2> 9542 INFO  (qtp5342393-78) [n:127.0.0.1:40366_solr c:testschemaapi s:shard1 r:core_node1 x:testschemaapi_shard1_replica1] o.a.s.h.l.XMLLoader xsltCacheLifetimeSeconds=60
   [junit4]   2> 9544 INFO  (qtp5342393-78) [n:127.0.0.1:40366_solr c:testschemaapi s:shard1 r:core_node1 x:testschemaapi_shard1_replica1] o.a.s.c.RequestHandlers Registered paths: /admin/mbeans,/update/json/docs,/admin/luke,/export,/get,/admin/properties,/update/json,/admin/threads,/update/csv,/sql,/graph,/select,/admin/segments,/admin/system,/replication,/config,/stream,/schema,/admin/plugins,/admin/logging,/admin/ping,/update,/admin/file,/terms
   [junit4]   2> 9544 INFO  (qtp5342393-78) [n:127.0.0.1:40366_solr c:testschemaapi s:shard1 r:core_node1 x:testschemaapi_shard1_replica1] o.a.s.c.SolrCore Using default statsCache cache: org.apache.solr.search.stats.LocalStatsCache
   [junit4]   2> 9549 INFO  (qtp5342393-78) [n:127.0.0.1:40366_solr c:testschemaapi s:shard1 r:core_node1 x:testschemaapi_shard1_replica1] o.a.s.u.UpdateHandler Using UpdateLog implementation: org.apache.solr.update.UpdateLog
   [junit4]   2> 9549 INFO  (qtp5342393-78) [n:127.0.0.1:40366_solr c:testschemaapi s:shard1 r:core_node1 x:testschemaapi_shard1_replica1] o.a.s.u.UpdateLog Initializing UpdateLog: dataDir=null defaultSyncLevel=FLUSH numRecordsToKeep=100 maxNumLogsToKeep=10 numVersionBuckets=65536
   [junit4]   2> 9551 INFO  (qtp19951933-71) [n:127.0.0.1:38822_solr c:testschemaapi s:shard1  x:testschemaapi_shard1_replica2] o.a.s.c.ZkController waiting to find shard id in clusterstate for testschemaapi_shard1_replica2
   [junit4]   2> 9551 INFO  (qtp19951933-71) [n:127.0.0.1:38822_solr c:testschemaapi s:shard1  x:testschemaapi_shard1_replica2] o.a.s.c.ZkController Check for collection zkNode:testschemaapi
   [junit4]   2> 9552 INFO  (qtp19951933-71) [n:127.0.0.1:38822_solr c:testschemaapi s:shard1  x:testschemaapi_shard1_replica2] o.a.s.c.ZkController Collection zkNode exists
   [junit4]   2> 9552 INFO  (qtp19951933-71) [n:127.0.0.1:38822_solr c:testschemaapi s:shard1  x:testschemaapi_shard1_replica2] o.a.s.c.c.ZkStateReader Load collection config from: [/collections/testschemaapi]
   [junit4]   2> 9553 INFO  (qtp19951933-71) [n:127.0.0.1:38822_solr c:testschemaapi s:shard1  x:testschemaapi_shard1_replica2] o.a.s.c.c.ZkStateReader path=[/collections/testschemaapi] [configName]=[conf1] specified config exists in ZooKeeper
   [junit4]   2> 9553 INFO  (qtp19951933-71) [n:127.0.0.1:38822_solr c:testschemaapi s:shard1  x:testschemaapi_shard1_replica2] o.a.s.c.SolrResourceLoader new SolrResourceLoader for directory: '/home/jenkins/workspace/Lucene-Solr-master-Linux/solr/build/solr-core/test/J1/temp/solr.schema.TestManagedSchemaAPI_2C69E749B828036B-001/tempDir-001/node1/testschemaapi_shard1_replica2'
   [junit4]   2> 9553 INFO  (qtp19951933-71) [n:127.0.0.1:38822_solr c:testschemaapi s:shard1  x:testschemaapi_shard1_replica2] o.a.s.c.SolrResourceLoader JNDI not configured for solr (NoInitialContextEx)
   [junit4]   2> 9553 INFO  (qtp19951933-71) [n:127.0.0.1:38822_solr c:testschemaapi s:shard1  x:testschemaapi_shard1_replica2] o.a.s.c.SolrResourceLoader solr home defaulted to 'solr/' (could not find system property or JNDI)
   [junit4]   2> 9554 INFO  (qtp5342393-78) [n:127.0.0.1:40366_solr c:testschemaapi s:shard1 r:core_node1 x:testschemaapi_shard1_replica1] o.a.s.u.CommitTracker Hard AutoCommit: disabled
   [junit4]   2> 9554 INFO  (qtp5342393-78) [n:127.0.0.1:40366_solr c:testschemaapi s:shard1 r:core_node1 x:testschemaapi_shard1_replica1] o.a.s.u.CommitTracker Soft AutoCommit: disabled
   [junit4]   2> 9554 INFO  (qtp5342393-78) [n:127.0.0.1:40366_solr c:testschemaapi s:shard1 r:core_node1 x:testschemaapi_shard1_replica1] o.a.s.c.SolrDeletionPolicy SolrDeletionPolicy.onInit: commits: num=1
   [junit4]   2> 	commit{dir=MockDirectoryWrapper(RAMDirectory@1ca7452 lockFactory=org.apache.lucene.store.SingleInstanceLockFactory@1bcfadc),segFN=segments_1,generation=1}
   [junit4]   2> 9554 INFO  (qtp5342393-78) [n:127.0.0.1:40366_solr c:testschemaapi s:shard1 r:core_node1 x:testschemaapi_shard1_replica1] o.a.s.c.SolrDeletionPolicy newest commit generation = 1
   [junit4]   2> 9554 INFO  (qtp5342393-78) [n:127.0.0.1:40366_solr c:testschemaapi s:shard1 r:core_node1 x:testschemaapi_shard1_replica1] o.a.s.s.SolrIndexSearcher Opening [Searcher@284477[testschemaapi_shard1_replica1] main]
   [junit4]   2> 9555 INFO  (qtp5342393-78) [n:127.0.0.1:40366_solr c:testschemaapi s:shard1 r:core_node1 x:testschemaapi_shard1_replica1] o.a.s.c.c.ZkStateReader Load collection config from: [/collections/testschemaapi]
   [junit4]   2> 9555 INFO  (qtp19951933-71) [n:127.0.0.1:38822_solr c:testschemaapi s:shard1  x:testschemaapi_shard1_replica2] o.a.s.c.Config loaded config solrconfig.xml with version 0 
   [junit4]   2> 9555 INFO  (qtp5342393-78) [n:127.0.0.1:40366_solr c:testschemaapi s:shard1 r:core_node1 x:testschemaapi_shard1_replica1] o.a.s.c.c.ZkStateReader path=[/collections/testschemaapi] [configName]=[conf1] specified config exists in ZooKeeper
   [junit4]   2> 9555 INFO  (qtp5342393-78) [n:127.0.0.1:40366_solr c:testschemaapi s:shard1 r:core_node1 x:testschemaapi_shard1_replica1] o.a.s.r.ManagedResourceStorage Setting up ZooKeeper-based storage for the RestManager with znodeBase: /configs/conf1
   [junit4]   2> 9557 INFO  (qtp5342393-78) [n:127.0.0.1:40366_solr c:testschemaapi s:shard1 r:core_node1 x:testschemaapi_shard1_replica1] o.a.s.r.ManagedResourceStorage Configured ZooKeeperStorageIO with znodeBase: /configs/conf1
   [junit4]   2> 9557 INFO  (qtp5342393-78) [n:127.0.0.1:40366_solr c:testschemaapi s:shard1 r:core_node1 x:testschemaapi_shard1_replica1] o.a.s.r.RestManager Initializing RestManager with initArgs: {}
   [junit4]   2> 9557 INFO  (qtp5342393-78) [n:127.0.0.1:40366_solr c:testschemaapi s:shard1 r:core_node1 x:testschemaapi_shard1_replica1] o.a.s.r.ManagedResourceStorage Reading _rest_managed.json using ZooKeeperStorageIO:path=/configs/conf1
   [junit4]   2> 9558 INFO  (qtp5342393-78) [n:127.0.0.1:40366_solr c:testschemaapi s:shard1 r:core_node1 x:testschemaapi_shard1_replica1] o.a.s.r.ManagedResourceStorage No data found for znode /configs/conf1/_rest_managed.json
   [junit4]   2> 9558 INFO  (qtp5342393-78) [n:127.0.0.1:40366_solr c:testschemaapi s:shard1 r:core_node1 x:testschemaapi_shard1_replica1] o.a.s.r.ManagedResourceStorage Loaded null at path _rest_managed.json using ZooKeeperStorageIO:path=/configs/conf1
   [junit4]   2> 9558 INFO  (qtp5342393-78) [n:127.0.0.1:40366_solr c:testschemaapi s:shard1 r:core_node1 x:testschemaapi_shard1_replica1] o.a.s.r.RestManager Initializing 0 registered ManagedResources
   [junit4]   2> 9560 INFO  (qtp5342393-78) [n:127.0.0.1:40366_solr c:testschemaapi s:shard1 r:core_node1 x:testschemaapi_shard1_replica1] o.a.s.s.ZkIndexSchemaReader Creating ZooKeeper watch for the managed schema at /configs/conf1/managed-schema
   [junit4]   2> 9561 INFO  (qtp19951933-71) [n:127.0.0.1:38822_solr c:testschemaapi s:shard1  x:testschemaapi_shard1_replica2] o.a.s.c.SolrConfig current version of requestparams : -1
   [junit4]   2> 9562 INFO  (qtp5342393-78) [n:127.0.0.1:40366_solr c:testschemaapi s:shard1 r:core_node1 x:testschemaapi_shard1_replica1] o.a.s.c.ZkController Added new OnReconnect listener ZkIndexSchemaReader: /configs/conf1/managed-schema, uniqueCoreId: testschemaapi_shard1_replica1:420563556694249
   [junit4]   2> 9562 INFO  (qtp5342393-78) [n:127.0.0.1:40366_solr c:testschemaapi s:shard1 r:core_node1 x:testschemaapi_shard1_replica1] o.a.s.h.ReplicationHandler Commits will be reserved for  10000
   [junit4]   2> 9562 INFO  (searcherExecutor-39-thread-1-processing-n:127.0.0.1:40366_solr x:testschemaapi_shard1_replica1 s:shard1 c:testschemaapi r:core_node1) [n:127.0.0.1:40366_solr c:testschemaapi s:shard1 r:core_node1 x:testschemaapi_shard1_replica1] o.a.s.c.SolrCore [testschemaapi_shard1_replica1] Registered new searcher Searcher@284477[testschemaapi_shard1_replica1] main{ExitableDirectoryReader(UninvertingDirectoryReader())}
   [junit4]   2> 9562 INFO  (qtp5342393-78) [n:127.0.0.1:40366_solr c:testschemaapi s:shard1 r:core_node1 x:testschemaapi_shard1_replica1] o.a.s.u.UpdateLog Looking up max value of version field to seed version buckets
   [junit4]   2> 9562 INFO  (qtp5342393-78) [n:127.0.0.1:40366_solr c:testschemaapi s:shard1 r:core_node1 x:testschemaapi_shard1_replica1] o.a.s.u.VersionInfo Refreshing highest value of _version_ for 65536 version buckets from index
   [junit4]   2> 9568 INFO  (qtp5342393-78) [n:127.0.0.1:40366_solr c:testschemaapi s:shard1 r:core_node1 x:testschemaapi_shard1_replica1] o.a.s.u.VersionInfo No terms found for _version_, cannot seed version bucket highest value from index
   [junit4]   2> 9568 INFO  (qtp5342393-78) [n:127.0.0.1:40366_solr c:testschemaapi s:shard1 r:core_node1 x:testschemaapi_shard1_replica1] o.a.s.u.UpdateLog Could not find max version in index or recent updates, using new clock 1545078197253570560
   [junit4]   2> 9571 INFO  (qtp19951933-71) [n:127.0.0.1:38822_solr c:testschemaapi s:shard1  x:testschemaapi_shard1_replica2] o.a.s.c.SolrConfig Using Lucene MatchVersion: 7.0.0
   [junit4]   2> 9572 INFO  (qtp5342393-78) [n:127.0.0.1:40366_solr c:testschemaapi s:shard1 r:core_node1 x:testschemaapi_shard1_replica1] o.a.s.u.UpdateLog Took 9.0ms to seed version buckets with highest version 1545078197253570560
   [junit4]   2> 9573 INFO  (qtp5342393-78) [n:127.0.0.1:40366_solr c:testschemaapi s:shard1 r:core_node1 x:testschemaapi_shard1_replica1] o.a.s.c.ZkController watch zkdir /configs/conf1
   [junit4]   2> 9580 INFO  (qtp5342393-78) [n:127.0.0.1:40366_solr c:testschemaapi s:shard1 r:core_node1 x:testschemaapi_shard1_replica1] o.a.s.c.CoreContainer registering core: testschemaapi_shard1_replica1
   [junit4]   2> 9580 INFO  (qtp5342393-78) [n:127.0.0.1:40366_solr c:testschemaapi s:shard1 r:core_node1 x:testschemaapi_shard1_replica1] o.a.s.c.ZkController Register replica - core:testschemaapi_shard1_replica1 address:https://127.0.0.1:40366/solr collection:testschemaapi shard:shard1
   [junit4]   2> 9589 INFO  (qtp5342393-78) [n:127.0.0.1:40366_solr c:testschemaapi s:shard1 r:core_node1 x:testschemaapi_shard1_replica1] o.a.s.c.c.SolrZkClient makePath: /collections/testschemaapi/leader_elect/shard1/election
   [junit4]   2> 9589 INFO  (qtp19951933-71) [n:127.0.0.1:38822_solr c:testschemaapi s:shard1  x:testschemaapi_shard1_replica2] o.a.s.c.SolrConfig Loaded SolrConfig: solrconfig.xml
   [junit4]   2> 9593 INFO  (qtp5342393-78) [n:127.0.0.1:40366_solr c:testschemaapi s:shard1 r:core_node1 x:testschemaapi_shard1_replica1] o.a.s.c.LeaderElector Joined leadership election with path: /collections/testschemaapi/leader_elect/shard1/election/96567387194589190-core_node1-n_0000000000
   [junit4]   2> 9593 INFO  (qtp5342393-78) [n:127.0.0.1:40366_solr c:testschemaapi s:shard1 r:core_node1 x:testschemaapi_shard1_replica1] o.a.s.c.ShardLeaderElectionContext Running the leader process for shard=shard1 and weAreReplacement=false and leaderVoteWait=10000
   [junit4]   2> 9595 INFO  (qtp19951933-71) [n:127.0.0.1:38822_solr c:testschemaapi s:shard1  x:testschemaapi_shard1_replica2] o.a.s.s.IndexSchema [testschemaapi_shard1_replica2] Schema name=minimal
   [junit4]   2> 9596 INFO  (qtp5342393-78) [n:127.0.0.1:40366_solr c:testschemaapi s:shard1 r:core_node1 x:testschemaapi_shard1_replica1] o.a.s.c.ShardLeaderElectionContext Waiting until we see more replicas up for shard shard1: total=2 found=1 timeoutin=9999ms
   [junit4]   2> 9597 INFO  (OverseerStateUpdate-96567387194589190-127.0.0.1:40366_solr-n_0000000000) [n:127.0.0.1:40366_solr    ] o.a.s.c.Overseer processMessage: queueSize: 1, message = {
   [junit4]   2>   "operation":"leader",
   [junit4]   2>   "shard":"shard1",
   [junit4]   2>   "collection":"testschemaapi"} current state version: 0
   [junit4]   2> 9603 INFO  (qtp19951933-71) [n:127.0.0.1:38822_solr c:testschemaapi s:shard1  x:testschemaapi_shard1_replica2] o.a.s.s.IndexSchema unique key field: id
   [junit4]   2> 9604 INFO  (qtp19951933-71) [n:127.0.0.1:38822_solr c:testschemaapi s:shard1  x:testschemaapi_shard1_replica2] o.a.s.c.ConfigSetProperties Did not find ConfigSet properties, assuming default properties: Can't find resource 'configsetprops.json' in classpath or '/configs/conf1', cwd=/home/jenkins/workspace/Lucene-Solr-master-Linux/solr/build/solr-core/test/J1
   [junit4]   2> 9604 INFO  (qtp19951933-71) [n:127.0.0.1:38822_solr c:testschemaapi s:shard1  x:testschemaapi_shard1_replica2] o.a.s.c.CoreContainer Creating SolrCore 'testschemaapi_shard1_replica2' using configuration from collection testschemaapi
   [junit4]   2> 9605 INFO  (qtp19951933-71) [n:127.0.0.1:38822_solr c:testschemaapi s:shard1 r:core_node2 x:testschemaapi_shard1_replica2] o.a.s.c.SolrCore org.apache.solr.core.MockDirectoryFactory
   [junit4]   2> 9605 INFO  (qtp19951933-71) [n:127.0.0.1:38822_solr c:testschemaapi s:shard1 r:core_node2 x:testschemaapi_shard1_replica2] o.a.s.c.SolrCore [[testschemaapi_shard1_replica2] ] Opening new SolrCore at [/home/jenkins/workspace/Lucene-Solr-master-Linux/solr/build/solr-core/test/J1/temp/solr.schema.TestManagedSchemaAPI_2C69E749B828036B-001/tempDir-001/node1/testschemaapi_shard1_replica2], dataDir=[/home/jenkins/workspace/Lucene-Solr-master-Linux/solr/build/solr-core/test/J1/temp/solr.schema.TestManagedSchemaAPI_2C69E749B828036B-001/tempDir-001/node1/./testschemaapi_shard1_replica2/data/]
   [junit4]   2> 9605 INFO  (qtp19951933-71) [n:127.0.0.1:38822_solr c:testschemaapi s:shard1 r:core_node2 x:testschemaapi_shard1_replica2] o.a.s.c.SolrCore JMX monitoring not detected for core: testschemaapi_shard1_replica2
   [junit4]   2> 9606 INFO  (qtp19951933-71) [n:127.0.0.1:38822_solr c:testschemaapi s:shard1 r:core_node2 x:testschemaapi_shard1_replica2] o.a.s.c.CachingDirectoryFactory return new directory for /home/jenkins/workspace/Lucene-Solr-master-Linux/solr/build/solr-core/test/J1/temp/solr.schema.TestManagedSchemaAPI_2C69E749B828036B-001/tempDir-001/node1/./testschemaapi_shard1_replica2/data/snapshot_metadata
   [junit4]   2> 9606 INFO  (qtp19951933-71) [n:127.0.0.1:38822_solr c:testschemaapi s:shard1 r:core_node2 x:testschemaapi_shard1_replica2] o.a.s.c.s.SolrSnapshotMetaDataManager Loading from snapshot metadata file...
   [junit4]   2> 9606 INFO  (qtp19951933-71) [n:127.0.0.1:38822_solr c:testschemaapi s:shard1 r:core_node2 x:testschemaapi_shard1_replica2] o.a.s.c.CachingDirectoryFactory return new directory for /home/jenkins/workspace/Lucene-Solr-master-Linux/solr/build/solr-core/test/J1/temp/solr.schema.TestManagedSchemaAPI_2C69E749B828036B-001/tempDir-001/node1/./testschemaapi_shard1_replica2/data
   [junit4]   2> 9606 INFO  (qtp19951933-71) [n:127.0.0.1:38822_solr c:testschemaapi s:shard1 r:core_node2 x:testschemaapi_shard1_replica2] o.a.s.c.SolrCore New index directory detected: old=null new=/home/jenkins/workspace/Lucene-Solr-master-Linux/solr/build/solr-core/test/J1/temp/solr.schema.TestManagedSchemaAPI_2C69E749B828036B-001/tempDir-001/node1/./testschemaapi_shard1_replica2/data/index/
   [junit4]   2> 9606 WARN  (qtp19951933-71) [n:127.0.0.1:38822_solr c:testschemaapi s:shard1 r:core_node2 x:testschemaapi_shard1_replica2] o.a.s.c.SolrCore [testschemaapi_shard1_replica2] Solr index directory '/home/jenkins/workspace/Lucene-Solr-master-Linux/solr/build/solr-core/test/J1/temp/solr.schema.TestManagedSchemaAPI_2C69E749B828036B-001/tempDir-001/node1/./testschemaapi_shard1_replica2/data/index' doesn't exist. Creating new index...
   [junit4]   2> 9607 INFO  (qtp19951933-71) [n:127.0.0.1:38822_solr c:testschemaapi s:shard1 r:core_node2 x:testschemaapi_shard1_replica2] o.a.s.c.CachingDirectoryFactory return new directory for /home/jenkins/workspace/Lucene-Solr-master-Linux/solr/build/solr-core/test/J1/temp/solr.schema.TestManagedSchemaAPI_2C69E749B828036B-001/tempDir-001/node1/./testschemaapi_shard1_replica2/data/index
   [junit4]   2> 9607 INFO  (qtp19951933-71) [n:127.0.0.1:38822_solr c:testschemaapi s:shard1 r:core_node2 x:testschemaapi_shard1_replica2] o.a.s.c.SolrDeletionPolicy SolrDeletionPolicy.onCommit: commits: num=1
   [junit4]   2> 	commit{dir=MockDirectoryWrapper(RAMDirectory@54dc2 lockFactory=org.apache.lucene.store.SingleInstanceLockFactory@be1fac),segFN=segments_1,generation=1}
   [junit4]   2> 9607 INFO  (qtp19951933-71) [n:127.0.0.1:38822_solr c:testschemaapi s:shard1 r:core_node2 x:testschemaapi_shard1_replica2] o.a.s.c.SolrDeletionPolicy newest commit generation = 1
   [junit4]   2> 9608 INFO  (OldIndexDirectoryCleanupThreadForCore-testschemaapi_shard1_replica2) [n:127.0.0.1:38822_solr c:testschemaapi s:shard1 r:core_node2 x:testschemaapi_shard1_replica2] o.a.s.c.SolrCore Looking for old index directories to cleanup for core testschemaapi_shard1_replica2 in /home/jenkins/workspace/Lucene-Solr-master-Linux/solr/build/solr-core/test/J1/temp/solr.schema.TestManagedSchemaAPI_2C69E749B828036B-001/tempDir-001/node1/./testschemaapi_shard1_replica2/data/
   [junit4]   2> 9608 WARN  (OldIndexDirectoryCleanupThreadForCore-testschemaapi_shard1_replica2) [n:127.0.0.1:38822_solr c:testschemaapi s:shard1 r:core_node2 x:testschemaapi_shard1_replica2] o.a.s.c.DirectoryFactory /home/jenkins/workspace/Lucene-Solr-master-Linux/solr/build/solr-core/test/J1/temp/solr.schema.TestManagedSchemaAPI_2C69E749B828036B-001/tempDir-001/node1/./testschemaapi_shard1_replica2/data/ does not point to a valid data directory; skipping clean-up of old index directories.
   [junit4]   2> 9610 INFO  (qtp19951933-71) [n:127.0.0.1:38822_solr c:testschemaapi s:shard1 r:core_node2 x:testschemaapi_shard1_replica2] o.a.s.c.SolrCore no updateRequestProcessorChain defined as default, creating implicit default
   [junit4]   2> 9611 INFO  (qtp19951933-71) [n:127.0.0.1:38822_solr c:testschemaapi s:shard1 r:core_node2 x:testschemaapi_shard1_replica2] o.a.s.h.l.XMLLoader xsltCacheLifetimeSeconds=60
   [junit4]   2> 9612 INFO  (qtp19951933-71) [n:127.0.0.1:38822_solr c:testschemaapi s:shard1 r:core_node2 x:testschemaapi_shard1_replica2] o.a.s.h.l.XMLLoader xsltCacheLifetimeSeconds=60
   [junit4]   2> 9613 INFO  (qtp19951933-71) [n:127.0.0.1:38822_solr c:testschemaapi s:shard1 r:core_node2 x:testschemaapi_shard1_replica2] o.a.s.h.l.XMLLoader xsltCacheLifetimeSeconds=60
   [junit4]   2> 9614 INFO  (qtp19951933-71) [n:127.0.0.1:38822_solr c:testschemaapi s:shard1 r:core_node2 x:testschemaapi_shard1_replica2] o.a.s.h.l.XMLLoader xsltCacheLifetimeSeconds=60
   [junit4]   2> 9616 INFO  (qtp19951933-71) [n:127.0.0.1:38822_solr c:testschemaapi s:shard1 r:core_node2 x:testschemaapi_shard1_replica2] o.a.s.c.RequestHandlers Registered paths: /admin/mbeans,/update/json/docs,/admin/luke,/export,/get,/admin/properties,/update/json,/admin/threads,/update/csv,/sql,/graph,/select,/admin/segments,/admin/system,/replication,/config,/stream,/schema,/admin/plugins,/admin/logging,/admin/ping,/update,/admin/file,/terms
   [junit4]   2> 9616 INFO  (qtp19951933-71) [n:127.0.0.1:38822_solr c:testschemaapi s:shard1 r:core_node2 x:testschemaapi_shard1_replica2] o.a.s.c.SolrCore Using default statsCache cache: org.apache.solr.search.stats.LocalStatsCache
   [junit4]   2> 9616 INFO  (qtp19951933-71) [n:127.0.0.1:38822_solr c:testschemaapi s:shard1 r:core_node2 x:testschemaapi_shard1_replica2] o.a.s.u.UpdateHandler Using UpdateLog implementation: org.apache.solr.update.UpdateLog
   [junit4]   2> 9616 INFO  (qtp19951933-71) [n:127.0.0.1:38822_solr c:testschemaapi s:shard1 r:core_node2 x:testschemaapi_shard1_replica2] o.a.s.u.UpdateLog Initializing UpdateLog: dataDir=null defaultSyncLevel=FLUSH numRecordsToKeep=100 maxNumLogsToKeep=10 numVersionBuckets=65536
   [junit4]   2> 9618 INFO  (qtp19951933-71) [n:127.0.0.1:38822_solr c:testschemaapi s:shard1 r:core_node2 x:testschemaapi_shard1_replica2] o.a.s.u.CommitTracker Hard AutoCommit: disabled
   [junit4]   2> 9618 INFO  (qtp19951933-71) [n:127.0.0.1:38822_solr c:testschemaapi s:shard1 r:core_node2 x:testschemaapi_shard1_replica2] o.a.s.u.CommitTracker Soft AutoCommit: disabled
   [junit4]   2> 9618 INFO  (qtp19951933-71) [n:127.0.0.1:38822_solr c:testschemaapi s:shard1 r:core_node2 x:testschemaapi_shard1_replica2] o.a.s.c.SolrDeletionPolicy SolrDeletionPolicy.onInit: commits: num=1
   [junit4]   2> 	commit{dir=MockDirectoryWrapper(RAMDirectory@54dc2 lockFactory=org.apache.lucene.store.SingleInstanceLockFactory@be1fac),segFN=segments_1,generation=1}
   [junit4]   2> 9618 INFO  (qtp19951933-71) [n:127.0.0.1:38822_solr c:testschemaapi s:shard1 r:core_node2 x:testschemaapi_shard1_replica2] o.a.s.c.SolrDeletionPolicy newest commit generation = 1
   [junit4]   2> 9618 INFO  (qtp19951933-71) [n:127.0.0.1:38822_solr c:testschemaapi s:shard1 r:core_node2 x:testschemaapi_shard1_replica2] o.a.s.s.SolrIndexSearcher Opening [Searcher@138e1e6[testschemaapi_shard1_replica2] main]
   [junit4]   2> 9619 INFO  (qtp19951933-71) [n:127.0.0.1:38822_solr c:testschemaapi s:shard1 r:core_node2 x:testschemaapi_shard1_replica2] o.a.s.c.c.ZkStateReader Load collection config from: [/collections/testschemaapi]
   [junit4]   2> 9619 INFO  (qtp19951933-71) [n:127.0.0.1:38822_solr c:testschemaapi s:shard1 r:core_node2 x:testschemaapi_shard1_replica2] o.a.s.c.c.ZkStateReader path=[/collections/testschemaapi] [configName]=[conf1] specified config exists in ZooKeeper
   [junit4]   2> 9619 INFO  (qtp19951933-71) [n:127.0.0.1:38822_solr c:testschemaapi s:shard1 r:core_node2 x:testschemaapi_shard1_replica2] o.a.s.r.ManagedResourceStorage Setting up ZooKeeper-based storage for the RestManager with znodeBase: /configs/conf1
   [junit4]   2> 9620 INFO  (qtp19951933-71) [n:127.0.0.1:38822_solr c:testschemaapi s:shard1 r:core_node2 x:testschemaapi_shard1_replica2] o.a.s.r.ManagedResourceStorage Configured ZooKeeperStorageIO with znodeBase: /configs/conf1
   [junit4]   2> 9620 INFO  (qtp19951933-71) [n:127.0.0.1:38822_solr c:testschemaapi s:shard1 r:core_node2 x:testschemaapi_shard1_replica2] o.a.s.r.RestManager Initializing RestManager with initArgs: {}
   [junit4]   2> 9620 INFO  (qtp19951933-71) [n:127.0.0.1:38822_solr c:testschemaapi s:shard1 r:core_node2 x:testschemaapi_shard1_replica2] o.a.s.r.ManagedResourceStorage Reading _rest_managed.json using ZooKeeperStorageIO:path=/configs/conf1
   [junit4]   2> 9621 INFO  (qtp19951933-71) [n:127.0.0.1:38822_solr c:testschemaapi s:shard1 r:core_node2 x:testschemaapi_shard1_replica2] o.a.s.r.ManagedResourceStorage No data found for znode /configs/conf1/_rest_managed.json
   [junit4]   2> 9621 INFO  (qtp19951933-71) [n:127.0.0.1:38822_solr c:testschemaapi s:shard1 r:core_node2 x:testschemaapi_shard1_replica2] o.a.s.r.ManagedResourceStorage Loaded null at path _rest_managed.json using ZooKeeperStorageIO:path=/configs/conf1
   [junit4]   2> 9621 INFO  (qtp19951933-71) [n:127.0.0.1:38822_solr c:testschemaapi s:shard1 r:core_node2 x:testschemaapi_shard1_replica2] o.a.s.r.RestManager Initializing 0 registered ManagedResources
   [junit4]   2> 9621 INFO  (qtp19951933-71) [n:127.0.0.1:38822_solr c:testschemaapi s:shard1 r:core_node2 x:testschemaapi_shard1_replica2] o.a.s.s.ZkIndexSchemaReader Creating ZooKeeper watch for the managed schema at /configs/conf1/managed-schema
   [junit4]   2> 9622 INFO  (qtp19951933-71) [n:127.0.0.1:38822_solr c:testschemaapi s:shard1 r:core_node2 x:testschemaapi_shard1_replica2] o.a.s.c.ZkController Added new OnReconnect listener ZkIndexSchemaReader: /configs/conf1/managed-schema, uniqueCoreId: testschemaapi_shard1_replica2:420563632648772
   [junit4]   2> 9622 INFO  (qtp19951933-71) [n:127.0.0.1:38822_solr c:testschemaapi s:shard1 r:core_node2 x:testschemaapi_shard1_replica2] o.a.s.h.ReplicationHandler Commits will be reserved for  10000
   [junit4]   2> 9622 INFO  (qtp19951933-71) [n:127.0.0.1:38822_solr c:testschemaapi s:shard1 r:core_node2 x:testschemaapi_shard1_replica2] o.a.s.u.UpdateLog Looking up max value of version field to seed version buckets
   [junit4]   2> 9622 INFO  (qtp19951933-71) [n:127.0.0.1:38822_solr c:testschemaapi s:shard1 r:core_node2 x:testschemaapi_shard1_replica2] o.a.s.u.VersionInfo Refreshing highest value of _version_ for 65536 version buckets from index
   [junit4]   2> 9622 INFO  (searcherExecutor-44-thread-1-processing-n:127.0.0.1:38822_solr x:testschemaapi_shard1_replica2 s:shard1 c:testschemaapi r:core_node2) [n:127.0.0.1:38822_solr c:testschemaapi s:shard1 r:core_node2 x:testschemaapi_shard1_replica2] o.a.s.c.SolrCore [testschemaapi_shard1_replica2] Registered new searcher Searcher@138e1e6[testschemaapi_shard1_replica2] main{ExitableDirectoryReader(UninvertingDirectoryReader())}
   [junit4]   2> 9622 INFO  (qtp19951933-71) [n:127.0.0.1:38822_solr c:testschemaapi s:shard1 r:core_node2 x:testschemaapi_shard1_replica2] o.a.s.u.VersionInfo No terms found for _version_, cannot seed version bucket highest value from index
   [junit4]   2> 9622 INFO  (qtp19951933-71) [n:127.0.0.1:38822_solr c:testschemaapi s:shard1 r:core_node2 x:testschemaapi_shard1_replica2] o.a.s.u.UpdateLog Could not find max version in index or recent updates, using new clock 1545078197310193664
   [junit4]   2> 9624 INFO  (qtp19951933-71) [n:127.0.0.1:38822_solr c:testschemaapi s:shard1 r:core_node2 x:testschemaapi_shard1_replica2] o.a.s.u.UpdateLog Took 2.0ms to seed version buckets with highest version 1545078197310193664
   [junit4]   2> 9624 INFO  (qtp19951933-71) [n:127.0.0.1:38822_solr c:testschemaapi s:shard1 r:core_node2 x:testschemaapi_shard1_replica2] o.a.s.c.ZkController watch zkdir /configs/conf1
   [junit4]   2> 9625 INFO  (qtp19951933-71) [n:127.0.0.1:38822_solr c:testschemaapi s:shard1 r:core_node2 x:testschemaapi_shard1_replica2] o.a.s.c.CoreContainer registering core: testschemaapi_shard1_replica2
   [junit4]   2> 9625 INFO  (qtp19951933-71) [n:127.0.0.1:38822_solr c:testschemaapi s:shard1 r:core_node2 x:testschemaapi_shard1_replica2] o.a.s.c.ZkController Register replica - core:testschemaapi_shard1_replica2 address:https://127.0.0.1:38822/solr collection:testschemaapi shard:shard1
   [junit4]   2> 9626 INFO  (qtp19951933-71) [n:127.0.0.1:38822_solr c:testschemaapi s:shard1 r:core_node2 x:testschemaapi_shard1_replica2] o.a.s.c.LeaderElector Joined leadership election with path: /collections/testschemaapi/leader_elect/shard1/election/96567387194589189-core_node2-n_0000000001
   [junit4]   2> 9627 INFO  (qtp19951933-71) [n:127.0.0.1:38822_solr c:testschemaapi s:shard1 r:core_node2 x:testschemaapi_shard1_replica2] o.a.s.c.LeaderElector Watching path /collections/testschemaapi/leader_elect/shard1/election/96567387194589190-core_node1-n_0000000000 to know if I could be the leader
   [junit4]   2> 9705 INFO  (OverseerStateUpdate-96567387194589190-127.0.0.1:40366_solr-n_0000000000) [n:127.0.0.1:40366_solr    ] o.a.s.c.o.ZkStateWriter going to update_collection /collections/testschemaapi/state.json version: 1
   [junit4]   2> 9705 INFO  (zkCallback-15-thread-2-processing-n:127.0.0.1:40366_solr) [n:127.0.0.1:40366_solr    ] o.a.s.c.c.ZkStateReader A cluster state change: [WatchedEvent state:SyncConnected type:NodeDataChanged path:/collections/testschemaapi/state.json] for collection [testschemaapi] has occurred - updating... (live nodes size: [2])
   [junit4]   2> 9705 INFO  (zkCallback-16-thread-1-processing-n:127.0.0.1:38822_solr) [n:127.0.0.1:38822_solr    ] o.a.s.c.c.ZkStateReader A cluster state change: [WatchedEvent state:SyncConnected type:NodeDataChanged path:/collections/testschemaapi/state.json] for collection [testschemaapi] has occurred - updating... (live nodes size: [2])
   [junit4]   2> 9706 INFO  (zkCallback-15-thread-2-processing-n:127.0.0.1:40366_solr) [n:127.0.0.1:40366_solr    ] o.a.s.c.c.ZkStateReader Updating data for [testschemaapi] from [1] to [2]
   [junit4]   2> 9706 INFO  (zkCallback-16-thread-1-processing-n:127.0.0.1:38822_solr) [n:127.0.0.1:38822_solr    ] o.a.s.c.c.ZkStateReader Updating data for [testschemaapi] from [1] to [2]
   [junit4]   2> 10096 INFO  (qtp5342393-78) [n:127.0.0.1:40366_solr c:testschemaapi s:shard1 r:core_node1 x:testschemaapi_shard1_replica1] o.a.s.c.ShardLeaderElectionContext Enough replicas found to continue.
   [junit4]   2> 10096 INFO  (qtp5342393-78) [n:127.0.0.1:40366_solr c:testschemaapi s:shard1 r:core_node1 x:testschemaapi_shard1_replica1] o.a.s.c.ShardLeaderElectionContext I may be the new leader - try and sync
   [junit4]   2> 10097 INFO  (qtp5342393-78) [n:127.0.0.1:40366_solr c:testschemaapi s:shard1 r:core_node1 x:testschemaapi_shard1_replica1] o.a.s.c.SyncStrategy Sync replicas to https://127.0.0.1:40366/solr/testschemaapi_shard1_replica1/
   [junit4]   2> 10100 INFO  (qtp5342393-78) [n:127.0.0.1:40366_solr c:testschemaapi s:shard1 r:core_node1 x:testschemaapi_shard1_replica1] o.a.s.u.PeerSync PeerSync: core=testschemaapi_shard1_replica1 url=https://127.0.0.1:40366/solr START replicas=[https://127.0.0.1:38822/solr/testschemaapi_shard1_replica2/] nUpdates=100
   [junit4]   2> 10101 INFO  (qtp5342393-78) [n:127.0.0.1:40366_solr c:testschemaapi s:shard1 r:core_node1 x:testschemaapi_shard1_replica1] o.a.s.u.PeerSync PeerSync: core=testschemaapi_shard1_replica1 url=https://127.0.0.1:40366/solr DONE.  We have no versions.  sync failed.
   [junit4]   2> 10101 INFO  (qtp5342393-78) [n:127.0.0.1:40366_solr c:testschemaapi s:shard1 r:core_node1 x:testschemaapi_shard1_replica1] o.a.s.c.SyncStrategy Leader's attempt to sync with shard failed, moving to the next candidate
   [junit4]   2> 10101 INFO  (qtp5342393-78) [n:127.0.0.1:40366_solr c:testschemaapi s:shard1 r:core_node1 x:testschemaapi_shard1_replica1] o.a.s.c.ShardLeaderElectionContext We failed sync, but we have no versions - we can't sync in that case - we were active before, so become leader anyway
   [junit4]   2> 10118 INFO  (qtp5342393-78) [n:127.0.0.1:40366_solr c:testschemaapi s:shard1 r:core_node1 x:testschemaapi_shard1_replica1] o.a.s.c.c.SolrZkClient makePath: /collections/testschemaapi/leaders/shard1
   [junit4]   2> 10121 INFO  (qtp19951933-83) [n:127.0.0.1:38822_solr c:testschemaapi s:shard1 r:core_node2 x:testschemaapi_shard1_replica2] o.a.s.c.S.Request [testschemaapi_shard1_replica2]  webapp=/solr path=/get params={distrib=false&qt=/get&fingerprint=false&getVersions=100&wt=javabin&version=2} status=0 QTime=1
   [junit4]   2> 10124 INFO  (qtp5342393-78) [n:127.0.0.1:40366_solr c:testschemaapi s:shard1 r:core_node1 x:testschemaapi_shard1_replica1] o.a.s.c.ShardLeaderElectionContextBase Creating leader registration node /collections/testschemaapi/leaders/shard1/leader after winning as /collections/testschemaapi/leader_elect/shard1/election/96567387194589190-core_node1-n_0000000000
   [junit4]   2> 10137 INFO  (qtp5342393-78) [n:127.0.0.1:40366_solr c:testschemaapi s:shard1 r:core_node1 x:testschemaapi_shard1_replica1] o.a.s.c.ShardLeaderElectionContext I am the new leader: https://127.0.0.1:40366/solr/testschemaapi_shard1_replica1/ shard1
   [junit4]   2> 10138 INFO  (OverseerStateUpdate-96567387194589190-127.0.0.1:40366_solr-n_0000000000) [n:127.0.0.1:40366_solr    ] o.a.s.c.Overseer processMessage: queueSize: 1, message = {
   [junit4]   2>   "operation":"leader",
   [junit4]   2>   "shard":"shard1",
   [junit4]   2>   "collection":"testschemaapi",
   [junit4]   2>   "base_url":"https://127.0.0.1:40366/solr",
   [junit4]   2>   "core":"testschemaapi_shard1_replica1",
   [junit4]   2>   "state":"active"} current state version: 0
   [junit4]   2> 10240 INFO  (OverseerStateUpdate-96567387194589190-127.0.0.1:40366_solr-n_0000000000) [n:127.0.0.1:40366_solr    ] o.a.s.c.o.ZkStateWriter going to update_collection /collections/testschemaapi/state.json version: 2
   [junit4]   2> 10241 INFO  (zkCallback-15-thread-1-processing-n:127.0.0.1:40366_solr) [n:127.0.0.1:40366_solr    ] o.a.s.c.c.ZkStateReader A cluster state change: [WatchedEvent state:SyncConnected type:NodeDataChanged path:/collections/testschemaapi/state.json] for collection [testschemaapi] has occurred - updating... (live nodes size: [2])
   [junit4]   2> 10241 INFO  (zkCallback-16-thread-1-processing-n:127.0.0.1:38822_solr) [n:127.0.0.1:38822_solr    ] o.a.s.c.c.ZkStateReader A cluster state change: [WatchedEvent state:SyncConnected type:NodeDataChanged path:/collections/testschemaapi/state.json] for collection [testschemaapi] has occurred - updating... (live nodes size: [2])
   [junit4]   2> 10241 INFO  (zkCallback-15-thread-1-processing-n:127.0.0.1:40366_solr) [n:127.0.0.1:40366_solr    ] o.a.s.c.c.ZkStateReader Updating data for [testschemaapi] from [2] to [3]
   [junit4]   2> 10241 INFO  (zkCallback-16-thread-1-processing-n:127.0.0.1:38822_solr) [n:127.0.0.1:38822_solr    ] o.a.s.c.c.ZkStateReader Updating data for [testschemaapi] from [2] to [3]
   [junit4]   2> 10288 INFO  (qtp5342393-78) [n:127.0.0.1:40366_solr c:testschemaapi s:shard1 r:core_node1 x:testschemaapi_shard1_replica1] o.a.s.c.ZkController We are https://127.0.0.1:40366/solr/testschemaapi_shard1_replica1/ and leader is https://127.0.0.1:40366/solr/testschemaapi_shard1_replica1/
   [junit4]   2> 10289 INFO  (qtp5342393-78) [n:127.0.0.1:40366_solr c:testschemaapi s:shard1 r:core_node1 x:testschemaapi_shard1_replica1] o.a.s.c.ZkController No LogReplay needed for core=testschemaapi_shard1_replica1 baseURL=https://127.0.0.1:40366/solr
   [junit4]   2> 10289 INFO  (qtp5342393-78) [n:127.0.0.1:40366_solr c:testschemaapi s:shard1 r:core_node1 x:testschemaapi_shard1_replica1] o.a.s.c.ZkController I am the leader, no recovery necessary
   [junit4]   2> 10289 INFO  (qtp5342393-78) [n:127.0.0.1:40366_solr c:testschemaapi s:shard1 r:core_node1 x:testschemaapi_shard1_replica1] o.a.s.c.ZkController publishing state=active
   [junit4]   2> 10290 INFO  (qtp5342393-78) [n:127.0.0.1:40366_solr c:testschemaapi s:shard1 r:core_node1 x:testschemaapi_shard1_replica1] o.a.s.c.c.ZkStateReader Forcing refresh of watched collection state for testschemaapi
   [junit4]   2> 10291 INFO  (OverseerStateUpdate-96567387194589190-127.0.0.1:40366_solr-n_0000000000) [n:127.0.0.1:40366_solr    ] o.a.s.c.Overseer processMessage: queueSize: 1, message = {
   [junit4]   2>   "core":"testschemaapi_shard1_replica1",
   [junit4]   2>   "core_node_name":"core_node1",
   [junit4]   2>   "roles":null,
   [junit4]   2>   "base_url":"https://127.0.0.1:40366/solr",
   [junit4]   2>   "node_name":"127.0.0.1:40366_solr",
   [junit4]   2>   "numShards":"1",
   [junit4]   2>   "state":"active",
   [junit4]   2>   "shard":"shard1",
   [junit4]   2>   "collection":"testschemaapi",
   [junit4]   2>   "operation":"state"} current state version: 0
   [junit4]   2> 10291 INFO  (OverseerStateUpdate-96567387194589190-127.0.0.1:40366_solr-n_0000000000) [n:127.0.0.1:40366_solr    ] o.a.s.c.o.ReplicaMutator Update state numShards=1 message={
   [junit4]   2>   "core":"testschemaapi_shard1_replica1",
   [junit4]   2>   "core_node_name":"core_node1",
   [junit4]   2>   "roles":null,
   [junit4]   2>   "base_url":"https://127.0.0.1:40366/solr",
   [junit4]   2>   "node_name":"127.0.0.1:40366_solr",
   [junit4]   2>   "numShards":"1",
   [junit4]   2>   "state":"active",
   [junit4]   2>   "shard":"shard1",
   [junit4]   2>   "collection":"testschemaapi",
   [junit4]   2>   "operation":"state"}
   [junit4]   2> 10293 INFO  (qtp5342393-78) [n:127.0.0.1:40366_solr c:testschemaapi s:shard1 r:core_node1 x:testschemaapi_shard1_replica1] o.a.s.s.HttpSolrCall [admin] webapp=null path=/admin/cores params={qt=/admin/cores&collection.configName=conf1&name=testschemaapi_shard1_replica1&action=CREATE&numShards=1&collection=testschemaapi&shard=shard1&wt=javabin&version=2} status=0 QTime=1842
   [junit4]   2> 10393 INFO  (OverseerStateUpdate-96567387194589190-127.0.0.1:40366_solr-n_0000000000) [n:127.0.0.1:40366_solr    ] o.a.s.c.o.ZkStateWriter going to update_collection /collections/testschemaapi/state.json version: 3
   [junit4]   2> 10394 INFO  (zkCallback-15-thread-2-processing-n:127.0.0.1:40366_solr) [n:127.0.0.1:40366_solr    ] o.a.s.c.c.ZkStateReader A cluster state change: [WatchedEvent state:SyncConnected type:NodeDataChanged path:/collections/testschemaapi/state.json] for collection [testschemaapi] has occurred - updating... (live nodes size: [2])
   [junit4]   2> 10394 INFO  (zkCallback-16-thread-1-processing-n:127.0.0.1:38822_solr) [n:127.0.0.1:38822_solr    ] o.a.s.c.c.ZkStateReader A cluster state change: [WatchedEvent state:SyncConnected type:NodeDataChanged path:/collections/testschemaapi/state.json] for collection [testschemaapi] has occurred - updating... (live nodes size: [2])
   [junit4]   2> 10395 INFO  (zkCallback-15-thread-2-processing-n:127.0.0.1:40366_solr) [n:127.0.0.1:40366_solr    ] o.a.s.c.c.ZkStateReader Updating data for [testschemaapi] from [3] to [4]
   [junit4]   2> 10395 INFO  (zkCallback-16-thread-1-processing-n:127.0.0.1:38822_solr) [n:127.0.0.1:38822_solr    ] o.a.s.c.c.ZkStateReader Updating data for [testschemaapi] from [3] to [4]
   [junit4]   2> 10628 INFO  (qtp19951933-71) [n:127.0.0.1:38822_solr c:testschemaapi s:shard1 r:core_node2 x:testschemaapi_shard1_replica2] o.a.s.c.ZkController We are https://127.0.0.1:38822/solr/test

[...truncated too long message...]

28036B-001/tempDir-001/node2/./testschemaapi_shard1_replica1/data
   [junit4]   2> 20135 INFO  (Thread-48) [n:127.0.0.1:38822_solr c:testschemaapi s:shard1 r:core_node2 x:testschemaapi_shard1_replica2] o.a.s.c.CachingDirectoryFactory looking to close /home/jenkins/workspace/Lucene-Solr-master-Linux/solr/build/solr-core/test/J1/temp/solr.schema.TestManagedSchemaAPI_2C69E749B828036B-001/tempDir-001/node1/./testschemaapi_shard1_replica2/data [CachedDir<<refCount=0;path=/home/jenkins/workspace/Lucene-Solr-master-Linux/solr/build/solr-core/test/J1/temp/solr.schema.TestManagedSchemaAPI_2C69E749B828036B-001/tempDir-001/node1/./testschemaapi_shard1_replica2/data;done=false>>]
   [junit4]   2> 20136 INFO  (Thread-47) [n:127.0.0.1:40366_solr c:testschemaapi s:shard1 r:core_node1 x:testschemaapi_shard1_replica1] o.a.s.c.CachingDirectoryFactory looking to close /home/jenkins/workspace/Lucene-Solr-master-Linux/solr/build/solr-core/test/J1/temp/solr.schema.TestManagedSchemaAPI_2C69E749B828036B-001/tempDir-001/node2/./testschemaapi_shard1_replica1/data/snapshot_metadata [CachedDir<<refCount=0;path=/home/jenkins/workspace/Lucene-Solr-master-Linux/solr/build/solr-core/test/J1/temp/solr.schema.TestManagedSchemaAPI_2C69E749B828036B-001/tempDir-001/node2/./testschemaapi_shard1_replica1/data/snapshot_metadata;done=false>>]
   [junit4]   2> 20136 INFO  (Thread-48) [n:127.0.0.1:38822_solr c:testschemaapi s:shard1 r:core_node2 x:testschemaapi_shard1_replica2] o.a.s.c.CachingDirectoryFactory Closing directory, CoreContainer#isShutdown=true
   [junit4]   2> 20136 INFO  (Thread-47) [n:127.0.0.1:40366_solr c:testschemaapi s:shard1 r:core_node1 x:testschemaapi_shard1_replica1] o.a.s.c.CachingDirectoryFactory Closing directory, CoreContainer#isShutdown=true
   [junit4]   2> 20136 INFO  (Thread-48) [n:127.0.0.1:38822_solr c:testschemaapi s:shard1 r:core_node2 x:testschemaapi_shard1_replica2] o.a.s.c.CachingDirectoryFactory Closing directory: /home/jenkins/workspace/Lucene-Solr-master-Linux/solr/build/solr-core/test/J1/temp/solr.schema.TestManagedSchemaAPI_2C69E749B828036B-001/tempDir-001/node1/./testschemaapi_shard1_replica2/data
   [junit4]   2> 20136 INFO  (Thread-47) [n:127.0.0.1:40366_solr c:testschemaapi s:shard1 r:core_node1 x:testschemaapi_shard1_replica1] o.a.s.c.CachingDirectoryFactory Closing directory: /home/jenkins/workspace/Lucene-Solr-master-Linux/solr/build/solr-core/test/J1/temp/solr.schema.TestManagedSchemaAPI_2C69E749B828036B-001/tempDir-001/node2/./testschemaapi_shard1_replica1/data/snapshot_metadata
   [junit4]   2> 20137 WARN  (Thread-47) [n:127.0.0.1:40366_solr c:testschemaapi s:shard1 r:core_node1 x:testschemaapi_shard1_replica1] o.a.s.c.ZkController listener throws error
   [junit4]   2> org.apache.solr.common.SolrException: Unable to reload core [testschemaapi_shard1_replica1]
   [junit4]   2> 	at org.apache.solr.core.CoreContainer.reload(CoreContainer.java:968)
   [junit4]   2> 	at org.apache.solr.core.SolrCore.lambda$getConfListener$6(SolrCore.java:2602)
   [junit4]   2> 	at org.apache.solr.cloud.ZkController.lambda$fireEventListeners$3(ZkController.java:2443)
   [junit4]   2> 	at java.lang.Thread.run(Thread.java:745)
   [junit4]   2> Caused by: org.apache.solr.common.SolrException: Failed to load config name for collection:testschemaapi due to: 
   [junit4]   2> 	at org.apache.solr.core.SolrCore.<init>(SolrCore.java:833)
   [junit4]   2> 	at org.apache.solr.core.SolrCore.reload(SolrCore.java:503)
   [junit4]   2> 	at org.apache.solr.core.CoreContainer.reload(CoreContainer.java:962)
   [junit4]   2> 	... 3 more
   [junit4]   2> Caused by: org.apache.solr.common.SolrException: Failed to load config name for collection:testschemaapi due to: 
   [junit4]   2> 	at org.apache.solr.rest.ManagedResourceStorage.newStorageIO(ManagedResourceStorage.java:98)
   [junit4]   2> 	at org.apache.solr.core.SolrCore.initRestManager(SolrCore.java:2382)
   [junit4]   2> 	at org.apache.solr.core.SolrCore.<init>(SolrCore.java:809)
   [junit4]   2> 	... 5 more
   [junit4]   2> Caused by: org.apache.solr.common.SolrException: Error loading config name for collection testschemaapi
   [junit4]   2> 	at org.apache.solr.common.cloud.ZkStateReader.readConfigName(ZkStateReader.java:197)
   [junit4]   2> 	at org.apache.solr.rest.ManagedResourceStorage.newStorageIO(ManagedResourceStorage.java:95)
   [junit4]   2> 	... 7 more
   [junit4]   2> Caused by: org.apache.zookeeper.KeeperException$SessionExpiredException: KeeperErrorCode = Session expired for /collections/testschemaapi
   [junit4]   2> 	at org.apache.zookeeper.KeeperException.create(KeeperException.java:127)
   [junit4]   2> 	at org.apache.zookeeper.KeeperException.create(KeeperException.java:51)
   [junit4]   2> 	at org.apache.zookeeper.ZooKeeper.getData(ZooKeeper.java:1155)
   [junit4]   2> 	at org.apache.solr.common.cloud.SolrZkClient$7.execute(SolrZkClient.java:348)
   [junit4]   2> 	at org.apache.solr.common.cloud.SolrZkClient$7.execute(SolrZkClient.java:345)
   [junit4]   2> 	at org.apache.solr.common.cloud.ZkCmdExecutor.retryOperation(ZkCmdExecutor.java:60)
   [junit4]   2> 	at org.apache.solr.common.cloud.SolrZkClient.getData(SolrZkClient.java:345)
   [junit4]   2> 	at org.apache.solr.common.cloud.ZkStateReader.readConfigName(ZkStateReader.java:178)
   [junit4]   2> 	... 8 more
   [junit4]   2> 20137 WARN  (Thread-48) [n:127.0.0.1:38822_solr c:testschemaapi s:shard1 r:core_node2 x:testschemaapi_shard1_replica2] o.a.s.c.ZkController listener throws error
   [junit4]   2> org.apache.solr.common.SolrException: Unable to reload core [testschemaapi_shard1_replica2]
   [junit4]   2> 	at org.apache.solr.core.CoreContainer.reload(CoreContainer.java:968)
   [junit4]   2> 	at org.apache.solr.core.SolrCore.lambda$getConfListener$6(SolrCore.java:2602)
   [junit4]   2> 	at org.apache.solr.cloud.ZkController.lambda$fireEventListeners$3(ZkController.java:2443)
   [junit4]   2> 	at java.lang.Thread.run(Thread.java:745)
   [junit4]   2> Caused by: org.apache.solr.common.SolrException: Failed to load config name for collection:testschemaapi due to: 
   [junit4]   2> 	at org.apache.solr.core.SolrCore.<init>(SolrCore.java:833)
   [junit4]   2> 	at org.apache.solr.core.SolrCore.reload(SolrCore.java:503)
   [junit4]   2> 	at org.apache.solr.core.CoreContainer.reload(CoreContainer.java:962)
   [junit4]   2> 	... 3 more
   [junit4]   2> Caused by: org.apache.solr.common.SolrException: Failed to load config name for collection:testschemaapi due to: 
   [junit4]   2> 	at org.apache.solr.rest.ManagedResourceStorage.newStorageIO(ManagedResourceStorage.java:98)
   [junit4]   2> 	at org.apache.solr.core.SolrCore.initRestManager(SolrCore.java:2382)
   [junit4]   2> 	at org.apache.solr.core.SolrCore.<init>(SolrCore.java:809)
   [junit4]   2> 	... 5 more
   [junit4]   2> Caused by: org.apache.solr.common.SolrException: Error loading config name for collection testschemaapi
   [junit4]   2> 	at org.apache.solr.common.cloud.ZkStateReader.readConfigName(ZkStateReader.java:197)
   [junit4]   2> 	at org.apache.solr.rest.ManagedResourceStorage.newStorageIO(ManagedResourceStorage.java:95)
   [junit4]   2> 	... 7 more
   [junit4]   2> Caused by: org.apache.zookeeper.KeeperException$SessionExpiredException: KeeperErrorCode = Session expired for /collections/testschemaapi
   [junit4]   2> 	at org.apache.zookeeper.KeeperException.create(KeeperException.java:127)
   [junit4]   2> 	at org.apache.zookeeper.KeeperException.create(KeeperException.java:51)
   [junit4]   2> 	at org.apache.zookeeper.ZooKeeper.getData(ZooKeeper.java:1155)
   [junit4]   2> 	at org.apache.solr.common.cloud.SolrZkClient$7.execute(SolrZkClient.java:348)
   [junit4]   2> 	at org.apache.solr.common.cloud.SolrZkClient$7.execute(SolrZkClient.java:345)
   [junit4]   2> 	at org.apache.solr.common.cloud.ZkCmdExecutor.retryOperation(ZkCmdExecutor.java:60)
   [junit4]   2> 	at org.apache.solr.common.cloud.SolrZkClient.getData(SolrZkClient.java:345)
   [junit4]   2> 	at org.apache.solr.common.cloud.ZkStateReader.readConfigName(ZkStateReader.java:178)
   [junit4]   2> 	... 8 more
   [junit4]   2> Sep 10, 2016 9:56:44 AM com.carrotsearch.randomizedtesting.ThreadLeakControl checkThreadLeaks
   [junit4]   2> WARNING: Will linger awaiting termination of 6 leaked thread(s).
   [junit4]   2> NOTE: test params are: codec=Asserting(Lucene62): {_version_=TestBloomFilteredLucenePostings(BloomFilteringPostingsFormat(Lucene50(blocksize=128))), id=PostingsFormat(name=Direct), myNewField1=PostingsFormat(name=Direct), myNewField=TestBloomFilteredLucenePostings(BloomFilteringPostingsFormat(Lucene50(blocksize=128)))}, docValues:{}, maxPointsInLeafNode=532, maxMBSortInHeap=5.196963852035661, sim=RandomSimilarity(queryNorm=false): {}, locale=ar-QA, timezone=Africa/Khartoum
   [junit4]   2> NOTE: Linux 4.4.0-36-generic i386/Oracle Corporation 1.8.0_102 (32-bit)/cpus=12,threads=1,free=16491168,total=46579712
   [junit4]   2> NOTE: All tests run in this JVM: [TestRestoreCore, TestManagedSchemaAPI]
   [junit4]   2> NOTE: reproduce with: ant test  -Dtestcase=TestManagedSchemaAPI -Dtests.seed=2C69E749B828036B -Dtests.multiplier=3 -Dtests.slow=true -Dtests.locale=ar-QA -Dtests.timezone=Africa/Khartoum -Dtests.asserts=true -Dtests.file.encoding=ISO-8859-1
   [junit4] ERROR   0.00s J1 | TestManagedSchemaAPI (suite) <<<
   [junit4]    > Throwable #1: java.lang.AssertionError: ObjectTracker found 10 object(s) that were not released!!! [TransactionLog, MockDirectoryWrapper, MockDirectoryWrapper, MockDirectoryWrapper, MDCAwareThreadPoolExecutor, MDCAwareThreadPoolExecutor, MockDirectoryWrapper, MockDirectoryWrapper, TransactionLog, MockDirectoryWrapper]
   [junit4]    > 	at __randomizedtesting.SeedInfo.seed([2C69E749B828036B]:0)
   [junit4]    > 	at org.apache.solr.SolrTestCaseJ4.teardownTestCases(SolrTestCaseJ4.java:257)
   [junit4]    > 	at java.lang.Thread.run(Thread.java:745)
   [junit4] Completed [12/631 (1!)] on J1 in 13.80s, 1 test, 1 failure <<< FAILURES!

[...truncated 54515 lines...]


Mime
View raw message