lucene-dev mailing list archives

Site index · List index
Message view « Date » · « Thread »
Top « Date » · « Thread »
From Policeman Jenkins Server <jenk...@thetaphi.de>
Subject [JENKINS] Lucene-Solr-5.5-Windows (32bit/jdk1.8.0_102) - Build # 113 - Unstable!
Date Sun, 04 Sep 2016 15:57:12 GMT
Build: http://jenkins.thetaphi.de/job/Lucene-Solr-5.5-Windows/113/
Java: 32bit/jdk1.8.0_102 -client -XX:+UseConcMarkSweepGC

2 tests failed.
FAILED:  org.apache.solr.handler.TestReplicationHandler.doTestIndexFetchOnMasterRestart

Error Message:
expected:<1> but was:<2>

Stack Trace:
java.lang.AssertionError: expected:<1> but was:<2>
	at __randomizedtesting.SeedInfo.seed([CFF01DE76BF1B182:1707D903C02A73DE]:0)
	at org.junit.Assert.fail(Assert.java:93)
	at org.junit.Assert.failNotEquals(Assert.java:647)
	at org.junit.Assert.assertEquals(Assert.java:128)
	at org.junit.Assert.assertEquals(Assert.java:472)
	at org.junit.Assert.assertEquals(Assert.java:456)
	at org.apache.solr.handler.TestReplicationHandler.doTestIndexFetchOnMasterRestart(TestReplicationHandler.java:624)
	at sun.reflect.NativeMethodAccessorImpl.invoke0(Native Method)
	at sun.reflect.NativeMethodAccessorImpl.invoke(NativeMethodAccessorImpl.java:62)
	at sun.reflect.DelegatingMethodAccessorImpl.invoke(DelegatingMethodAccessorImpl.java:43)
	at java.lang.reflect.Method.invoke(Method.java:498)
	at com.carrotsearch.randomizedtesting.RandomizedRunner.invoke(RandomizedRunner.java:1764)
	at com.carrotsearch.randomizedtesting.RandomizedRunner$8.evaluate(RandomizedRunner.java:871)
	at com.carrotsearch.randomizedtesting.RandomizedRunner$9.evaluate(RandomizedRunner.java:907)
	at com.carrotsearch.randomizedtesting.RandomizedRunner$10.evaluate(RandomizedRunner.java:921)
	at com.carrotsearch.randomizedtesting.rules.SystemPropertiesRestoreRule$1.evaluate(SystemPropertiesRestoreRule.java:57)
	at org.apache.lucene.util.TestRuleSetupTeardownChained$1.evaluate(TestRuleSetupTeardownChained.java:49)
	at org.apache.lucene.util.AbstractBeforeAfterRule$1.evaluate(AbstractBeforeAfterRule.java:45)
	at org.apache.lucene.util.TestRuleThreadAndTestName$1.evaluate(TestRuleThreadAndTestName.java:48)
	at org.apache.lucene.util.TestRuleIgnoreAfterMaxFailures$1.evaluate(TestRuleIgnoreAfterMaxFailures.java:64)
	at org.apache.lucene.util.TestRuleMarkFailure$1.evaluate(TestRuleMarkFailure.java:47)
	at com.carrotsearch.randomizedtesting.rules.StatementAdapter.evaluate(StatementAdapter.java:36)
	at com.carrotsearch.randomizedtesting.ThreadLeakControl$StatementRunner.run(ThreadLeakControl.java:367)
	at com.carrotsearch.randomizedtesting.ThreadLeakControl.forkTimeoutingTask(ThreadLeakControl.java:809)
	at com.carrotsearch.randomizedtesting.ThreadLeakControl$3.evaluate(ThreadLeakControl.java:460)
	at com.carrotsearch.randomizedtesting.RandomizedRunner.runSingleTest(RandomizedRunner.java:880)
	at com.carrotsearch.randomizedtesting.RandomizedRunner$5.evaluate(RandomizedRunner.java:781)
	at com.carrotsearch.randomizedtesting.RandomizedRunner$6.evaluate(RandomizedRunner.java:816)
	at com.carrotsearch.randomizedtesting.RandomizedRunner$7.evaluate(RandomizedRunner.java:827)
	at com.carrotsearch.randomizedtesting.rules.StatementAdapter.evaluate(StatementAdapter.java:36)
	at com.carrotsearch.randomizedtesting.rules.SystemPropertiesRestoreRule$1.evaluate(SystemPropertiesRestoreRule.java:57)
	at org.apache.lucene.util.AbstractBeforeAfterRule$1.evaluate(AbstractBeforeAfterRule.java:45)
	at com.carrotsearch.randomizedtesting.rules.StatementAdapter.evaluate(StatementAdapter.java:36)
	at org.apache.lucene.util.TestRuleStoreClassName$1.evaluate(TestRuleStoreClassName.java:41)
	at com.carrotsearch.randomizedtesting.rules.NoShadowingOrOverridesOnMethodsRule$1.evaluate(NoShadowingOrOverridesOnMethodsRule.java:40)
	at com.carrotsearch.randomizedtesting.rules.NoShadowingOrOverridesOnMethodsRule$1.evaluate(NoShadowingOrOverridesOnMethodsRule.java:40)
	at com.carrotsearch.randomizedtesting.rules.StatementAdapter.evaluate(StatementAdapter.java:36)
	at com.carrotsearch.randomizedtesting.rules.StatementAdapter.evaluate(StatementAdapter.java:36)
	at com.carrotsearch.randomizedtesting.rules.StatementAdapter.evaluate(StatementAdapter.java:36)
	at org.apache.lucene.util.TestRuleAssertionsRequired$1.evaluate(TestRuleAssertionsRequired.java:53)
	at org.apache.lucene.util.TestRuleMarkFailure$1.evaluate(TestRuleMarkFailure.java:47)
	at org.apache.lucene.util.TestRuleIgnoreAfterMaxFailures$1.evaluate(TestRuleIgnoreAfterMaxFailures.java:64)
	at org.apache.lucene.util.TestRuleIgnoreTestSuites$1.evaluate(TestRuleIgnoreTestSuites.java:54)
	at com.carrotsearch.randomizedtesting.rules.StatementAdapter.evaluate(StatementAdapter.java:36)
	at com.carrotsearch.randomizedtesting.ThreadLeakControl$StatementRunner.run(ThreadLeakControl.java:367)
	at java.lang.Thread.run(Thread.java:745)


FAILED:  org.apache.solr.handler.TestReplicationHandler.doTestIndexAndConfigAliasReplication

Error Message:
Index: 0, Size: 0

Stack Trace:
java.lang.IndexOutOfBoundsException: Index: 0, Size: 0
	at __randomizedtesting.SeedInfo.seed([CFF01DE76BF1B182:3883F3BFAD191E64]:0)
	at java.util.ArrayList.rangeCheck(ArrayList.java:653)
	at java.util.ArrayList.get(ArrayList.java:429)
	at org.apache.solr.handler.TestReplicationHandler.doTestIndexAndConfigAliasReplication(TestReplicationHandler.java:1323)
	at sun.reflect.NativeMethodAccessorImpl.invoke0(Native Method)
	at sun.reflect.NativeMethodAccessorImpl.invoke(NativeMethodAccessorImpl.java:62)
	at sun.reflect.DelegatingMethodAccessorImpl.invoke(DelegatingMethodAccessorImpl.java:43)
	at java.lang.reflect.Method.invoke(Method.java:498)
	at com.carrotsearch.randomizedtesting.RandomizedRunner.invoke(RandomizedRunner.java:1764)
	at com.carrotsearch.randomizedtesting.RandomizedRunner$8.evaluate(RandomizedRunner.java:871)
	at com.carrotsearch.randomizedtesting.RandomizedRunner$9.evaluate(RandomizedRunner.java:907)
	at com.carrotsearch.randomizedtesting.RandomizedRunner$10.evaluate(RandomizedRunner.java:921)
	at com.carrotsearch.randomizedtesting.rules.SystemPropertiesRestoreRule$1.evaluate(SystemPropertiesRestoreRule.java:57)
	at org.apache.lucene.util.TestRuleSetupTeardownChained$1.evaluate(TestRuleSetupTeardownChained.java:49)
	at org.apache.lucene.util.AbstractBeforeAfterRule$1.evaluate(AbstractBeforeAfterRule.java:45)
	at org.apache.lucene.util.TestRuleThreadAndTestName$1.evaluate(TestRuleThreadAndTestName.java:48)
	at org.apache.lucene.util.TestRuleIgnoreAfterMaxFailures$1.evaluate(TestRuleIgnoreAfterMaxFailures.java:64)
	at org.apache.lucene.util.TestRuleMarkFailure$1.evaluate(TestRuleMarkFailure.java:47)
	at com.carrotsearch.randomizedtesting.rules.StatementAdapter.evaluate(StatementAdapter.java:36)
	at com.carrotsearch.randomizedtesting.ThreadLeakControl$StatementRunner.run(ThreadLeakControl.java:367)
	at com.carrotsearch.randomizedtesting.ThreadLeakControl.forkTimeoutingTask(ThreadLeakControl.java:809)
	at com.carrotsearch.randomizedtesting.ThreadLeakControl$3.evaluate(ThreadLeakControl.java:460)
	at com.carrotsearch.randomizedtesting.RandomizedRunner.runSingleTest(RandomizedRunner.java:880)
	at com.carrotsearch.randomizedtesting.RandomizedRunner$5.evaluate(RandomizedRunner.java:781)
	at com.carrotsearch.randomizedtesting.RandomizedRunner$6.evaluate(RandomizedRunner.java:816)
	at com.carrotsearch.randomizedtesting.RandomizedRunner$7.evaluate(RandomizedRunner.java:827)
	at com.carrotsearch.randomizedtesting.rules.StatementAdapter.evaluate(StatementAdapter.java:36)
	at com.carrotsearch.randomizedtesting.rules.SystemPropertiesRestoreRule$1.evaluate(SystemPropertiesRestoreRule.java:57)
	at org.apache.lucene.util.AbstractBeforeAfterRule$1.evaluate(AbstractBeforeAfterRule.java:45)
	at com.carrotsearch.randomizedtesting.rules.StatementAdapter.evaluate(StatementAdapter.java:36)
	at org.apache.lucene.util.TestRuleStoreClassName$1.evaluate(TestRuleStoreClassName.java:41)
	at com.carrotsearch.randomizedtesting.rules.NoShadowingOrOverridesOnMethodsRule$1.evaluate(NoShadowingOrOverridesOnMethodsRule.java:40)
	at com.carrotsearch.randomizedtesting.rules.NoShadowingOrOverridesOnMethodsRule$1.evaluate(NoShadowingOrOverridesOnMethodsRule.java:40)
	at com.carrotsearch.randomizedtesting.rules.StatementAdapter.evaluate(StatementAdapter.java:36)
	at com.carrotsearch.randomizedtesting.rules.StatementAdapter.evaluate(StatementAdapter.java:36)
	at com.carrotsearch.randomizedtesting.rules.StatementAdapter.evaluate(StatementAdapter.java:36)
	at org.apache.lucene.util.TestRuleAssertionsRequired$1.evaluate(TestRuleAssertionsRequired.java:53)
	at org.apache.lucene.util.TestRuleMarkFailure$1.evaluate(TestRuleMarkFailure.java:47)
	at org.apache.lucene.util.TestRuleIgnoreAfterMaxFailures$1.evaluate(TestRuleIgnoreAfterMaxFailures.java:64)
	at org.apache.lucene.util.TestRuleIgnoreTestSuites$1.evaluate(TestRuleIgnoreTestSuites.java:54)
	at com.carrotsearch.randomizedtesting.rules.StatementAdapter.evaluate(StatementAdapter.java:36)
	at com.carrotsearch.randomizedtesting.ThreadLeakControl$StatementRunner.run(ThreadLeakControl.java:367)
	at java.lang.Thread.run(Thread.java:745)




Build Log:
[...truncated 10934 lines...]
   [junit4] Suite: org.apache.solr.handler.TestReplicationHandler
   [junit4]   2> Creating dataDir: C:\Users\jenkins\workspace\Lucene-Solr-5.5-Windows\solr\build\solr-core\test\J0\temp\solr.handler.TestReplicationHandler_CFF01DE76BF1B182-001\init-core-data-001
   [junit4]   2> 598882 INFO  (TEST-TestReplicationHandler.doTestHandlerPathUnchanged-seed#[CFF01DE76BF1B182]) [    ] o.a.s.SolrTestCaseJ4 ###Starting doTestHandlerPathUnchanged
   [junit4]   2> 598888 INFO  (TEST-TestReplicationHandler.doTestHandlerPathUnchanged-seed#[CFF01DE76BF1B182]) [    ] o.a.s.SolrTestCaseJ4 Writing core.properties file to C:\Users\jenkins\workspace\Lucene-Solr-5.5-Windows\solr\build\solr-core\test\J0\temp\solr.handler.TestReplicationHandler_CFF01DE76BF1B182-001\solr-instance-001\collection1
   [junit4]   2> 598918 INFO  (TEST-TestReplicationHandler.doTestHandlerPathUnchanged-seed#[CFF01DE76BF1B182]) [    ] o.e.j.s.Server jetty-9.2.13.v20150730
   [junit4]   2> 598920 INFO  (TEST-TestReplicationHandler.doTestHandlerPathUnchanged-seed#[CFF01DE76BF1B182]) [    ] o.e.j.s.h.ContextHandler Started o.e.j.s.ServletContextHandler@74b056{/solr,null,AVAILABLE}
   [junit4]   2> 598927 INFO  (TEST-TestReplicationHandler.doTestHandlerPathUnchanged-seed#[CFF01DE76BF1B182]) [    ] o.e.j.s.ServerConnector Started ServerConnector@140a103{HTTP/1.1}{127.0.0.1:60794}
   [junit4]   2> 598927 INFO  (TEST-TestReplicationHandler.doTestHandlerPathUnchanged-seed#[CFF01DE76BF1B182]) [    ] o.e.j.s.Server Started @605314ms
   [junit4]   2> 598927 INFO  (TEST-TestReplicationHandler.doTestHandlerPathUnchanged-seed#[CFF01DE76BF1B182]) [    ] o.a.s.c.s.e.JettySolrRunner Jetty properties: {solr.data.dir=C:\Users\jenkins\workspace\Lucene-Solr-5.5-Windows\solr\build\solr-core\test\J0\temp\solr.handler.TestReplicationHandler_CFF01DE76BF1B182-001\solr-instance-001\collection1\data, hostContext=/solr, hostPort=60794}
   [junit4]   2> 598928 INFO  (TEST-TestReplicationHandler.doTestHandlerPathUnchanged-seed#[CFF01DE76BF1B182]) [    ] o.a.s.s.SolrDispatchFilter SolrDispatchFilter.init(): sun.misc.Launcher$AppClassLoader@1d16e93
   [junit4]   2> 598928 INFO  (TEST-TestReplicationHandler.doTestHandlerPathUnchanged-seed#[CFF01DE76BF1B182]) [    ] o.a.s.c.SolrResourceLoader new SolrResourceLoader for directory: 'C:\Users\jenkins\workspace\Lucene-Solr-5.5-Windows\solr\build\solr-core\test\J0\temp\solr.handler.TestReplicationHandler_CFF01DE76BF1B182-001\solr-instance-001'
   [junit4]   2> 598929 INFO  (TEST-TestReplicationHandler.doTestHandlerPathUnchanged-seed#[CFF01DE76BF1B182]) [    ] o.a.s.c.SolrResourceLoader JNDI not configured for solr (NoInitialContextEx)
   [junit4]   2> 598929 INFO  (TEST-TestReplicationHandler.doTestHandlerPathUnchanged-seed#[CFF01DE76BF1B182]) [    ] o.a.s.c.SolrResourceLoader solr home defaulted to 'solr/' (could not find system property or JNDI)
   [junit4]   2> 598933 INFO  (TEST-TestReplicationHandler.doTestHandlerPathUnchanged-seed#[CFF01DE76BF1B182]) [    ] o.a.s.c.SolrXmlConfig Loading container configuration from C:\Users\jenkins\workspace\Lucene-Solr-5.5-Windows\solr\build\solr-core\test\J0\temp\solr.handler.TestReplicationHandler_CFF01DE76BF1B182-001\solr-instance-001\solr.xml
   [junit4]   2> 599050 INFO  (TEST-TestReplicationHandler.doTestHandlerPathUnchanged-seed#[CFF01DE76BF1B182]) [    ] o.a.s.c.CorePropertiesLocator Config-defined core root directory: C:\Users\jenkins\workspace\Lucene-Solr-5.5-Windows\solr\build\solr-core\test\J0\temp\solr.handler.TestReplicationHandler_CFF01DE76BF1B182-001\solr-instance-001\.
   [junit4]   2> 599051 INFO  (TEST-TestReplicationHandler.doTestHandlerPathUnchanged-seed#[CFF01DE76BF1B182]) [    ] o.a.s.c.CoreContainer New CoreContainer 18006288
   [junit4]   2> 599051 INFO  (TEST-TestReplicationHandler.doTestHandlerPathUnchanged-seed#[CFF01DE76BF1B182]) [    ] o.a.s.c.CoreContainer Loading cores into CoreContainer [instanceDir=C:\Users\jenkins\workspace\Lucene-Solr-5.5-Windows\solr\build\solr-core\test\J0\temp\solr.handler.TestReplicationHandler_CFF01DE76BF1B182-001\solr-instance-001]
   [junit4]   2> 599051 WARN  (TEST-TestReplicationHandler.doTestHandlerPathUnchanged-seed#[CFF01DE76BF1B182]) [    ] o.a.s.c.CoreContainer Couldn't add files from C:\Users\jenkins\workspace\Lucene-Solr-5.5-Windows\solr\build\solr-core\test\J0\temp\solr.handler.TestReplicationHandler_CFF01DE76BF1B182-001\solr-instance-001\lib to classpath: C:\Users\jenkins\workspace\Lucene-Solr-5.5-Windows\solr\build\solr-core\test\J0\temp\solr.handler.TestReplicationHandler_CFF01DE76BF1B182-001\solr-instance-001\lib
   [junit4]   2> 599052 INFO  (TEST-TestReplicationHandler.doTestHandlerPathUnchanged-seed#[CFF01DE76BF1B182]) [    ] o.a.s.h.c.HttpShardHandlerFactory created with socketTimeout : 90000,urlScheme : ,connTimeout : 15000,maxConnectionsPerHost : 20,maxConnections : 10000,corePoolSize : 0,maximumPoolSize : 2147483647,maxThreadIdleTime : 5,sizeOfQueue : -1,fairnessPolicy : false,useRetries : false,connectionsEvictorSleepDelay : 5000,maxConnectionIdleTime : 40000,
   [junit4]   2> 599054 INFO  (TEST-TestReplicationHandler.doTestHandlerPathUnchanged-seed#[CFF01DE76BF1B182]) [    ] o.a.s.u.UpdateShardHandler Creating UpdateShardHandler HTTP client with params: socketTimeout=340000&connTimeout=45000&retry=true
   [junit4]   2> 599055 INFO  (TEST-TestReplicationHandler.doTestHandlerPathUnchanged-seed#[CFF01DE76BF1B182]) [    ] o.a.s.l.LogWatcher SLF4J impl is org.slf4j.impl.Log4jLoggerFactory
   [junit4]   2> 599055 INFO  (TEST-TestReplicationHandler.doTestHandlerPathUnchanged-seed#[CFF01DE76BF1B182]) [    ] o.a.s.l.LogWatcher Registering Log Listener [Log4j (org.slf4j.impl.Log4jLoggerFactory)]
   [junit4]   2> 599055 INFO  (TEST-TestReplicationHandler.doTestHandlerPathUnchanged-seed#[CFF01DE76BF1B182]) [    ] o.a.s.c.CoreContainer Security conf doesn't exist. Skipping setup for authorization module.
   [junit4]   2> 599056 INFO  (TEST-TestReplicationHandler.doTestHandlerPathUnchanged-seed#[CFF01DE76BF1B182]) [    ] o.a.s.c.CoreContainer No authentication plugin used.
   [junit4]   2> 599059 INFO  (TEST-TestReplicationHandler.doTestHandlerPathUnchanged-seed#[CFF01DE76BF1B182]) [    ] o.a.s.c.CorePropertiesLocator Looking for core definitions underneath C:\Users\jenkins\workspace\Lucene-Solr-5.5-Windows\solr\build\solr-core\test\J0\temp\solr.handler.TestReplicationHandler_CFF01DE76BF1B182-001\solr-instance-001\.
   [junit4]   2> 599065 INFO  (TEST-TestReplicationHandler.doTestHandlerPathUnchanged-seed#[CFF01DE76BF1B182]) [    ] o.a.s.c.CoreDescriptor Created CoreDescriptor: {name=collection1, config=solrconfig.xml, loadOnStartup=true, schema=schema.xml, configSetProperties=configsetprops.json, transient=false, dataDir=data\}
   [junit4]   2> 599065 INFO  (TEST-TestReplicationHandler.doTestHandlerPathUnchanged-seed#[CFF01DE76BF1B182]) [    ] o.a.s.c.CorePropertiesLocator Found core collection1 in C:\Users\jenkins\workspace\Lucene-Solr-5.5-Windows\solr\build\solr-core\test\J0\temp\solr.handler.TestReplicationHandler_CFF01DE76BF1B182-001\solr-instance-001\.\collection1
   [junit4]   2> 599066 INFO  (TEST-TestReplicationHandler.doTestHandlerPathUnchanged-seed#[CFF01DE76BF1B182]) [    ] o.a.s.c.CorePropertiesLocator Found 1 core definitions
   [junit4]   2> 599067 INFO  (TEST-TestReplicationHandler.doTestHandlerPathUnchanged-seed#[CFF01DE76BF1B182]) [    ] o.a.s.s.SolrDispatchFilter user.dir=C:\Users\jenkins\workspace\Lucene-Solr-5.5-Windows\solr\build\solr-core\test\J0
   [junit4]   2> 599067 INFO  (TEST-TestReplicationHandler.doTestHandlerPathUnchanged-seed#[CFF01DE76BF1B182]) [    ] o.a.s.s.SolrDispatchFilter SolrDispatchFilter.init() done
   [junit4]   2> 599069 INFO  (coreLoadExecutor-1901-thread-1) [    ] o.a.s.c.SolrResourceLoader new SolrResourceLoader for directory: 'C:\Users\jenkins\workspace\Lucene-Solr-5.5-Windows\solr\build\solr-core\test\J0\temp\solr.handler.TestReplicationHandler_CFF01DE76BF1B182-001\solr-instance-001\collection1'
   [junit4]   2> 599069 INFO  (coreLoadExecutor-1901-thread-1) [    ] o.a.s.c.SolrResourceLoader JNDI not configured for solr (NoInitialContextEx)
   [junit4]   2> 599069 INFO  (coreLoadExecutor-1901-thread-1) [    ] o.a.s.c.SolrResourceLoader solr home defaulted to 'solr/' (could not find system property or JNDI)
   [junit4]   2> 599195 INFO  (coreLoadExecutor-1901-thread-1) [    ] o.a.s.c.SolrConfig current version of requestparams : -1
   [junit4]   2> 599253 INFO  (coreLoadExecutor-1901-thread-1) [    ] o.a.s.c.SolrConfig Using Lucene MatchVersion: 5.5.3
   [junit4]   2> 599295 INFO  (coreLoadExecutor-1901-thread-1) [    ] o.a.s.c.SolrConfig Loaded SolrConfig: solrconfig.xml
   [junit4]   2> 599306 INFO  (coreLoadExecutor-1901-thread-1) [    ] o.a.s.s.IndexSchema [collection1] Schema name=test
   [junit4]   2> 599326 INFO  (coreLoadExecutor-1901-thread-1) [    ] o.a.s.s.IndexSchema unique key field: id
   [junit4]   2> 599335 INFO  (coreLoadExecutor-1901-thread-1) [    ] o.a.s.c.ConfigSetProperties Did not find ConfigSet properties, assuming default properties: Can't find resource 'configsetprops.json' in classpath or 'C:\Users\jenkins\workspace\Lucene-Solr-5.5-Windows\solr\build\solr-core\test\J0\temp\solr.handler.TestReplicationHandler_CFF01DE76BF1B182-001\solr-instance-001\collection1'
   [junit4]   2> 599335 INFO  (coreLoadExecutor-1901-thread-1) [    ] o.a.s.c.CoreContainer Creating SolrCore 'collection1' using configuration from instancedir C:\Users\jenkins\workspace\Lucene-Solr-5.5-Windows\solr\build\solr-core\test\J0\temp\solr.handler.TestReplicationHandler_CFF01DE76BF1B182-001\solr-instance-001\.\collection1
   [junit4]   2> 599335 INFO  (coreLoadExecutor-1901-thread-1) [    x:collection1] o.a.s.c.SolrCore org.apache.solr.core.MockDirectoryFactory
   [junit4]   2> 599336 INFO  (coreLoadExecutor-1901-thread-1) [    x:collection1] o.a.s.c.SolrCore [[collection1] ] Opening new SolrCore at [C:\Users\jenkins\workspace\Lucene-Solr-5.5-Windows\solr\build\solr-core\test\J0\temp\solr.handler.TestReplicationHandler_CFF01DE76BF1B182-001\solr-instance-001\collection1], dataDir=[C:\Users\jenkins\workspace\Lucene-Solr-5.5-Windows\solr\build\solr-core\test\J0\temp\solr.handler.TestReplicationHandler_CFF01DE76BF1B182-001\solr-instance-001\.\collection1\data\]
   [junit4]   2> 599336 INFO  (coreLoadExecutor-1901-thread-1) [    x:collection1] o.a.s.c.SolrCore JMX monitoring not detected for core: collection1
   [junit4]   2> 599337 INFO  (coreLoadExecutor-1901-thread-1) [    x:collection1] o.a.s.c.CachingDirectoryFactory return new directory for C:\Users\jenkins\workspace\Lucene-Solr-5.5-Windows\solr\build\solr-core\test\J0\temp\solr.handler.TestReplicationHandler_CFF01DE76BF1B182-001\solr-instance-001\.\collection1\data\
   [junit4]   2> 599337 INFO  (coreLoadExecutor-1901-thread-1) [    x:collection1] o.a.s.c.SolrCore New index directory detected: old=null new=C:\Users\jenkins\workspace\Lucene-Solr-5.5-Windows\solr\build\solr-core\test\J0\temp\solr.handler.TestReplicationHandler_CFF01DE76BF1B182-001\solr-instance-001\.\collection1\data\index/
   [junit4]   2> 599337 WARN  (coreLoadExecutor-1901-thread-1) [    x:collection1] o.a.s.c.SolrCore [collection1] Solr index directory 'C:\Users\jenkins\workspace\Lucene-Solr-5.5-Windows\solr\build\solr-core\test\J0\temp\solr.handler.TestReplicationHandler_CFF01DE76BF1B182-001\solr-instance-001\.\collection1\data\index' doesn't exist. Creating new index...
   [junit4]   2> 599337 INFO  (coreLoadExecutor-1901-thread-1) [    x:collection1] o.a.s.c.CachingDirectoryFactory return new directory for C:\Users\jenkins\workspace\Lucene-Solr-5.5-Windows\solr\build\solr-core\test\J0\temp\solr.handler.TestReplicationHandler_CFF01DE76BF1B182-001\solr-instance-001\.\collection1\data\index
   [junit4]   2> 599338 INFO  (coreLoadExecutor-1901-thread-1) [    x:collection1] o.a.s.u.RandomMergePolicy RandomMergePolicy wrapping class org.apache.lucene.index.LogByteSizeMergePolicy: [LogByteSizeMergePolicy: minMergeSize=1677721, mergeFactor=43, maxMergeSize=2147483648, maxMergeSizeForForcedMerge=9223372036854775807, calibrateSizeByDeletes=false, maxMergeDocs=2147483647, maxCFSSegmentSizeMB=8.796093022207999E12, noCFSRatio=0.0]
   [junit4]   2> 599347 INFO  (coreLoadExecutor-1901-thread-1) [    x:collection1] o.a.s.c.SolrDeletionPolicy SolrDeletionPolicy.onCommit: commits: num=1
   [junit4]   2> 	commit{dir=MockDirectoryWrapper(NRTCachingDirectory(RAMDirectory@3a646f lockFactory=org.apache.lucene.store.SingleInstanceLockFactory@d922a4; maxCacheMB=0.998046875 maxMergeSizeMB=0.3447265625)),segFN=segments_1,generation=1}
   [junit4]   2> 599352 INFO  (coreLoadExecutor-1901-thread-1) [    x:collection1] o.a.s.c.SolrDeletionPolicy newest commit generation = 1
   [junit4]   2> 599352 INFO  (OldIndexDirectoryCleanupThreadForCore-collection1) [    x:collection1] o.a.s.c.SolrCore Looking for old index directories to cleanup for core collection1 in C:\Users\jenkins\workspace\Lucene-Solr-5.5-Windows\solr\build\solr-core\test\J0\temp\solr.handler.TestReplicationHandler_CFF01DE76BF1B182-001\solr-instance-001\.\collection1\data\
   [junit4]   2> 599382 INFO  (coreLoadExecutor-1901-thread-1) [    x:collection1] o.a.s.c.SolrCore no updateRequestProcessorChain defined as default, creating implicit default
   [junit4]   2> 599406 INFO  (coreLoadExecutor-1901-thread-1) [    x:collection1] o.a.s.h.l.XMLLoader xsltCacheLifetimeSeconds=60
   [junit4]   2> 599411 INFO  (coreLoadExecutor-1901-thread-1) [    x:collection1] o.a.s.h.l.XMLLoader xsltCacheLifetimeSeconds=60
   [junit4]   2> 599425 INFO  (coreLoadExecutor-1901-thread-1) [    x:collection1] o.a.s.h.l.XMLLoader xsltCacheLifetimeSeconds=60
   [junit4]   2> 599439 INFO  (coreLoadExecutor-1901-thread-1) [    x:collection1] o.a.s.h.l.XMLLoader xsltCacheLifetimeSeconds=60
   [junit4]   2> 599458 INFO  (coreLoadExecutor-1901-thread-1) [    x:collection1] o.a.s.c.PluginBag requestHandler : 'lazy' created with startup=lazy 
   [junit4]   2> 599458 INFO  (coreLoadExecutor-1901-thread-1) [    x:collection1] o.a.s.c.RequestHandlers Registered paths: /admin/mbeans,standard,lazy,/update/csv,/update/json/docs,/admin/luke,/admin/segments,/get,/admin/system,/replication,/admin/properties,defaults,/config,/schema,/admin/plugins,/admin/logging,/update/json,/admin/threads,/admin/ping,/update,/admin/file
   [junit4]   2> 599462 INFO  (coreLoadExecutor-1901-thread-1) [    x:collection1] o.a.s.c.SolrCore Using default statsCache cache: org.apache.solr.search.stats.LocalStatsCache
   [junit4]   2> 599462 INFO  (coreLoadExecutor-1901-thread-1) [    x:collection1] o.a.s.u.CommitTracker Hard AutoCommit: disabled
   [junit4]   2> 599462 INFO  (coreLoadExecutor-1901-thread-1) [    x:collection1] o.a.s.u.CommitTracker Soft AutoCommit: disabled
   [junit4]   2> 599465 INFO  (coreLoadExecutor-1901-thread-1) [    x:collection1] o.a.s.u.RandomMergePolicy RandomMergePolicy wrapping class org.apache.lucene.index.LogDocMergePolicy: [LogDocMergePolicy: minMergeSize=1000, mergeFactor=38, maxMergeSize=9223372036854775807, maxMergeSizeForForcedMerge=9223372036854775807, calibrateSizeByDeletes=true, maxMergeDocs=2147483647, maxCFSSegmentSizeMB=8.796093022207999E12, noCFSRatio=0.0]
   [junit4]   2> 599473 INFO  (coreLoadExecutor-1901-thread-1) [    x:collection1] o.a.s.c.SolrDeletionPolicy SolrDeletionPolicy.onInit: commits: num=1
   [junit4]   2> 	commit{dir=MockDirectoryWrapper(NRTCachingDirectory(RAMDirectory@3a646f lockFactory=org.apache.lucene.store.SingleInstanceLockFactory@d922a4; maxCacheMB=0.998046875 maxMergeSizeMB=0.3447265625)),segFN=segments_1,generation=1}
   [junit4]   2> 599473 INFO  (coreLoadExecutor-1901-thread-1) [    x:collection1] o.a.s.c.SolrDeletionPolicy newest commit generation = 1
   [junit4]   2> 599477 INFO  (coreLoadExecutor-1901-thread-1) [    x:collection1] o.a.s.s.SolrIndexSearcher Opening Searcher@49bba8[collection1] main
   [junit4]   2> 599479 INFO  (coreLoadExecutor-1901-thread-1) [    x:collection1] o.a.s.r.ManagedResourceStorage File-based storage initialized to use dir: C:\Users\jenkins\workspace\Lucene-Solr-5.5-Windows\solr\build\solr-core\test\J0\temp\solr.handler.TestReplicationHandler_CFF01DE76BF1B182-001\solr-instance-001\collection1\conf
   [junit4]   2> 599480 INFO  (coreLoadExecutor-1901-thread-1) [    x:collection1] o.a.s.r.RestManager Initializing RestManager with initArgs: {storageDir=C:\Users\jenkins\workspace\Lucene-Solr-5.5-Windows\solr\build\solr-core\test\J0\temp\solr.handler.TestReplicationHandler_CFF01DE76BF1B182-001\solr-instance-001\collection1\conf}
   [junit4]   2> 599484 INFO  (coreLoadExecutor-1901-thread-1) [    x:collection1] o.a.s.r.ManagedResourceStorage Reading _rest_managed.json using file:dir=C:\Users\jenkins\workspace\Lucene-Solr-5.5-Windows\solr\build\solr-core\test\J0\temp\solr.handler.TestReplicationHandler_CFF01DE76BF1B182-001\solr-instance-001\collection1\conf
   [junit4]   2> 599485 INFO  (coreLoadExecutor-1901-thread-1) [    x:collection1] o.a.s.r.RestManager Initializing 0 registered ManagedResources
   [junit4]   2> 599485 INFO  (coreLoadExecutor-1901-thread-1) [    x:collection1] o.a.s.h.ReplicationHandler Replication enabled for following config files: schema.xml,xslt/dummy.xsl
   [junit4]   2> 599485 INFO  (coreLoadExecutor-1901-thread-1) [    x:collection1] o.a.s.h.ReplicationHandler Commits will be reserved for  10000
   [junit4]   2> 599485 INFO  (searcherExecutor-1902-thread-1-processing-x:collection1) [    x:collection1] o.a.s.c.SolrCore [collection1] Registered new searcher Searcher@49bba8[collection1] main{ExitableDirectoryReader(UninvertingDirectoryReader())}
   [junit4]   2> 599485 INFO  (coreLoadExecutor-1901-thread-1) [    x:collection1] o.a.s.c.CoreContainer registering core: collection1
   [junit4]   2> 599575 INFO  (TEST-TestReplicationHandler.doTestHandlerPathUnchanged-seed#[CFF01DE76BF1B182]) [    ] o.a.s.SolrTestCaseJ4 Writing core.properties file to C:\Users\jenkins\workspace\Lucene-Solr-5.5-Windows\solr\build\solr-core\test\J0\temp\solr.handler.TestReplicationHandler_CFF01DE76BF1B182-001\solr-instance-002\collection1
   [junit4]   2> 599601 INFO  (TEST-TestReplicationHandler.doTestHandlerPathUnchanged-seed#[CFF01DE76BF1B182]) [    ] o.e.j.s.Server jetty-9.2.13.v20150730
   [junit4]   2> 599607 INFO  (TEST-TestReplicationHandler.doTestHandlerPathUnchanged-seed#[CFF01DE76BF1B182]) [    ] o.e.j.s.h.ContextHandler Started o.e.j.s.ServletContextHandler@18d0aa1{/solr,null,AVAILABLE}
   [junit4]   2> 599609 INFO  (TEST-TestReplicationHandler.doTestHandlerPathUnchanged-seed#[CFF01DE76BF1B182]) [    ] o.e.j.s.ServerConnector Started ServerConnector@9680c{HTTP/1.1}{127.0.0.1:60804}
   [junit4]   2> 599609 INFO  (TEST-TestReplicationHandler.doTestHandlerPathUnchanged-seed#[CFF01DE76BF1B182]) [    ] o.e.j.s.Server Started @605996ms
   [junit4]   2> 599609 INFO  (TEST-TestReplicationHandler.doTestHandlerPathUnchanged-seed#[CFF01DE76BF1B182]) [    ] o.a.s.c.s.e.JettySolrRunner Jetty properties: {solr.data.dir=C:\Users\jenkins\workspace\Lucene-Solr-5.5-Windows\solr\build\solr-core\test\J0\temp\solr.handler.TestReplicationHandler_CFF01DE76BF1B182-001\solr-instance-002\collection1\data, hostContext=/solr, hostPort=60804}
   [junit4]   2> 599610 INFO  (TEST-TestReplicationHandler.doTestHandlerPathUnchanged-seed#[CFF01DE76BF1B182]) [    ] o.a.s.s.SolrDispatchFilter SolrDispatchFilter.init(): sun.misc.Launcher$AppClassLoader@1d16e93
   [junit4]   2> 599610 INFO  (TEST-TestReplicationHandler.doTestHandlerPathUnchanged-seed#[CFF01DE76BF1B182]) [    ] o.a.s.c.SolrResourceLoader new SolrResourceLoader for directory: 'C:\Users\jenkins\workspace\Lucene-Solr-5.5-Windows\solr\build\solr-core\test\J0\temp\solr.handler.TestReplicationHandler_CFF01DE76BF1B182-001\solr-instance-002'
   [junit4]   2> 599614 INFO  (TEST-TestReplicationHandler.doTestHandlerPathUnchanged-seed#[CFF01DE76BF1B182]) [    ] o.a.s.c.SolrResourceLoader JNDI not configured for solr (NoInitialContextEx)
   [junit4]   2> 599614 INFO  (TEST-TestReplicationHandler.doTestHandlerPathUnchanged-seed#[CFF01DE76BF1B182]) [    ] o.a.s.c.SolrResourceLoader solr home defaulted to 'solr/' (could not find system property or JNDI)
   [junit4]   2> 599616 INFO  (TEST-TestReplicationHandler.doTestHandlerPathUnchanged-seed#[CFF01DE76BF1B182]) [    ] o.a.s.c.SolrXmlConfig Loading container configuration from C:\Users\jenkins\workspace\Lucene-Solr-5.5-Windows\solr\build\solr-core\test\J0\temp\solr.handler.TestReplicationHandler_CFF01DE76BF1B182-001\solr-instance-002\solr.xml
   [junit4]   2> 599648 INFO  (TEST-TestReplicationHandler.doTestHandlerPathUnchanged-seed#[CFF01DE76BF1B182]) [    ] o.a.s.c.CorePropertiesLocator Config-defined core root directory: C:\Users\jenkins\workspace\Lucene-Solr-5.5-Windows\solr\build\solr-core\test\J0\temp\solr.handler.TestReplicationHandler_CFF01DE76BF1B182-001\solr-instance-002\.
   [junit4]   2> 599648 INFO  (TEST-TestReplicationHandler.doTestHandlerPathUnchanged-seed#[CFF01DE76BF1B182]) [    ] o.a.s.c.CoreContainer New CoreContainer 30067059
   [junit4]   2> 599648 INFO  (TEST-TestReplicationHandler.doTestHandlerPathUnchanged-seed#[CFF01DE76BF1B182]) [    ] o.a.s.c.CoreContainer Loading cores into CoreContainer [instanceDir=C:\Users\jenkins\workspace\Lucene-Solr-5.5-Windows\solr\build\solr-core\test\J0\temp\solr.handler.TestReplicationHandler_CFF01DE76BF1B182-001\solr-instance-002]
   [junit4]   2> 599651 WARN  (TEST-TestReplicationHandler.doTestHandlerPathUnchanged-seed#[CFF01DE76BF1B182]) [    ] o.a.s.c.CoreContainer Couldn't add files from C:\Users\jenkins\workspace\Lucene-Solr-5.5-Windows\solr\build\solr-core\test\J0\temp\solr.handler.TestReplicationHandler_CFF01DE76BF1B182-001\solr-instance-002\lib to classpath: C:\Users\jenkins\workspace\Lucene-Solr-5.5-Windows\solr\build\solr-core\test\J0\temp\solr.handler.TestReplicationHandler_CFF01DE76BF1B182-001\solr-instance-002\lib
   [junit4]   2> 599652 INFO  (TEST-TestReplicationHandler.doTestHandlerPathUnchanged-seed#[CFF01DE76BF1B182]) [    ] o.a.s.h.c.HttpShardHandlerFactory created with socketTimeout : 90000,urlScheme : ,connTimeout : 15000,maxConnectionsPerHost : 20,maxConnections : 10000,corePoolSize : 0,maximumPoolSize : 2147483647,maxThreadIdleTime : 5,sizeOfQueue : -1,fairnessPolicy : false,useRetries : false,connectionsEvictorSleepDelay : 5000,maxConnectionIdleTime : 40000,
   [junit4]   2> 599654 INFO  (TEST-TestReplicationHandler.doTestHandlerPathUnchanged-seed#[CFF01DE76BF1B182]) [    ] o.a.s.u.UpdateShardHandler Creating UpdateShardHandler HTTP client with params: socketTimeout=340000&connTimeout=45000&retry=true
   [junit4]   2> 599660 INFO  (TEST-TestReplicationHandler.doTestHandlerPathUnchanged-seed#[CFF01DE76BF1B182]) [    ] o.a.s.l.LogWatcher SLF4J impl is org.slf4j.impl.Log4jLoggerFactory
   [junit4]   2> 599660 INFO  (TEST-TestReplicationHandler.doTestHandlerPathUnchanged-seed#[CFF01DE76BF1B182]) [    ] o.a.s.l.LogWatcher Registering Log Listener [Log4j (org.slf4j.impl.Log4jLoggerFactory)]
   [junit4]   2> 599660 INFO  (TEST-TestReplicationHandler.doTestHandlerPathUnchanged-seed#[CFF01DE76BF1B182]) [    ] o.a.s.c.CoreContainer Security conf doesn't exist. Skipping setup for authorization module.
   [junit4]   2> 599660 INFO  (TEST-TestReplicationHandler.doTestHandlerPathUnchanged-seed#[CFF01DE76BF1B182]) [    ] o.a.s.c.CoreContainer No authentication plugin used.
   [junit4]   2> 599665 INFO  (TEST-TestReplicationHandler.doTestHandlerPathUnchanged-seed#[CFF01DE76BF1B182]) [    ] o.a.s.c.CorePropertiesLocator Looking for core definitions underneath C:\Users\jenkins\workspace\Lucene-Solr-5.5-Windows\solr\build\solr-core\test\J0\temp\solr.handler.TestReplicationHandler_CFF01DE76BF1B182-001\solr-instance-002\.
   [junit4]   2> 599675 INFO  (TEST-TestReplicationHandler.doTestHandlerPathUnchanged-seed#[CFF01DE76BF1B182]) [    ] o.a.s.c.CoreDescriptor Created CoreDescriptor: {name=collection1, config=solrconfig.xml, loadOnStartup=true, schema=schema.xml, configSetProperties=configsetprops.json, transient=false, dataDir=data\}
   [junit4]   2> 599675 INFO  (TEST-TestReplicationHandler.doTestHandlerPathUnchanged-seed#[CFF01DE76BF1B182]) [    ] o.a.s.c.CorePropertiesLocator Found core collection1 in C:\Users\jenkins\workspace\Lucene-Solr-5.5-Windows\solr\build\solr-core\test\J0\temp\solr.handler.TestReplicationHandler_CFF01DE76BF1B182-001\solr-instance-002\.\collection1
   [junit4]   2> 599680 INFO  (TEST-TestReplicationHandler.doTestHandlerPathUnchanged-seed#[CFF01DE76BF1B182]) [    ] o.a.s.c.CorePropertiesLocator Found 1 core definitions
   [junit4]   2> 599681 INFO  (TEST-TestReplicationHandler.doTestHandlerPathUnchanged-seed#[CFF01DE76BF1B182]) [    ] o.a.s.s.SolrDispatchFilter user.dir=C:\Users\jenkins\workspace\Lucene-Solr-5.5-Windows\solr\build\solr-core\test\J0
   [junit4]   2> 599681 INFO  (TEST-TestReplicationHandler.doTestHandlerPathUnchanged-seed#[CFF01DE76BF1B182]) [    ] o.a.s.s.SolrDispatchFilter SolrDispatchFilter.init() done
   [junit4]   2> 599682 INFO  (coreLoadExecutor-1911-thread-1) [    ] o.a.s.c.SolrResourceLoader new SolrResourceLoader for directory: 'C:\Users\jenkins\workspace\Lucene-Solr-5.5-Windows\solr\build\solr-core\test\J0\temp\solr.handler.TestReplicationHandler_CFF01DE76BF1B182-001\solr-instance-002\collection1'
   [junit4]   2> 599685 INFO  (coreLoadExecutor-1911-thread-1) [    ] o.a.s.c.SolrResourceLoader JNDI not configured for solr (NoInitialContextEx)
   [junit4]   2> 599687 INFO  (coreLoadExecutor-1911-thread-1) [    ] o.a.s.c.SolrResourceLoader solr home defaulted to 'solr/' (could not find system property or JNDI)
   [junit4]   2> 599753 INFO  (coreLoadExecutor-1911-thread-1) [    ] o.a.s.c.SolrConfig current version of requestparams : -1
   [junit4]   2> 599769 INFO  (coreLoadExecutor-1911-thread-1) [    ] o.a.s.c.SolrConfig Using Lucene MatchVersion: 5.5.3
   [junit4]   2> 599829 INFO  (coreLoadExecutor-1911-thread-1) [    ] o.a.s.c.SolrConfig Loaded SolrConfig: solrconfig.xml
   [junit4]   2> 599843 INFO  (coreLoadExecutor-1911-thread-1) [    ] o.a.s.s.IndexSchema [collection1] Schema name=test
   [junit4]   2> 599859 INFO  (coreLoadExecutor-1911-thread-1) [    ] o.a.s.s.IndexSchema unique key field: id
   [junit4]   2> 599889 INFO  (coreLoadExecutor-1911-thread-1) [    ] o.a.s.c.ConfigSetProperties Did not find ConfigSet properties, assuming default properties: Can't find resource 'configsetprops.json' in classpath or 'C:\Users\jenkins\workspace\Lucene-Solr-5.5-Windows\solr\build\solr-core\test\J0\temp\solr.handler.TestReplicationHandler_CFF01DE76BF1B182-001\solr-instance-002\collection1'
   [junit4]   2> 599889 INFO  (coreLoadExecutor-1911-thread-1) [    ] o.a.s.c.CoreContainer Creating SolrCore 'collection1' using configuration from instancedir C:\Users\jenkins\workspace\Lucene-Solr-5.5-Windows\solr\build\solr-core\test\J0\temp\solr.handler.TestReplicationHandler_CFF01DE76BF1B182-001\solr-instance-002\.\collection1
   [junit4]   2> 599890 INFO  (coreLoadExecutor-1911-thread-1) [    x:collection1] o.a.s.c.SolrCore org.apache.solr.core.MockDirectoryFactory
   [junit4]   2> 599891 INFO  (coreLoadExecutor-1911-thread-1) [    x:collection1] o.a.s.c.SolrCore [[collection1] ] Opening new SolrCore at [C:\Users\jenkins\workspace\Lucene-Solr-5.5-Windows\solr\build\solr-core\test\J0\temp\solr.handler.TestReplicationHandler_CFF01DE76BF1B182-001\solr-instance-002\collection1], dataDir=[C:\Users\jenkins\workspace\Lucene-Solr-5.5-Windows\solr\build\solr-core\test\J0\temp\solr.handler.TestReplicationHandler_CFF01DE76BF1B182-001\solr-instance-002\.\collection1\data\]
   [junit4]   2> 599891 INFO  (coreLoadExecutor-1911-thread-1) [    x:collection1] o.a.s.c.SolrCore JMX monitoring not detected for core: collection1
   [junit4]   2> 599892 INFO  (coreLoadExecutor-1911-thread-1) [    x:collection1] o.a.s.c.CachingDirectoryFactory return new directory for C:\Users\jenkins\workspace\Lucene-Solr-5.5-Windows\solr\build\solr-core\test\J0\temp\solr.handler.TestReplicationHandler_CFF01DE76BF1B182-001\solr-instance-002\.\collection1\data\
   [junit4]   2> 599892 INFO  (coreLoadExecutor-1911-thread-1) [    x:collection1] o.a.s.c.SolrCore New index directory detected: old=null new=C:\Users\jenkins\workspace\Lucene-Solr-5.5-Windows\solr\build\solr-core\test\J0\temp\solr.handler.TestReplicationHandler_CFF01DE76BF1B182-001\solr-instance-002\.\collection1\data\index/
   [junit4]   2> 599894 WARN  (coreLoadExecutor-1911-thread-1) [    x:collection1] o.a.s.c.SolrCore [collection1] Solr index directory 'C:\Users\jenkins\workspace\Lucene-Solr-5.5-Windows\solr\build\solr-core\test\J0\temp\solr.handler.TestReplicationHandler_CFF01DE76BF1B182-001\solr-instance-002\.\collection1\data\index' doesn't exist. Creating new index...
   [junit4]   2> 599896 INFO  (coreLoadExecutor-1911-thread-1) [    x:collection1] o.a.s.c.CachingDirectoryFactory return new directory for C:\Users\jenkins\workspace\Lucene-Solr-5.5-Windows\solr\build\solr-core\test\J0\temp\solr.handler.TestReplicationHandler_CFF01DE76BF1B182-001\solr-instance-002\.\collection1\data\index
   [junit4]   2> 599898 INFO  (coreLoadExecutor-1911-thread-1) [    x:collection1] o.a.s.u.RandomMergePolicy RandomMergePolicy wrapping class org.apache.lucene.index.LogByteSizeMergePolicy: [LogByteSizeMergePolicy: minMergeSize=1677721, mergeFactor=43, maxMergeSize=2147483648, maxMergeSizeForForcedMerge=9223372036854775807, calibrateSizeByDeletes=false, maxMergeDocs=2147483647, maxCFSSegmentSizeMB=8.796093022207999E12, noCFSRatio=0.0]
   [junit4]   2> 599903 INFO  (coreLoadExecutor-1911-thread-1) [    x:collection1] o.a.s.c.SolrDeletionPolicy SolrDeletionPolicy.onCommit: commits: num=1
   [junit4]   2> 	commit{dir=MockDirectoryWrapper(NRTCachingDirectory(RAMDirectory@17b7115 lockFactory=org.apache.lucene.store.SingleInstanceLockFactory@29f4b0; maxCacheMB=0.998046875 maxMergeSizeMB=0.3447265625)),segFN=segments_1,generation=1}
   [junit4]   2> 599903 INFO  (coreLoadExecutor-1911-thread-1) [    x:collection1] o.a.s.c.SolrDeletionPolicy newest commit generation = 1
   [junit4]   2> 599907 INFO  (OldIndexDirectoryCleanupThreadForCore-collection1) [    x:collection1] o.a.s.c.SolrCore Looking for old index directories to cleanup for core collection1 in C:\Users\jenkins\workspace\Lucene-Solr-5.5-Windows\solr\build\solr-core\test\J0\temp\solr.handler.TestReplicationHandler_CFF01DE76BF1B182-001\solr-instance-002\.\collection1\data\
   [junit4]   2> 599916 INFO  (coreLoadExecutor-1911-thread-1) [    x:collection1] o.a.s.c.SolrCore no updateRequestProcessorChain defined as default, creating implicit default
   [junit4]   2> 599934 INFO  (coreLoadExecutor-1911-thread-1) [    x:collection1] o.a.s.h.l.XMLLoader xsltCacheLifetimeSeconds=60
   [junit4]   2> 599940 INFO  (coreLoadExecutor-1911-thread-1) [    x:collection1] o.a.s.h.l.XMLLoader xsltCacheLifetimeSeconds=60
   [junit4]   2> 599942 INFO  (coreLoadExecutor-1911-thread-1) [    x:collection1] o.a.s.h.l.XMLLoader xsltCacheLifetimeSeconds=60
   [junit4]   2> 599946 INFO  (coreLoadExecutor-1911-thread-1) [    x:collection1] o.a.s.h.l.XMLLoader xsltCacheLifetimeSeconds=60
   [junit4]   2> 599948 INFO  (coreLoadExecutor-1911-thread-1) [    x:collection1] o.a.s.c.PluginBag requestHandler : 'lazy' created with startup=lazy 
   [junit4]   2> 599949 INFO  (coreLoadExecutor-1911-thread-1) [    x:collection1] o.a.s.c.RequestHandlers Registered paths: /admin/mbeans,standard,lazy,/update/csv,/update/json/docs,/admin/luke,/admin/segments,/get,/admin/system,/replication,/admin/properties,defaults,/config,/schema,/admin/plugins,/admin/logging,/update/json,/admin/threads,/admin/ping,/update,/admin/file
   [junit4]   2> 599952 INFO  (coreLoadExecutor-1911-thread-1) [    x:collection1] o.a.s.c.SolrCore Using default statsCache cache: org.apache.solr.search.stats.LocalStatsCache
   [junit4]   2> 599952 INFO  (coreLoadExecutor-1911-thread-1) [    x:collection1] o.a.s.u.CommitTracker Hard AutoCommit: disabled
   [junit4]   2> 599952 INFO  (coreLoadExecutor-1911-thread-1) [    x:collection1] o.a.s.u.CommitTracker Soft AutoCommit: disabled
   [junit4]   2> 599954 INFO  (coreLoadExecutor-1911-thread-1) [    x:collection1] o.a.s.u.RandomMergePolicy RandomMergePolicy wrapping class org.apache.lucene.index.LogDocMergePolicy: [LogDocMergePolicy: minMergeSize=1000, mergeFactor=38, maxMergeSize=9223372036854775807, maxMergeSizeForForcedMerge=9223372036854775807, calibrateSizeByDeletes=true, maxMergeDocs=2147483647, maxCFSSegmentSizeMB=8.796093022207999E12, noCFSRatio=0.0]
   [junit4]   2> 599962 INFO  (coreLoadExecutor-1911-thread-1) [    x:collection1] o.a.s.c.SolrDeletionPolicy SolrDeletionPolicy.onInit: commits: num=1
   [junit4]   2> 	commit{dir=MockDirectoryWrapper(NRTCachingDirectory(RAMDirectory@17b7115 lockFactory=org.apache.lucene.store.SingleInstanceLockFactory@29f4b0; maxCacheMB=0.998046875 maxMergeSizeMB=0.3447265625)),segFN=segments_1,generation=1}
   [junit4]   2> 599962 INFO  (coreLoadExecutor-1911-thread-1) [    x:collection1] o.a.s.c.SolrDeletionPolicy newest commit generation = 1
   [junit4]   2> 599962 INFO  (coreLoadExecutor-1911-thread-1) [    x:collection1] o.a.s.s.SolrIndexSearcher Opening Searcher@131d872[collection1] main
   [junit4]   2> 599967 INFO  (coreLoadExecutor-1911-thread-1) [    x:collection1] o.a.s.r.ManagedResourceStorage File-based storage initialized to use dir: C:\Users\jenkins\workspace\Lucene-Solr-5.5-Windows\solr\build\solr-core\test\J0\temp\solr.handler.TestReplicationHandler_CFF01DE76BF1B182-001\solr-instance-002\collection1\conf
   [junit4]   2> 599967 INFO  (coreLoadExecutor-1911-thread-1) [    x:collection1] o.a.s.r.RestManager Initializing RestManager with initArgs: {storageDir=C:\Users\jenkins\workspace\Lucene-Solr-5.5-Windows\solr\build\solr-core\test\J0\temp\solr.handler.TestReplicationHandler_CFF01DE76BF1B182-001\solr-instance-002\collection1\conf}
   [junit4]   2> 599967 INFO  (coreLoadExecutor-1911-thread-1) [    x:collection1] o.a.s.r.ManagedResourceStorage Reading _rest_managed.json using file:dir=C:\Users\jenkins\workspace\Lucene-Solr-5.5-Windows\solr\build\solr-core\test\J0\temp\solr.handler.TestReplicationHandler_CFF01DE76BF1B182-001\solr-instance-002\collection1\conf
   [junit4]   2> 599970 INFO  (coreLoadExecutor-1911-thread-1) [    x:collection1] o.a.s.r.RestManager Initializing 0 registered ManagedResources
   [junit4]   2> 599995 INFO  (coreLoadExecutor-1911-thread-1) [    x:collection1] o.a.s.h.ReplicationHandler Poll scheduled at an interval of 1000ms
   [junit4]   2> 599997 INFO  (searcherExecutor-1912-thread-1-processing-x:collection1) [    x:collection1] o.a.s.c.SolrCore [collection1] Registered new searcher Searcher@131d872[collection1] main{ExitableDirectoryReader(UninvertingDirectoryReader())}
   [junit4]   2> 599997 INFO  (coreLoadExecutor-1911-thread-1) [    x:collection1] o.a.s.c.CoreContainer registering core: collection1
   [junit4]   2> 600027 INFO  (qtp12392811-4198) [    x:collection1] o.a.s.c.S.Request [collection1]  webapp=/solr path=/replication params={qt=/replication&wt=javabin&version=2&command=indexversion} status=0 QTime=3
   [junit4]   2> 600199 INFO  (TEST-TestReplicationHandler.doTestHandlerPathUnchanged-seed#[CFF01DE76BF1B182]) [    ] o.a.s.SolrTestCaseJ4 ###Ending doTestHandlerPathUnchanged
   [junit4]   2> 600214 INFO  (TEST-TestReplicationHandler.doTestHandlerPathUnchanged-seed#[CFF01DE76BF1B182]) [    ] o.e.j.s.ServerConnector Stopped ServerConnector@140a103{HTTP/1.1}{127.0.0.1:0}
   [junit4]   2> 600214 INFO  (TEST-TestReplicationHandler.doTestHandlerPathUnchanged-seed#[CFF01DE76BF1B182]) [    ] o.a.s.c.CoreContainer Shutting down CoreContainer instance=18006288
   [junit4]   2> 600222 INFO  (coreCloseExecutor-1917-thread-1) [    x:collection1] o.a.s.c.SolrCore [collection1]  CLOSING SolrCore org.apache.solr.core.SolrCore@14c1b03
   [junit4]   2> 600222 INFO  (coreCloseExecutor-1917-thread-1) [    x:collection1] o.a.s.u.DirectUpdateHandler2 closing DirectUpdateHandler2{commits=0,autocommits=0,soft autocommits=0,optimizes=0,rollbacks=0,expungeDeletes=0,docsPending=0,adds=0,deletesById=0,deletesByQuery=0,errors=0,cumulative_adds=0,cumulative_deletesById=0,cumulative_deletesByQuery=0,cumulative_errors=0}
   [junit4]   2> 600228 INFO  (coreCloseExecutor-1917-thread-1) [    x:collection1] o.a.s.u.SolrCoreState Closing SolrCoreState
   [junit4]   2> 600228 INFO  (coreCloseExecutor-1917-thread-1) [    x:collection1] o.a.s.u.DefaultSolrCoreState SolrCoreState ref count has reached 0 - closing IndexWriter
   [junit4]   2> 600229 INFO  (coreCloseExecutor-1917-thread-1) [    x:collection1] o.a.s.u.DefaultSolrCoreState closing IndexWriter with IndexWriterCloser
   [junit4]   2> 600234 INFO  (coreCloseExecutor-1917-thread-1) [    x:collection1] o.a.s.c.SolrCore [collection1] Closing main searcher on request.
   [junit4]   2> 600235 INFO  (coreCloseExecutor-1917-thread-1) [    x:collection1] o.a.s.c.CachingDirectoryFactory Closing MockDirectoryFactory - 2 directories currently being tracked
   [junit4]   2> 600235 INFO  (coreCloseExecutor-1917-thread-1) [    x:collection1] o.a.s.c.CachingDirectoryFactory looking to close C:\Users\jenkins\workspace\Lucene-Solr-5.5-Windows\solr\build\solr-core\test\J0\temp\solr.handler.TestReplicationHandler_CFF01DE76BF1B182-001\solr-instance-001\.\collection1\data\ [CachedDir<<refCount=0;path=C:\Users\jenkins\workspace\Lucene-Solr-5.5-Windows\solr\build\solr-core\test\J0\temp\solr.handler.TestReplicationHandler_CFF01DE76BF1B182-001\solr-instance-001\.\collection1\data\;done=false>>]
   [junit4]   2> 600235 INFO  (coreCloseExecutor-1917-thread-1) [    x:collection1] o.a.s.c.CachingDirectoryFactory Closing directory: C:\Users\jenkins\workspace\Lucene-Solr-5.5-Windows\solr\build\solr-core\test\J0\temp\solr.handler.TestReplicationHandler_CFF01DE76BF1B182-001\solr-instance-001\.\collection1\data\
   [junit4]   2> 600235 INFO  (coreCloseExecutor-1917-thread-1) [    x:collection1] o.a.s.c.CachingDirectoryFactory looking to close C:\Users\jenkins\workspace\Lucene-Solr-5.5-Windows\solr\build\solr-core\test\J0\temp\solr.handler.TestReplicationHandler_CFF01DE76BF1B182-001\solr-instance-001\.\collection1\data\index [CachedDir<<refCount=0;path=C:\Users\jenkins\workspace\Lucene-Solr-5.5-Windows\solr\build\solr-core\test\J0\temp\solr.handler.TestReplicationHandler_CFF01DE76BF1B182-001\solr-instance-001\.\collection1\data\index;done=false>>]
   [junit4]   2> 600235 INFO  (coreCloseExecutor-1917-thread-1) [    x:collection1] o.a.s.c.CachingDirectoryFactory Closing directory: C:\Users\jenkins\workspace\Lucene-Solr-5.5-Windows\solr\build\solr-core\test\J0\temp\solr.handler.TestReplicationHandler_CFF01DE76BF1B182-001\solr-instance-001\.\collection1\data\index
   [junit4]   2> 600238 INFO  (TEST-TestReplicationHandler.doTestHandlerPathUnchanged-seed#[CFF01DE76BF1B182]) [    ] o.e.j.s.h.ContextHandler Stopped o.e.j.s.ServletContextHandler@74b056{/solr,null,UNAVAILABLE}
   [junit4]   2> 600259 INFO  (TEST-TestReplicationHandler.doTestHandlerPathUnchanged-seed#[CFF01DE76BF1B182]) [    ] o.e.j.s.ServerConnector Stopped ServerConnector@9680c{HTTP/1.1}{127.0.0.1:0}
   [junit4]   2> 600259 INFO  (TEST-TestReplicationHandler.doTestHandlerPathUnchanged-seed#[CFF01DE76BF1B182]) [    ] o.a.s.c.CoreContainer Shutting down CoreContainer instance=30067059
   [junit4]   2> 600269 INFO  (coreCloseExecutor-1919-thread-1) [    x:collection1] o.a.s.c.SolrCore [collection1]  CLOSING SolrCore org.apache.solr.core.SolrCore@10e174f
   [junit4]   2> 600272 INFO  (coreCloseExecutor-1919-thread-1) [    x:collection1] o.a.s.u.DirectUpdateHandler2 closing DirectUpdateHandler2{commits=0,autocommits=0,soft autocommits=0,optimizes=0,rollbacks=0,expungeDeletes=0,docsPending=0,adds=0,deletesById=0,deletesByQuery=0,errors=0,cumulative_adds=0,cumulative_deletesById=0,cumulative_deletesByQuery=0,cumulative_errors=0}
   [junit4]   2> 600275 INFO  (coreCloseExecutor-1919-thread-1) [    x:collection1] o.a.s.u.SolrCoreState Closing SolrCoreState
   [junit4]   2> 600276 INFO  (coreCloseExecutor-1919-thread-1) [    x:collection1] o.a.s.u.DefaultSolrCoreState SolrCoreState ref count has reached 0 - closing IndexWriter
   [junit4]   2> 600276 INFO  (coreCloseExecutor-1919-thread-1) [    x:collection1] o.a.s.u.DefaultSolrCoreState closing IndexWriter with IndexWriterCloser
   [junit4]   2> 600283 INFO  (coreCloseExecutor-1919-thread-1) [    x:collection1] o.a.s.c.SolrCore [collection1] Closing main searcher on request.
   [junit4]   2> 600283 INFO  (coreCloseExecutor-1919-thread-1) [    x:collection1] o.a.s.c.CachingDirectoryFactory Closing MockDirectoryFactory - 2 directories currently being tracked
   [junit4]   2> 600283 INFO  (coreCloseExecutor-1919-thread-1) [    x:collection1] o.a.s.c.CachingDirectoryFactory looking to close C:\Users\jenkins\workspace\Lucene-Solr-5.5-Windows\solr\build\solr-core\test\J0\temp\solr.handler.TestReplicationHandler_CFF01DE76BF1B182-001\solr-instance-002\.\collection1\data\ [CachedDir<<refCount=0;path=C:\Users\jenkins\workspace\Lucene-Solr-5.5-Windows\solr\build\solr-core\test\J0\temp\solr.handler.TestReplicationHandler_CFF01DE76BF1B182-001\solr-instance-002\.\collection1\data\;done=false>>]
   [junit4]   2> 600283 INFO  (coreCloseExecutor-1919-thread-1) [    x:collection1] o.a.s.c.CachingDirectoryFactory Closing directory: C:\Users\jenkins\workspace\Lucene-Solr-5.5-Windows\solr\build\solr-core\test\J0\temp\solr.handler.TestReplicationHandler_CFF01DE76BF1B182-001\solr-instance-002\.\collection1\data\
   [junit4]   2> 600285 INFO  (coreCloseExecutor-1919-thread-1) [    x:collection1] o.a.s.c.CachingDirectoryFactory looking to close C:\Users\jenkins\workspace\Lucene-Solr-5.5-Windows\solr\build\solr-core\test\J0\temp\solr.handler.TestReplicationHandler_CFF01DE76BF1B182-001\solr-instance-002\.\collection1\data\index [CachedDir<<refCount=0;path=C:\Users\jenkins\workspace\Lucene-Solr-5.5-Windows\solr\build\solr-core\test\J0\temp\solr.handler.TestReplicationHandler_CFF01DE76BF1B182-001\solr-instance-002\.\collection1\data\index;done=false>>]
   [junit4]   2> 600286 INFO  (coreCloseExecutor-1919-thread-1) [    x:collection1] o.a.s.c.CachingDirectoryFactory Closing directory: C:\Users\jenkins\workspace\Lucene-Solr-5.5-Windows\solr\build\solr-core\test\J0\temp\solr.handler.TestReplicationHandler_CFF01DE76BF1B182-001\solr-instance-002\.\collection1\data\index
   [junit4]   2> 600290 INFO  (TEST-TestReplicationHandler.doTestHandlerPathUnchanged-seed#[CFF01DE76BF1B182]) [    ] o.e.j.s.h.ContextHandler Stopped o.e.j.s.ServletContextHandler@18d0aa1{/solr,null,UNAVAILABLE}
   [junit4]   2> 600326 INFO  (TEST-TestReplicationHandler.doTestDetails-seed#[CFF01DE76BF1B182]) [    ] o.a.s.SolrTestCaseJ4 ###Starting doTestDetails
   [junit4]   2> 600335 INFO  (TEST-TestReplicationHandler.doTestDetails-seed#[CFF01DE76BF1B182]) [    ] o.a.s.SolrTestCaseJ4 Writing core.properties file to C:\Users\jenkins\workspace\Lucene-Solr-5.5-Windows\solr\build\solr-core\test\J0\temp\solr.handler.TestReplicationHandler_CFF01DE76BF1B182-001\solr-instance-003\collection1
   [junit4]   2> 600358 INFO  (TEST-TestReplicationHandler.doTestDetails-seed#[CFF01DE76BF1B182]) [    ] o.e.j.s.Server jetty-9.2.13.v20150730
   [junit4]   2> 600368 INFO  (TEST-TestReplicationHandler.doTestDetails-seed#[CFF01DE76BF1B182]) [    ] o.e.j.s.h.ContextHandler Started o.e.j.s.ServletContextHandler@8cb1ff{/solr,null,AVAILABLE}
   [junit4]   2> 600370 INFO  (TEST-TestReplicationHandler.doTestDetails-seed#[CFF01DE76BF1B182]) [    ] o.e.j.s.ServerConnector Started ServerConnector@8e1f22{HTTP/1.1}{127.0.0.1:60808}
   [junit4]   2> 600370 INFO  (TEST-TestReplicationHandler.doTestDetails-seed#[CFF01DE76BF1B182]) [    ] o.e.j.s.Server Started @606757ms
   [junit4]   2> 600370 INFO  (TEST-TestReplicationHandler.doTestDetails-seed#[CFF01DE76BF1B182]) [    ] o.a.s.c.s.e.JettySolrRunner Jetty properties: {solr.data.dir=C:\Users\jenkins\workspace\Lucene-Solr-5.5-Windows\solr\build\solr-core\test\J0\temp\solr.handler.TestReplicationHandler_CFF01DE76BF1B182-001\solr-instance-003\collection1\data, hostContext=/solr, hostPort=60808}
   [junit4]   2> 600371 INFO  (TEST-TestReplicationHandler.doTestDetails-seed#[CFF01DE76BF1B182]) [    ] o.a.s.s.SolrDispatchFilter SolrDispatchFilter.init(): sun.misc.Launcher$AppClassLoader@1d16e93
   [junit4]   2> 600373 INFO  (TEST-TestReplicationHandler.doTestDetails-seed#[CFF01DE76BF1B182]) [    ] o.a.s.c.SolrResourceLoader new SolrResourceLoader for directory: 'C:\Users\jenkins\workspace\Lucene-Solr-5.5-Windows\solr\build\solr-core\test\J0\temp\solr.handler.TestReplicationHandler_CFF01DE76BF1B182-001\solr-instance-003'
   [junit4]   2> 600374 INFO  (TEST-TestReplicationHandler.doTestDetails-seed#[CFF01DE76BF1B182]) [    ] o.a.s.c.SolrResourceLoader JNDI not configured for solr (NoInitialContextEx)
   [junit4]   2> 600374 INFO  (TEST-TestReplicationHandler.doTestDetails-seed#[CFF01DE76BF1B182]) [    ] o.a.s.c.SolrResourceLoader solr home defaulted to 'solr/' (could not find system property or JNDI)
   [junit4]   2> 600375 INFO  (TEST-TestReplicationHandler.doTestDetails-seed#[CFF01DE76BF1B182]) [    ] o.a.s.c.SolrXmlConfig Loading container configuration from C:\Users\jenkins\workspace\Lucene-Solr-5.5-Windows\solr\build\solr-core\test\J0\temp\solr.handler.TestReplicationHandler_CFF01DE76BF1B182-001\solr-instance-003\solr.xml
   [junit4]   2> 600407 INFO  (TEST-TestReplicationHandler.doTestDetails-seed#[CFF01DE76BF1B182]) [    ] o.a.s.c.CorePropertiesLocator Config-defined core root directory: C:\Users\jenkins\workspace\Lucene-Solr-5.5-Windows\solr\build\solr-core\test\J0\temp\solr.handler.TestReplicationHandler_CFF01DE76BF1B182-001\solr-instance-003\.
   [junit4]   2> 600407 INFO  (TEST-TestReplicationHandler.doTestDetails-seed#[CFF01DE76BF1B182]) [    ] o.a.s.c.CoreContainer New CoreContainer 19104605
   [junit4]   2> 600407 INFO  (TEST-TestReplicationHandler.doTestDetails-seed#[CFF01DE76BF1B182]) [    ] o.a.s.c.CoreContainer Loading cores into CoreContainer [instanceDir=C:\Users\jenkins\workspace\Lucene-Solr-5.5-Windows\solr\build\solr-core\test\J0\temp\solr.handler.TestReplicationHandler_CFF01DE76BF1B182-001\solr-instance-003]
   [junit4]   2> 600407 WARN  (TEST-TestReplicationHandler.doTestDetails-seed#[CFF01DE76BF1B182]) [    ] o.a.s.c.CoreContainer Couldn't add files from C:\Users\jenkins\workspace\Lucene-Solr-5.5-Windows\solr\build\solr-core\test\J0\temp\solr.handler.TestReplicationHandler_CFF01DE76BF1B182-001\solr-instance-003\lib to classpath: C:\Users\jenkins\workspace\Lucene-Solr-5.5-Windows\solr\build\solr-core\test\J0\temp\solr.handler.TestReplicationHandler_CFF01DE76BF1B182-001\solr-instance-003\lib
   [junit4]   2> 600408 INFO  (TEST-TestReplicationHandler.doTestDetails-seed#[CFF01DE76BF1B182]) [    ] o.a.s.h.c.HttpShardHandlerFactory created with socketTimeout : 90000,urlScheme : ,connTimeout : 15000,maxConnectionsPerHost : 20,maxConnections : 10000,corePoolSize : 0,maximumPoolSize : 2147483647,maxThreadIdleTime : 5,sizeOfQueue : -1,fairnessPolicy : false,useRetries : false,connectionsEvictorSleepDelay : 5000,maxConnectionIdleTime : 40000,
   [junit4]   2> 600410 INFO  (TEST-TestReplicationHandler.doTestDetails-seed#[CFF01DE76BF1B182]) [    ] o.a.s.u.UpdateShardHandler Creating UpdateShardHandler HTTP client with params: socketTimeout=340000&connTimeout=45000&retry=true
   [junit4]   2> 600411 INFO  (TEST-TestReplicationHandler.doTestDetails-seed#[CFF01DE76BF1B182]) [    ] o.a.s.l.LogWatcher SLF4J impl is org.slf4j.impl.Log4jLoggerFactory
   [junit4]   2> 600411 INFO  (TEST-TestReplicationHandler.doTestDetails-seed#[CFF01DE76BF1B182]) [    ] o.a.s.l.LogWatcher Registering Log Listener [Log4j (org.slf4j.impl.Log4jLoggerFactory)]
   [junit4]   2> 600411 INFO  (TEST-TestReplicationHandler.doTestDetails-seed#[CFF01DE76BF1B182]) [    ] o.a.s.c.CoreContainer Security conf doesn't exist. Skipping setup for authorization module.
   [junit4]   2> 600411 INFO  (TEST-TestReplicationHandler.doTestDetails-seed#[CFF01DE76BF1B182]) [    ] o.a.s.c.CoreContainer No authentication plugin used.
   [junit4]   2> 600417 INFO  (TEST-TestReplicationHandler.doTestDetails-seed#[CFF01DE76BF1B182]) [    ] o.a.s.c.CorePropertiesLocator Looking for core definitions underneath C:\Users\jenkins\workspace\Lucene-Solr-5.5-Windows\solr\build\solr-core\test\J0\temp\solr.handler.TestReplicationHandler_CFF01DE76BF1B182-001\solr-instance-003\.
   [junit4]   2> 600425 INFO  (TEST-TestReplicationHandler.doTestDetails-seed#[CFF01DE76BF1B182]) [    ] o.a.s.c.CoreDescriptor Created CoreDescriptor: {name=collection1, config=solrconfig.xml, loadOnStartup=true, schema=schema.xml, configSetProperties=configsetprops.json, transient=false, dataDir=data\}
   [junit4]   2> 600426 INFO  (TEST-TestReplicationHandler.doTestDetails-seed#[CFF01DE76BF1B182]) [    ] o.a.s.c.CorePropertiesLocator Found core collection1 in C:\Users\jenkins\workspace\Lucene-Solr-5.5-Windows\solr\build\solr-core\test\J0\temp\solr.handler.TestReplicationHandler_CFF01DE76BF1B182-001\solr-instance-003\.\collection1
   [junit4]   2> 600426 INFO  (TEST-TestReplicationHandler.doTestDetails-seed#[CFF01DE76BF1B182]) [    ] o.a.s.c.CorePropertiesLocator Found 1 core definitions
   [junit4]   2> 600426 INFO  (TEST-TestReplicationHandler.doTestDetails-seed#[CFF01DE76BF1B182]) [    ] o.a.s.s.SolrDispatchFilter user.dir=C:\Users\jenkins\workspace\Lucene-Solr-5.5-Windows\solr\build\solr-core\test\J0
   [junit4]   2> 600426 INFO  (TEST-TestReplicationHandler.doTestDetails-seed#[CFF01DE76BF1B182]) [    ] o.a.s.s.SolrDispatchFilter SolrDispatchFilter.init() done
   [junit4]   2> 600429 INFO  (coreLoadExecutor-1926-thread-1) [    ] o.a.s.c.SolrResourceLoader new SolrResourceLoader for directory: 'C:\Users\jenkins\workspace\Lucene-Solr-5.5-Windows\solr\build\solr-core\test\J0\temp\solr.handler.TestReplicationHandler_CFF01DE76BF1B182-001\solr-instance-003\collection1'
   [junit4]   2> 600431 INFO  (coreLoadExecutor-1926-thread-1) [    ] o.a.s.c.SolrResourceLoader JNDI not configured for solr (NoInitialContextEx)
   [junit4]   2> 600433 INFO  (coreLoadExecutor-1926-thread-1) [    ] o.a.s.c.SolrResourceLoader solr home defaulted to 'solr/' (could not find system property or JNDI)
   [junit4]   2> 600480 INFO  (coreLoadExecutor-1926-thread-1) [    ] o.a.s.c.SolrConfig current version of requestparams : -1
   [junit4]   2> 600516 INFO  (coreLoadExecutor-1926-thread-1) [    ] o.a.s.c.SolrConfig Using Lucene MatchVersion: 5.5.3
   [junit4]   2> 600562 INFO  (coreLoadExecutor-1926-thread-1) [    ] o.a.s.c.SolrConfig Loaded SolrConfig: solrconfig.xml
   [junit4]   2> 600572 INFO  (coreLoadExecutor-1926-thread-1) [    ] o.a.s.s.IndexSchema [collection1] Schema name=test
   [junit4]   2> 600588 INFO  (coreLoadExecutor-1926-thread-1) [    ] o.a.s.s.IndexSchema unique key field: id
   [junit4]   2> 600596 INFO  (coreLoadExecutor-1926-thread-1) [    ] o.a.s.c.ConfigSetProperties Did not find ConfigSet properties, assuming default properties: Can't find resource 'configsetprops.json' in classpath or 'C:\Users\jenkins\workspace\Lucene-Solr-5.5-Windows\solr\build\solr-core\test\J0\temp\solr.handler.TestReplicationHandler_CFF01DE76BF1B182-001\solr-instance-003\collection1'
   [junit4]   2> 600596 INFO  (coreLoadExecutor-1926-thread-1) [    ] o.a.s.c.CoreContainer Creating SolrCore 'collection1' using configuration from instancedir C:\Users\jenkins\workspace\Lucene-Solr-5.5-Windows\solr\build\solr-core\test\J0\temp\solr.handler.TestReplicationHandler_CFF01DE76BF1B182-001\solr-instance-003\.\collection1
   [junit4]   2> 600596 INFO  (coreLoadExecutor-1926-thread-1) [    x:collection1] o.a.s.c.SolrCore org.apache.solr.core.MockDirectoryFactory
   [junit4]   2> 600598 INFO  (coreLoadExecutor-1926-thread-1) [    x:collection1] o.a.s.c.SolrCore [[collection1] ] Opening new SolrCore at [C:\Users\jenkins\workspace\Lucene-Solr-5.5-Windows\solr\build\solr-core\test\J0\temp\solr.handler.TestReplicationHandler_CFF01DE76BF1B182-001\solr-instance-003\collection1], dataDir=[C:\Users\jenkins\workspace\Lucene-Solr-5.5-Windows\solr\build\solr-core\test\J0\temp\solr.handler.TestReplicationHandler_CFF01DE76BF1B182-001\solr-instance-003\.\collection1\data\]
   [junit4]   2> 600598 INFO  (coreLoadExecutor-1926-thread-1) [    x:collection1] o.a.s.c.SolrCore JMX monitoring not detected for core: collection1
   [junit4]   2> 600599 INFO  (coreLoadExecutor-1926-thread-1) [    x:collection1] o.a.s.c.CachingDirectoryFactory return new directory for C:\Users\jenkins\workspace\Lucene-Solr-5.5-Windows\solr\build\solr-core\test\J0\temp\solr.handler.TestReplicationHandler_CFF01DE76BF1B182-001\solr-instance-003\.\collection1\data\
   [junit4]   2> 600599 INFO  (coreLoadExecutor-1926-thread-1) [    x:collection1] o.a.s.c.SolrCore New index directory detected: old=null new=C:\Users\jenkins\workspace\Lucene-Solr-5.5-Windows\solr\build\solr-core\test\J0\temp\solr.handler.TestReplicationHandler_CFF01DE76BF1B182-001\solr-instance-003\.\collection1\data\index/
   [junit4]   2> 600599 WARN  (coreLoadExecutor-1926-thread-1) [    x:collection1] o.a.s.c.SolrCore [collection1] Solr index directory 'C:\Users\jenkins\workspace\Lucene-Solr-5.5-Windows\solr\build\solr-core\test\J0\temp\solr.handler.TestReplicationHandler_CFF01DE76BF1B182-001\solr-instance-003\.\collection1\data\index' doesn't exist. Creating new index...
   [junit4]   2> 600600 INFO  (coreLoadExecutor-1926-thread-1) [    x:collection1] o.a.s.c.CachingDirectoryFactory return new directory for C:\Users\jenkins\workspace\Lucene-Solr-5.5-Windows\solr\build\solr-core\test\J0\temp\solr.handler.TestReplicationHandler_CFF01DE76BF1B182-001\solr-instance-003\.\collection1\data\index
   [junit4]   2> 600600 INFO  (coreLoadExecutor-1926-thread-1) [    x:collection1] o.a.s.u.RandomMergePolicy RandomMergePolicy wrapping class org.apache.lucene.index.LogByteSizeMergePolicy: [LogByteSizeMergePolicy: minMergeSize=1677721, mergeFactor=43, maxMergeSize=2147483648, maxMergeSizeForForcedMerge=9223372036854775807, calibrateSizeByDeletes=false, maxMergeDocs=2147483647, maxCFSSegmentSizeMB=8.796093022207999E12, noCFSRatio=0.0]
   [junit4]   2> 600608 INFO  (coreLoadExecutor-1926-thread-1) [    x:collection1] o.a.s.c.SolrDeletionPolicy SolrDeletionPolicy.onCommit: commits: num=1
   [junit4]   2> 	commit{dir=MockDirectoryWrapper(NRTCachingDirectory(RAMDirectory@cbc051 lockFactory=org.apache.lucene.store.SingleInstanceLockFactory@13efd8b; maxCacheMB=0.998046875 maxMergeSizeMB=0.3447265625)),segFN=segments_1,generation=1}
   [junit4]   2> 600608 INFO  (coreLoadExecutor-1926-thread-1) [    x:collection1] o.a.s.c.SolrDeletionPolicy newest commit generation = 1
   [junit4]   2> 600617 INFO  (OldIndexDirectoryCleanupThreadForCore-collection1) [    x:collection1] o.a.s.c.SolrCore Looking for old index directories to cleanup for core collection1 in C:\Users\jenkins\workspace\Lucene-Solr-5.5-Windows\solr\build\solr-core\test\J0\temp\solr.handler.TestReplicationHandler_CFF01DE76BF1B182-001\solr-instance-003\.\collection1\data\
   [junit4]   2> 600621 INFO  (coreLoadExecutor-1926-thread-1) [    x:collection1] o.a.s.c.SolrCore no updateRequestProcessorChain defined as default, creating implicit default
   [junit4]   2> 600634 INFO  (coreLoadExecutor-1926-thread-1) [    x:collection1] o.a.s.h.l.XMLLoader xsltCacheLifetimeSeconds=60
   [junit4]   2> 600636 INFO  (coreLoadExecutor-1926-thread-1) [    x:collection1] o.a.s.h.l.XMLLoader xsltCacheLifetimeSeconds=60
   [junit4]   2> 600643 INFO  (coreLoadExecutor-1926-thread-1) [    x:collection1] o.a.s.h.l.XMLLoader xsltCacheLifetimeSeconds=60
   [junit4]   2> 600651 INFO  (coreLoadExecutor-1926-thread-1) [    x:collection1] o.a.s.h.l.XMLLoader xsltCacheLifetimeSeconds=60
   [junit4]   2> 600655 INFO  (coreLoadExecutor-1926-thread-1) [    x:collection1] o.a.s.c.PluginBag requestHandler : 'lazy' created with startup=lazy 
   [junit4]   2> 600655 INFO  (coreLoadExecutor-1926-thread-1) [    x:collection1] o.a.s.c.RequestHandlers Registered paths: /admin/mbeans,standard,lazy,/update/csv,/update/json/docs,/admin/luke,/admin/segments,/get,/admin/system,/replication,/admin/properties,defaults,/config,/schema,/admin/plugins,/admin/logging,/update/json,/admin/threads,/admin/ping,/update,/admin/file
   [junit4]   2> 600658 INFO  (coreLoadExecutor-1926-thread-1) [    x:collection1] o.a.s.c.SolrCore Using default statsCache cache: org.apache.solr.search.stats.LocalStatsCache
   [junit4]   2> 600659 INFO  (coreLoadExecutor-1926-thread-1) [    x:collection1] o.a.s.u.CommitTracker Hard AutoCommit: disabled
   [junit4]   2> 600659 INFO  (coreLoadExecutor-1926-thread-1) [    x:collection1] o.a.s.u.CommitTracker Soft AutoCommit: disabled
   [junit4]   2> 600665 INFO  (coreLoadExecutor-1926-thread-1) [    x:collection1] o.a.s.u.RandomMergePolicy RandomMergePolicy wrapping class org.apache.lucene.index.LogDocMergePolicy: [LogDocMergePolicy: minMergeSize=1000, mergeFactor=38, maxMergeSize=9223372036854775807, maxMergeSizeForForcedMerge=9223372036854775807, calibrateSizeByDeletes=true, maxMergeDocs=2147483647, maxCFSSegmentSizeMB=8.796093022207999E12, noCFSRatio=0.0]
   [junit4]   2> 600669 INFO  (coreLoadExecutor-1926-thread-1) [    x:collection1] o.a.s.c.SolrDeletionPolicy SolrDeletionPolicy.onInit: commits: num=1
   [junit4]   2> 	commit{dir=MockDirectoryWrapper(NRTCachingDirectory(RAMDirectory@cbc051 lockFactory=org.apache.lucene.store.SingleInstanceLockFactory@13efd8b; maxCacheMB=0.998046875 maxMergeSizeMB=0.3447265625)),segFN=segments_1,generation=1}
   [junit4]   2> 600673 INFO  (coreLoadExecutor-1926-thread-1) [    x:collection1] o.a.s.c.SolrDeletionPolicy newest commit generation = 1
   [junit4]   2> 600673 INFO  (coreLoadExecutor-1926-thread-1) [    x:collection1] o.a.s.s.SolrIndexSearcher Opening Searcher@7dd8c5[collection1] main
   [junit4]   2> 600677 INFO  (coreLoadExecutor-1926-thread-1) [    x:collection1] o.a.s.r.ManagedResourceStorage File-based storage initialized to use dir: C:\Users\jenkins\workspace\Lucene-Solr-5.5-Windows\solr\build\solr-core\test\J0\temp\solr.handler.TestReplicationHandler_CFF01DE76BF1B182-001\solr-instance-003\collection1\conf
   [junit4]   2> 600680 INFO  (coreLoadExecutor-1926-thread-1) [    x:collection1] o.a.s.r.RestManager Initializing RestManager with initArgs: {storageDir=C:\Users\jenkins\workspace\Lucene-Solr-5.5-Windows\solr\build\solr-core\test\J0\temp\solr.handler.TestReplicationHandler_CFF01DE76BF1B182-001\solr-instance-003\collection1\conf}
   [junit4]   2> 600680 INFO  (coreLoadExecutor-1926-thread-1) [    x:collection1] o.a.s.r.ManagedResourceStorage Reading _rest_managed.json using file:dir=C:\Users\jenkins\workspace\Lucene-Solr-5.5-Windows\solr\build\solr-core\test\J0\temp\solr.handler.TestReplicationHandler_CFF01DE76BF1B182-001\solr-instance-003\collection1\conf
   [junit4]   2> 600684 INFO  (coreLoadExecutor-1926-thread-1) [    x:collection1] o.a.s.r.RestManager Initializing 0 registered ManagedResources
   [junit4]   2> 600689 INFO  (coreLoadExecutor-1926-thread-1) [    x:collection1] o.a.s.h.ReplicationHandler Replication enabled for following config files: schema.xml,xslt/dummy.xsl
   [junit4]   2> 600690 INFO  (coreLoadExecutor-1926-thread-1) [    x:collection1] o.a.s.h.ReplicationHandler Commits will be reserved for  10000
   [junit4]   2> 600690 INFO  (searcherExecutor-1927-thread-1-processing-x:collection1) [    x:collection1] o.a.s.c.SolrCore [collection1] Registered new searcher Searcher@7dd8c5[collection1] main{ExitableDirectoryReader(UninvertingDirectoryReader())}
   [junit4]   2> 600690 INFO  (coreLoadExecutor-1926-thread-1) [    x:collection1] o.a.s.c.CoreContainer registering core: collection1
   [junit4]   2> 600958 INFO  (TEST-TestReplicationHandler.doTestDetails-seed#[CFF01DE76BF1B182]) [    ] o.a.s.SolrTestCaseJ4 Writing core.properties file to C:\Users\jenkins\workspace\Lucene-Solr-5.5-Windows\solr\build\solr-core\test\J0\temp\solr.handler.TestReplicationHandler_CFF01DE76BF1B182-001\solr-instance-004\collection1
   [junit4]   2> 601030 INFO  (TEST-TestReplicationHandler.doTestDetails-seed#[CFF01DE76BF1B182]) [    ] o.e.j.s.Server jetty-9.2.13.v20150730
   [junit4]   2> 601038 INFO  (TEST-TestReplicationHandler.doTestDetails-seed#[CFF01DE76BF1B182]) [    ] o.e.j.s.h.ContextHandler Started o.e.j.s.ServletContextHandler@2756e9{/solr,null,AVAILABLE}
   [junit4]   2> 601040 INFO  (TEST-TestReplicationHandler.doTestDetails-seed#[CFF01DE76BF1B182]) [    ] o.e.j.s.ServerConnector Started ServerConnector@1116296{HTTP/1.1}{127.0.0.1:60811}
   [junit4]   2> 601041 INFO  (TEST-TestReplicationHandler.doTestDetails-seed#[CFF01DE76BF1B182]) [    ] o.e.j.s.Server Started @607427ms
   [junit4]   2> 601041 INFO  (TEST-TestReplicationHandler.doTestDetails-seed#[CFF01DE76BF1B182]) [    ] o.a.s.c.s.e.JettySolrRunner Jetty properties: {solr.data.dir=C:\Users\jenkins\workspace\Lucene-Solr-5.5-Windows\solr\build\solr-core\test\J0\temp\solr.handler.TestReplicationHandler_CFF01DE76BF1B182-001\solr-instance-004\collection1\data, hostContext=/solr, hostPort=60811}
   [junit4]   2> 601041 INFO  (TEST-TestReplicationHandler.doTestDetails-seed#[CFF01DE76BF1B182]) [    ] o.a.s.s.SolrDispatchFilter SolrDispatchFilter.init(): sun.misc.Launcher$AppClassLoader@1d16e93
   [junit4]   2> 601041 INFO  (TEST-TestReplicationHandler.doTestDetails-seed#[CFF01DE76BF1B182]) [    ] o.a.s.c.SolrResourceLoader new SolrResourceLoader for directory: 'C:\Users\jenkins\workspace\Lucene-Solr-5.5-Windows\solr\build\solr-core\test\J0\temp\solr.handler.TestReplicationHandler_CFF01DE76BF1B182-001\solr-instance-004'
   [junit4]   2> 601041 INFO  (TEST-TestReplicationHandler.doTestDetails-seed#[CFF01DE76BF1B182]) [    ] o.a.s.c.SolrResourceLoader JNDI not configured for solr (NoInitialContextEx)
   [junit4]   2> 601041 INFO  (TEST-TestReplicationHandler.doTestDetails-seed#[CFF01DE76BF1B182]) [    ] o.a.s.c.SolrResourceLoader solr home defaulted to 'solr/' (could not find system property or JNDI)
   [junit4]   2> 601043 INFO  (TEST-TestReplicationHandler.doTestDetails-seed#[CFF01DE76BF1B182]) [    ] o.a.s.c.SolrXmlConfig Loading container configuration from C:\Users\jenkins\workspace\Lucene-Solr-5.5-Windows\solr\build\solr-core\test\J0\temp\solr.handler.TestReplicationHandler_CFF01DE76BF1B182-001\solr-instance-004\solr.xml
   [junit4]   2> 601090 INFO  (TEST-TestReplicationHandler.doTestDetails-seed#[CFF01DE76BF1B182]) [    ] o.a.s.c.CorePropertiesLocator Config-defined core root directory: C:\Users\jenkins\workspace\Lucene-Solr-5.5-Windows\solr\build\solr-core\test\J0\temp\solr.handler.TestReplicationHandler_CFF01DE76BF1B182-001\solr-instance-004\.
   [junit4]   2> 601090 INFO  (TEST-TestReplicationHandler.doTestDetails-seed#[CFF01DE76BF1B182]) [    ] o.a.s.c.CoreContainer New CoreContainer 10477805
   [junit4]   2> 601090 INFO  (TEST-TestReplicationHandler.doTestDetails-seed#[CFF01DE76BF1B182]) [    ] o.a.s.c.CoreContainer Loading cores into CoreContainer [instanceDir=C:\Users\jenkins\workspace\Lucene-Solr-5.5-Windows\solr\build\solr-core\test\J0\temp\solr.handler.TestReplicationHandler_CFF01DE76BF1B182-001\solr-instance-004]
   [junit4]   2> 601091 WARN  (TEST-TestReplicationHandler.doTestDetails-seed#[CFF01DE76BF1B182]) [    ] o.a.s.c.CoreContainer Couldn't add files from C:\Users\jenkins\workspace\Lucene-Solr-5.5-Windows\solr\build\solr-core\test\J0\temp\solr.handler.TestReplicationHandler_CFF01DE76BF1B182-001\solr-instance-004\lib to classpath: C:\Users\jenkins\workspace\Lucene-Solr-5.5-Windows\solr\build\solr-core\test\J0\temp\solr.handler.TestReplicationHandler_CFF01DE76BF1B182-001\solr-instance-004\lib
   [junit4]   2> 601094 INFO  (TEST-TestReplicationHandler.doTestDetails-seed#[CFF01DE76BF1B182]) [    ] o.a.s.h.c.HttpShardHandlerFactory created with socketTimeout : 90000,urlScheme : ,connTimeout : 15000,maxConnectionsPerHost : 20,maxConnections : 10000,corePoolSize : 0,maximumPoolSize : 2147483647,maxThreadIdleTime : 5,sizeOfQueue : -1,fairnessPolicy : false,useRetries : false,connectionsEvictorSleepDelay : 5000,maxConnectionIdleTime : 40000,
   [junit4]   2> 601096 INFO  (TEST-TestReplicationHandler.doTestDetails-seed#[CFF01DE76BF1B182]) [    ] o.a.s.u.UpdateShardHandler Creating UpdateShardHandler HTTP client with params: socketTimeout=340000&connTimeout=45000&retry=true
   [junit4]   2> 601097 INFO  (TEST-TestReplicationHandler.doTestDetails-seed#[CFF01DE76BF1B182]) [    ] o.a.s.l.LogWatcher SLF4J impl is org.slf4j.impl.Log4jLoggerFactory
   [junit4]   2> 601097 INFO  (TEST-TestReplicationHandler.doTestDetails-seed#[CFF01DE76BF1B182]) [    ] o.a.s.l.LogWatcher Registering Log Listener [Log4j (org.slf4j.impl.Log4jLoggerFactory)]
   [junit4]   2> 601097 INFO  (TEST-TestReplicationHandler.doTestDetails-seed#[CFF01DE76BF1B182]) [    ] o.a.s.c.CoreContainer Security conf doesn't exist. Skipping setup for authorization module.
   [junit4]   2> 601097 INFO  (TEST-TestReplicationHandler.doTestDetails-seed#[CFF01DE76BF1B182]) [    ] o.a.s.c.CoreContainer No authentication plugin used.
   [junit4]   2> 601098 INFO  (TEST-TestReplicationHandler.doTestDetails-seed#[CFF01DE76BF1B182]) [    ] o.a.s.c.CorePropertiesLocator Looking for core definitions underneath C:\Users\jenkins\workspace\Lucene-Solr-5.5-Windows\solr\build\solr-core\test\J0\temp\solr.handler.TestReplicationHandler_CFF01DE76BF1B182-001\solr-instance-004\.
   [junit4]   2> 601112 INFO  (TEST-TestReplicationHandler.doTestDetails-seed#[CFF01DE76BF1B182]) [    ] o.a.s.c.CoreDescriptor Created CoreDescriptor: {name=collection1, config=solrconfig.xml, loadOnStartup=true, schema=schema.xml, configSetProperties=configsetprops.json, transient=false, dataDir=data\}
   [junit4]   2> 601112 INFO  (TEST-TestReplicationHandler.doTestDetails-seed#[CFF01DE76BF1B182]) [    ] o.a.s.c.CorePropertiesLocator Found core collection1 in C:\Users\jenkins\workspace\Lucene-Solr-5.5-Windows\solr\build\solr-core\test\J0\temp\solr.handler.TestReplicationHandler_CFF01DE76BF1B182-001\solr-instance-004\.\collection1
   [junit4]   2> 601113 INFO  (TEST-TestReplicationHandler.doTestDetails-seed#[CFF01DE76BF1B182]) [    ] o.a.s.c.CorePropertiesLocator Found 1 core definitions
   [junit4]   2> 601114 INFO  (TEST-TestReplicationHandler.doTestDetails-seed#[CFF01DE76BF1B182]) [    ] o.a.s.s.SolrDispatchFilter user.dir=C:\Users\jenkins\workspace\Lucene-Solr-5.5-Windows\solr\build\solr-core\test\J0
   [junit4]   2> 601114 INFO  (TEST-TestReplicationHandler.doTestDetails-seed#[CFF01DE76BF1B182]) [    ] o.a.s.s.SolrDispatchFilter SolrDispatchFilter.init() done
   [junit4]   2> 601120 INFO  (coreLoadExecutor-1936-thread-1) [    ] o.a.s.c.SolrResourceLoader new SolrResourceLoader for directory: 'C:\Users\jenkins\workspace\Lucene-Solr-5.5-Windows\solr\build\solr-core\test\J0\temp\solr.handler.TestReplicationHandler_CFF01DE76BF1B182-001\solr-instance-004\collection1'
   [junit4]   2> 601127 INFO  (coreLoadExecutor-1936-thread-1) [    ] o.a.s.c.SolrResourceLoader JNDI not configured for solr (NoInitialContextEx)
   [junit4]   2> 601127 INFO  (coreLoadExecutor-1936-thread-1) [    ] o.a.s.c.SolrResourceLoader solr home defaulted to 'solr/' (could not find system property or JNDI)
   [junit4]   2> 601194 INFO  (coreLoadExecutor-1936-thread-1) [    ] o.a.s.c.SolrConfig current version of requestparams : -1
   [junit4]   2> 601214 INFO  (coreLoadExecutor-1936-thread-1) [    ] o.a.s.c.SolrConfig Using Lucene MatchVersion: 5.5.3
   [junit4]   2> 601260 INFO  (coreLoadExecutor-1936-thread-1) [    ] o.a.s.c.SolrConfig Loaded SolrConfig: solrconfig.xml
   [junit4]   2> 601272 INFO  (coreLoadExecutor-1936-thread-1) [    ] o.a.s.s.IndexSchema [collection1] Schema name=test
   [junit4]   2> 601292 INFO  (coreLoadExecutor-1936-thread-1) [    ] o.a.s.s.IndexSchema unique key field: id
   [junit4]   2> 601300 INFO  (coreLoadExecutor-1936-thread-1) [    ] o.a.s.c.ConfigSetProperties Did not find ConfigSet properties, assuming default properties: Can't find resource 'configsetprops.json' in classpath or 'C:\Users\jenkins\workspace\Lucene-Solr-5.5-Windows\solr\build\solr-core\test\J0\temp\solr.handler.TestReplicationHandler_CFF01DE76BF1B182-001\solr-instance-004\collection1'
   [junit4]   2> 601300 INFO  (coreLoadExecutor-1936-thread-1) [    ] o.a.s.c.CoreContainer Creating SolrCore 'collection1' using configuration from instancedir C:\Users\jenkins\workspace\Lucene-Solr-5.5-Windows\solr\build\solr-core\test\J0\temp\solr.handler.TestReplicationHandler_CFF01DE76BF1B182-001\solr-instance-004\.\collection1
   [junit4]   2> 601300 INFO  (coreLoadExecutor-1936-thread-1) [    x:collection1] o.a.s.c.SolrCore org.apache.solr.core.MockDirectoryFactory
   [junit4]   2> 601300 INFO  (coreLoadExecutor-1936-thread-1) [    x:collection1] o.a.s.c.SolrCore [[collection1] ] Opening new SolrCore at [C:\Users\jenkins\workspace\Lucene-Solr-5.5-Windows\solr\build\solr-core\test\J0\temp\solr.handler.TestReplicationHandler_CFF01DE76BF1B182-001\solr-instance-004\collection1], dataDir=[C:\Users\jenkins\workspace\Lucene-Solr-5.5-Windows\solr\build\solr-core\test\J0\temp\solr.handler.TestReplicationHandler_CFF01DE76BF1B182-001\solr-instance-004\.\collection1\data\]
   [junit4]   2> 601304 INFO  (coreLoadExecutor-1936-thread-1) [    x:collection1] o.a.s.c.SolrCore JMX monitoring not detected for core: collection1
   [junit4]   2> 601305 INFO  (coreLoadExecutor-1936-thread-1) [    x:collection1] o.a.s.c.CachingDirectoryFactory return new directory for C:\Users\jenkins\workspace\Lucene-Solr-5.5-Windows\solr\build\solr-core\test\J0\temp\solr.handler.TestReplicationHandler_CFF01DE76BF1B182-001\solr-instance-004\.\collection1\data\
   [junit4]   2> 601305 INFO  (coreLoadExecutor-1936-thread-1) [    x:collection1] o.a.s.c.SolrCore New index directory detected: old=null new=C:\Users\jenkins\workspace\Lucene-Solr-5.5-Windows\solr\build\solr-core\test\J0\temp\solr.handler.TestReplicationHandler_CFF01DE76BF1B182-001\solr-instance-004\.\collection1\data\index/
   [junit4]   2> 601305 WARN  (coreLoadExecutor-1936-thread-1) [    x:collection1] o.a.s.c.SolrCore [collection1] Solr index directory 'C:\Users\jenkins\workspace\Lucene-Solr-5.5-Windows\solr\build\solr-core\test\J0\temp\solr.handler.TestReplicationHandler_CFF01DE76BF1B182-001\solr-instance-004\.\collection1\data\index' doesn't exist. Creating new index...
   [junit4]   2> 601306 INFO  (coreLoadExecutor-1936-thread-1) [    x:collection1] o.a.s.c.CachingDirectoryFactory return new directory for C:\Users\jenkins\workspace\Lucene-Solr-5.5-Windows\solr\build\solr-core\test\J0\temp\solr.handler.TestReplicationHandler_CFF01DE76BF1B182-001\solr-instance-004\.\collection1\data\index
   [junit4]   2> 601306 INFO  (coreLoadExecutor-1936-thread-1) [    x:collection1] o.a.s.u.RandomMergePolicy RandomMergePolicy wrapping class org.apache.lucene.index.LogByteSizeMergePolicy: [LogByteSizeMergePolicy: minMergeSize=1677721, mergeFactor=43, maxMergeSize=2147483648, maxMergeSizeForForcedMerge=9223372036854775807, calibrateSizeByDeletes=false, maxMergeDocs=2147483647, maxCFSSegmentSizeMB=8.796093022207999E12, noCFSRatio=0.0]
   [junit4]   2> 601313 INFO  (coreLoadExecutor-1936-thread-1) [    x:collection1] o.a.s.c.SolrDeletionPolicy SolrDeletionPolicy.onCommit: commits: num=1
   [junit4]   2> 	commit{dir=MockDirectoryWrapper(NRTCachingDirectory(RAMDirectory@1706015 lockFactory=org.apache.lucene.store.SingleInstanceLockFactory@aa6482; maxCacheMB=0.998046875 maxMergeSizeMB=0.3447265625)),segFN=segments_1,generation=1}
   [junit4]   2> 601313 INFO  (coreLoadExecutor-1936-thread-1) [    x:collection1] o.a.s.c.SolrDeletionPolicy newest commit generation = 1
   [junit4]   2> 601317 INFO  (OldIndexDirectoryCleanupThreadForCore-collection1) [    x:collection1] o.a.s.c.SolrCore Looking for old index directories to cleanup for core collection1 in C:\Users\jenkins\workspace\Lucene-Solr-5.5-Windows\solr\build\solr-core\test\J0\temp\solr.handler.TestReplicationHandler_CFF01DE76BF1B182-001\solr-instance-004\.\collection1\data\
   [junit4]   2> 601325 INFO  (coreLoadExecutor-1936-thread-1) [    x:collection1] o.a.s.c.SolrCore no updateRequestProcessorChain defined as default, creating implicit default
   [junit4]   2> 601349 INFO  (coreLoadExecutor-1936-thread-1) [    x:collection1] o.a.s.h.l.XMLLoader xsltCacheLifetimeSeconds=60
   [junit4]   2> 601370 INFO  (coreLoadExecutor-1936-thread-1) [    x:collection1] o.a.s.h.l.XMLLoader xsltCacheLifetimeSeconds=60
   [junit4]   2> 601391 INFO  (coreLoadExecutor-1936-thread-1) [    x:collection1] o.a.s.h.l.XMLLoader xsltCacheLifetimeSeconds=60
   [junit4]   2> 601413 INFO  (coreLoadExecutor-1936-thread-1) [    x:collection1] o.a.s.h.l.XMLLoader xsltCacheLifetimeSeconds=60
   [junit4]   2> 601429 INFO  (coreLoadExecutor-1936-thread-1) [    x:collection1] o.a.s.c.PluginBag requestHandler : 'lazy' created with startup=lazy 
   [junit4]   2> 601429 INFO  (coreLoadExecutor-1936-thread-1) [    x:collection1] o.a.s.c.RequestHandlers Registered paths: /admin/mbeans,standard,lazy,/update/csv,/update/json/docs,/admin/luke,/admin/segments,/get,/admin/system,/replication,/admin/properties,defaults,/config,/schema,/admin/plugins,/admin/logging,/update/json,/admin/threads,/admin/ping,/update,/admin/file
   [junit4]   2> 601429 INFO  (coreLoadExecutor-1936-thread-1) [    x:collection1] o.a.s.c.SolrCore Using default statsCache cache: org.apache.solr.search.stats.LocalStatsCache
   [junit4]   2> 601430 INFO  (coreLoadExecutor-1936-thread-1) [    x:collection1] o.a.s.u.CommitTracker Hard AutoCommit: disabled
   [junit4]   2> 601430 INFO  (coreLoadExecutor-1936-thread-1) [    x:collection1] o.a.s.u.CommitTracker Soft AutoCommit: disabled
   [junit4]   2> 601433 INFO  (coreLoadExecutor-1936-thread-1) [    x:collection1] o.a.s.u.RandomMergePolicy RandomMergePolicy wrapping class org.apache.lucene.index.LogDocMergePolicy: [LogDocMergePolicy: minMergeSize=1000, mergeFactor=38, maxMergeSize=9223372036854775807, maxMergeSizeForForcedMerge=9223372036854775807, calibrateSizeByDeletes=true, maxMergeDocs=2147483647, maxCFSSegmentSizeMB=8.796093022207999E12, noCFSRatio=0.0]
   [junit4]   2> 601440 INFO  (coreLoadExecutor-1936-thread-1) [    x:collection1] o.a.s.c.SolrDeletionPolicy SolrDeletionPolicy.onInit: commits: num=1
   [junit4]   2> 	commit{dir=MockDirectoryWrapper(NRTCachingDirectory(RAMDirectory@1706015 lockFactory=org.apache.lucene.store.SingleInstanceLockFactory@aa6482; maxCacheMB=0.998046875 maxMergeSizeMB=0.3447265625)),segFN=segments_1,generation=1}
   [junit4]   2> 601440 INFO  (coreLoadExecutor-1936-thread-1) [    x:collection1] o.a.s.c.SolrDeletionPolicy newest commit generation = 1
   [junit4]   2> 601441 INFO  (coreLoadExecutor-1936-thread-1) [    x:collection1] o.a.s.s.SolrIndexSearcher Opening Searcher@fdc0f6[collection1] main
   [junit4]   2> 601441 INFO  (coreLoadExecutor-1936-thread-1) [    x:collection1] o.a.s.r.ManagedResourceStorage File-based storage initialized to use dir: C:\Users\jenkins\workspace\Lucene-Solr-5.5-Windows\solr\build\solr-core\test\J0\temp\solr.handler.TestReplicationHandler_CFF01DE76BF1B182-001\solr-instance-004\collection1\conf
   [junit4]   2> 601442 INFO  (coreLoadExecutor-1936-thread-1) [    x:collection1] o.a.s.r.RestManager Initializing RestManager with initArgs: {storageDir=C:\Users\jenkins\workspace\Lucene-Solr-5.5-Windows\solr\build\solr-core\test\J0\temp\solr.handler.TestReplicationHandler_CFF01DE76BF1B182-001\solr-instance-004\collection1\conf}
   [junit4]   2> 601450 INFO  (coreLoadExecutor-1936-thread-1) [    x:collection1] o.a.s.r.ManagedResourceStorage Reading _rest_managed.json using file:dir=C:\Users\jenkins\workspace\Lucene-Solr-5.5-Windows\solr\build\solr-core\test\J0\temp\solr.handler.TestReplicationHandler_CFF01DE76BF1B182-001\solr-instance-004\collection1\conf
   [junit4]   2> 601452 INFO  (coreLoadExecutor-1936-thread-1) [    x:collection1] o.a.s.r.RestManager Initializing 0 registered ManagedResources
   [junit4]   2> 601460 INFO  (coreLoadExecutor-1936-thread-1) [    x:collection1] o.a.s.h.ReplicationHandler Poll scheduled at an interval of 1000ms
   [junit4]   2> 601461 INFO  (coreLoadExecutor-1936-thread-1) [    x:collection1] o.a.s.c.CoreContainer registering core: collection1
   [junit4]   2> 601465 INFO  (searcherExecutor-1937-thread-1-processing-x:collection1) [    x:collection1] o.a.s.c.SolrCore [collection1] Registered new searcher Searcher@fdc0f6[collection1] main{ExitableDirectoryReader(UninvertingDirectoryReader())}
   [junit4]   2> 601485 INFO  (qtp23163834-4254) [    x:collection1] o.a.s.c.S.Request [collection1]  webapp=/solr path=/replication params={qt=/replication&wt=javabin&version=2&command=indexversion} status=0 QTime=4
   [junit4]   2> 601721 INFO  (qtp23163834-4253) [    x:collection1] o.a.s.c.S.Request [collection1]  webapp=/solr path=/select params={q=*:*&sort=id+desc&wt=javabin&version=2} hits=0 status=0 QTime=1
   [junit4]   2> 601739 INFO  (qtp23163834-4252) [    x:collection1] o.a.s.c.S.Request [collection1]  webapp=/solr path=/replication params={_trace=getDetails&qt=/replication&wt=javabin&version=2&command=details} status=0 QTime=10
   [junit4]   2> 601764 INFO  (qtp23163834-4251) [    x:collection1] o.a.s.c.S.Request [collection1]  webapp=/solr path=/replication params={slave=false&qt=/replication&wt=javabin&version=2&command=details} status=0 QTime=11
   [junit4]   2> 601768 INFO  (qtp24434677-4272) [    x:collection1] o.a.s.c.S.Request [collection1]  webapp=/solr path=/replication params={_trace=getDetails&qt=/replication&wt=javabin&version=2&command=details} status=0 QTime=20
   [junit4]   2> 601779 INFO  (qtp23163834-4250) [    x:collection1] o.a.s.u.p.LogUpdateProcessorFactory [collection1]  webapp=/solr path=/update params={wt=javabin&version=2}{add=[0]} 0 4
   [junit4]   2> 601790 INFO  (qtp23163834-4249) [    x:collection1] o.a.s.u.DirectUpdateHandler2 start commit{,optimize=false,openSearcher=true,waitSearcher=true,expungeDeletes=false,softCommit=false,prepareCommit=false}
   [junit4]   2> 601820 INFO  (qtp23163834-4249) [    x:collection1] o.a.s.c.SolrDeletionPolicy SolrDeletionPolicy.onCommit: commits: num=2
   [junit4]   2> 	commit{dir=MockDirectoryWrapper(NRTCachingDirectory(RAMDirectory@cbc051 lockFactory=org.apache.lucene.store.SingleInstanceLockFactory@13efd8b; maxCacheMB=0.998046875 maxMergeSizeMB=0.3447265625)),segFN=segments_1,generation=1}
   [junit4]   2> 	commit{dir=MockDirectoryWrapper(NRTCachingDirectory(RAMDirectory@cbc051 lockFactory=org.apache.lucene.store.SingleInstanceLockFactory@13efd8b; maxCacheMB=0.998046875 maxMergeSizeMB=0.3447265625)),segFN=segments_2,generation=2}
   [junit4]   2> 601821 INFO  (qtp23163834-4249) [    x:collection1] o.a.s.c.SolrDeletionPolicy newest commit generation = 2
   [junit4]   2> 602047 INFO  (qtp23163834-4249) [    x:collection1] o.a.s.s.SolrIndexSearcher Opening Searcher@e01167[collection1] main
   [junit4]   2> 602050 INFO  (qtp23163834-4249) [    x:collection1] o.a.s.u.DirectUpdateHandler2 end_commit_flush
   [junit4]   2> 602050 INFO  (searcherExecutor-1927-thread-1-processing-x:collection1) [    x:collection1] o.a.s.c.SolrCore [collection1] Registered new searcher Searcher@e01167[collection1] main{ExitableDirectoryReader(UninvertingDirectoryReader(Uninverting(_0(5.5.3):c1)))}
   [junit4]   2> 602056 INFO  (qtp23163834-4249) [    x:collection1] o.a.s.u.p.LogUpdateProcessorFactory [collection1]  webapp=/solr path=/update params={waitSearcher=true&commit=true&softCommit=false&wt=javabin&version=2}{commit=} 0 266
   [junit4]   2> 602074 WARN  (explicit-fetchindex-cmd) [    x:collection1] o.a.s.h.IndexFetcher 'masterUrl' must be specified without the /replication suffix
   [junit4]   2> 602109 INFO  (qtp23163834-4258) [    x:collection1] o.a.s.c.S.Request [collection1]  webapp=/solr path=/replication params={qt=/replication&wt=javabin&version=2&command=indexversion} status=0 QTime=0
   [junit4]   2> 602112 INFO  (explicit-fetchindex-cmd) [    x:collection1] o.a.s.h.IndexFetcher Master's generation: 2
   [junit4]   2> 602112 INFO  (explicit-fetchindex-cmd) [    x:collection1] o.a.s.h.IndexFetcher Slave's generation: 1
   [junit4]   2> 602112 INFO  (explicit-fetchindex-cmd) [    x:collection1] o.a.s.h.IndexFetcher Starting replication process
   [junit4]   2> 602172 INFO  (qtp23163834-4258) [    x:collection1] o.a.s.c.S.Request [collection1]  webapp=/solr path=/replication params={generation=2&qt=/replication&wt=javabin&version=2&command=filelist} status=0 QTime=58
   [junit4]   2> 602177 INFO  (explicit-fetchindex-cmd) [    x:collection1] o.a.s.h.IndexFetcher Number of files in latest index in master: 4
   [junit4]   2> 602178 INFO  (explicit-fetchindex-cmd) [    x:collection1] o.a.s.c.CachingDirectoryFactory return new directory for C:\Users\jenkins\workspace\Lucene-Solr-5.5-Windows\solr\build\solr-core\test\

[...truncated too long message...]

   2> 778104 INFO  (indexFetcher-2599-thread-1) [    x:collection1] o.a.s.c.CachingDirectoryFactory Closing directory: C:\Users\jenkins\workspace\Lucene-Solr-5.5-Windows\solr\build\solr-core\test\J0\temp\solr.handler.TestReplicationHandler_CFF01DE76BF1B182-001\solr-instance-032\.\collection1\data\index.20160904054802551
   [junit4]   2> 778162 INFO  (qtp2245156-5555) [    x:collection1] o.a.s.c.S.Request [collection1]  webapp=/solr path=/select params={q=*:*&sort=id+desc&wt=javabin&version=2} hits=493 status=0 QTime=4
   [junit4]   2> 778163 INFO  (TEST-TestReplicationHandler.doTestStopPoll-seed#[CFF01DE76BF1B182]) [    ] o.a.s.h.TestReplicationHandler Waited for 500ms and found 493 docs
   [junit4]   2> 778163 INFO  (TEST-TestReplicationHandler.doTestStopPoll-seed#[CFF01DE76BF1B182]) [    ] o.a.s.SolrTestCaseJ4 ###Ending doTestStopPoll
   [junit4]   2> 778170 INFO  (TEST-TestReplicationHandler.doTestStopPoll-seed#[CFF01DE76BF1B182]) [    ] o.e.j.s.ServerConnector Stopped ServerConnector@1c1418c{HTTP/1.1}{127.0.0.1:0}
   [junit4]   2> 778170 INFO  (TEST-TestReplicationHandler.doTestStopPoll-seed#[CFF01DE76BF1B182]) [    ] o.a.s.c.CoreContainer Shutting down CoreContainer instance=23416895
   [junit4]   2> 778174 INFO  (coreCloseExecutor-2602-thread-1) [    x:collection1] o.a.s.c.SolrCore [collection1]  CLOSING SolrCore org.apache.solr.core.SolrCore@254513
   [junit4]   2> 778177 INFO  (coreCloseExecutor-2602-thread-1) [    x:collection1] o.a.s.u.DirectUpdateHandler2 closing DirectUpdateHandler2{commits=2,autocommits=0,soft autocommits=0,optimizes=0,rollbacks=0,expungeDeletes=0,docsPending=0,adds=0,deletesById=0,deletesByQuery=0,errors=0,cumulative_adds=493,cumulative_deletesById=0,cumulative_deletesByQuery=0,cumulative_errors=0}
   [junit4]   2> 778177 INFO  (coreCloseExecutor-2602-thread-1) [    x:collection1] o.a.s.u.SolrCoreState Closing SolrCoreState
   [junit4]   2> 778177 INFO  (coreCloseExecutor-2602-thread-1) [    x:collection1] o.a.s.u.DefaultSolrCoreState SolrCoreState ref count has reached 0 - closing IndexWriter
   [junit4]   2> 778177 INFO  (coreCloseExecutor-2602-thread-1) [    x:collection1] o.a.s.u.DefaultSolrCoreState closing IndexWriter with IndexWriterCloser
   [junit4]   2> 778184 INFO  (coreCloseExecutor-2602-thread-1) [    x:collection1] o.a.s.c.SolrCore [collection1] Closing main searcher on request.
   [junit4]   2> 778188 INFO  (coreCloseExecutor-2602-thread-1) [    x:collection1] o.a.s.c.CachingDirectoryFactory Closing MockDirectoryFactory - 2 directories currently being tracked
   [junit4]   2> 778188 INFO  (coreCloseExecutor-2602-thread-1) [    x:collection1] o.a.s.c.CachingDirectoryFactory looking to close C:\Users\jenkins\workspace\Lucene-Solr-5.5-Windows\solr\build\solr-core\test\J0\temp\solr.handler.TestReplicationHandler_CFF01DE76BF1B182-001\solr-instance-031\.\collection1\data\ [CachedDir<<refCount=0;path=C:\Users\jenkins\workspace\Lucene-Solr-5.5-Windows\solr\build\solr-core\test\J0\temp\solr.handler.TestReplicationHandler_CFF01DE76BF1B182-001\solr-instance-031\.\collection1\data\;done=false>>]
   [junit4]   2> 778188 INFO  (coreCloseExecutor-2602-thread-1) [    x:collection1] o.a.s.c.CachingDirectoryFactory Closing directory: C:\Users\jenkins\workspace\Lucene-Solr-5.5-Windows\solr\build\solr-core\test\J0\temp\solr.handler.TestReplicationHandler_CFF01DE76BF1B182-001\solr-instance-031\.\collection1\data\
   [junit4]   2> 778188 INFO  (coreCloseExecutor-2602-thread-1) [    x:collection1] o.a.s.c.CachingDirectoryFactory looking to close C:\Users\jenkins\workspace\Lucene-Solr-5.5-Windows\solr\build\solr-core\test\J0\temp\solr.handler.TestReplicationHandler_CFF01DE76BF1B182-001\solr-instance-031\.\collection1\data\index [CachedDir<<refCount=0;path=C:\Users\jenkins\workspace\Lucene-Solr-5.5-Windows\solr\build\solr-core\test\J0\temp\solr.handler.TestReplicationHandler_CFF01DE76BF1B182-001\solr-instance-031\.\collection1\data\index;done=false>>]
   [junit4]   2> 778188 INFO  (coreCloseExecutor-2602-thread-1) [    x:collection1] o.a.s.c.CachingDirectoryFactory Closing directory: C:\Users\jenkins\workspace\Lucene-Solr-5.5-Windows\solr\build\solr-core\test\J0\temp\solr.handler.TestReplicationHandler_CFF01DE76BF1B182-001\solr-instance-031\.\collection1\data\index
   [junit4]   2> 778192 INFO  (TEST-TestReplicationHandler.doTestStopPoll-seed#[CFF01DE76BF1B182]) [    ] o.e.j.s.h.ContextHandler Stopped o.e.j.s.ServletContextHandler@ab26b6{/solr,null,UNAVAILABLE}
   [junit4]   2> 778205 INFO  (TEST-TestReplicationHandler.doTestStopPoll-seed#[CFF01DE76BF1B182]) [    ] o.e.j.s.ServerConnector Stopped ServerConnector@1d821b7{HTTP/1.1}{127.0.0.1:0}
   [junit4]   2> 778205 INFO  (TEST-TestReplicationHandler.doTestStopPoll-seed#[CFF01DE76BF1B182]) [    ] o.a.s.c.CoreContainer Shutting down CoreContainer instance=6959165
   [junit4]   2> 778211 INFO  (coreCloseExecutor-2604-thread-1) [    x:collection1] o.a.s.c.SolrCore [collection1]  CLOSING SolrCore org.apache.solr.core.SolrCore@b5cbf1
   [junit4]   2> 778214 INFO  (coreCloseExecutor-2604-thread-1) [    x:collection1] o.a.s.u.DirectUpdateHandler2 closing DirectUpdateHandler2{commits=0,autocommits=0,soft autocommits=0,optimizes=0,rollbacks=0,expungeDeletes=0,docsPending=0,adds=0,deletesById=0,deletesByQuery=0,errors=0,cumulative_adds=0,cumulative_deletesById=0,cumulative_deletesByQuery=0,cumulative_errors=0}
   [junit4]   2> 778214 INFO  (coreCloseExecutor-2604-thread-1) [    x:collection1] o.a.s.u.SolrCoreState Closing SolrCoreState
   [junit4]   2> 778216 INFO  (coreCloseExecutor-2604-thread-1) [    x:collection1] o.a.s.u.DefaultSolrCoreState SolrCoreState ref count has reached 0 - closing IndexWriter
   [junit4]   2> 778217 INFO  (coreCloseExecutor-2604-thread-1) [    x:collection1] o.a.s.u.DefaultSolrCoreState closing IndexWriter with IndexWriterCloser
   [junit4]   2> 778225 INFO  (coreCloseExecutor-2604-thread-1) [    x:collection1] o.a.s.c.SolrCore [collection1] Closing main searcher on request.
   [junit4]   2> 778231 INFO  (coreCloseExecutor-2604-thread-1) [    x:collection1] o.a.s.c.CachingDirectoryFactory Closing MockDirectoryFactory - 2 directories currently being tracked
   [junit4]   2> 778231 INFO  (coreCloseExecutor-2604-thread-1) [    x:collection1] o.a.s.c.CachingDirectoryFactory looking to close C:\Users\jenkins\workspace\Lucene-Solr-5.5-Windows\solr\build\solr-core\test\J0\temp\solr.handler.TestReplicationHandler_CFF01DE76BF1B182-001\solr-instance-032\.\collection1\data\index [CachedDir<<refCount=0;path=C:\Users\jenkins\workspace\Lucene-Solr-5.5-Windows\solr\build\solr-core\test\J0\temp\solr.handler.TestReplicationHandler_CFF01DE76BF1B182-001\solr-instance-032\.\collection1\data\index;done=false>>]
   [junit4]   2> 778231 INFO  (coreCloseExecutor-2604-thread-1) [    x:collection1] o.a.s.c.CachingDirectoryFactory Closing directory: C:\Users\jenkins\workspace\Lucene-Solr-5.5-Windows\solr\build\solr-core\test\J0\temp\solr.handler.TestReplicationHandler_CFF01DE76BF1B182-001\solr-instance-032\.\collection1\data\index
   [junit4]   2> 778232 INFO  (coreCloseExecutor-2604-thread-1) [    x:collection1] o.a.s.c.CachingDirectoryFactory looking to close C:\Users\jenkins\workspace\Lucene-Solr-5.5-Windows\solr\build\solr-core\test\J0\temp\solr.handler.TestReplicationHandler_CFF01DE76BF1B182-001\solr-instance-032\.\collection1\data\ [CachedDir<<refCount=0;path=C:\Users\jenkins\workspace\Lucene-Solr-5.5-Windows\solr\build\solr-core\test\J0\temp\solr.handler.TestReplicationHandler_CFF01DE76BF1B182-001\solr-instance-032\.\collection1\data\;done=false>>]
   [junit4]   2> 778232 INFO  (coreCloseExecutor-2604-thread-1) [    x:collection1] o.a.s.c.CachingDirectoryFactory Closing directory: C:\Users\jenkins\workspace\Lucene-Solr-5.5-Windows\solr\build\solr-core\test\J0\temp\solr.handler.TestReplicationHandler_CFF01DE76BF1B182-001\solr-instance-032\.\collection1\data\
   [junit4]   2> 778235 INFO  (TEST-TestReplicationHandler.doTestStopPoll-seed#[CFF01DE76BF1B182]) [    ] o.e.j.s.h.ContextHandler Stopped o.e.j.s.ServletContextHandler@159c238{/solr,null,UNAVAILABLE}
   [junit4]   2> 778253 INFO  (SUITE-TestReplicationHandler-seed#[CFF01DE76BF1B182]-worker) [    ] o.a.s.SolrTestCaseJ4 ###deleteCore
   [junit4]   2> NOTE: leaving temporary files on disk at: C:\Users\jenkins\workspace\Lucene-Solr-5.5-Windows\solr\build\solr-core\test\J0\temp\solr.handler.TestReplicationHandler_CFF01DE76BF1B182-001
   [junit4]   2> NOTE: test params are: codec=Asserting(Lucene54): {name=PostingsFormat(name=Direct), id=PostingsFormat(name=Direct), newname=PostingsFormat(name=Direct)}, docValues:{}, sim=RandomSimilarity(queryNorm=false,coord=crazy): {}, locale=de-LU, timezone=America/Adak
   [junit4]   2> NOTE: Windows 10 10.0 x86/Oracle Corporation 1.8.0_102 (32-bit)/cpus=3,threads=1,free=106682664,total=241434624
   [junit4]   2> NOTE: All tests run in this JVM: [HighlighterMaxOffsetTest, TestSmileRequest, SimplePostToolTest, TestExactSharedStatsCache, AsyncMigrateRouteKeyTest, ReplicationFactorTest, SpatialHeatmapFacetsTest, TestRestoreCore, TestFreeTextSuggestions, HdfsChaosMonkeyNothingIsSafeTest, BitVectorTest, ConfigSetsAPITest, UpdateParamsTest, ForceLeaderTest, TestChildDocTransformer, ZkStateWriterTest, RegexBoostProcessorTest, TestTrieFacet, BlockJoinFacetRandomTest, SimpleFacetsTest, TestSearcherReuse, TestMissingGroups, TestRawResponseWriter, TestComponentsName, CreateCollectionCleanupTest, ZkCLITest, TestReloadAndDeleteDocs, TestCloudPivotFacet, CheckHdfsIndexTest, TestJsonFacets, SolrRequestParserTest, TestStandardQParsers, SmileWriterTest, HdfsBasicDistributedZk2Test, TestSurroundQueryParser, TestIntervalFaceting, TestManagedSchema, BigEndianAscendingWordDeserializerTest, TestManagedSchemaFieldResource, RecoveryAfterSoftCommitTest, DisMaxRequestHandlerTest, TestUpdate, TestReplicationHandler]
   [junit4] Completed [103/575 (1!)] on J0 in 184.54s, 15 tests, 1 failure, 1 error <<< FAILURES!

[...truncated 50671 lines...]


Mime
View raw message