lucene-dev mailing list archives

Site index · List index
Message view « Date » · « Thread »
Top « Date » · « Thread »
From Policeman Jenkins Server <jenk...@thetaphi.de>
Subject [JENKINS] Lucene-Solr-6.x-Solaris (64bit/jdk1.8.0) - Build # 383 - Unstable!
Date Sat, 10 Sep 2016 22:38:14 GMT
Build: http://jenkins.thetaphi.de/job/Lucene-Solr-6.x-Solaris/383/
Java: 64bit/jdk1.8.0 -XX:-UseCompressedOops -XX:+UseParallelGC

1 tests failed.
FAILED:  org.apache.solr.security.BasicAuthIntegrationTest.testBasicAuth

Error Message:
IOException occured when talking to server at: https://127.0.0.1:47782/solr

Stack Trace:
org.apache.solr.client.solrj.SolrServerException: IOException occured when talking to server at: https://127.0.0.1:47782/solr
	at __randomizedtesting.SeedInfo.seed([4A2B627F97BE926A:F645146D33ED1110]:0)
	at org.apache.solr.client.solrj.impl.HttpSolrClient.executeMethod(HttpSolrClient.java:606)
	at org.apache.solr.client.solrj.impl.HttpSolrClient.request(HttpSolrClient.java:261)
	at org.apache.solr.client.solrj.impl.HttpSolrClient.request(HttpSolrClient.java:250)
	at org.apache.solr.client.solrj.SolrClient.request(SolrClient.java:1219)
	at org.apache.solr.security.BasicAuthIntegrationTest.testBasicAuth(BasicAuthIntegrationTest.java:158)
	at sun.reflect.NativeMethodAccessorImpl.invoke0(Native Method)
	at sun.reflect.NativeMethodAccessorImpl.invoke(NativeMethodAccessorImpl.java:62)
	at sun.reflect.DelegatingMethodAccessorImpl.invoke(DelegatingMethodAccessorImpl.java:43)
	at java.lang.reflect.Method.invoke(Method.java:498)
	at com.carrotsearch.randomizedtesting.RandomizedRunner.invoke(RandomizedRunner.java:1764)
	at com.carrotsearch.randomizedtesting.RandomizedRunner$8.evaluate(RandomizedRunner.java:871)
	at com.carrotsearch.randomizedtesting.RandomizedRunner$9.evaluate(RandomizedRunner.java:907)
	at com.carrotsearch.randomizedtesting.RandomizedRunner$10.evaluate(RandomizedRunner.java:921)
	at com.carrotsearch.randomizedtesting.rules.SystemPropertiesRestoreRule$1.evaluate(SystemPropertiesRestoreRule.java:57)
	at org.apache.lucene.util.TestRuleSetupTeardownChained$1.evaluate(TestRuleSetupTeardownChained.java:49)
	at org.apache.lucene.util.AbstractBeforeAfterRule$1.evaluate(AbstractBeforeAfterRule.java:45)
	at org.apache.lucene.util.TestRuleThreadAndTestName$1.evaluate(TestRuleThreadAndTestName.java:48)
	at org.apache.lucene.util.TestRuleIgnoreAfterMaxFailures$1.evaluate(TestRuleIgnoreAfterMaxFailures.java:64)
	at org.apache.lucene.util.TestRuleMarkFailure$1.evaluate(TestRuleMarkFailure.java:47)
	at com.carrotsearch.randomizedtesting.rules.StatementAdapter.evaluate(StatementAdapter.java:36)
	at com.carrotsearch.randomizedtesting.ThreadLeakControl$StatementRunner.run(ThreadLeakControl.java:367)
	at com.carrotsearch.randomizedtesting.ThreadLeakControl.forkTimeoutingTask(ThreadLeakControl.java:809)
	at com.carrotsearch.randomizedtesting.ThreadLeakControl$3.evaluate(ThreadLeakControl.java:460)
	at com.carrotsearch.randomizedtesting.RandomizedRunner.runSingleTest(RandomizedRunner.java:880)
	at com.carrotsearch.randomizedtesting.RandomizedRunner$5.evaluate(RandomizedRunner.java:781)
	at com.carrotsearch.randomizedtesting.RandomizedRunner$6.evaluate(RandomizedRunner.java:816)
	at com.carrotsearch.randomizedtesting.RandomizedRunner$7.evaluate(RandomizedRunner.java:827)
	at com.carrotsearch.randomizedtesting.rules.StatementAdapter.evaluate(StatementAdapter.java:36)
	at com.carrotsearch.randomizedtesting.rules.SystemPropertiesRestoreRule$1.evaluate(SystemPropertiesRestoreRule.java:57)
	at org.apache.lucene.util.AbstractBeforeAfterRule$1.evaluate(AbstractBeforeAfterRule.java:45)
	at com.carrotsearch.randomizedtesting.rules.StatementAdapter.evaluate(StatementAdapter.java:36)
	at org.apache.lucene.util.TestRuleStoreClassName$1.evaluate(TestRuleStoreClassName.java:41)
	at com.carrotsearch.randomizedtesting.rules.NoShadowingOrOverridesOnMethodsRule$1.evaluate(NoShadowingOrOverridesOnMethodsRule.java:40)
	at com.carrotsearch.randomizedtesting.rules.NoShadowingOrOverridesOnMethodsRule$1.evaluate(NoShadowingOrOverridesOnMethodsRule.java:40)
	at com.carrotsearch.randomizedtesting.rules.StatementAdapter.evaluate(StatementAdapter.java:36)
	at com.carrotsearch.randomizedtesting.rules.StatementAdapter.evaluate(StatementAdapter.java:36)
	at com.carrotsearch.randomizedtesting.rules.StatementAdapter.evaluate(StatementAdapter.java:36)
	at org.apache.lucene.util.TestRuleAssertionsRequired$1.evaluate(TestRuleAssertionsRequired.java:53)
	at org.apache.lucene.util.TestRuleMarkFailure$1.evaluate(TestRuleMarkFailure.java:47)
	at org.apache.lucene.util.TestRuleIgnoreAfterMaxFailures$1.evaluate(TestRuleIgnoreAfterMaxFailures.java:64)
	at org.apache.lucene.util.TestRuleIgnoreTestSuites$1.evaluate(TestRuleIgnoreTestSuites.java:54)
	at com.carrotsearch.randomizedtesting.rules.StatementAdapter.evaluate(StatementAdapter.java:36)
	at com.carrotsearch.randomizedtesting.ThreadLeakControl$StatementRunner.run(ThreadLeakControl.java:367)
	at java.lang.Thread.run(Thread.java:745)
Caused by: javax.net.ssl.SSLHandshakeException: sun.security.validator.ValidatorException: PKIX path building failed: sun.security.provider.certpath.SunCertPathBuilderException: unable to find valid certification path to requested target
	at sun.security.ssl.Alerts.getSSLException(Alerts.java:192)
	at sun.security.ssl.SSLSocketImpl.fatal(SSLSocketImpl.java:1949)
	at sun.security.ssl.Handshaker.fatalSE(Handshaker.java:302)
	at sun.security.ssl.Handshaker.fatalSE(Handshaker.java:296)
	at sun.security.ssl.ClientHandshaker.serverCertificate(ClientHandshaker.java:1509)
	at sun.security.ssl.ClientHandshaker.processMessage(ClientHandshaker.java:216)
	at sun.security.ssl.Handshaker.processLoop(Handshaker.java:979)
	at sun.security.ssl.Handshaker.process_record(Handshaker.java:914)
	at sun.security.ssl.SSLSocketImpl.readRecord(SSLSocketImpl.java:1062)
	at sun.security.ssl.SSLSocketImpl.performInitialHandshake(SSLSocketImpl.java:1375)
	at sun.security.ssl.SSLSocketImpl.startHandshake(SSLSocketImpl.java:1403)
	at sun.security.ssl.SSLSocketImpl.startHandshake(SSLSocketImpl.java:1387)
	at org.apache.http.conn.ssl.SSLSocketFactory.connectSocket(SSLSocketFactory.java:543)
	at org.apache.http.conn.ssl.SSLSocketFactory.connectSocket(SSLSocketFactory.java:409)
	at org.apache.http.impl.conn.DefaultClientConnectionOperator.openConnection(DefaultClientConnectionOperator.java:177)
	at org.apache.http.impl.conn.ManagedClientConnectionImpl.open(ManagedClientConnectionImpl.java:304)
	at org.apache.http.impl.client.DefaultRequestDirector.tryConnect(DefaultRequestDirector.java:611)
	at org.apache.http.impl.client.DefaultRequestDirector.execute(DefaultRequestDirector.java:446)
	at org.apache.http.impl.client.AbstractHttpClient.doExecute(AbstractHttpClient.java:882)
	at org.apache.http.impl.client.CloseableHttpClient.execute(CloseableHttpClient.java:82)
	at org.apache.http.impl.client.CloseableHttpClient.execute(CloseableHttpClient.java:107)
	at org.apache.http.impl.client.CloseableHttpClient.execute(CloseableHttpClient.java:55)
	at org.apache.solr.client.solrj.impl.HttpSolrClient.executeMethod(HttpSolrClient.java:497)
	... 43 more
Caused by: sun.security.validator.ValidatorException: PKIX path building failed: sun.security.provider.certpath.SunCertPathBuilderException: unable to find valid certification path to requested target
	at sun.security.validator.PKIXValidator.doBuild(PKIXValidator.java:387)
	at sun.security.validator.PKIXValidator.engineValidate(PKIXValidator.java:292)
	at sun.security.validator.Validator.validate(Validator.java:260)
	at sun.security.ssl.X509TrustManagerImpl.validate(X509TrustManagerImpl.java:324)
	at sun.security.ssl.X509TrustManagerImpl.checkTrusted(X509TrustManagerImpl.java:229)
	at sun.security.ssl.X509TrustManagerImpl.checkServerTrusted(X509TrustManagerImpl.java:124)
	at sun.security.ssl.ClientHandshaker.serverCertificate(ClientHandshaker.java:1491)
	... 61 more
Caused by: sun.security.provider.certpath.SunCertPathBuilderException: unable to find valid certification path to requested target
	at sun.security.provider.certpath.SunCertPathBuilder.build(SunCertPathBuilder.java:141)
	at sun.security.provider.certpath.SunCertPathBuilder.engineBuild(SunCertPathBuilder.java:126)
	at java.security.cert.CertPathBuilder.build(CertPathBuilder.java:280)
	at sun.security.validator.PKIXValidator.doBuild(PKIXValidator.java:382)
	... 67 more




Build Log:
[...truncated 12452 lines...]
   [junit4] Suite: org.apache.solr.security.BasicAuthIntegrationTest
   [junit4]   2> Creating dataDir: /export/home/jenkins/workspace/Lucene-Solr-6.x-Solaris/solr/build/solr-core/test/J0/temp/solr.security.BasicAuthIntegrationTest_4A2B627F97BE926A-001/init-core-data-001
   [junit4]   2> 3168317 INFO  (SUITE-BasicAuthIntegrationTest-seed#[4A2B627F97BE926A]-worker) [    ] o.a.s.SolrTestCaseJ4 Randomized ssl (true) and clientAuth (false) via: @org.apache.solr.util.RandomizeSSL(reason=, value=NaN, ssl=NaN, clientAuth=NaN)
   [junit4]   2> 3168318 INFO  (SUITE-BasicAuthIntegrationTest-seed#[4A2B627F97BE926A]-worker) [    ] o.a.s.c.ZkTestServer STARTING ZK TEST SERVER
   [junit4]   2> 3168318 INFO  (Thread-12001) [    ] o.a.s.c.ZkTestServer client port:0.0.0.0/0.0.0.0:0
   [junit4]   2> 3168318 INFO  (Thread-12001) [    ] o.a.s.c.ZkTestServer Starting server
   [junit4]   2> 3168419 INFO  (SUITE-BasicAuthIntegrationTest-seed#[4A2B627F97BE926A]-worker) [    ] o.a.s.c.ZkTestServer start zk server on port:40000
   [junit4]   2> 3168419 INFO  (SUITE-BasicAuthIntegrationTest-seed#[4A2B627F97BE926A]-worker) [    ] o.a.s.c.c.SolrZkClient Using default ZkCredentialsProvider
   [junit4]   2> 3168419 INFO  (SUITE-BasicAuthIntegrationTest-seed#[4A2B627F97BE926A]-worker) [    ] o.a.s.c.c.ConnectionManager Waiting for client to connect to ZooKeeper
   [junit4]   2> 3168421 INFO  (zkCallback-4290-thread-1) [    ] o.a.s.c.c.ConnectionManager Watcher org.apache.solr.common.cloud.ConnectionManager@61bcc772 name:ZooKeeperConnection Watcher:127.0.0.1:40000 got event WatchedEvent state:SyncConnected type:None path:null path:null type:None
   [junit4]   2> 3168421 INFO  (SUITE-BasicAuthIntegrationTest-seed#[4A2B627F97BE926A]-worker) [    ] o.a.s.c.c.ConnectionManager Client is connected to ZooKeeper
   [junit4]   2> 3168421 INFO  (SUITE-BasicAuthIntegrationTest-seed#[4A2B627F97BE926A]-worker) [    ] o.a.s.c.c.SolrZkClient Using default ZkACLProvider
   [junit4]   2> 3168421 INFO  (SUITE-BasicAuthIntegrationTest-seed#[4A2B627F97BE926A]-worker) [    ] o.a.s.c.c.SolrZkClient makePath: /solr/solr.xml
   [junit4]   2> 3168424 INFO  (SUITE-BasicAuthIntegrationTest-seed#[4A2B627F97BE926A]-worker) [    ] o.a.s.c.c.SolrZkClient makePath: /solr/clusterprops.json
   [junit4]   2> 3168430 INFO  (jetty-launcher-4289-thread-1) [    ] o.e.j.s.Server jetty-9.3.8.v20160314
   [junit4]   2> 3168430 INFO  (jetty-launcher-4289-thread-2) [    ] o.e.j.s.Server jetty-9.3.8.v20160314
   [junit4]   2> 3168430 INFO  (jetty-launcher-4289-thread-3) [    ] o.e.j.s.Server jetty-9.3.8.v20160314
   [junit4]   2> 3168433 INFO  (jetty-launcher-4289-thread-3) [    ] o.e.j.s.h.ContextHandler Started o.e.j.s.ServletContextHandler@2550cc8a{/solr,null,AVAILABLE}
   [junit4]   2> 3168434 INFO  (jetty-launcher-4289-thread-2) [    ] o.e.j.s.h.ContextHandler Started o.e.j.s.ServletContextHandler@1d52d79f{/solr,null,AVAILABLE}
   [junit4]   2> 3168435 INFO  (jetty-launcher-4289-thread-1) [    ] o.e.j.s.h.ContextHandler Started o.e.j.s.ServletContextHandler@7db7aa08{/solr,null,AVAILABLE}
   [junit4]   2> 3168435 INFO  (jetty-launcher-4289-thread-2) [    ] o.e.j.s.ServerConnector Started ServerConnector@d0268c4{SSL,[ssl, http/1.1]}{127.0.0.1:36906}
   [junit4]   2> 3168435 INFO  (jetty-launcher-4289-thread-2) [    ] o.e.j.s.Server Started @3171697ms
   [junit4]   2> 3168436 INFO  (jetty-launcher-4289-thread-2) [    ] o.a.s.c.s.e.JettySolrRunner Jetty properties: {hostContext=/solr, hostPort=36906}
   [junit4]   2> 3168436 INFO  (jetty-launcher-4289-thread-1) [    ] o.e.j.s.ServerConnector Started ServerConnector@3c7cf192{SSL,[ssl, http/1.1]}{127.0.0.1:62928}
   [junit4]   2> 3168436 INFO  (jetty-launcher-4289-thread-2) [    ] o.a.s.s.SolrDispatchFilter SolrDispatchFilter.init(): sun.misc.Launcher$AppClassLoader@6d06d69c
   [junit4]   2> 3168436 INFO  (jetty-launcher-4289-thread-1) [    ] o.e.j.s.Server Started @3171698ms
   [junit4]   2> 3168436 INFO  (jetty-launcher-4289-thread-2) [    ] o.a.s.c.SolrResourceLoader new SolrResourceLoader for directory: '/export/home/jenkins/workspace/Lucene-Solr-6.x-Solaris/solr/build/solr-core/test/J0/temp/solr.security.BasicAuthIntegrationTest_4A2B627F97BE926A-001/tempDir-001/node2'
   [junit4]   2> 3168436 INFO  (jetty-launcher-4289-thread-2) [    ] o.a.s.c.SolrResourceLoader JNDI not configured for solr (NoInitialContextEx)
   [junit4]   2> 3168436 INFO  (jetty-launcher-4289-thread-2) [    ] o.a.s.c.SolrResourceLoader solr home defaulted to 'solr/' (could not find system property or JNDI)
   [junit4]   2> 3168436 INFO  (jetty-launcher-4289-thread-1) [    ] o.a.s.c.s.e.JettySolrRunner Jetty properties: {hostContext=/solr, hostPort=62928}
   [junit4]   2> 3168436 INFO  (jetty-launcher-4289-thread-2) [    ] o.a.s.c.c.SolrZkClient Using default ZkCredentialsProvider
   [junit4]   2> 3168436 INFO  (jetty-launcher-4289-thread-1) [    ] o.a.s.s.SolrDispatchFilter SolrDispatchFilter.init(): sun.misc.Launcher$AppClassLoader@6d06d69c
   [junit4]   2> 3168436 INFO  (jetty-launcher-4289-thread-1) [    ] o.a.s.c.SolrResourceLoader new SolrResourceLoader for directory: '/export/home/jenkins/workspace/Lucene-Solr-6.x-Solaris/solr/build/solr-core/test/J0/temp/solr.security.BasicAuthIntegrationTest_4A2B627F97BE926A-001/tempDir-001/node1'
   [junit4]   2> 3168437 INFO  (jetty-launcher-4289-thread-1) [    ] o.a.s.c.SolrResourceLoader JNDI not configured for solr (NoInitialContextEx)
   [junit4]   2> 3168437 INFO  (jetty-launcher-4289-thread-1) [    ] o.a.s.c.SolrResourceLoader solr home defaulted to 'solr/' (could not find system property or JNDI)
   [junit4]   2> 3168437 INFO  (jetty-launcher-4289-thread-1) [    ] o.a.s.c.c.SolrZkClient Using default ZkCredentialsProvider
   [junit4]   2> 3168437 INFO  (jetty-launcher-4289-thread-2) [    ] o.a.s.c.c.ConnectionManager Waiting for client to connect to ZooKeeper
   [junit4]   2> 3168438 INFO  (jetty-launcher-4289-thread-1) [    ] o.a.s.c.c.ConnectionManager Waiting for client to connect to ZooKeeper
   [junit4]   2> 3168438 INFO  (jetty-launcher-4289-thread-3) [    ] o.e.j.s.ServerConnector Started ServerConnector@68191870{SSL,[ssl, http/1.1]}{127.0.0.1:47782}
   [junit4]   2> 3168438 INFO  (jetty-launcher-4289-thread-3) [    ] o.e.j.s.Server Started @3171700ms
   [junit4]   2> 3168438 INFO  (jetty-launcher-4289-thread-3) [    ] o.a.s.c.s.e.JettySolrRunner Jetty properties: {hostContext=/solr, hostPort=47782}
   [junit4]   2> 3168438 INFO  (jetty-launcher-4289-thread-3) [    ] o.a.s.s.SolrDispatchFilter SolrDispatchFilter.init(): sun.misc.Launcher$AppClassLoader@6d06d69c
   [junit4]   2> 3168438 INFO  (jetty-launcher-4289-thread-3) [    ] o.a.s.c.SolrResourceLoader new SolrResourceLoader for directory: '/export/home/jenkins/workspace/Lucene-Solr-6.x-Solaris/solr/build/solr-core/test/J0/temp/solr.security.BasicAuthIntegrationTest_4A2B627F97BE926A-001/tempDir-001/node3'
   [junit4]   2> 3168438 INFO  (jetty-launcher-4289-thread-3) [    ] o.a.s.c.SolrResourceLoader JNDI not configured for solr (NoInitialContextEx)
   [junit4]   2> 3168438 INFO  (jetty-launcher-4289-thread-3) [    ] o.a.s.c.SolrResourceLoader solr home defaulted to 'solr/' (could not find system property or JNDI)
   [junit4]   2> 3168438 INFO  (jetty-launcher-4289-thread-3) [    ] o.a.s.c.c.SolrZkClient Using default ZkCredentialsProvider
   [junit4]   2> 3168439 INFO  (zkCallback-4291-thread-1) [    ] o.a.s.c.c.ConnectionManager Watcher org.apache.solr.common.cloud.ConnectionManager@41e36a9e name:ZooKeeperConnection Watcher:127.0.0.1:40000/solr got event WatchedEvent state:SyncConnected type:None path:null path:null type:None
   [junit4]   2> 3168439 INFO  (zkCallback-4292-thread-1) [    ] o.a.s.c.c.ConnectionManager Watcher org.apache.solr.common.cloud.ConnectionManager@1c1ce87b name:ZooKeeperConnection Watcher:127.0.0.1:40000/solr got event WatchedEvent state:SyncConnected type:None path:null path:null type:None
   [junit4]   2> 3168439 INFO  (jetty-launcher-4289-thread-2) [    ] o.a.s.c.c.ConnectionManager Client is connected to ZooKeeper
   [junit4]   2> 3168439 INFO  (jetty-launcher-4289-thread-3) [    ] o.a.s.c.c.ConnectionManager Waiting for client to connect to ZooKeeper
   [junit4]   2> 3168439 INFO  (jetty-launcher-4289-thread-2) [    ] o.a.s.c.c.SolrZkClient Using default ZkACLProvider
   [junit4]   2> 3168439 INFO  (jetty-launcher-4289-thread-1) [    ] o.a.s.c.c.ConnectionManager Client is connected to ZooKeeper
   [junit4]   2> 3168440 INFO  (jetty-launcher-4289-thread-1) [    ] o.a.s.c.c.SolrZkClient Using default ZkACLProvider
   [junit4]   2> 3168440 INFO  (jetty-launcher-4289-thread-2) [    ] o.a.s.s.SolrDispatchFilter solr.xml found in ZooKeeper. Loading...
   [junit4]   2> 3168441 INFO  (jetty-launcher-4289-thread-1) [    ] o.a.s.s.SolrDispatchFilter solr.xml found in ZooKeeper. Loading...
   [junit4]   2> 3168441 INFO  (zkCallback-4293-thread-1) [    ] o.a.s.c.c.ConnectionManager Watcher org.apache.solr.common.cloud.ConnectionManager@5b9bc173 name:ZooKeeperConnection Watcher:127.0.0.1:40000/solr got event WatchedEvent state:SyncConnected type:None path:null path:null type:None
   [junit4]   2> 3168441 INFO  (jetty-launcher-4289-thread-3) [    ] o.a.s.c.c.ConnectionManager Client is connected to ZooKeeper
   [junit4]   2> 3168441 INFO  (jetty-launcher-4289-thread-3) [    ] o.a.s.c.c.SolrZkClient Using default ZkACLProvider
   [junit4]   2> 3168442 INFO  (jetty-launcher-4289-thread-3) [    ] o.a.s.s.SolrDispatchFilter solr.xml found in ZooKeeper. Loading...
   [junit4]   2> 3168447 INFO  (jetty-launcher-4289-thread-2) [    ] o.a.s.c.CorePropertiesLocator Config-defined core root directory: /export/home/jenkins/workspace/Lucene-Solr-6.x-Solaris/solr/build/solr-core/test/J0/temp/solr.security.BasicAuthIntegrationTest_4A2B627F97BE926A-001/tempDir-001/node2/.
   [junit4]   2> 3168447 INFO  (jetty-launcher-4289-thread-3) [    ] o.a.s.c.CorePropertiesLocator Config-defined core root directory: /export/home/jenkins/workspace/Lucene-Solr-6.x-Solaris/solr/build/solr-core/test/J0/temp/solr.security.BasicAuthIntegrationTest_4A2B627F97BE926A-001/tempDir-001/node3/.
   [junit4]   2> 3168447 INFO  (jetty-launcher-4289-thread-2) [    ] o.a.s.c.CoreContainer New CoreContainer 1639805293
   [junit4]   2> 3168447 INFO  (jetty-launcher-4289-thread-1) [    ] o.a.s.c.CorePropertiesLocator Config-defined core root directory: /export/home/jenkins/workspace/Lucene-Solr-6.x-Solaris/solr/build/solr-core/test/J0/temp/solr.security.BasicAuthIntegrationTest_4A2B627F97BE926A-001/tempDir-001/node1/.
   [junit4]   2> 3168447 INFO  (jetty-launcher-4289-thread-1) [    ] o.a.s.c.CoreContainer New CoreContainer 780808463
   [junit4]   2> 3168447 INFO  (jetty-launcher-4289-thread-1) [    ] o.a.s.c.CoreContainer Loading cores into CoreContainer [instanceDir=/export/home/jenkins/workspace/Lucene-Solr-6.x-Solaris/solr/build/solr-core/test/J0/temp/solr.security.BasicAuthIntegrationTest_4A2B627F97BE926A-001/tempDir-001/node1]
   [junit4]   2> 3168447 INFO  (jetty-launcher-4289-thread-2) [    ] o.a.s.c.CoreContainer Loading cores into CoreContainer [instanceDir=/export/home/jenkins/workspace/Lucene-Solr-6.x-Solaris/solr/build/solr-core/test/J0/temp/solr.security.BasicAuthIntegrationTest_4A2B627F97BE926A-001/tempDir-001/node2]
   [junit4]   2> 3168448 WARN  (jetty-launcher-4289-thread-1) [    ] o.a.s.c.CoreContainer Couldn't add files from /export/home/jenkins/workspace/Lucene-Solr-6.x-Solaris/solr/build/solr-core/test/J0/temp/solr.security.BasicAuthIntegrationTest_4A2B627F97BE926A-001/tempDir-001/node1/lib to classpath: /export/home/jenkins/workspace/Lucene-Solr-6.x-Solaris/solr/build/solr-core/test/J0/temp/solr.security.BasicAuthIntegrationTest_4A2B627F97BE926A-001/tempDir-001/node1/lib
   [junit4]   2> 3168447 INFO  (jetty-launcher-4289-thread-3) [    ] o.a.s.c.CoreContainer New CoreContainer 420972699
   [junit4]   2> 3168448 INFO  (jetty-launcher-4289-thread-1) [    ] o.a.s.h.c.HttpShardHandlerFactory created with socketTimeout : 90000,urlScheme : https,connTimeout : 15000,maxConnectionsPerHost : 20,maxConnections : 10000,corePoolSize : 0,maximumPoolSize : 2147483647,maxThreadIdleTime : 5,sizeOfQueue : -1,fairnessPolicy : false,useRetries : false,connectionsEvictorSleepDelay : 5000,maxConnectionIdleTime : 40000,
   [junit4]   2> 3168448 INFO  (jetty-launcher-4289-thread-3) [    ] o.a.s.c.CoreContainer Loading cores into CoreContainer [instanceDir=/export/home/jenkins/workspace/Lucene-Solr-6.x-Solaris/solr/build/solr-core/test/J0/temp/solr.security.BasicAuthIntegrationTest_4A2B627F97BE926A-001/tempDir-001/node3]
   [junit4]   2> 3168448 WARN  (jetty-launcher-4289-thread-2) [    ] o.a.s.c.CoreContainer Couldn't add files from /export/home/jenkins/workspace/Lucene-Solr-6.x-Solaris/solr/build/solr-core/test/J0/temp/solr.security.BasicAuthIntegrationTest_4A2B627F97BE926A-001/tempDir-001/node2/lib to classpath: /export/home/jenkins/workspace/Lucene-Solr-6.x-Solaris/solr/build/solr-core/test/J0/temp/solr.security.BasicAuthIntegrationTest_4A2B627F97BE926A-001/tempDir-001/node2/lib
   [junit4]   2> 3168448 WARN  (jetty-launcher-4289-thread-3) [    ] o.a.s.c.CoreContainer Couldn't add files from /export/home/jenkins/workspace/Lucene-Solr-6.x-Solaris/solr/build/solr-core/test/J0/temp/solr.security.BasicAuthIntegrationTest_4A2B627F97BE926A-001/tempDir-001/node3/lib to classpath: /export/home/jenkins/workspace/Lucene-Solr-6.x-Solaris/solr/build/solr-core/test/J0/temp/solr.security.BasicAuthIntegrationTest_4A2B627F97BE926A-001/tempDir-001/node3/lib
   [junit4]   2> 3168448 INFO  (jetty-launcher-4289-thread-2) [    ] o.a.s.h.c.HttpShardHandlerFactory created with socketTimeout : 90000,urlScheme : https,connTimeout : 15000,maxConnectionsPerHost : 20,maxConnections : 10000,corePoolSize : 0,maximumPoolSize : 2147483647,maxThreadIdleTime : 5,sizeOfQueue : -1,fairnessPolicy : false,useRetries : false,connectionsEvictorSleepDelay : 5000,maxConnectionIdleTime : 40000,
   [junit4]   2> 3168448 INFO  (jetty-launcher-4289-thread-3) [    ] o.a.s.h.c.HttpShardHandlerFactory created with socketTimeout : 90000,urlScheme : https,connTimeout : 15000,maxConnectionsPerHost : 20,maxConnections : 10000,corePoolSize : 0,maximumPoolSize : 2147483647,maxThreadIdleTime : 5,sizeOfQueue : -1,fairnessPolicy : false,useRetries : false,connectionsEvictorSleepDelay : 5000,maxConnectionIdleTime : 40000,
   [junit4]   2> 3168449 INFO  (jetty-launcher-4289-thread-3) [    ] o.a.s.u.UpdateShardHandler Creating UpdateShardHandler HTTP client with params: socketTimeout=340000&connTimeout=45000&retry=true
   [junit4]   2> 3168449 INFO  (jetty-launcher-4289-thread-2) [    ] o.a.s.u.UpdateShardHandler Creating UpdateShardHandler HTTP client with params: socketTimeout=340000&connTimeout=45000&retry=true
   [junit4]   2> 3168449 INFO  (jetty-launcher-4289-thread-1) [    ] o.a.s.u.UpdateShardHandler Creating UpdateShardHandler HTTP client with params: socketTimeout=340000&connTimeout=45000&retry=true
   [junit4]   2> 3168450 INFO  (jetty-launcher-4289-thread-3) [    ] o.a.s.l.LogWatcher SLF4J impl is org.slf4j.impl.Log4jLoggerFactory
   [junit4]   2> 3168450 INFO  (jetty-launcher-4289-thread-3) [    ] o.a.s.l.LogWatcher Registering Log Listener [Log4j (org.slf4j.impl.Log4jLoggerFactory)]
   [junit4]   2> 3168450 INFO  (jetty-launcher-4289-thread-2) [    ] o.a.s.l.LogWatcher SLF4J impl is org.slf4j.impl.Log4jLoggerFactory
   [junit4]   2> 3168450 INFO  (jetty-launcher-4289-thread-2) [    ] o.a.s.l.LogWatcher Registering Log Listener [Log4j (org.slf4j.impl.Log4jLoggerFactory)]
   [junit4]   2> 3168450 INFO  (jetty-launcher-4289-thread-1) [    ] o.a.s.l.LogWatcher SLF4J impl is org.slf4j.impl.Log4jLoggerFactory
   [junit4]   2> 3168450 INFO  (jetty-launcher-4289-thread-1) [    ] o.a.s.l.LogWatcher Registering Log Listener [Log4j (org.slf4j.impl.Log4jLoggerFactory)]
   [junit4]   2> 3168450 INFO  (jetty-launcher-4289-thread-3) [    ] o.a.s.c.ZkContainer Zookeeper client=127.0.0.1:40000/solr
   [junit4]   2> 3168450 INFO  (jetty-launcher-4289-thread-3) [    ] o.a.s.c.ZkController zkHost includes chroot
   [junit4]   2> 3168450 INFO  (jetty-launcher-4289-thread-3) [    ] o.a.s.c.c.SolrZkClient Using default ZkCredentialsProvider
   [junit4]   2> 3168450 INFO  (jetty-launcher-4289-thread-2) [    ] o.a.s.c.ZkContainer Zookeeper client=127.0.0.1:40000/solr
   [junit4]   2> 3168450 INFO  (jetty-launcher-4289-thread-2) [    ] o.a.s.c.ZkController zkHost includes chroot
   [junit4]   2> 3168451 INFO  (jetty-launcher-4289-thread-2) [    ] o.a.s.c.c.SolrZkClient Using default ZkCredentialsProvider
   [junit4]   2> 3168451 INFO  (jetty-launcher-4289-thread-1) [    ] o.a.s.c.ZkContainer Zookeeper client=127.0.0.1:40000/solr
   [junit4]   2> 3168451 INFO  (jetty-launcher-4289-thread-1) [    ] o.a.s.c.ZkController zkHost includes chroot
   [junit4]   2> 3168451 INFO  (jetty-launcher-4289-thread-1) [    ] o.a.s.c.c.SolrZkClient Using default ZkCredentialsProvider
   [junit4]   2> 3168451 INFO  (jetty-launcher-4289-thread-3) [    ] o.a.s.c.c.ConnectionManager Waiting for client to connect to ZooKeeper
   [junit4]   2> 3168451 INFO  (jetty-launcher-4289-thread-1) [    ] o.a.s.c.c.ConnectionManager Waiting for client to connect to ZooKeeper
   [junit4]   2> 3168452 INFO  (jetty-launcher-4289-thread-2) [    ] o.a.s.c.c.ConnectionManager Waiting for client to connect to ZooKeeper
   [junit4]   2> 3168452 INFO  (zkCallback-4300-thread-1) [    ] o.a.s.c.c.ConnectionManager Watcher org.apache.solr.common.cloud.ConnectionManager@6702bab6 name:ZooKeeperConnection Watcher:127.0.0.1:40000 got event WatchedEvent state:SyncConnected type:None path:null path:null type:None
   [junit4]   2> 3168453 INFO  (jetty-launcher-4289-thread-3) [    ] o.a.s.c.c.ConnectionManager Client is connected to ZooKeeper
   [junit4]   2> 3168453 INFO  (jetty-launcher-4289-thread-3) [    ] o.a.s.c.c.SolrZkClient Using default ZkACLProvider
   [junit4]   2> 3168453 INFO  (zkCallback-4302-thread-1) [    ] o.a.s.c.c.ConnectionManager Watcher org.apache.solr.common.cloud.ConnectionManager@58850df0 name:ZooKeeperConnection Watcher:127.0.0.1:40000 got event WatchedEvent state:SyncConnected type:None path:null path:null type:None
   [junit4]   2> 3168453 INFO  (jetty-launcher-4289-thread-1) [    ] o.a.s.c.c.ConnectionManager Client is connected to ZooKeeper
   [junit4]   2> 3168453 INFO  (zkCallback-4301-thread-1) [    ] o.a.s.c.c.ConnectionManager Watcher org.apache.solr.common.cloud.ConnectionManager@12506e9a name:ZooKeeperConnection Watcher:127.0.0.1:40000 got event WatchedEvent state:SyncConnected type:None path:null path:null type:None
   [junit4]   2> 3168454 INFO  (jetty-launcher-4289-thread-2) [    ] o.a.s.c.c.ConnectionManager Client is connected to ZooKeeper
   [junit4]   2> 3168454 INFO  (jetty-launcher-4289-thread-1) [    ] o.a.s.c.c.SolrZkClient Using default ZkACLProvider
   [junit4]   2> 3168454 INFO  (jetty-launcher-4289-thread-2) [    ] o.a.s.c.c.SolrZkClient Using default ZkACLProvider
   [junit4]   2> 3168454 WARN  (NIOServerCxn.Factory:0.0.0.0/0.0.0.0:0) [    ] o.a.z.s.NIOServerCnxn caught end of stream exception
   [junit4]   2> EndOfStreamException: Unable to read additional data from client sessionid 0x157162b0a970004, likely client has closed socket
   [junit4]   2> 	at org.apache.zookeeper.server.NIOServerCnxn.doIO(NIOServerCnxn.java:228)
   [junit4]   2> 	at org.apache.zookeeper.server.NIOServerCnxnFactory.run(NIOServerCnxnFactory.java:208)
   [junit4]   2> 	at java.lang.Thread.run(Thread.java:745)
   [junit4]   2> 3168454 INFO  (jetty-launcher-4289-thread-3) [n:127.0.0.1:47782_solr    ] o.a.s.c.ZkController Added new OnReconnect listener org.apache.solr.cloud.ZkController$$Lambda$83/520971206@12b98d7d
   [junit4]   2> 3168455 INFO  (jetty-launcher-4289-thread-3) [n:127.0.0.1:47782_solr    ] o.a.s.c.c.ConnectionManager Waiting for client to connect to ZooKeeper
   [junit4]   2> 3168456 INFO  (jetty-launcher-4289-thread-2) [n:127.0.0.1:36906_solr    ] o.a.s.c.ZkController Added new OnReconnect listener org.apache.solr.cloud.ZkController$$Lambda$83/520971206@4f454716
   [junit4]   2> 3168456 INFO  (jetty-launcher-4289-thread-1) [n:127.0.0.1:62928_solr    ] o.a.s.c.ZkController Added new OnReconnect listener org.apache.solr.cloud.ZkController$$Lambda$83/520971206@439f7c63
   [junit4]   2> 3168456 INFO  (jetty-launcher-4289-thread-2) [n:127.0.0.1:36906_solr    ] o.a.s.c.c.ConnectionManager Waiting for client to connect to ZooKeeper
   [junit4]   2> 3168456 INFO  (jetty-launcher-4289-thread-1) [n:127.0.0.1:62928_solr    ] o.a.s.c.c.ConnectionManager Waiting for client to connect to ZooKeeper
   [junit4]   2> 3168457 INFO  (zkCallback-4303-thread-1-processing-n:127.0.0.1:47782_solr) [n:127.0.0.1:47782_solr    ] o.a.s.c.c.ConnectionManager Watcher org.apache.solr.common.cloud.ConnectionManager@451c4c32 name:ZooKeeperConnection Watcher:127.0.0.1:40000/solr got event WatchedEvent state:SyncConnected type:None path:null path:null type:None
   [junit4]   2> 3168457 INFO  (jetty-launcher-4289-thread-3) [n:127.0.0.1:47782_solr    ] o.a.s.c.c.ConnectionManager Client is connected to ZooKeeper
   [junit4]   2> 3168457 INFO  (zkCallback-4305-thread-1-processing-n:127.0.0.1:62928_solr) [n:127.0.0.1:62928_solr    ] o.a.s.c.c.ConnectionManager Watcher org.apache.solr.common.cloud.ConnectionManager@4979a0d3 name:ZooKeeperConnection Watcher:127.0.0.1:40000/solr got event WatchedEvent state:SyncConnected type:None path:null path:null type:None
   [junit4]   2> 3168457 INFO  (jetty-launcher-4289-thread-1) [n:127.0.0.1:62928_solr    ] o.a.s.c.c.ConnectionManager Client is connected to ZooKeeper
   [junit4]   2> 3168458 INFO  (zkCallback-4304-thread-1-processing-n:127.0.0.1:36906_solr) [n:127.0.0.1:36906_solr    ] o.a.s.c.c.ConnectionManager Watcher org.apache.solr.common.cloud.ConnectionManager@6803a277 name:ZooKeeperConnection Watcher:127.0.0.1:40000/solr got event WatchedEvent state:SyncConnected type:None path:null path:null type:None
   [junit4]   2> 3168458 INFO  (jetty-launcher-4289-thread-2) [n:127.0.0.1:36906_solr    ] o.a.s.c.c.ConnectionManager Client is connected to ZooKeeper
   [junit4]   2> 3168458 INFO  (jetty-launcher-4289-thread-3) [n:127.0.0.1:47782_solr    ] o.a.s.c.c.SolrZkClient makePath: /overseer/queue
   [junit4]   2> 3168459 INFO  (jetty-launcher-4289-thread-2) [n:127.0.0.1:36906_solr    ] o.a.s.c.c.SolrZkClient makePath: /overseer/queue
   [junit4]   2> 3168459 INFO  (jetty-launcher-4289-thread-1) [n:127.0.0.1:62928_solr    ] o.a.s.c.c.SolrZkClient makePath: /overseer/queue
   [junit4]   2> 3168462 INFO  (jetty-launcher-4289-thread-2) [n:127.0.0.1:36906_solr    ] o.a.s.c.c.SolrZkClient makePath: /overseer/collection-queue-work
   [junit4]   2> 3168462 INFO  (jetty-launcher-4289-thread-1) [n:127.0.0.1:62928_solr    ] o.a.s.c.c.SolrZkClient makePath: /overseer/collection-queue-work
   [junit4]   2> 3168462 INFO  (jetty-launcher-4289-thread-3) [n:127.0.0.1:47782_solr    ] o.a.s.c.c.SolrZkClient makePath: /overseer/collection-queue-work
   [junit4]   2> 3168466 INFO  (jetty-launcher-4289-thread-3) [n:127.0.0.1:47782_solr    ] o.a.s.c.c.SolrZkClient makePath: /overseer/collection-map-running
   [junit4]   2> 3168466 INFO  (jetty-launcher-4289-thread-1) [n:127.0.0.1:62928_solr    ] o.a.s.c.c.SolrZkClient makePath: /overseer/collection-map-running
   [junit4]   2> 3168466 INFO  (jetty-launcher-4289-thread-2) [n:127.0.0.1:36906_solr    ] o.a.s.c.c.SolrZkClient makePath: /overseer/collection-map-running
   [junit4]   2> 3168468 INFO  (jetty-launcher-4289-thread-2) [n:127.0.0.1:36906_solr    ] o.a.s.c.c.SolrZkClient makePath: /overseer/collection-map-completed
   [junit4]   2> 3168469 INFO  (jetty-launcher-4289-thread-3) [n:127.0.0.1:47782_solr    ] o.a.s.c.c.SolrZkClient makePath: /overseer/collection-map-completed
   [junit4]   2> 3168469 INFO  (jetty-launcher-4289-thread-1) [n:127.0.0.1:62928_solr    ] o.a.s.c.c.SolrZkClient makePath: /overseer/collection-map-completed
   [junit4]   2> 3168471 INFO  (jetty-launcher-4289-thread-3) [n:127.0.0.1:47782_solr    ] o.a.s.c.c.SolrZkClient makePath: /overseer/collection-map-failure
   [junit4]   2> 3168471 INFO  (jetty-launcher-4289-thread-2) [n:127.0.0.1:36906_solr    ] o.a.s.c.c.SolrZkClient makePath: /overseer/collection-map-failure
   [junit4]   2> 3168472 INFO  (jetty-launcher-4289-thread-1) [n:127.0.0.1:62928_solr    ] o.a.s.c.c.SolrZkClient makePath: /overseer/collection-map-failure
   [junit4]   2> 3168473 INFO  (jetty-launcher-4289-thread-2) [n:127.0.0.1:36906_solr    ] o.a.s.c.c.SolrZkClient makePath: /live_nodes
   [junit4]   2> 3168473 INFO  (jetty-launcher-4289-thread-3) [n:127.0.0.1:47782_solr    ] o.a.s.c.c.SolrZkClient makePath: /live_nodes
   [junit4]   2> 3168473 INFO  (jetty-launcher-4289-thread-1) [n:127.0.0.1:62928_solr    ] o.a.s.c.c.SolrZkClient makePath: /live_nodes
   [junit4]   2> 3168475 INFO  (jetty-launcher-4289-thread-3) [n:127.0.0.1:47782_solr    ] o.a.s.c.c.SolrZkClient makePath: /collections
   [junit4]   2> 3168475 INFO  (jetty-launcher-4289-thread-1) [n:127.0.0.1:62928_solr    ] o.a.s.c.c.SolrZkClient makePath: /collections
   [junit4]   2> 3168475 INFO  (jetty-launcher-4289-thread-2) [n:127.0.0.1:36906_solr    ] o.a.s.c.c.SolrZkClient makePath: /collections
   [junit4]   2> 3168477 INFO  (jetty-launcher-4289-thread-1) [n:127.0.0.1:62928_solr    ] o.a.s.c.c.SolrZkClient makePath: /aliases.json
   [junit4]   2> 3168477 INFO  (jetty-launcher-4289-thread-2) [n:127.0.0.1:36906_solr    ] o.a.s.c.c.SolrZkClient makePath: /aliases.json
   [junit4]   2> 3168477 INFO  (jetty-launcher-4289-thread-3) [n:127.0.0.1:47782_solr    ] o.a.s.c.c.SolrZkClient makePath: /aliases.json
   [junit4]   2> 3168478 INFO  (jetty-launcher-4289-thread-2) [n:127.0.0.1:36906_solr    ] o.a.s.c.c.SolrZkClient makePath: /clusterstate.json
   [junit4]   2> 3168478 INFO  (jetty-launcher-4289-thread-1) [n:127.0.0.1:62928_solr    ] o.a.s.c.c.SolrZkClient makePath: /clusterstate.json
   [junit4]   2> 3168478 INFO  (jetty-launcher-4289-thread-3) [n:127.0.0.1:47782_solr    ] o.a.s.c.c.SolrZkClient makePath: /clusterstate.json
   [junit4]   2> 3168480 INFO  (jetty-launcher-4289-thread-1) [n:127.0.0.1:62928_solr    ] o.a.s.c.c.SolrZkClient makePath: /security.json
   [junit4]   2> 3168480 INFO  (jetty-launcher-4289-thread-3) [n:127.0.0.1:47782_solr    ] o.a.s.c.c.SolrZkClient makePath: /security.json
   [junit4]   2> 3168480 INFO  (jetty-launcher-4289-thread-2) [n:127.0.0.1:36906_solr    ] o.a.s.c.c.SolrZkClient makePath: /security.json
   [junit4]   2> 3168481 INFO  (jetty-launcher-4289-thread-3) [n:127.0.0.1:47782_solr    ] o.a.s.c.c.ZkStateReader Updating cluster state from ZooKeeper... 
   [junit4]   2> 3168481 INFO  (jetty-launcher-4289-thread-1) [n:127.0.0.1:62928_solr    ] o.a.s.c.c.ZkStateReader Updating cluster state from ZooKeeper... 
   [junit4]   2> 3168481 INFO  (jetty-launcher-4289-thread-2) [n:127.0.0.1:36906_solr    ] o.a.s.c.c.ZkStateReader Updating cluster state from ZooKeeper... 
   [junit4]   2> 3168482 INFO  (jetty-launcher-4289-thread-3) [n:127.0.0.1:47782_solr    ] o.a.s.c.c.ZkStateReader Loaded cluster properties: {urlScheme=https}
   [junit4]   2> 3168482 INFO  (jetty-launcher-4289-thread-1) [n:127.0.0.1:62928_solr    ] o.a.s.c.c.ZkStateReader Loaded cluster properties: {urlScheme=https}
   [junit4]   2> 3168483 INFO  (jetty-launcher-4289-thread-3) [n:127.0.0.1:47782_solr    ] o.a.s.c.c.ZkStateReader Updated live nodes from ZooKeeper... (0) -> (0)
   [junit4]   2> 3168482 INFO  (jetty-launcher-4289-thread-2) [n:127.0.0.1:36906_solr    ] o.a.s.c.c.ZkStateReader Loaded cluster properties: {urlScheme=https}
   [junit4]   2> 3168483 INFO  (jetty-launcher-4289-thread-1) [n:127.0.0.1:62928_solr    ] o.a.s.c.c.ZkStateReader Updated live nodes from ZooKeeper... (0) -> (0)
   [junit4]   2> 3168483 INFO  (jetty-launcher-4289-thread-2) [n:127.0.0.1:36906_solr    ] o.a.s.c.c.ZkStateReader Updated live nodes from ZooKeeper... (0) -> (0)
   [junit4]   2> 3168487 INFO  (jetty-launcher-4289-thread-1) [n:127.0.0.1:62928_solr    ] o.a.s.c.c.SolrZkClient makePath: /overseer_elect
   [junit4]   2> 3168487 INFO  (jetty-launcher-4289-thread-3) [n:127.0.0.1:47782_solr    ] o.a.s.c.c.SolrZkClient makePath: /overseer_elect
   [junit4]   2> 3168487 INFO  (jetty-launcher-4289-thread-2) [n:127.0.0.1:36906_solr    ] o.a.s.c.c.SolrZkClient makePath: /overseer_elect
   [junit4]   2> 3168488 INFO  (jetty-launcher-4289-thread-1) [n:127.0.0.1:62928_solr    ] o.a.s.c.c.SolrZkClient makePath: /overseer_elect/election
   [junit4]   2> 3168489 INFO  (jetty-launcher-4289-thread-3) [n:127.0.0.1:47782_solr    ] o.a.s.c.c.SolrZkClient makePath: /overseer_elect/election
   [junit4]   2> 3168489 INFO  (jetty-launcher-4289-thread-2) [n:127.0.0.1:36906_solr    ] o.a.s.c.c.SolrZkClient makePath: /overseer_elect/election
   [junit4]   2> 3168490 INFO  (jetty-launcher-4289-thread-2) [n:127.0.0.1:36906_solr    ] o.a.s.c.Overseer Overseer (id=null) closing
   [junit4]   2> 3168490 INFO  (jetty-launcher-4289-thread-1) [n:127.0.0.1:62928_solr    ] o.a.s.c.Overseer Overseer (id=null) closing
   [junit4]   2> 3168490 INFO  (jetty-launcher-4289-thread-3) [n:127.0.0.1:47782_solr    ] o.a.s.c.Overseer Overseer (id=null) closing
   [junit4]   2> 3168491 INFO  (jetty-launcher-4289-thread-1) [n:127.0.0.1:62928_solr    ] o.a.s.c.LeaderElector Joined leadership election with path: /overseer_elect/election/96570291128827912-127.0.0.1:62928_solr-n_0000000000
   [junit4]   2> 3168491 INFO  (jetty-launcher-4289-thread-2) [n:127.0.0.1:36906_solr    ] o.a.s.c.LeaderElector Joined leadership election with path: /overseer_elect/election/96570291128827913-127.0.0.1:36906_solr-n_0000000001
   [junit4]   2> 3168491 INFO  (jetty-launcher-4289-thread-3) [n:127.0.0.1:47782_solr    ] o.a.s.c.LeaderElector Joined leadership election with path: /overseer_elect/election/96570291128827911-127.0.0.1:47782_solr-n_0000000002
   [junit4]   2> 3168491 INFO  (jetty-launcher-4289-thread-1) [n:127.0.0.1:62928_solr    ] o.a.s.c.OverseerElectionContext I am going to be the leader 127.0.0.1:62928_solr
   [junit4]   2> 3168491 INFO  (jetty-launcher-4289-thread-1) [n:127.0.0.1:62928_solr    ] o.a.s.c.c.SolrZkClient makePath: /overseer_elect/leader
   [junit4]   2> 3168492 INFO  (jetty-launcher-4289-thread-2) [n:127.0.0.1:36906_solr    ] o.a.s.c.LeaderElector Watching path /overseer_elect/election/96570291128827912-127.0.0.1:62928_solr-n_0000000000 to know if I could be the leader
   [junit4]   2> 3168492 INFO  (jetty-launcher-4289-thread-3) [n:127.0.0.1:47782_solr    ] o.a.s.c.LeaderElector Watching path /overseer_elect/election/96570291128827913-127.0.0.1:36906_solr-n_0000000001 to know if I could be the leader
   [junit4]   2> 3168492 INFO  (jetty-launcher-4289-thread-3) [n:127.0.0.1:47782_solr    ] o.a.s.c.ZkController Register node as live in ZooKeeper:/live_nodes/127.0.0.1:47782_solr
   [junit4]   2> 3168493 INFO  (jetty-launcher-4289-thread-3) [n:127.0.0.1:47782_solr    ] o.a.s.c.c.SolrZkClient makePath: /live_nodes/127.0.0.1:47782_solr
   [junit4]   2> 3168492 INFO  (jetty-launcher-4289-thread-2) [n:127.0.0.1:36906_solr    ] o.a.s.c.ZkController Register node as live in ZooKeeper:/live_nodes/127.0.0.1:36906_solr
   [junit4]   2> 3168493 INFO  (jetty-launcher-4289-thread-2) [n:127.0.0.1:36906_solr    ] o.a.s.c.c.SolrZkClient makePath: /live_nodes/127.0.0.1:36906_solr
   [junit4]   2> 3168493 INFO  (jetty-launcher-4289-thread-1) [n:127.0.0.1:62928_solr    ] o.a.s.c.Overseer Overseer (id=96570291128827912-127.0.0.1:62928_solr-n_0000000000) starting
   [junit4]   2> 3168494 INFO  (zkCallback-4305-thread-1-processing-n:127.0.0.1:62928_solr) [n:127.0.0.1:62928_solr    ] o.a.s.c.c.ZkStateReader A live node change: [WatchedEvent state:SyncConnected type:NodeChildrenChanged path:/live_nodes], has occurred - updating... (live nodes size: [0])
   [junit4]   2> 3168494 INFO  (zkCallback-4304-thread-1-processing-n:127.0.0.1:36906_solr) [n:127.0.0.1:36906_solr    ] o.a.s.c.c.ZkStateReader A live node change: [WatchedEvent state:SyncConnected type:NodeChildrenChanged path:/live_nodes], has occurred - updating... (live nodes size: [0])
   [junit4]   2> 3168494 INFO  (zkCallback-4303-thread-1-processing-n:127.0.0.1:47782_solr) [n:127.0.0.1:47782_solr    ] o.a.s.c.c.ZkStateReader A live node change: [WatchedEvent state:SyncConnected type:NodeChildrenChanged path:/live_nodes], has occurred - updating... (live nodes size: [0])
   [junit4]   2> 3168496 INFO  (zkCallback-4303-thread-1-processing-n:127.0.0.1:47782_solr) [n:127.0.0.1:47782_solr    ] o.a.s.c.c.ZkStateReader Updated live nodes from ZooKeeper... (0) -> (2)
   [junit4]   2> 3168497 INFO  (zkCallback-4305-thread-1-processing-n:127.0.0.1:62928_solr) [n:127.0.0.1:62928_solr    ] o.a.s.c.c.ZkStateReader Updated live nodes from ZooKeeper... (0) -> (2)
   [junit4]   2> 3168496 INFO  (zkCallback-4304-thread-1-processing-n:127.0.0.1:36906_solr) [n:127.0.0.1:36906_solr    ] o.a.s.c.c.ZkStateReader Updated live nodes from ZooKeeper... (0) -> (2)
   [junit4]   2> 3168498 INFO  (jetty-launcher-4289-thread-1) [n:127.0.0.1:62928_solr    ] o.a.s.c.c.SolrZkClient makePath: /overseer/queue-work
   [junit4]   2> 3168504 INFO  (jetty-launcher-4289-thread-1) [n:127.0.0.1:62928_solr    ] o.a.s.c.OverseerAutoReplicaFailoverThread Starting OverseerAutoReplicaFailoverThread autoReplicaFailoverWorkLoopDelay=10000 autoReplicaFailoverWaitAfterExpiration=30000 autoReplicaFailoverBadNodeExpiration=60000
   [junit4]   2> 3168505 INFO  (jetty-launcher-4289-thread-1) [n:127.0.0.1:62928_solr    ] o.a.s.c.ZkController Publish node=127.0.0.1:62928_solr as DOWN
   [junit4]   2> 3168506 INFO  (jetty-launcher-4289-thread-1) [n:127.0.0.1:62928_solr    ] o.a.s.c.ZkController Register node as live in ZooKeeper:/live_nodes/127.0.0.1:62928_solr
   [junit4]   2> 3168506 INFO  (jetty-launcher-4289-thread-1) [n:127.0.0.1:62928_solr    ] o.a.s.c.c.SolrZkClient makePath: /live_nodes/127.0.0.1:62928_solr
   [junit4]   2> 3168509 INFO  (OverseerCollectionConfigSetProcessor-96570291128827912-127.0.0.1:62928_solr-n_0000000000) [n:127.0.0.1:62928_solr    ] o.a.s.c.OverseerTaskProcessor Process current queue of overseer operations
   [junit4]   2> 3168509 INFO  (zkCallback-4303-thread-1-processing-n:127.0.0.1:47782_solr) [n:127.0.0.1:47782_solr    ] o.a.s.c.c.ZkStateReader A live node change: [WatchedEvent state:SyncConnected type:NodeChildrenChanged path:/live_nodes], has occurred - updating... (live nodes size: [2])
   [junit4]   2> 3168509 INFO  (OverseerStateUpdate-96570291128827912-127.0.0.1:62928_solr-n_0000000000) [n:127.0.0.1:62928_solr    ] o.a.s.c.Overseer Starting to work on the main queue
   [junit4]   2> 3168509 INFO  (zkCallback-4303-thread-1-processing-n:127.0.0.1:47782_solr) [n:127.0.0.1:47782_solr    ] o.a.s.c.c.ZkStateReader Updated live nodes from ZooKeeper... (2) -> (3)
   [junit4]   2> 3168510 INFO  (zkCallback-4305-thread-1-processing-n:127.0.0.1:62928_solr) [n:127.0.0.1:62928_solr    ] o.a.s.c.c.ZkStateReader A live node change: [WatchedEvent state:SyncConnected type:NodeChildrenChanged path:/live_nodes], has occurred - updating... (live nodes size: [2])
   [junit4]   2> 3168514 INFO  (zkCallback-4304-thread-1-processing-n:127.0.0.1:36906_solr) [n:127.0.0.1:36906_solr    ] o.a.s.c.c.ZkStateReader A live node change: [WatchedEvent state:SyncConnected type:NodeChildrenChanged path:/live_nodes], has occurred - updating... (live nodes size: [2])
   [junit4]   2> 3168514 INFO  (zkCallback-4304-thread-1-processing-n:127.0.0.1:36906_solr) [n:127.0.0.1:36906_solr    ] o.a.s.c.c.ZkStateReader Updated live nodes from ZooKeeper... (2) -> (3)
   [junit4]   2> 3168514 INFO  (zkCallback-4305-thread-1-processing-n:127.0.0.1:62928_solr) [n:127.0.0.1:62928_solr    ] o.a.s.c.c.ZkStateReader Updated live nodes from ZooKeeper... (2) -> (3)
   [junit4]   2> 3168521 INFO  (jetty-launcher-4289-thread-3) [n:127.0.0.1:47782_solr    ] o.a.s.c.CoreContainer Security conf doesn't exist. Skipping setup for authorization module.
   [junit4]   2> 3168521 INFO  (jetty-launcher-4289-thread-3) [n:127.0.0.1:47782_solr    ] o.a.s.c.CoreContainer No authentication plugin used.
   [junit4]   2> 3168521 INFO  (jetty-launcher-4289-thread-3) [n:127.0.0.1:47782_solr    ] o.a.s.c.CorePropertiesLocator Looking for core definitions underneath /export/home/jenkins/workspace/Lucene-Solr-6.x-Solaris/solr/build/solr-core/test/J0/temp/solr.security.BasicAuthIntegrationTest_4A2B627F97BE926A-001/tempDir-001/node3/.
   [junit4]   2> 3168522 INFO  (jetty-launcher-4289-thread-3) [n:127.0.0.1:47782_solr    ] o.a.s.c.CorePropertiesLocator Found 0 core definitions
   [junit4]   2> 3168523 INFO  (OverseerStateUpdate-96570291128827912-127.0.0.1:62928_solr-n_0000000000) [n:127.0.0.1:62928_solr    ] o.a.s.c.c.ZkStateReader Updated live nodes from ZooKeeper... (3) -> (3)
   [junit4]   2> 3168523 INFO  (jetty-launcher-4289-thread-2) [n:127.0.0.1:36906_solr    ] o.a.s.c.CoreContainer Security conf doesn't exist. Skipping setup for authorization module.
   [junit4]   2> 3168523 INFO  (jetty-launcher-4289-thread-2) [n:127.0.0.1:36906_solr    ] o.a.s.c.CoreContainer No authentication plugin used.
   [junit4]   2> 3168524 INFO  (jetty-launcher-4289-thread-2) [n:127.0.0.1:36906_solr    ] o.a.s.c.CorePropertiesLocator Looking for core definitions underneath /export/home/jenkins/workspace/Lucene-Solr-6.x-Solaris/solr/build/solr-core/test/J0/temp/solr.security.BasicAuthIntegrationTest_4A2B627F97BE926A-001/tempDir-001/node2/.
   [junit4]   2> 3168524 INFO  (jetty-launcher-4289-thread-2) [n:127.0.0.1:36906_solr    ] o.a.s.c.CorePropertiesLocator Found 0 core definitions
   [junit4]   2> 3168524 INFO  (OverseerStateUpdate-96570291128827912-127.0.0.1:62928_solr-n_0000000000) [n:127.0.0.1:62928_solr    ] o.a.s.c.Overseer processMessage: queueSize: 1, message = {
   [junit4]   2>   "operation":"downnode",
   [junit4]   2>   "node_name":"127.0.0.1:62928_solr"} current state version: 0
   [junit4]   2> 3168524 INFO  (OverseerStateUpdate-96570291128827912-127.0.0.1:62928_solr-n_0000000000) [n:127.0.0.1:62928_solr    ] o.a.s.c.o.NodeMutator DownNode state invoked for node: 127.0.0.1:62928_solr
   [junit4]   2> 3168525 INFO  (jetty-launcher-4289-thread-3) [n:127.0.0.1:47782_solr    ] o.a.s.s.SolrDispatchFilter user.dir=/export/home/jenkins/workspace/Lucene-Solr-6.x-Solaris/solr/build/solr-core/test/J0
   [junit4]   2> 3168525 INFO  (jetty-launcher-4289-thread-3) [n:127.0.0.1:47782_solr    ] o.a.s.s.SolrDispatchFilter SolrDispatchFilter.init() done
   [junit4]   2> 3168525 INFO  (jetty-launcher-4289-thread-2) [n:127.0.0.1:36906_solr    ] o.a.s.s.SolrDispatchFilter user.dir=/export/home/jenkins/workspace/Lucene-Solr-6.x-Solaris/solr/build/solr-core/test/J0
   [junit4]   2> 3168525 INFO  (jetty-launcher-4289-thread-2) [n:127.0.0.1:36906_solr    ] o.a.s.s.SolrDispatchFilter SolrDispatchFilter.init() done
   [junit4]   2> 3168533 INFO  (jetty-launcher-4289-thread-1) [n:127.0.0.1:62928_solr    ] o.a.s.c.CoreContainer Security conf doesn't exist. Skipping setup for authorization module.
   [junit4]   2> 3168533 INFO  (jetty-launcher-4289-thread-1) [n:127.0.0.1:62928_solr    ] o.a.s.c.CoreContainer No authentication plugin used.
   [junit4]   2> 3168533 INFO  (jetty-launcher-4289-thread-1) [n:127.0.0.1:62928_solr    ] o.a.s.c.CorePropertiesLocator Looking for core definitions underneath /export/home/jenkins/workspace/Lucene-Solr-6.x-Solaris/solr/build/solr-core/test/J0/temp/solr.security.BasicAuthIntegrationTest_4A2B627F97BE926A-001/tempDir-001/node1/.
   [junit4]   2> 3168534 INFO  (jetty-launcher-4289-thread-1) [n:127.0.0.1:62928_solr    ] o.a.s.c.CorePropertiesLocator Found 0 core definitions
   [junit4]   2> 3168534 INFO  (jetty-launcher-4289-thread-1) [n:127.0.0.1:62928_solr    ] o.a.s.s.SolrDispatchFilter user.dir=/export/home/jenkins/workspace/Lucene-Solr-6.x-Solaris/solr/build/solr-core/test/J0
   [junit4]   2> 3168534 INFO  (jetty-launcher-4289-thread-1) [n:127.0.0.1:62928_solr    ] o.a.s.s.SolrDispatchFilter SolrDispatchFilter.init() done
   [junit4]   2> 3168535 INFO  (SUITE-BasicAuthIntegrationTest-seed#[4A2B627F97BE926A]-worker) [    ] o.a.s.c.c.SolrZkClient Using default ZkCredentialsProvider
   [junit4]   2> 3168535 INFO  (SUITE-BasicAuthIntegrationTest-seed#[4A2B627F97BE926A]-worker) [    ] o.a.s.c.c.ConnectionManager Waiting for client to connect to ZooKeeper
   [junit4]   2> 3168537 INFO  (zkCallback-4309-thread-1) [    ] o.a.s.c.c.ConnectionManager Watcher org.apache.solr.common.cloud.ConnectionManager@6878038b name:ZooKeeperConnection Watcher:127.0.0.1:40000 got event WatchedEvent state:SyncConnected type:None path:null path:null type:None
   [junit4]   2> 3168537 INFO  (SUITE-BasicAuthIntegrationTest-seed#[4A2B627F97BE926A]-worker) [    ] o.a.s.c.c.ConnectionManager Client is connected to ZooKeeper
   [junit4]   2> 3168537 INFO  (SUITE-BasicAuthIntegrationTest-seed#[4A2B627F97BE926A]-worker) [    ] o.a.s.c.c.SolrZkClient Using default ZkACLProvider
   [junit4]   2> 3168539 INFO  (SUITE-BasicAuthIntegrationTest-seed#[4A2B627F97BE926A]-worker) [    ] o.a.s.c.c.SolrZkClient Using default ZkCredentialsProvider
   [junit4]   2> 3168539 INFO  (SUITE-BasicAuthIntegrationTest-seed#[4A2B627F97BE926A]-worker) [    ] o.a.s.c.c.ConnectionManager Waiting for client to connect to ZooKeeper
   [junit4]   2> 3168540 INFO  (zkCallback-4312-thread-1) [    ] o.a.s.c.c.ConnectionManager Watcher org.apache.solr.common.cloud.ConnectionManager@8a4cfe8 name:ZooKeeperConnection Watcher:127.0.0.1:40000/solr got event WatchedEvent state:SyncConnected type:None path:null path:null type:None
   [junit4]   2> 3168541 INFO  (SUITE-BasicAuthIntegrationTest-seed#[4A2B627F97BE926A]-worker) [    ] o.a.s.c.c.ConnectionManager Client is connected to ZooKeeper
   [junit4]   2> 3168541 INFO  (SUITE-BasicAuthIntegrationTest-seed#[4A2B627F97BE926A]-worker) [    ] o.a.s.c.c.SolrZkClient Using default ZkACLProvider
   [junit4]   2> 3168541 INFO  (SUITE-BasicAuthIntegrationTest-seed#[4A2B627F97BE926A]-worker) [    ] o.a.s.c.c.ZkStateReader Updating cluster state from ZooKeeper... 
   [junit4]   2> 3168542 INFO  (SUITE-BasicAuthIntegrationTest-seed#[4A2B627F97BE926A]-worker) [    ] o.a.s.c.c.ZkStateReader Loaded cluster properties: {urlScheme=https}
   [junit4]   2> 3168542 INFO  (SUITE-BasicAuthIntegrationTest-seed#[4A2B627F97BE926A]-worker) [    ] o.a.s.c.c.ZkStateReader Updated live nodes from ZooKeeper... (0) -> (3)
   [junit4]   2> 3168544 INFO  (SUITE-BasicAuthIntegrationTest-seed#[4A2B627F97BE926A]-worker) [    ] o.a.s.c.c.SolrZkClient makePath: /configs/conf/schema.xml
   [junit4]   2> 3168548 INFO  (SUITE-BasicAuthIntegrationTest-seed#[4A2B627F97BE926A]-worker) [    ] o.a.s.c.c.SolrZkClient makePath: /configs/conf/solrconfig.xml
   [junit4]   2> 3168567 INFO  (qtp2086722363-30821) [n:127.0.0.1:47782_solr    ] o.a.s.h.a.CollectionsHandler Invoked Collection Action :create with params replicationFactor=1&collection.configName=conf&name=authCollection&action=CREATE&numShards=3&wt=javabin&version=2 and sendToOCPQueue=true
   [junit4]   2> 3168571 INFO  (OverseerCollectionConfigSetProcessor-96570291128827912-127.0.0.1:62928_solr-n_0000000000) [n:127.0.0.1:62928_solr    ] o.a.s.c.OverseerTaskProcessor Overseer Collection Message Handler: Get the message id:/overseer/collection-queue-work/qn-0000000000 message:{
   [junit4]   2>   "name":"authCollection",
   [junit4]   2>   "fromApi":"true",
   [junit4]   2>   "replicationFactor":"1",
   [junit4]   2>   "collection.configName":"conf",
   [junit4]   2>   "numShards":"3",
   [junit4]   2>   "stateFormat":"2",
   [junit4]   2>   "operation":"create"}
   [junit4]   2> 3168571 INFO  (OverseerThreadFactory-11921-thread-1-processing-n:127.0.0.1:62928_solr) [n:127.0.0.1:62928_solr    ] o.a.s.c.OverseerCollectionMessageHandler OverseerCollectionMessageHandler.processMessage : create , {
   [junit4]   2>   "name":"authCollection",
   [junit4]   2>   "fromApi":"true",
   [junit4]   2>   "replicationFactor":"1",
   [junit4]   2>   "collection.configName":"conf",
   [junit4]   2>   "numShards":"3",
   [junit4]   2>   "stateFormat":"2",
   [junit4]   2>   "operation":"create"}
   [junit4]   2> 3168571 INFO  (OverseerThreadFactory-11921-thread-1-processing-n:127.0.0.1:62928_solr) [n:127.0.0.1:62928_solr    ] o.a.s.c.CreateCollectionCmd Create collection authCollection
   [junit4]   2> 3168572 INFO  (OverseerThreadFactory-11921-thread-1-processing-n:127.0.0.1:62928_solr) [n:127.0.0.1:62928_solr    ] o.a.s.c.OverseerCollectionMessageHandler creating collections conf node /collections/authCollection 
   [junit4]   2> 3168572 INFO  (OverseerThreadFactory-11921-thread-1-processing-n:127.0.0.1:62928_solr) [n:127.0.0.1:62928_solr    ] o.a.s.c.c.SolrZkClient makePath: /collections/authCollection
   [junit4]   2> 3168574 INFO  (zkCallback-4305-thread-1-processing-n:127.0.0.1:62928_solr) [n:127.0.0.1:62928_solr    ] o.a.s.c.c.ZkStateReader A collections change: [WatchedEvent state:SyncConnected type:NodeChildrenChanged path:/collections], has occurred - updating...
   [junit4]   2> 3168574 INFO  (zkCallback-4312-thread-1) [    ] o.a.s.c.c.ZkStateReader A collections change: [WatchedEvent state:SyncConnected type:NodeChildrenChanged path:/collections], has occurred - updating...
   [junit4]   2> 3168574 INFO  (zkCallback-4303-thread-1-processing-n:127.0.0.1:47782_solr) [n:127.0.0.1:47782_solr    ] o.a.s.c.c.ZkStateReader A collections change: [WatchedEvent state:SyncConnected type:NodeChildrenChanged path:/collections], has occurred - updating...
   [junit4]   2> 3168574 INFO  (zkCallback-4304-thread-1-processing-n:127.0.0.1:36906_solr) [n:127.0.0.1:36906_solr    ] o.a.s.c.c.ZkStateReader A collections change: [WatchedEvent state:SyncConnected type:NodeChildrenChanged path:/collections], has occurred - updating...
   [junit4]   2> 3168578 INFO  (OverseerStateUpdate-96570291128827912-127.0.0.1:62928_solr-n_0000000000) [n:127.0.0.1:62928_solr    ] o.a.s.c.Overseer processMessage: queueSize: 1, message = {
   [junit4]   2>   "name":"authCollection",
   [junit4]   2>   "fromApi":"true",
   [junit4]   2>   "replicationFactor":"1",
   [junit4]   2>   "collection.configName":"conf",
   [junit4]   2>   "numShards":"3",
   [junit4]   2>   "stateFormat":"2",
   [junit4]   2>   "operation":"create"} current state version: 0
   [junit4]   2> 3168578 INFO  (OverseerStateUpdate-96570291128827912-127.0.0.1:62928_solr-n_0000000000) [n:127.0.0.1:62928_solr    ] o.a.s.c.o.ClusterStateMutator building a new cName: authCollection
   [junit4]   2> 3168580 INFO  (OverseerStateUpdate-96570291128827912-127.0.0.1:62928_solr-n_0000000000) [n:127.0.0.1:62928_solr    ] o.a.s.c.o.ZkStateWriter going to create_collection /collections/authCollection/state.json
   [junit4]   2> 3168678 INFO  (OverseerThreadFactory-11921-thread-1-processing-n:127.0.0.1:62928_solr) [n:127.0.0.1:62928_solr    ] o.a.s.c.CreateCollectionCmd Creating SolrCores for new collection authCollection, shardNames [shard1, shard2, shard3] , replicationFactor : 1
   [junit4]   2> 3168678 INFO  (OverseerThreadFactory-11921-thread-1-processing-n:127.0.0.1:62928_solr) [n:127.0.0.1:62928_solr    ] o.a.s.c.CreateCollectionCmd Creating core authCollection_shard3_replica1 as part of shard shard3 of collection authCollection on 127.0.0.1:62928_solr
   [junit4]   2> 3168678 INFO  (OverseerThreadFactory-11921-thread-1-processing-n:127.0.0.1:62928_solr) [n:127.0.0.1:62928_solr    ] o.a.s.c.CreateCollectionCmd Creating core authCollection_shard2_replica1 as part of shard shard2 of collection authCollection on 127.0.0.1:36906_solr
   [junit4]   2> 3168678 INFO  (OverseerThreadFactory-11921-thread-1-processing-n:127.0.0.1:62928_solr) [n:127.0.0.1:62928_solr    ] o.a.s.c.CreateCollectionCmd Creating core authCollection_shard1_replica1 as part of shard shard1 of collection authCollection on 127.0.0.1:47782_solr
   [junit4]   2> 3168688 INFO  (qtp2086722363-30824) [n:127.0.0.1:47782_solr    ] o.a.s.h.a.CoreAdminOperation core create command qt=/admin/cores&collection.configName=conf&name=authCollection_shard1_replica1&action=CREATE&numShards=3&collection=authCollection&shard=shard1&wt=javabin&version=2
   [junit4]   2> 3168689 INFO  (qtp2086722363-30824) [n:127.0.0.1:47782_solr    ] o.a.s.c.CoreDescriptor Created CoreDescriptor: {name=authCollection_shard1_replica1, collection.configName=conf, config=solrconfig.xml, transient=false, schema=schema.xml, loadOnStartup=true, configSetProperties=configsetprops.json, collection=authCollection, numShards=3, dataDir=data/, shard=shard1}
   [junit4]   2> 3168689 INFO  (qtp2086722363-30824) [n:127.0.0.1:47782_solr c:authCollection s:shard1  x:authCollection_shard1_replica1] o.a.s.c.ZkController publishing state=down
   [junit4]   2> 3168690 INFO  (qtp2086722363-30824) [n:127.0.0.1:47782_solr c:authCollection s:shard1  x:authCollection_shard1_replica1] o.a.s.c.ZkController Registering watch for collection authCollection
   [junit4]   2> 3168690 INFO  (qtp2086722363-30824) [n:127.0.0.1:47782_solr c:authCollection s:shard1  x:authCollection_shard1_replica1] o.a.s.c.c.ZkStateReader Add data for [authCollection] ver [0]
   [junit4]   2> 3168691 INFO  (qtp2086722363-30824) [n:127.0.0.1:47782_solr c:authCollection s:shard1  x:authCollection_shard1_replica1] o.a.s.c.ZkController look for our core node name
   [junit4]   2> 3168698 INFO  (OverseerStateUpdate-96570291128827912-127.0.0.1:62928_solr-n_0000000000) [n:127.0.0.1:62928_solr    ] o.a.s.c.Overseer processMessage: queueSize: 1, message = {
   [junit4]   2>   "core":"authCollection_shard1_replica1",
   [junit4]   2>   "roles":null,
   [junit4]   2>   "base_url":"https://127.0.0.1:47782/solr",
   [junit4]   2>   "node_name":"127.0.0.1:47782_solr",
   [junit4]   2>   "numShards":"3",
   [junit4]   2>   "state":"down",
   [junit4]   2>   "shard":"shard1",
   [junit4]   2>   "collection":"authCollection",
   [junit4]   2>   "operation":"state"} current state version: 0
   [junit4]   2> 3168698 INFO  (OverseerStateUpdate-96570291128827912-127.0.0.1:62928_solr-n_0000000000) [n:127.0.0.1:62928_solr    ] o.a.s.c.o.ReplicaMutator Update state numShards=3 message={
   [junit4]   2>   "core":"authCollection_shard1_replica1",
   [junit4]   2>   "roles":null,
   [junit4]   2>   "base_url":"https://127.0.0.1:47782/solr",
   [junit4]   2>   "node_name":"127.0.0.1:47782_solr",
   [junit4]   2>   "numShards":"3",
   [junit4]   2>   "state":"down",
   [junit4]   2>   "shard":"shard1",
   [junit4]   2>   "collection":"authCollection",
   [junit4]   2>   "operation":"state"}
   [junit4]   2> 3168704 INFO  (qtp1917159589-30813) [n:127.0.0.1:62928_solr    ] o.a.s.h.a.CoreAdminOperation core create command qt=/admin/cores&collection.configName=conf&name=authCollection_shard3_replica1&action=CREATE&numShards=3&collection=authCollection&shard=shard3&wt=javabin&version=2
   [junit4]   2> 3168705 INFO  (qtp1917159589-30813) [n:127.0.0.1:62928_solr    ] o.a.s.c.CoreDescriptor Created CoreDescriptor: {name=authCollection_shard3_replica1, collection.configName=conf, config=solrconfig.xml, transient=false, schema=schema.xml, loadOnStartup=true, configSetProperties=configsetprops.json, collection=authCollection, numShards=3, dataDir=data/, shard=shard3}
   [junit4]   2> 3168706 INFO  (qtp1917159589-30813) [n:127.0.0.1:62928_solr c:authCollection s:shard3  x:authCollection_shard3_replica1] o.a.s.c.ZkController publishing state=down
   [junit4]   2> 3168706 INFO  (qtp1989024534-30831) [n:127.0.0.1:36906_solr    ] o.a.s.h.a.CoreAdminOperation core create command qt=/admin/cores&collection.configName=conf&name=authCollection_shard2_replica1&action=CREATE&numShards=3&collection=authCollection&shard=shard2&wt=javabin&version=2
   [junit4]   2> 3168706 INFO  (qtp1989024534-30831) [n:127.0.0.1:36906_solr    ] o.a.s.c.CoreDescriptor Created CoreDescriptor: {name=authCollection_shard2_replica1, collection.configName=conf, config=solrconfig.xml, transient=false, schema=schema.xml, loadOnStartup=true, configSetProperties=configsetprops.json, collection=authCollection, numShards=3, dataDir=data/, shard=shard2}
   [junit4]   2> 3168707 INFO  (qtp1989024534-30831) [n:127.0.0.1:36906_solr c:authCollection s:shard2  x:authCollection_shard2_replica1] o.a.s.c.ZkController publishing state=down
   [junit4]   2> 3168707 INFO  (qtp1917159589-30813) [n:127.0.0.1:62928_solr c:authCollection s:shard3  x:authCollection_shard3_replica1] o.a.s.c.ZkController Registering watch for collection authCollection
   [junit4]   2> 3168708 INFO  (OverseerStateUpdate-96570291128827912-127.0.0.1:62928_solr-n_0000000000) [n:127.0.0.1:62928_solr    ] o.a.s.c.Overseer processMessage: queueSize: 1, message = {
   [junit4]   2>   "core":"authCollection_shard3_replica1",
   [junit4]   2>   "roles":null,
   [junit4]   2>   "base_url":"https://127.0.0.1:62928/solr",
   [junit4]   2>   "node_name":"127.0.0.1:62928_solr",
   [junit4]   2>   "numShards":"3",
   [junit4]   2>   "state":"down",
   [junit4]   2>   "shard":"shard3",
   [junit4]   2>   "collection":"authCollection",
   [junit4]   2>   "operation":"state"} current state version: 0
   [junit4]   2> 3168708 INFO  (OverseerStateUpdate-96570291128827912-127.0.0.1:62928_solr-n_0000000000) [n:127.0.0.1:62928_solr    ] o.a.s.c.o.ReplicaMutator Update state numShards=3 message={
   [junit4]   2>   "core":"authCollection_shard3_replica1",
   [junit4]   2>   "roles":null,
   [junit4]   2>   "base_url":"https://127.0.0.1:62928/solr",
   [junit4]   2>   "node_name":"127.0.0.1:62928_solr",
   [junit4]   2>   "numShards":"3",
   [junit4]   2>   "state":"down",
   [junit4]   2>   "shard":"shard3",
   [junit4]   2>   "collection":"authCollection",
   [junit4]   2>   "operation":"state"}
   [junit4]   2> 3168708 INFO  (qtp1917159589-30813) [n:127.0.0.1:62928_solr c:authCollection s:shard3  x:authCollection_shard3_replica1] o.a.s.c.c.ZkStateReader Add data for [authCollection] ver [0]
   [junit4]   2> 3168708 INFO  (qtp1917159589-30813) [n:127.0.0.1:62928_solr c:authCollection s:shard3  x:authCollection_shard3_replica1] o.a.s.c.ZkController look for our core node name
   [junit4]   2> 3168709 INFO  (qtp1989024534-30831) [n:127.0.0.1:36906_solr c:authCollection s:shard2  x:authCollection_shard2_replica1] o.a.s.c.ZkController Registering watch for collection authCollection
   [junit4]   2> 3168709 INFO  (qtp1989024534-30831) [n:127.0.0.1:36906_solr c:authCollection s:shard2  x:authCollection_shard2_replica1] o.a.s.c.c.ZkStateReader Add data for [authCollection] ver [0]
   [junit4]   2> 3168709 INFO  (qtp1989024534-30831) [n:127.0.0.1:36906_solr c:authCollection s:shard2  x:authCollection_shard2_replica1] o.a.s.c.ZkController look for our core node name
   [junit4]   2> 3168711 INFO  (OverseerStateUpdate-96570291128827912-127.0.0.1:62928_solr-n_0000000000) [n:127.0.0.1:62928_solr    ] o.a.s.c.Overseer processMessage: queueSize: 1, message = {
   [junit4]   2>   "core":"authCollection_shard2_replica1",
   [junit4]   2>   "roles":null,
   [junit4]   2>   "base_url":"https://127.0.0.1:36906/solr",
   [junit4]   2>   "node_name":"127.0.0.1:36906_solr",
   [junit4]   2>   "numShards":"3",
   [junit4]   2>   "state":"down",
   [junit4]   2>   "shard":"shard2",
   [junit4]   2>   "collection":"authCollection",
   [junit4]   2>   "operation":"state"} current state version: 0
   [junit4]   2> 3168711 INFO  (OverseerStateUpdate-96570291128827912-127.0.0.1:62928_solr-n_0000000000) [n:127.0.0.1:62928_solr    ] o.a.s.c.o.ReplicaMutator Update state numShards=3 message={
   [junit4]   2>   "core":"authCollection_shard2_replica1",
   [junit4]   2>   "roles":null,
   [junit4]   2>   "base_url":"https://127.0.0.1:36906/solr",
   [junit4]   2>   "node_name":"127.0.0.1:36906_solr",
   [junit4]   2>   "numShards":"3",
   [junit4]   2>   "state":"down",
   [junit4]   2>   "shard":"shard2",
   [junit4]   2>   "collection":"authCollection",
   [junit4]   2>   "operation":"state"}
   [junit4]   2> 3168815 INFO  (OverseerStateUpdate-96570291128827912-127.0.0.1:62928_solr-n_0000000000) [n:127.0.0.1:62928_solr    ] o.a.s.c.o.ZkStateWriter going to update_collection /collections/authCollection/state.json version: 0
   [junit4]   2> 3168815 INFO  (zkCallback-4303-thread-1-processing-n:127.0.0.1:47782_solr) [n:127.0.0.1:47782_solr    ] o.a.s.c.c.ZkStateReader A cluster state change: [WatchedEvent state:SyncConnected type:NodeDataChanged path:/collections/authCollection/state.json] for collection [authCollection] has occurred - updating... (live nodes size: [3])
   [junit4]   2> 3168815 INFO  (zkCallback-4304-thread-1-processing-n:127.0.0.1:36906_solr) [n:127.0.0.1:36906_solr    ] o.a.s.c.c.ZkStateReader A cluster state change: [WatchedEvent state:SyncConnected type:NodeDataChanged path:/collections/authCollection/state.json] for collection [authCollection] has occurred - updating... (live nodes size: [3])
   [junit4]   2> 3168815 INFO  (zkCallback-4305-thread-1-processing-n:127.0.0.1:62928_solr) [n:127.0.0.1:62928_solr    ] o.a.s.c.c.ZkStateReader A cluster state change: [WatchedEvent state:SyncConnected type:NodeDataChanged path:/collections/authCollection/state.json] for collection [authCollection] has occurred - updating... (live nodes size: [3])
   [junit4]   2> 3168816 INFO  (zkCallback-4303-thread-1-processing-n:127.0.0.1:47782_solr) [n:127.0.0.1:47782_solr    ] o.a.s.c.c.ZkStateReader Updating data for [authCollection] from [0] to [1]
   [junit4]   2> 3168816 INFO  (zkCallback-4304-thread-1-processing-n:127.0.0.1:36906_solr) [n:127.0.0.1:36906_solr    ] o.a.s.c.c.ZkStateReader Updating data for [authCollection] from [0] to [1]
   [junit4]   2> 3168816 INFO  (zkCallback-4305-thread-1-processing-n:127.0.0.1:62928_solr) [n:127.0.0.1:62928_solr    ] o.a.s.c.c.ZkStateReader Updating data for [authCollection] from [0] to [1]
   [junit4]   2> 3169693 INFO  (qtp2086722363-30824) [n:127.0.0.1:47782_solr c:authCollection s:shard1  x:authCollection_shard1_replica1] o.a.s.c.ZkController waiting to find shard id in clusterstate for authCollection_shard1_replica1
   [junit4]   2> 3169693 INFO  (qtp2086722363-30824) [n:127.0.0.1:47782_solr c:authCollection s:shard1  x:authCollection_shard1_replica1] o.a.s.c.ZkController Check for collection zkNode:authCollection
   [junit4]   2> 3169694 INFO  (qtp2086722363-30824) [n:127.0.0.1:47782_solr c:authCollection s:shard1  x:authCollection_shard1_replica1] o.a.s.c.ZkController Collection zkNode exists
   [junit4]   2> 3169694 INFO  (qtp2086722363-30824) [n:127.0.0.1:47782_solr c:authCollection s:shard1  x:authCollection_shard1_replica1] o.a.s.c.c.ZkStateReader Load collection config from: [/collections/authCollection]
   [junit4]   2> 3169695 INFO  (qtp2086722363-30824) [n:127.0.0.1:47782_solr c:authCollection s:shard1  x:authCollection_shard1_replica1] o.a.s.c.c.ZkStateReader path=[/collections/authCollection] [configName]=[conf] specified config exists in ZooKeeper
   [junit4]   2> 3169695 INFO  (qtp2086722363-30824) [n:127.0.0.1:47782_solr c:authCollection s:shard1  x:authCollection_shard1_replica1] o.a.s.c.SolrResourceLoader new SolrResourceLoader for directory: '/export/home/jenkins/workspace/Lucene-Solr-6.x-Solaris/solr/build/solr-core/test/J0/temp/solr.security.BasicAuthIntegrationTest_4A2B627F97BE926A-001/tempDir-001/node3/authCollection_shard1_replica1'
   [junit4]   2> 3169696 INFO  (qtp2086722363-30824) [n:127.0.0.1:47782_solr c:authCollection s:shard1  x:authCollection_shard1_replica1] o.a.s.c.SolrResourceLoader JNDI not configured for solr (NoInitialContextEx)
   [junit4]   2> 3169696 INFO  (qtp2086722363-30824) [n:127.0.0.1:47782_solr c:authCollection s:shard1  x:authCollection_shard1_replica1] o.a.s.c.SolrResourceLoader solr home defaulted to 'solr/' (could not find system property or JNDI)
   [junit4]   2> 3169698 INFO  (qtp2086722363-30824) [n:127.0.0.1:47782_solr c:authCollection s:shard1  x:authCollection_shard1_replica1] o.a.s.c.Config loaded config solrconfig.xml with version 0 
   [junit4]   2> 3169701 INFO  (qtp2086722363-30824) [n:127.0.0.1:47782_solr c:authCollection s:shard1  x:authCollection_shard1_replica1] o.a.s.c.SolrConfig current version of requestparams : -1
   [junit4]   2> 3169703 INFO  (qtp2086722363-30824) [n:127.0.0.1:47782_solr c:authCollection s:shard1  x:authCollection_shard1_replica1] o.a.s.c.SolrConfig Using Lucene MatchVersion: 6.3.0
   [junit4]   2> 3169718 INFO  (qtp1917159589-30813) [n:127.0.0.1:62928_solr c:authCollection s:shard3  x:authCollection_shard3_replica1] o.a.s.c.ZkController waiting to find shard id in clusterstate for authCollection_shard3_replica1
   [junit4]   2> 3169718 INFO  (qtp1989024534-30831) [n:127.0.0.1:36906_solr c:authCollection s:shard2  x:authCollection_shard2_replica1] o.a.s.c.ZkController waiting to find shard id in clusterstate for authCollection_shard2_replica1
   [junit4]   2> 3169718 INFO  (qtp1989024534-30831) [n:127.0.0.1:36906_solr c:authCollection s:shard2  x:authCollection_shard2_replica1] o.a.s.c.ZkController Check for collection zkNode:authCollection
   [junit4]   2> 3169718 INFO  (qtp1917159589-30813) [n:127.0.0.1:62928_solr c:authCollection s:shard3  x:authCollection_shard3_replica1] o.a.s.c.ZkController Check for collection zkNode:authCollection
   [junit4]   2> 3169718 INFO  (qtp2086722363-30824) [n:127.0.0.1:47782_solr c:authCollection s:shard1  x:authCollection_shard1_replica1] o.a.s.c.SolrConfig Loaded SolrConfig: solrconfig.xml
   [junit4]   2> 3169719 INFO  (qtp1917159589-30813) [n:127.0.0.1:62928_solr c:authCollection s:shard3  x:authCollection_shard3_replica1] o.a.s.c.ZkController Collection zkNode exists
   [junit4]   2> 3169719 INFO  (qtp1989024534-30831) [n:127.0.0.1:36906_solr c:authCollection s:shard2  x:authCollection_shard2_replica1] o.a.s.c.ZkController Collection zkNode exists
   [junit4]   2> 3169719 INFO  (qtp1989024534-30831) [n:127.0.0.1:36906_solr c:authCollection s:shard2  x:authCollection_shard2_replica1] o.a.s.c.c.ZkStateReader Load collection config from: [/collections/authCollection]
   [junit4]   2> 3169719 INFO  (qtp1917159589-30813) [n:127.0.0.1:62928_solr c:authCollection s:shard3  x:authCollection_shard3_replica1] o.a.s.c.c.ZkStateReader Load collection config from: [/collections/authCollection]
   [junit4]   2> 3169720 INFO  (qtp1989024534-30831) [n:127.0.0.1:36906_solr c:authCollection s:shard2  x:authCollection_shard2_replica1] o.a.s.c.c.ZkStateReader path=[/collections/authCollection] [configName]=[conf] specified config exists in ZooKeeper
   [junit4]   2> 3169720 INFO  (qtp1989024534-30831) [n:127.0.0.1:36906_solr c:authCollection s:shard2  x:authCollection_shard2_replica1] o.a.s.c.SolrResourceLoader new SolrResourceLoader for directory: '/export/home/jenkins/workspace/Lucene-Solr-6.x-Solaris/solr/build/solr-core/test/J0/temp/solr.security.BasicAuthIntegrationTest_4A2B627F97BE926A-001/tempDir-001/node2/authCollection_shard2_replica1'
   [junit4]   2> 3169720 INFO  (qtp1917159589-30813) [n:127.0.0.1:62928_solr c:authCollection s:shard3  x:authCollection_shard3_replica1] o.a.s.c.c.ZkStateReader path=[/collections/authCollection] [configName]=[conf] specified config exists in ZooKeeper
   [junit4]   2> 3169720 INFO  (qtp1917159589-30813) [n:127.0.0.1:62928_solr c:authCollection s:shard3  x:authCollection_shard3_replica1] o.a.s.c.SolrResourceLoader new SolrResourceLoader for directory: '/export/home/jenkins/workspace/Lucene-Solr-6.x-Solaris/solr/build/solr-core/test/J0/temp/solr.security.BasicAuthIntegrationTest_4A2B627F97BE926A-001/tempDir-001/node1/authCollection_shard3_replica1'
   [junit4]   2> 3169720 INFO  (qtp1989024534-30831) [n:127.0.0.1:36906_solr c:authCollection s:shard2  x:authCollection_shard2_replica1] o.a.s.c.SolrResourceLoader JNDI not configured for solr (NoInitialContextEx)
   [junit4]   2> 3169720 INFO  (qtp1917159589-30813) [n:127.0.0.1:62928_solr c:authCollection s:shard3  x:authCollection_shard3_replica1] o.a.s.c.SolrResourceLoader JNDI not configured for solr (NoInitialContextEx)
   [junit4]   2> 3169721 INFO  (qtp1989024534-30831) [n:127.0.0.1:36906_solr c:authCollection s:shard2  x:authCollection_shard2_replica1] o.a.s.c.SolrResourceLoader solr home defaulted to 'solr/' (could not find system property or JNDI)
   [junit4]   2> 3169721 INFO  (qtp1917159589-30813) [n:127.0.0.1:62928_solr c:authCollection s:shard3  x:authCollection_shard3_replica1] o.a.s.c.SolrResourceLoader solr home defaulted to 'solr/' (could not find system property or JNDI)
   [junit4]   2> 3169721 INFO  (qtp2086722363-30824) [n:127.0.0.1:47782_solr c:authCollection s:shard1  x:authCollection_shard1_replica1] o.a.s.s.IndexSchema [authCollection_shard1_replica1] Schema name=minimal
   [junit4]   2> 3169722 INFO  (qtp1917159589-30813) [n:127.0.0.1:62928_solr c:authCollection s:shard3  x:authCollection_shard3_replica1] o.a.s.c.Config loaded config solrconfig.xml with version 0 
   [junit4]   2> 3169722 INFO  (qtp1989024534-30831) [n:127.0.0.1:36906_solr c:authCollection s:shard2  x:authCollection_shard2_replica1] o.a.s.c.Config loaded config solrconfig.xml with version 0 
   [junit4]   2> 3169724 INFO  (qtp2086722363-30824) [n:127.0.0.1:47782_solr c:authCollection s:shard1  x:authCollection_shard1_replica1] o.a.s.s.IndexSchema unique key field: id
   [junit4]   2> 3169726 INFO  (qtp2086722363-30824) [n:127.0.0.1:47782_solr c:authCollection s:shard1  x:authCollection_shard1_replica1] o.a.s.c.ConfigSetProperties Did not find ConfigSet properties, assuming default properties: Can't find resource 'configsetprops.json' in classpath or '/configs/conf', cwd=/export/home/jenkins/workspace/Lucene-Solr-6.x-Solaris/solr/build/solr-core/test/J0
   [junit4]   2> 3169726 INFO  (qtp2086722363-30824) [n:127.0.0.1:47782_solr c:authCollection s:shard1  x:authCollection_shard1_replica1] o.a.s.c.CoreContainer Creating SolrCore 'authCollection_shard1_replica1' using configuration from collection authCollection
   [junit4]   2> 3169726 INFO  (qtp1917159589-30813) [n:127.0.0.1:62928_solr c:authCollection s:shard3  x:authCollection_shard3_replica1] o.a.s.c.SolrConfig current version of requestparams : -1
   [junit4]   2> 3169726 INFO  (qtp1989024534-30831) [n:127.0.0.1:36906_solr c:authCollection s:shard2  x:authCollection_shard2_replica1] o.a.s.c.SolrConfig current version of requestparams : -1
   [junit4]   2> 3169726 INFO  (qtp2086722363-30824) [n:127.0.0.1:47782_solr c:authCollection s:shard1 r:core_node1 x:authCollection_shard1_replica1] o.a.s.c.SolrCore org.apache.solr.core.MockDirectoryFactory
   [junit4]   2> 3169726 INFO  (qtp2086722363-30824) [n:127.0.0.1:47782_solr c:authCollection s:shard1 r:core_node1 x:authCollection_shard1_replica1] o.a.s.c.SolrCore [[authCollection_shard1_replica1] ] Opening new SolrCore at [/export/home/jenkins/workspace/Lucene-Solr-6.x-Solaris/solr/build/solr-core/test/J0/temp/solr.security.BasicAuthIntegrationTest_4A2B627F97BE926A-001/tempDir-001/node3/authCollection_shard1_replica1], dataDir=[/export/home/jenkins/workspace/Lucene-Solr-6.x-Solaris/solr/build/solr-core/test/J0/temp/solr.security.BasicAuthIntegrationTest_4A2B627F97BE926A-001/tempDir-001/node3/./authCollection_shard1_replica1/data/]
   [junit4]   2> 3169726 INFO  (qtp2086722363-30824) [n:127.0.0.1:47782_solr c:authCollection s:shard1 r:core_node1 x:authCollection_shard1_replica1] o.a.s.c.SolrCore JMX monitoring not detected for core: authCollection_shard1_replica1
   [junit4]   2> 3169727 INFO  (qtp2086722363-30824) [n:127.0.0.1:47782_solr c:authCollection s:shard1 r:core_node1 x:authCollection_shard1_replica1] o.a.s.c.CachingDirectoryFactory return new directory for /export/home/jenkins/workspace/Lucene-Solr-6.x-Solaris/solr/build/solr-core/test/J0/temp/solr.security.BasicAuthIntegrationTest_4A2B627F97BE926A-001/tempDir-001/node3/./authCollection_shard1_replica1/data/snapshot_metadata
   [junit4]   2> 3169727 INFO  (qtp2086722363-30824) [n:127.0.0.1:47782_solr c:authCollection s:shard1 r:core_node1 x:authCollection_shard1_replica1] o.a.s.c.s.SolrSnapshotMetaDataManager Loading from snapshot metadata file...
   [junit4]   2> 3169727 INFO  (qtp2086722363-30824) [n:127.0.0.1:47782_solr c:authCollection s:shard1 r:core_node1 x:authCollection_shard1_replica1] o.a.s.c.CachingDirectoryFactory return new directory for /export/home/jenkins/workspace/Lucene-Solr-6.x-Solaris/solr/build/solr-core/test/J0/temp/solr.security.BasicAuthIntegrationTest_4A2B627F97BE926A-001/tempDir-001/node3/./authCollection_shard1_replica1/data
   [junit4]   2> 3169727 INFO  (qtp2086722363-30824) [n:127.0.0.1:47782_solr c:authCollection s:shard1 r:core_node1 x:authCollection_shard1_replica1] o.a.s.c.SolrCore New index directory detected: old=null new=/export/home/jenkins/workspace/Lucene-Solr-6.x-Solaris/solr/build/solr-core/test/J0/temp/solr.security.BasicAuthIntegrationTest_4A2B627F97BE926A-001/tempDir-001/node3/./authCollection_shard1_replica1/data/index/
   [junit4]   2> 3169727 WARN  (qtp2086722363-30824) [n:127.0.0.1:47782_solr c:authCollection s:shard1 r:core_node1 x:authCollection_shard1_replica1] o.a.s.c.SolrCore [authCollection_shard1_replica1] Solr index directory '/export/home/jenkins/workspace/Lucene-Solr-6.x-Solaris/solr/build/solr-core/test/J0/temp/solr.security.BasicAuthIntegrationTest_4A2B627F97BE926A-001/tempDir-001/node3/./authCollection_shard1_replica1/data/index' doesn't exist. Creating new index...
   [junit4]   2> 3169728 INFO  (qtp1989024534-30831) [n:127.0.0.1:36906_solr c:authCollection s:shard2  x:authCollection_shard2_replica1] o.a.s.c.SolrConfig Using Lucene MatchVersion: 6.3.0
   [junit4]   2> 3169728 INFO  (qtp2086722363-30824) [n:127.0.0.1:47782_solr c:authCollection s:shard1 r:core_node1 x:authCollection_shard1_replica1] o.a.s.c.CachingDirectoryFactory return new directory for /export/home/jenkins/workspace/Lucene-Solr-6.x-Solaris/solr/build/solr-core/test/J0/temp/solr.security.BasicAuthIntegrationTest_4A2B627F97BE926A-001/tempDir-001/node3/./authCollection_shard1_replica1/data/index
   [junit4]   2> 3169728 INFO  (qtp1917159589-30813) [n:127.0.0.1:62928_solr c:authCollection s:shard3  x:authCollection_shard3_replica1] o.a.s.c.SolrConfig Using Lucene MatchVersion: 6.3.0
   [junit4]   2> 3169728 INFO  (qtp2086722363-30824) [n:127.0.0.1:47782_solr c:authCollection s:shard1 r:core_node1 x:authCollection_shard1_replica1] o.a.s.c.SolrDeletionPolicy SolrDeletionPolicy.onCommit: commits: num=1
   [junit4]   2> 	commit{dir=MockDirectoryWrapper(RAMDirectory@7a0af631 lockFactory=org.apache.lucene.store.SingleInstanceLockFactory@4b878955),segFN=segments_1,generation=1}
   [junit4]   2> 3169728 INFO  (qtp2086722363-30824) [n:127.0.0.1:47782_solr c:authCollection s:shard1 r:core_node1 x:authCollection_shard1_replica1] o.a.s.c.SolrDeletionPolicy newest commit generation = 1
   [junit4]   2> 3169731 INFO  (qtp2086722363-30824) [n:127.0.0.1:47782_solr c:authCollection s:shard1 r:core_node1 x:authCollection_shard1_replica1] o.a.s.c.SolrCore no updateRequestProcessorChain defined as default, creating implicit default
   [junit4]   2> 3169732 INFO  (qtp1989024534-30831) [n:127.0.0.1:36906_solr c:authCollection s:shard2  x:authCollection_shard2_replica1] o.a.s.c.SolrConfig Loaded SolrConfig: solrconfig.xml
   [junit4]   2> 3169732 INFO  (qtp1917159589-30813) [n:127.0.0.1:62928_solr c:authCollection s:shard3  x:authCollection_shard3_replica1] o.a.s.c.SolrConfig Loaded SolrConfig: solrconfig.xml
   [junit4]   2> 3169733 INFO  (OldIndexDirectoryCleanupThreadForCore-authCollection_shard1_replica1) [n:127.0.0.1:47782_solr c:authCollection s:shard1 r:core_node1 x:authCollection_shard1_replica1] o.a.s.c.SolrCore Looking for old index directories to cleanup for core authCollection_shard1_replica1 in /export/home/jenkins/workspace/Lucene-Solr-6.x-Solaris/solr/build/solr-core/test/J0/temp/solr.security.BasicAuthIntegrationTest_4A2B627F97BE926A-001/tempDir-001/node3/./authCollection_shard1_replica1/data/
   [junit4]   2> 3169733 WARN  (OldIndexDirectoryCleanupThreadForCore-authCollection_shard1_replica1) [n:127.0.0.1:47782_solr c:authCollection s:shard1 r:core_node1 x:authCollection_shard1_replica1] o.a.s.c.DirectoryFactory /export/home/jenkins/workspace/Lucene-Solr-6.x-Solaris/solr/build/solr-core/test/J0/temp/solr.security.BasicAuthIntegrationTest_4A2B627F97BE926A-001/tempDir-001/node3/./authCollection_shard1_replica1/data/ does not point to a valid data directory; skipping clean-up of old index directories.
   [junit4]   2> 3169733 INFO  (qtp2086722363-30824) [n:127.0.0.1:47782_solr c:authCollection s:shard1 r:core_node1 x:authCollection_shard1_replica1] o.a.s.h.l.XMLLoader xsltCacheLifetimeSeconds=60
   [junit4]   2> 3169735 INFO  (qtp2086722363-30824) [n:127.0.0.1:47782_solr c:authCollection s:shard1 r:core_node1 x:authCollection_shard1_replica1] o.a.s.h.l.XMLLoader xsltCacheLifetimeSeconds=60
   [junit4]   2> 3169735 INFO  (qtp2086722363-30824) [n:127.0.0.1:47782_solr c:authCollection s:shard1 r:core_node1 x:authCollection_shard1_replica1] o.a.s.h.l.XMLLoader xsltCacheLifetimeSeconds=60
   [junit4]   2> 3169736 INFO  (qtp1989024534-30831) [n:127.0.0.1:36906_solr c:authCollection s:shard2  x:authCollection_shard2_replica1] o.a.s.s.IndexSchema [authCollection_shard2_replica1] Schema name=minimal
   [junit4]   2> 3169736 INFO  (qtp1917159589-30813) [n:127.0.0.1:62928_solr c:authCollection s:shard3  x:authCollection_shard3_replica1] o.a.s.s.IndexSchema [authCollection_shard3_replica1] Schema name=minimal
   [junit4]   2> 3169737 INFO  (qtp2086722363-30824) [n:127.0.0.1:47782_solr c:authCollection s:shard1 r:core_node1 x:authCollection_shard1_replica1] o.a.s.h.l.XMLLoader xsltCacheLifetimeSeconds=60
   [junit4]   2> 3169738 INFO  (qtp1917159589-30813) [n:127.0.0.1:62928_solr c:authCollection s:shard3  x:authCollection_shard3_replica1] o.a.s.s.IndexSchema unique key field: id
   [junit4]   2> 3169738 INFO  (qtp1989024534-30831) [n:127.0.0.1:36906_solr c:authCollection s:shard2  x:authCollection_shard2_replica1] o.a.s.s.IndexSchema unique key field: id
   [junit4]   2> 3169739 INFO  (qtp2086722363-30824) [n:127.0.0.1:47782_solr c:authCollection s:shard1 r:core_node1 x:authCollection_shard1_replica1] o.a.s.c.RequestHandlers Registered paths: /admin/mbeans,/update/json/docs,/admin/luke,/export,/get,/admin/properties,/update/json,/admin/threads,/update/csv,/sql,/graph,/select,/admin/segments,/admin/system,/replication,/config,/stream,/schema,/admin/plugins,/admin/logging,/admin/ping,/update,/admin/file,/terms
   [junit4]   2> 3169739 INFO  (qtp2086722363-30824) [n:127.0.0.1:47782_solr c:authCollection s:shard1 r:core_node1 x:authCollection_shard1_replica1] o.a.s.c.SolrCore Using default statsCache cache: org.apache.solr.search.stats.LocalStatsCache
   [junit4]   2> 3169739 INFO  (qtp2086722363-30824) [n:127.0.0.1:47782_solr c:authCollection s:shard1 r:core_node1 x:authCollection_shard1_replica1] o.a.s.u.UpdateHandler Using UpdateLog implementation: org.apache.solr.update.UpdateLog
   [junit4]   2> 3169739 INFO  (qtp2086722363-30824) [n:127.0.0.1:47782_solr c:authCollection s:shard1 r:core_node1 x:authCollection_shard1_replica1] o.a.s.u.UpdateLog Initializing UpdateLog: dataDir=null defaultSyncLevel=FLUSH numRecordsToKeep=100 maxNumLogsToKeep=10 numVersionBuckets=65536
   [junit4]   2> 3169740 INFO  (qtp1989024534-30831) [n:127.0.0.1:36906_solr c:authCollection s:shard2  x:authCollection_shard2_replica1] o.a.s.c.ConfigSetProperties Did not find ConfigSet properties, assuming default properties: Can't find resource 'configsetprops.json' in classpath or '/configs/conf', cwd=/export/home/jenkins/workspace/Lucene-Solr-6.x-Solaris/solr/build/solr-core/test/J0
   [junit4]   2> 3169740 INFO  (qtp1989024534-30831) [n:127.0.0.1:36906_solr c:authCollection s:shard2  x:authCollection_shard2_replica1] o.a.s.c.CoreContainer Creating SolrCore 'authCollection_shard2_replica1' using configuration from collection authCollection
   [junit4]   2> 3169740 INFO  (qtp1917159589-30813) [n:127.0.0.1:62928_solr c:authCollection s:shard3  x:authCollection_shard3_replica1] o.a.s.c.ConfigSetProperties Did not find ConfigSet properties, assuming default properties: Can't find resource 'configsetprops.json' in classpath or '/configs/conf', cwd=/export/home/jenkins/workspace/Lucene-Solr-6.x-Solaris/solr/build/solr-core/test/J0
   [junit4]   2> 3169740 INFO  (qtp1917159589-30813) [n:127.0.0.1:62928_solr c:authCollection s:shard3  x:authCollection_shard3_replica1] o.a.s.c.CoreContainer Creating SolrCore 'authCollection_shard3_replica1' using configuration from collection authCollection
   [junit4]   2> 3169740 INFO  (qtp1989024534-30831) [n:127.0.0.1:36906_solr c:authCollection s:shard2 r:core_node3 x:authCollection_shard2_replica1] o.a.s.c.SolrCore org.apache.solr.core.MockDirectoryFactory
   [junit4]   2> 3169740 INFO  (qtp1917159589-30813) [n:127.0.0.1:62928_solr c:authCollection s:shard3 r:core_node2 x:authCollection_shard3_replica1] o.a.s.c.SolrCore org.apache.solr.core.MockDirectoryFactory
   [junit4]   2> 3169740 INFO  (qtp2086722363-30824) [n:127.0.0.1:47782_solr c:authCollection s:shard1 r:core_node1 x:authCollection_shard1_replica1] o.a.s.u.CommitTracker Hard AutoCommit: disabled
   [junit4]   2> 3169740 INFO  (qtp1989024534-30831) [n:127.0.0.1:36906_solr c:authCollection s:shard2 r:core_node3 x:authCollection_shard2_replica1] o.a.s.c.SolrCore [[authCollection_shard2_replica1] ] Opening new SolrCore at [/export/home/jenkins/workspace/Lucene-Solr-6.x-Solaris/solr/build/solr-core/test/J0/temp/solr.security.BasicAuthIntegrationTest_4A2B627F97BE926A-001/tempDir-001/node2/authCollection_shard2_replica1], dataDir=[/export/home/jenkins/workspace/Lucene-Solr-6.x-Solaris/solr/build/solr-core/test/J0/temp/solr.security.BasicAuthIntegrationTest_4A2B627F97BE926A-001/tempDir-001/node2/./authCollection_shard2_replica1/data/]
   [junit4]   2> 3169740 INFO  (qtp1917159589-30813) [n:127.0.0.1:62928_solr c:authCollection s:shard3 r:core_node2 x:authCollection_shard3_replica1] o.a.s.c.SolrCore [[authCollection_shard3_replica1] ] Opening new SolrCore at [/export/home/jenkins/workspace/Lucene-Solr-6.x-Solaris/solr/build/solr-core/test/J0/temp/solr.security.BasicAuthIntegrationTest_4A2B627F97BE926A-001/tempDir-001/node1/authCollection_shard3_replica1], dataDir=[/export/home/jenkins/workspace/Lucene-Solr-6.x-Solaris/solr/build/solr-core/test/J0/temp/solr.security.BasicAuthIntegrationTest_4A2B627F97BE926A-001/tempDir-001/node1/./authCollection_shard3_replica1/data/]
   [junit4]   2> 3169740 INFO  (qtp1917159589-30813) [n:127.0.0.1:62928_solr c:authCollection s:shard3 r:core_node2 x:authCollection_shard3_replica1] o.a.s.c.SolrCore JMX monitoring not detected for core: authCollection_shard3_replica1
   [junit4]   2> 3169740 INFO  (qtp1989024534-30831) [n:127.0.0.1:36906_solr c:authCollection s:shard2 r:core_node3 x:authCollection_shard2_replica1] o.a.s.c.SolrCore JMX monitoring not detected for core: authCollection_shard2_replica1
   [junit4]   2> 3169740 INFO  (qtp2086722363-30824) [n:127.0.0.1:47782_solr c:authCollection s:shard1 r:core_node1 x:authCollection_shard1_replica1] o.a.s.u.CommitTracker Soft AutoCommit: disabled
   [junit4]   2> 3169741 INFO  (qtp2086722363-30824) [n:127.0.0.1:47782_solr c:authCollection s:shard1 r:core_node1 x:authCollection_shard1_replica1] o.a.s.c.SolrDeletionPolicy SolrDeletionPolicy.onInit: commits: num=1
   [junit4]   2> 	commit{dir=MockDirectoryWrapper(RAMDirectory@7a0af631 lockFactory=org.apache.lucene.store.SingleInstanceLockFactory@4b878955),segFN=segments_1,generation=1}
   [junit4]   2> 3169741 INFO  (qtp1917159589-30813) [n:127.0.0.1:62928_solr c:authCollection s:shard3 r:core_node2 x:authCollection_shard3_replica1] o.a.s.c.CachingDirectoryFactory return new directory for /export/home/jenkins/workspace/Lucene-Solr-6.x-Solaris/solr/build/solr-core/test/J0/temp/solr.security.BasicAuthIntegrationTest_4A2B627F97BE926A-001/tempDir-001/node1/./authCollection_shard3_replica1/data/snapshot_metadata
   [junit4]   2> 3169741 INFO  (qtp1989024534-30831) [n:127.0.0.1:36906_solr c:authCollection s:shard2 r:core_node3 x:authCollection_shard2_replica1] o.a.s.c.CachingDirectoryFactory return new directory for /export/home/jenkins/workspace/Lucene-Solr-6.x-Solaris/solr/build/solr-core/test/J0/temp/solr.security.BasicAuthIntegrationTest_4A2B627F97BE926A-001/tempDir-001/node2/./authCollection_shard2_replica1/data/snapshot_metadata
   [junit4]   2> 3169741 INFO  (qtp1989024534-30831) [n:127.0.0.1:36906_solr c:authCollection s:shard2 r:core_node3 x:authCollection_shard2_replica1] o.a.s.c.s.SolrSnapshotMetaDataManager Loading from snapshot metadata file...
   [junit4]   2> 3169741 INFO  (qtp2086722363-30824) [n:127.0.0.1:47782_solr c:authCollection s:shard1 r:core_node1 x:authCollection_shard1_replica1] o.a.s.c.SolrDeletionPolicy newest commit generation = 1
   [junit4]   2> 3169741 INFO  (qtp1917159589-30813) [n:127.0.0.1:62928_solr c:authCollection s:shard3 r:core_node2 x:authCollection_shard3_replica1] o.a.s.c.s.SolrSnapshotMetaDataManager Loading from snapshot metadata file...
   [junit4]   2> 3169741 INFO  (qtp1989024534-30831) [n:127.0.0.1:36906_solr c:authCollection s:shard2 r:core_node3 x:authCollection_shard2_replica1] o.a.s.c.CachingDirectoryFactory return new directory for /export/home/jenkins/workspace/Lucene-Solr-6.x-Solaris/solr/build/solr-core/test/J0/temp/solr.security.BasicAuthIntegrationTest_4A2B627F97BE926A-001/tempDir-001/node2/./authCollection_shard2_replica1/data
   [junit4]   2> 3169742 INFO  (qtp1989024534-30831) [n:127.0.0.1:36906_solr c:authCollection s:shard2 r:core_node3 x:authCollection_shard2_replica1] o.a.s.c.SolrCore New index directory detected: old=null new=/export/home/jenkins/workspace/Lucene-Solr-6.x-Solaris/solr/build/solr-core/test/J0/temp/solr.security.BasicAuthIntegrationTest_4A2B627F97BE926A-001/tempDir-001/node2/./authCollection_shard2_replica1/data/inde

[...truncated too long message...]

r.java:1142)
   [junit4]   2> 	at java.util.concurrent.ThreadPoolExecutor$Worker.run(ThreadPoolExecutor.java:617)
   [junit4]   2> 	at java.lang.Thread.run(Thread.java:745)
   [junit4]   2> 3175746 WARN  (zkCallback-4317-thread-1-processing-n:127.0.0.1:55531_solr) [n:127.0.0.1:55531_solr    ] o.a.s.c.c.ZkStateReader ZooKeeper watch triggered, but Solr cannot talk to ZK: [KeeperErrorCode = Session expired for /live_nodes]
   [junit4]   2> 3175747 INFO  (jetty-launcher-4289-thread-3) [    ] o.e.j.s.h.ContextHandler Stopped o.e.j.s.ServletContextHandler@3604ccaf{/solr,null,UNAVAILABLE}
   [junit4]   2> 3175750 INFO  (SUITE-BasicAuthIntegrationTest-seed#[4A2B627F97BE926A]-worker) [    ] o.a.s.c.ZkTestServer connecting to 127.0.0.1:40000 40000
   [junit4]   2> 3175765 INFO  (Thread-12001) [    ] o.a.s.c.ZkTestServer connecting to 127.0.0.1:40000 40000
   [junit4]   2> 3175766 WARN  (Thread-12001) [    ] o.a.s.c.ZkTestServer Watch limit violations: 
   [junit4]   2> Maximum concurrent create/delete watches above limit:
   [junit4]   2> 
   [junit4]   2> 	5	/solr/aliases.json
   [junit4]   2> 	4	/solr/security.json
   [junit4]   2> 	4	/solr/configs/conf
   [junit4]   2> 
   [junit4]   2> Maximum concurrent data watches above limit:
   [junit4]   2> 
   [junit4]   2> 	5	/solr/clusterstate.json
   [junit4]   2> 	5	/solr/clusterprops.json
   [junit4]   2> 	4	/solr/collections/authCollection/state.json
   [junit4]   2> 
   [junit4]   2> Maximum concurrent children watches above limit:
   [junit4]   2> 
   [junit4]   2> 	14	/solr/overseer/queue
   [junit4]   2> 	6	/solr/overseer/collection-queue-work
   [junit4]   2> 	5	/solr/collections
   [junit4]   2> 	4	/solr/live_nodes
   [junit4]   2> 	2	/solr/overseer/queue-work
   [junit4]   2> 
   [junit4]   2> 3175766 INFO  (SUITE-BasicAuthIntegrationTest-seed#[4A2B627F97BE926A]-worker) [    ] o.a.s.SolrTestCaseJ4 ###deleteCore
   [junit4]   2> NOTE: leaving temporary files on disk at: /export/home/jenkins/workspace/Lucene-Solr-6.x-Solaris/solr/build/solr-core/test/J0/temp/solr.security.BasicAuthIntegrationTest_4A2B627F97BE926A-001
   [junit4]   2> Sep 10, 2016 10:15:09 PM com.carrotsearch.randomizedtesting.ThreadLeakControl checkThreadLeaks
   [junit4]   2> WARNING: Will linger awaiting termination of 1 leaked thread(s).
   [junit4]   2> NOTE: test params are: codec=Asserting(Lucene62), sim=ClassicSimilarity, locale=en-PH, timezone=Canada/Newfoundland
   [junit4]   2> NOTE: SunOS 5.11 amd64/Oracle Corporation 1.8.0_102 (64-bit)/cpus=3,threads=1,free=61869072,total=522190848
   [junit4]   2> NOTE: All tests run in this JVM: [HardAutoCommitTest, TestRandomDVFaceting, RequiredFieldsTest, BitVectorTest, TestReRankQParserPlugin, TestPhraseSuggestions, TestNamedUpdateProcessors, TestTolerantUpdateProcessorCloud, SimplePostToolTest, TestFastOutputStream, JSONWriterTest, DistributedFacetPivotLongTailTest, FastVectorHighlighterTest, SharedFSAutoReplicaFailoverUtilsTest, TestSchemaNameResource, TestReplicaProperties, TestDistributedSearch, TestOnReconnectListenerSupport, TestImplicitCoreProperties, ZkStateWriterTest, TestObjectReleaseTracker, TestHighFrequencyDictionaryFactory, TestFieldCacheVsDocValues, PolyFieldTest, TestTrieFacet, TestExactStatsCache, SolrPluginUtilsTest, PrimitiveFieldTypeTest, TestCSVResponseWriter, DistributedFacetPivotSmallTest, DirectSolrSpellCheckerTest, CdcrBootstrapTest, SimpleMLTQParserTest, DateFieldTest, UnloadDistributedZkTest, DistributedVersionInfoTest, ZkControllerTest, HdfsBasicDistributedZkTest, SolrCoreTest, TestCSVLoader, HdfsWriteToMultipleCollectionsTest, BlockJoinFacetSimpleTest, TestReloadAndDeleteDocs, TestCustomDocTransformer, SolrXmlInZkTest, TestGraphTermsQParserPlugin, SpatialHeatmapFacetsTest, TestManagedResourceStorage, TestShortCircuitedRequests, IndexSchemaRuntimeFieldTest, DistributedSpellCheckComponentTest, TestStressRecovery, DistributedSuggestComponentTest, TestPerFieldSimilarity, TestSort, TestCollationField, TestLeaderInitiatedRecoveryThread, TestHdfsCloudBackupRestore, WrapperMergePolicyFactoryTest, TestSolrConfigHandlerCloud, SolrCLIZkUtilsTest, RuleEngineTest, BlockDirectoryTest, CollectionsAPISolrJTest, DirectoryFactoryTest, XsltUpdateRequestHandlerTest, TestCollectionAPI, TestPerFieldSimilarityClassic, TestSerializedLuceneMatchVersion, TestExtendedDismaxParser, TestCopyFieldCollectionResource, TestStressReorder, BlockJoinFacetDistribTest, TestRandomRequestDistribution, TestHdfsUpdateLog, TestPostingsSolrHighlighter, SOLR749Test, TestCharFilters, TestLazyCores, TestLegacyFieldCache, SpatialRPTFieldTypeTest, TestBulkSchemaAPI, SuggesterFSTTest, TestBinaryResponseWriter, PluginInfoTest, CollectionReloadTest, ResponseLogComponentTest, LeaderInitiatedRecoveryOnCommitTest, SampleTest, DocValuesTest, DirectSolrConnectionTest, ClassificationUpdateProcessorFactoryTest, SuggestComponentTest, TestComplexPhraseQParserPlugin, TestDynamicFieldCollectionResource, RestartWhileUpdatingTest, ReplaceNodeTest, CollectionTooManyReplicasTest, HLLUtilTest, NumericFieldsTest, TestDocBasedVersionConstraints, HdfsNNFailoverTest, TestInitParams, PeerSyncTest, OutOfBoxZkACLAndCredentialsProvidersTest, FullHLLTest, SoftAutoCommitTest, TestRawTransformer, HdfsDirectoryTest, TestCloudPivotFacet, ParsingFieldUpdateProcessorsTest, TestUpdate, TestStressCloudBlindAtomicUpdates, TlogReplayBufferedWhileIndexingTest, TestHashPartitioner, TestRestoreCore, TestStandardQParsers, TestConfigSets, TestAnalyzedSuggestions, OpenExchangeRatesOrgProviderTest, TestAnalyzeInfixSuggestions, BlobRepositoryCloudTest, TestFieldCacheSort, TestDFISimilarityFactory, TermsComponentTest, TestFieldTypeCollectionResource, DeleteInactiveReplicaTest, CleanupOldIndexTest, TestSolrXml, TestMissingGroups, TestLFUCache, SolrTestCaseJ4Test, TestReloadDeadlock, BadCopyFieldTest, TestSubQueryTransformerDistrib, TestExpandComponent, DistribCursorPagingTest, TestSweetSpotSimilarityFactory, TestTrackingShardHandlerFactory, TestSolrCLIRunExample, DistributedMLTComponentTest, ClusterStateUpdateTest, ConfigSetsAPITest, TestBM25SimilarityFactory, TestBackupRepositoryFactory, SynonymTokenizerTest, TestMinMaxOnMultiValuedField, TestRequestStatusCollectionAPI, TestFastLRUCache, TestConfigSetsAPIExclusivity, TestFunctionQuery, HdfsRecoveryZkTest, TestOverriddenPrefixQueryForCustomFieldType, SyncSliceTest, ShardRoutingTest, RecoveryZkTest, TestRandomFaceting, LeaderElectionTest, ZkCLITest, ShardRoutingCustomTest, TestFaceting, TestRecovery, TestRealTimeGet, DistributedTermsComponentTest, TestGroupingSearch, QueryElevationComponentTest, TestFiltering, BasicFunctionalityTest, HighlighterTest, CurrencyFieldXmlFileTest, AnalysisAfterCoreReloadTest, SignatureUpdateProcessorFactoryTest, SpellCheckCollatorTest, SolrRequestParserTest, TestTrie, NoCacheHeaderTest, TestPseudoReturnFields, TestAtomicUpdateErrorCases, QueryEqualityTest, SortByFunctionTest, TestRemoteStreaming, DocValuesMultiTest, SolrInfoMBeanTest, IndexBasedSpellCheckerTest, LukeRequestHandlerTest, TestWriterPerf, XmlUpdateRequestHandlerTest, DocumentBuilderTest, TermVectorComponentTest, TestSolrQueryParser, TestJmxIntegration, QueryParsingTest, BinaryUpdateRequestHandlerTest, TestPHPSerializedResponseWriter, TestComponentsName, UpdateParamsTest, AlternateDirectoryTest, TestSolrIndexConfig, TestQuerySenderNoQuery, CopyFieldTest, SolrIndexConfigTest, BadComponentTest, TestMergePolicyConfig, MultiTermTest, TestDocSet, TestBinaryField, TestSearchPerf, TestElisionMultitermQuery, OutputWriterTest, ExternalFileFieldSortTest, TestLuceneMatchVersion, TestCodecSupport, TestXIncludeConfig, TestDFRSimilarityFactory, TestLMJelinekMercerSimilarityFactory, TestIBSimilarityFactory, TestJmxMonitoredMap, TimeZoneUtilsTest, ResourceLoaderTest, ScriptEngineTest, URLClassifyProcessorTest, DateMathParserTest, ChaosMonkeyNothingIsSafeTest, AssignTest, AsyncCallRequestStatusResponseTest, AsyncMigrateRouteKeyTest, CollectionsAPIAsyncDistributedZkTest, DeleteShardTest, DistribJoinFromCollectionTest, DistributedQueueTest, HttpPartitionTest, OverseerCollectionConfigSetProcessorTest, OverseerRolesTest, ReplicationFactorTest, SSLMigrationTest, ShardSplitTest, TestRebalanceLeaders, TestSolrCloudWithDelegationTokens, VMParamsZkACLAndCredentialsProvidersTest, HdfsBasicDistributedZk2Test, HdfsChaosMonkeyNothingIsSafeTest, HdfsChaosMonkeySafeLeaderTest, HdfsRecoverLeaseTest, HdfsTlogReplayBufferedWhileIndexingTest, StressHdfsTest, CachingDirectoryFactoryTest, CoreSorterTest, ExitableDirectoryReaderTest, HdfsDirectoryFactoryTest, QueryResultKeyTest, TestConfigSetImmutable, TestInfoStreamLogging, TestNRTOpen, TestSolrConfigHandler, TestSolrDynamicMBean, RequestLoggingTest, TestBlobHandler, TestReplicationHandlerBackup, TestReqParamsAPI, CoreAdminCreateDiscoverTest, CoreAdminRequestStatusTest, CoreMergeIndexesAdminHandlerTest, InfoHandlerTest, SecurityConfHandlerTest, DistributedDebugComponentTest, DistributedExpandComponentTest, DistributedFacetExistsSmallTest, DistributedFacetPivotSmallAdvancedTest, FacetPivotSmallTest, TestDistributedStatsComponentCardinality, TestCloudManagedSchema, TestCloudSchemaless, TestManagedSchema, TestSchemaManager, TestUseDocValuesAsStored2, AnalyticsMergeStrategyTest, AnalyticsQueryTest, MergeStrategyTest, RankQueryTest, SortSpecParsingTest, TestAddFieldRealTimeGet, TestFieldSortValues, TestHashQParserPlugin, TestInitQParser, TestRandomCollapseQParserPlugin, TestRecoveryHdfs, TestSimpleQParserPlugin, TestSmileRequest, TestSolr4Spatial2, TestSolrFieldCacheMBean, TestXmlQParser, TestXmlQParserPlugin, TestSortByMinMaxFunction, BlockJoinFacetRandomTest, GraphQueryTest, TestScoreJoinQPNoScore, TestScoreJoinQPScore, TestJsonRequest, CloudMLTQParserTest, TestClassicSimilarityFactory, TestNonDefinedSimilarityFactory, TestPerFieldSimilarityWithDefaultOverride, TestDefaultStatsCache, TestDistribIDF, TestExactSharedStatsCache, BasicAuthIntegrationTest]
   [junit4] Completed [599/630 (1!)] on J0 in 8.22s, 1 test, 1 error <<< FAILURES!

[...truncated 60387 lines...]


Mime
View raw message