lucene-dev mailing list archives

Site index · List index
Message view « Date » · « Thread »
Top « Date » · « Thread »
From Policeman Jenkins Server <jenk...@thetaphi.de>
Subject [JENKINS] Lucene-Solr-6.x-Linux (64bit/jdk1.8.0_102) - Build # 1698 - Still Unstable!
Date Sat, 10 Sep 2016 17:15:57 GMT
Build: http://jenkins.thetaphi.de/job/Lucene-Solr-6.x-Linux/1698/
Java: 64bit/jdk1.8.0_102 -XX:-UseCompressedOops -XX:+UseParallelGC

1 tests failed.
FAILED:  org.apache.solr.security.BasicAuthIntegrationTest.testBasicAuth

Error Message:
IOException occured when talking to server at: https://127.0.0.1:37565/solr

Stack Trace:
org.apache.solr.client.solrj.SolrServerException: IOException occured when talking to server at: https://127.0.0.1:37565/solr
	at __randomizedtesting.SeedInfo.seed([9EFE537BC715F3D1:22902569634670AB]:0)
	at org.apache.solr.client.solrj.impl.HttpSolrClient.executeMethod(HttpSolrClient.java:606)
	at org.apache.solr.client.solrj.impl.HttpSolrClient.request(HttpSolrClient.java:261)
	at org.apache.solr.client.solrj.impl.HttpSolrClient.request(HttpSolrClient.java:250)
	at org.apache.solr.client.solrj.SolrClient.request(SolrClient.java:1219)
	at org.apache.solr.security.BasicAuthIntegrationTest.testBasicAuth(BasicAuthIntegrationTest.java:158)
	at sun.reflect.NativeMethodAccessorImpl.invoke0(Native Method)
	at sun.reflect.NativeMethodAccessorImpl.invoke(NativeMethodAccessorImpl.java:62)
	at sun.reflect.DelegatingMethodAccessorImpl.invoke(DelegatingMethodAccessorImpl.java:43)
	at java.lang.reflect.Method.invoke(Method.java:498)
	at com.carrotsearch.randomizedtesting.RandomizedRunner.invoke(RandomizedRunner.java:1764)
	at com.carrotsearch.randomizedtesting.RandomizedRunner$8.evaluate(RandomizedRunner.java:871)
	at com.carrotsearch.randomizedtesting.RandomizedRunner$9.evaluate(RandomizedRunner.java:907)
	at com.carrotsearch.randomizedtesting.RandomizedRunner$10.evaluate(RandomizedRunner.java:921)
	at com.carrotsearch.randomizedtesting.rules.SystemPropertiesRestoreRule$1.evaluate(SystemPropertiesRestoreRule.java:57)
	at org.apache.lucene.util.TestRuleSetupTeardownChained$1.evaluate(TestRuleSetupTeardownChained.java:49)
	at org.apache.lucene.util.AbstractBeforeAfterRule$1.evaluate(AbstractBeforeAfterRule.java:45)
	at org.apache.lucene.util.TestRuleThreadAndTestName$1.evaluate(TestRuleThreadAndTestName.java:48)
	at org.apache.lucene.util.TestRuleIgnoreAfterMaxFailures$1.evaluate(TestRuleIgnoreAfterMaxFailures.java:64)
	at org.apache.lucene.util.TestRuleMarkFailure$1.evaluate(TestRuleMarkFailure.java:47)
	at com.carrotsearch.randomizedtesting.rules.StatementAdapter.evaluate(StatementAdapter.java:36)
	at com.carrotsearch.randomizedtesting.ThreadLeakControl$StatementRunner.run(ThreadLeakControl.java:367)
	at com.carrotsearch.randomizedtesting.ThreadLeakControl.forkTimeoutingTask(ThreadLeakControl.java:809)
	at com.carrotsearch.randomizedtesting.ThreadLeakControl$3.evaluate(ThreadLeakControl.java:460)
	at com.carrotsearch.randomizedtesting.RandomizedRunner.runSingleTest(RandomizedRunner.java:880)
	at com.carrotsearch.randomizedtesting.RandomizedRunner$5.evaluate(RandomizedRunner.java:781)
	at com.carrotsearch.randomizedtesting.RandomizedRunner$6.evaluate(RandomizedRunner.java:816)
	at com.carrotsearch.randomizedtesting.RandomizedRunner$7.evaluate(RandomizedRunner.java:827)
	at com.carrotsearch.randomizedtesting.rules.StatementAdapter.evaluate(StatementAdapter.java:36)
	at com.carrotsearch.randomizedtesting.rules.SystemPropertiesRestoreRule$1.evaluate(SystemPropertiesRestoreRule.java:57)
	at org.apache.lucene.util.AbstractBeforeAfterRule$1.evaluate(AbstractBeforeAfterRule.java:45)
	at com.carrotsearch.randomizedtesting.rules.StatementAdapter.evaluate(StatementAdapter.java:36)
	at org.apache.lucene.util.TestRuleStoreClassName$1.evaluate(TestRuleStoreClassName.java:41)
	at com.carrotsearch.randomizedtesting.rules.NoShadowingOrOverridesOnMethodsRule$1.evaluate(NoShadowingOrOverridesOnMethodsRule.java:40)
	at com.carrotsearch.randomizedtesting.rules.NoShadowingOrOverridesOnMethodsRule$1.evaluate(NoShadowingOrOverridesOnMethodsRule.java:40)
	at com.carrotsearch.randomizedtesting.rules.StatementAdapter.evaluate(StatementAdapter.java:36)
	at com.carrotsearch.randomizedtesting.rules.StatementAdapter.evaluate(StatementAdapter.java:36)
	at com.carrotsearch.randomizedtesting.rules.StatementAdapter.evaluate(StatementAdapter.java:36)
	at org.apache.lucene.util.TestRuleAssertionsRequired$1.evaluate(TestRuleAssertionsRequired.java:53)
	at org.apache.lucene.util.TestRuleMarkFailure$1.evaluate(TestRuleMarkFailure.java:47)
	at org.apache.lucene.util.TestRuleIgnoreAfterMaxFailures$1.evaluate(TestRuleIgnoreAfterMaxFailures.java:64)
	at org.apache.lucene.util.TestRuleIgnoreTestSuites$1.evaluate(TestRuleIgnoreTestSuites.java:54)
	at com.carrotsearch.randomizedtesting.rules.StatementAdapter.evaluate(StatementAdapter.java:36)
	at com.carrotsearch.randomizedtesting.ThreadLeakControl$StatementRunner.run(ThreadLeakControl.java:367)
	at java.lang.Thread.run(Thread.java:745)
Caused by: javax.net.ssl.SSLHandshakeException: sun.security.validator.ValidatorException: PKIX path building failed: sun.security.provider.certpath.SunCertPathBuilderException: unable to find valid certification path to requested target
	at sun.security.ssl.Alerts.getSSLException(Alerts.java:192)
	at sun.security.ssl.SSLSocketImpl.fatal(SSLSocketImpl.java:1949)
	at sun.security.ssl.Handshaker.fatalSE(Handshaker.java:302)
	at sun.security.ssl.Handshaker.fatalSE(Handshaker.java:296)
	at sun.security.ssl.ClientHandshaker.serverCertificate(ClientHandshaker.java:1509)
	at sun.security.ssl.ClientHandshaker.processMessage(ClientHandshaker.java:216)
	at sun.security.ssl.Handshaker.processLoop(Handshaker.java:979)
	at sun.security.ssl.Handshaker.process_record(Handshaker.java:914)
	at sun.security.ssl.SSLSocketImpl.readRecord(SSLSocketImpl.java:1062)
	at sun.security.ssl.SSLSocketImpl.performInitialHandshake(SSLSocketImpl.java:1375)
	at sun.security.ssl.SSLSocketImpl.startHandshake(SSLSocketImpl.java:1403)
	at sun.security.ssl.SSLSocketImpl.startHandshake(SSLSocketImpl.java:1387)
	at org.apache.http.conn.ssl.SSLSocketFactory.connectSocket(SSLSocketFactory.java:543)
	at org.apache.http.conn.ssl.SSLSocketFactory.connectSocket(SSLSocketFactory.java:409)
	at org.apache.http.impl.conn.DefaultClientConnectionOperator.openConnection(DefaultClientConnectionOperator.java:177)
	at org.apache.http.impl.conn.ManagedClientConnectionImpl.open(ManagedClientConnectionImpl.java:304)
	at org.apache.http.impl.client.DefaultRequestDirector.tryConnect(DefaultRequestDirector.java:611)
	at org.apache.http.impl.client.DefaultRequestDirector.execute(DefaultRequestDirector.java:446)
	at org.apache.http.impl.client.AbstractHttpClient.doExecute(AbstractHttpClient.java:882)
	at org.apache.http.impl.client.CloseableHttpClient.execute(CloseableHttpClient.java:82)
	at org.apache.http.impl.client.CloseableHttpClient.execute(CloseableHttpClient.java:107)
	at org.apache.http.impl.client.CloseableHttpClient.execute(CloseableHttpClient.java:55)
	at org.apache.solr.client.solrj.impl.HttpSolrClient.executeMethod(HttpSolrClient.java:497)
	... 43 more
Caused by: sun.security.validator.ValidatorException: PKIX path building failed: sun.security.provider.certpath.SunCertPathBuilderException: unable to find valid certification path to requested target
	at sun.security.validator.PKIXValidator.doBuild(PKIXValidator.java:387)
	at sun.security.validator.PKIXValidator.engineValidate(PKIXValidator.java:292)
	at sun.security.validator.Validator.validate(Validator.java:260)
	at sun.security.ssl.X509TrustManagerImpl.validate(X509TrustManagerImpl.java:324)
	at sun.security.ssl.X509TrustManagerImpl.checkTrusted(X509TrustManagerImpl.java:229)
	at sun.security.ssl.X509TrustManagerImpl.checkServerTrusted(X509TrustManagerImpl.java:124)
	at sun.security.ssl.ClientHandshaker.serverCertificate(ClientHandshaker.java:1491)
	... 61 more
Caused by: sun.security.provider.certpath.SunCertPathBuilderException: unable to find valid certification path to requested target
	at sun.security.provider.certpath.SunCertPathBuilder.build(SunCertPathBuilder.java:141)
	at sun.security.provider.certpath.SunCertPathBuilder.engineBuild(SunCertPathBuilder.java:126)
	at java.security.cert.CertPathBuilder.build(CertPathBuilder.java:280)
	at sun.security.validator.PKIXValidator.doBuild(PKIXValidator.java:382)
	... 67 more




Build Log:
[...truncated 10673 lines...]
   [junit4] Suite: org.apache.solr.security.BasicAuthIntegrationTest
   [junit4]   2> Creating dataDir: /home/jenkins/workspace/Lucene-Solr-6.x-Linux/solr/build/solr-core/test/J2/temp/solr.security.BasicAuthIntegrationTest_9EFE537BC715F3D1-001/init-core-data-001
   [junit4]   2> 16225 INFO  (SUITE-BasicAuthIntegrationTest-seed#[9EFE537BC715F3D1]-worker) [    ] o.a.s.SolrTestCaseJ4 Randomized ssl (true) and clientAuth (false) via: @org.apache.solr.util.RandomizeSSL(reason=, ssl=NaN, value=NaN, clientAuth=NaN)
   [junit4]   2> 16237 INFO  (SUITE-BasicAuthIntegrationTest-seed#[9EFE537BC715F3D1]-worker) [    ] o.a.s.c.ZkTestServer STARTING ZK TEST SERVER
   [junit4]   2> 16239 INFO  (Thread-74) [    ] o.a.s.c.ZkTestServer client port:0.0.0.0/0.0.0.0:0
   [junit4]   2> 16239 INFO  (Thread-74) [    ] o.a.s.c.ZkTestServer Starting server
   [junit4]   2> 16339 INFO  (SUITE-BasicAuthIntegrationTest-seed#[9EFE537BC715F3D1]-worker) [    ] o.a.s.c.ZkTestServer start zk server on port:43191
   [junit4]   2> 16347 INFO  (SUITE-BasicAuthIntegrationTest-seed#[9EFE537BC715F3D1]-worker) [    ] o.a.s.c.c.SolrZkClient Using default ZkCredentialsProvider
   [junit4]   2> 16372 INFO  (SUITE-BasicAuthIntegrationTest-seed#[9EFE537BC715F3D1]-worker) [    ] o.a.s.c.c.ConnectionManager Waiting for client to connect to ZooKeeper
   [junit4]   2> 16400 INFO  (zkCallback-20-thread-1) [    ] o.a.s.c.c.ConnectionManager Watcher org.apache.solr.common.cloud.ConnectionManager@6c58e31 name:ZooKeeperConnection Watcher:127.0.0.1:43191 got event WatchedEvent state:SyncConnected type:None path:null path:null type:None
   [junit4]   2> 16400 INFO  (SUITE-BasicAuthIntegrationTest-seed#[9EFE537BC715F3D1]-worker) [    ] o.a.s.c.c.ConnectionManager Client is connected to ZooKeeper
   [junit4]   2> 16400 INFO  (SUITE-BasicAuthIntegrationTest-seed#[9EFE537BC715F3D1]-worker) [    ] o.a.s.c.c.SolrZkClient Using default ZkACLProvider
   [junit4]   2> 16402 INFO  (SUITE-BasicAuthIntegrationTest-seed#[9EFE537BC715F3D1]-worker) [    ] o.a.s.c.c.SolrZkClient makePath: /solr/solr.xml
   [junit4]   2> 16441 INFO  (SUITE-BasicAuthIntegrationTest-seed#[9EFE537BC715F3D1]-worker) [    ] o.a.s.c.c.SolrZkClient makePath: /solr/clusterprops.json
   [junit4]   2> 16605 INFO  (jetty-launcher-19-thread-1) [    ] o.e.j.s.Server jetty-9.3.8.v20160314
   [junit4]   2> 16605 INFO  (jetty-launcher-19-thread-2) [    ] o.e.j.s.Server jetty-9.3.8.v20160314
   [junit4]   2> 16605 INFO  (jetty-launcher-19-thread-3) [    ] o.e.j.s.Server jetty-9.3.8.v20160314
   [junit4]   2> 16634 INFO  (jetty-launcher-19-thread-2) [    ] o.e.j.s.h.ContextHandler Started o.e.j.s.ServletContextHandler@b984b93{/solr,null,AVAILABLE}
   [junit4]   2> 16634 INFO  (jetty-launcher-19-thread-1) [    ] o.e.j.s.h.ContextHandler Started o.e.j.s.ServletContextHandler@18415b07{/solr,null,AVAILABLE}
   [junit4]   2> 16634 INFO  (jetty-launcher-19-thread-3) [    ] o.e.j.s.h.ContextHandler Started o.e.j.s.ServletContextHandler@4e15d2ac{/solr,null,AVAILABLE}
   [junit4]   2> 16768 INFO  (jetty-launcher-19-thread-1) [    ] o.e.j.s.ServerConnector Started ServerConnector@7bb09490{SSL,[ssl, http/1.1]}{127.0.0.1:37565}
   [junit4]   2> 16768 INFO  (jetty-launcher-19-thread-3) [    ] o.e.j.s.ServerConnector Started ServerConnector@7142a92a{SSL,[ssl, http/1.1]}{127.0.0.1:41255}
   [junit4]   2> 16768 INFO  (jetty-launcher-19-thread-2) [    ] o.e.j.s.ServerConnector Started ServerConnector@5347edaf{SSL,[ssl, http/1.1]}{127.0.0.1:45291}
   [junit4]   2> 16768 INFO  (jetty-launcher-19-thread-3) [    ] o.e.j.s.Server Started @18576ms
   [junit4]   2> 16768 INFO  (jetty-launcher-19-thread-1) [    ] o.e.j.s.Server Started @18576ms
   [junit4]   2> 16768 INFO  (jetty-launcher-19-thread-2) [    ] o.e.j.s.Server Started @18576ms
   [junit4]   2> 16768 INFO  (jetty-launcher-19-thread-2) [    ] o.a.s.c.s.e.JettySolrRunner Jetty properties: {hostContext=/solr, hostPort=45291}
   [junit4]   2> 16768 INFO  (jetty-launcher-19-thread-1) [    ] o.a.s.c.s.e.JettySolrRunner Jetty properties: {hostContext=/solr, hostPort=37565}
   [junit4]   2> 16768 INFO  (jetty-launcher-19-thread-3) [    ] o.a.s.c.s.e.JettySolrRunner Jetty properties: {hostContext=/solr, hostPort=41255}
   [junit4]   2> 16779 INFO  (jetty-launcher-19-thread-2) [    ] o.a.s.s.SolrDispatchFilter SolrDispatchFilter.init(): sun.misc.Launcher$AppClassLoader@73d16e93
   [junit4]   2> 16779 INFO  (jetty-launcher-19-thread-3) [    ] o.a.s.s.SolrDispatchFilter SolrDispatchFilter.init(): sun.misc.Launcher$AppClassLoader@73d16e93
   [junit4]   2> 16779 INFO  (jetty-launcher-19-thread-1) [    ] o.a.s.s.SolrDispatchFilter SolrDispatchFilter.init(): sun.misc.Launcher$AppClassLoader@73d16e93
   [junit4]   2> 16780 INFO  (jetty-launcher-19-thread-1) [    ] o.a.s.c.SolrResourceLoader new SolrResourceLoader for directory: '/home/jenkins/workspace/Lucene-Solr-6.x-Linux/solr/build/solr-core/test/J2/temp/solr.security.BasicAuthIntegrationTest_9EFE537BC715F3D1-001/tempDir-001/node1'
   [junit4]   2> 16780 INFO  (jetty-launcher-19-thread-3) [    ] o.a.s.c.SolrResourceLoader new SolrResourceLoader for directory: '/home/jenkins/workspace/Lucene-Solr-6.x-Linux/solr/build/solr-core/test/J2/temp/solr.security.BasicAuthIntegrationTest_9EFE537BC715F3D1-001/tempDir-001/node3'
   [junit4]   2> 16780 INFO  (jetty-launcher-19-thread-2) [    ] o.a.s.c.SolrResourceLoader new SolrResourceLoader for directory: '/home/jenkins/workspace/Lucene-Solr-6.x-Linux/solr/build/solr-core/test/J2/temp/solr.security.BasicAuthIntegrationTest_9EFE537BC715F3D1-001/tempDir-001/node2'
   [junit4]   2> 16780 INFO  (jetty-launcher-19-thread-1) [    ] o.a.s.c.SolrResourceLoader JNDI not configured for solr (NoInitialContextEx)
   [junit4]   2> 16780 INFO  (jetty-launcher-19-thread-3) [    ] o.a.s.c.SolrResourceLoader JNDI not configured for solr (NoInitialContextEx)
   [junit4]   2> 16780 INFO  (jetty-launcher-19-thread-1) [    ] o.a.s.c.SolrResourceLoader solr home defaulted to 'solr/' (could not find system property or JNDI)
   [junit4]   2> 16780 INFO  (jetty-launcher-19-thread-3) [    ] o.a.s.c.SolrResourceLoader solr home defaulted to 'solr/' (could not find system property or JNDI)
   [junit4]   2> 16781 INFO  (jetty-launcher-19-thread-2) [    ] o.a.s.c.SolrResourceLoader JNDI not configured for solr (NoInitialContextEx)
   [junit4]   2> 16781 INFO  (jetty-launcher-19-thread-2) [    ] o.a.s.c.SolrResourceLoader solr home defaulted to 'solr/' (could not find system property or JNDI)
   [junit4]   2> 16781 INFO  (jetty-launcher-19-thread-3) [    ] o.a.s.c.c.SolrZkClient Using default ZkCredentialsProvider
   [junit4]   2> 16781 INFO  (jetty-launcher-19-thread-1) [    ] o.a.s.c.c.SolrZkClient Using default ZkCredentialsProvider
   [junit4]   2> 16781 INFO  (jetty-launcher-19-thread-2) [    ] o.a.s.c.c.SolrZkClient Using default ZkCredentialsProvider
   [junit4]   2> 16781 INFO  (jetty-launcher-19-thread-1) [    ] o.a.s.c.c.ConnectionManager Waiting for client to connect to ZooKeeper
   [junit4]   2> 16781 INFO  (jetty-launcher-19-thread-3) [    ] o.a.s.c.c.ConnectionManager Waiting for client to connect to ZooKeeper
   [junit4]   2> 16782 INFO  (jetty-launcher-19-thread-2) [    ] o.a.s.c.c.ConnectionManager Waiting for client to connect to ZooKeeper
   [junit4]   2> 16783 INFO  (zkCallback-22-thread-1) [    ] o.a.s.c.c.ConnectionManager Watcher org.apache.solr.common.cloud.ConnectionManager@1b53fa7f name:ZooKeeperConnection Watcher:127.0.0.1:43191/solr got event WatchedEvent state:SyncConnected type:None path:null path:null type:None
   [junit4]   2> 16783 INFO  (jetty-launcher-19-thread-1) [    ] o.a.s.c.c.ConnectionManager Client is connected to ZooKeeper
   [junit4]   2> 16784 INFO  (jetty-launcher-19-thread-1) [    ] o.a.s.c.c.SolrZkClient Using default ZkACLProvider
   [junit4]   2> 16784 INFO  (zkCallback-21-thread-1) [    ] o.a.s.c.c.ConnectionManager Watcher org.apache.solr.common.cloud.ConnectionManager@64715fa2 name:ZooKeeperConnection Watcher:127.0.0.1:43191/solr got event WatchedEvent state:SyncConnected type:None path:null path:null type:None
   [junit4]   2> 16784 INFO  (jetty-launcher-19-thread-3) [    ] o.a.s.c.c.ConnectionManager Client is connected to ZooKeeper
   [junit4]   2> 16784 INFO  (zkCallback-23-thread-1) [    ] o.a.s.c.c.ConnectionManager Watcher org.apache.solr.common.cloud.ConnectionManager@338961e1 name:ZooKeeperConnection Watcher:127.0.0.1:43191/solr got event WatchedEvent state:SyncConnected type:None path:null path:null type:None
   [junit4]   2> 16784 INFO  (jetty-launcher-19-thread-3) [    ] o.a.s.c.c.SolrZkClient Using default ZkACLProvider
   [junit4]   2> 16784 INFO  (jetty-launcher-19-thread-2) [    ] o.a.s.c.c.ConnectionManager Client is connected to ZooKeeper
   [junit4]   2> 16785 INFO  (jetty-launcher-19-thread-1) [    ] o.a.s.s.SolrDispatchFilter solr.xml found in ZooKeeper. Loading...
   [junit4]   2> 16785 INFO  (jetty-launcher-19-thread-2) [    ] o.a.s.c.c.SolrZkClient Using default ZkACLProvider
   [junit4]   2> 16785 INFO  (jetty-launcher-19-thread-3) [    ] o.a.s.s.SolrDispatchFilter solr.xml found in ZooKeeper. Loading...
   [junit4]   2> 16785 INFO  (jetty-launcher-19-thread-2) [    ] o.a.s.s.SolrDispatchFilter solr.xml found in ZooKeeper. Loading...
   [junit4]   2> 16799 WARN  (NIOServerCxn.Factory:0.0.0.0/0.0.0.0:0) [    ] o.a.z.s.NIOServerCnxn caught end of stream exception
   [junit4]   2> EndOfStreamException: Unable to read additional data from client sessionid 0x15714dc31ce0001, likely client has closed socket
   [junit4]   2> 	at org.apache.zookeeper.server.NIOServerCnxn.doIO(NIOServerCnxn.java:228)
   [junit4]   2> 	at org.apache.zookeeper.server.NIOServerCnxnFactory.run(NIOServerCnxnFactory.java:208)
   [junit4]   2> 	at java.lang.Thread.run(Thread.java:745)
   [junit4]   2> 16800 INFO  (jetty-launcher-19-thread-3) [    ] o.a.s.c.CorePropertiesLocator Config-defined core root directory: /home/jenkins/workspace/Lucene-Solr-6.x-Linux/solr/build/solr-core/test/J2/temp/solr.security.BasicAuthIntegrationTest_9EFE537BC715F3D1-001/tempDir-001/node3/.
   [junit4]   2> 16800 INFO  (jetty-launcher-19-thread-1) [    ] o.a.s.c.CorePropertiesLocator Config-defined core root directory: /home/jenkins/workspace/Lucene-Solr-6.x-Linux/solr/build/solr-core/test/J2/temp/solr.security.BasicAuthIntegrationTest_9EFE537BC715F3D1-001/tempDir-001/node1/.
   [junit4]   2> 16801 INFO  (jetty-launcher-19-thread-3) [    ] o.a.s.c.CoreContainer New CoreContainer 1814599434
   [junit4]   2> 16801 INFO  (jetty-launcher-19-thread-2) [    ] o.a.s.c.CorePropertiesLocator Config-defined core root directory: /home/jenkins/workspace/Lucene-Solr-6.x-Linux/solr/build/solr-core/test/J2/temp/solr.security.BasicAuthIntegrationTest_9EFE537BC715F3D1-001/tempDir-001/node2/.
   [junit4]   2> 16801 INFO  (jetty-launcher-19-thread-1) [    ] o.a.s.c.CoreContainer New CoreContainer 1645219035
   [junit4]   2> 16801 INFO  (jetty-launcher-19-thread-3) [    ] o.a.s.c.CoreContainer Loading cores into CoreContainer [instanceDir=/home/jenkins/workspace/Lucene-Solr-6.x-Linux/solr/build/solr-core/test/J2/temp/solr.security.BasicAuthIntegrationTest_9EFE537BC715F3D1-001/tempDir-001/node3]
   [junit4]   2> 16801 INFO  (jetty-launcher-19-thread-1) [    ] o.a.s.c.CoreContainer Loading cores into CoreContainer [instanceDir=/home/jenkins/workspace/Lucene-Solr-6.x-Linux/solr/build/solr-core/test/J2/temp/solr.security.BasicAuthIntegrationTest_9EFE537BC715F3D1-001/tempDir-001/node1]
   [junit4]   2> 16801 INFO  (jetty-launcher-19-thread-2) [    ] o.a.s.c.CoreContainer New CoreContainer 1415581607
   [junit4]   2> 16801 INFO  (jetty-launcher-19-thread-2) [    ] o.a.s.c.CoreContainer Loading cores into CoreContainer [instanceDir=/home/jenkins/workspace/Lucene-Solr-6.x-Linux/solr/build/solr-core/test/J2/temp/solr.security.BasicAuthIntegrationTest_9EFE537BC715F3D1-001/tempDir-001/node2]
   [junit4]   2> 16801 WARN  (jetty-launcher-19-thread-3) [    ] o.a.s.c.CoreContainer Couldn't add files from /home/jenkins/workspace/Lucene-Solr-6.x-Linux/solr/build/solr-core/test/J2/temp/solr.security.BasicAuthIntegrationTest_9EFE537BC715F3D1-001/tempDir-001/node3/lib to classpath: /home/jenkins/workspace/Lucene-Solr-6.x-Linux/solr/build/solr-core/test/J2/temp/solr.security.BasicAuthIntegrationTest_9EFE537BC715F3D1-001/tempDir-001/node3/lib
   [junit4]   2> 16801 WARN  (jetty-launcher-19-thread-1) [    ] o.a.s.c.CoreContainer Couldn't add files from /home/jenkins/workspace/Lucene-Solr-6.x-Linux/solr/build/solr-core/test/J2/temp/solr.security.BasicAuthIntegrationTest_9EFE537BC715F3D1-001/tempDir-001/node1/lib to classpath: /home/jenkins/workspace/Lucene-Solr-6.x-Linux/solr/build/solr-core/test/J2/temp/solr.security.BasicAuthIntegrationTest_9EFE537BC715F3D1-001/tempDir-001/node1/lib
   [junit4]   2> 16801 WARN  (jetty-launcher-19-thread-2) [    ] o.a.s.c.CoreContainer Couldn't add files from /home/jenkins/workspace/Lucene-Solr-6.x-Linux/solr/build/solr-core/test/J2/temp/solr.security.BasicAuthIntegrationTest_9EFE537BC715F3D1-001/tempDir-001/node2/lib to classpath: /home/jenkins/workspace/Lucene-Solr-6.x-Linux/solr/build/solr-core/test/J2/temp/solr.security.BasicAuthIntegrationTest_9EFE537BC715F3D1-001/tempDir-001/node2/lib
   [junit4]   2> 16809 INFO  (jetty-launcher-19-thread-3) [    ] o.a.s.h.c.HttpShardHandlerFactory created with socketTimeout : 90000,urlScheme : https,connTimeout : 15000,maxConnectionsPerHost : 20,maxConnections : 10000,corePoolSize : 0,maximumPoolSize : 2147483647,maxThreadIdleTime : 5,sizeOfQueue : -1,fairnessPolicy : false,useRetries : false,connectionsEvictorSleepDelay : 5000,maxConnectionIdleTime : 40000,
   [junit4]   2> 16809 INFO  (jetty-launcher-19-thread-1) [    ] o.a.s.h.c.HttpShardHandlerFactory created with socketTimeout : 90000,urlScheme : https,connTimeout : 15000,maxConnectionsPerHost : 20,maxConnections : 10000,corePoolSize : 0,maximumPoolSize : 2147483647,maxThreadIdleTime : 5,sizeOfQueue : -1,fairnessPolicy : false,useRetries : false,connectionsEvictorSleepDelay : 5000,maxConnectionIdleTime : 40000,
   [junit4]   2> 16810 INFO  (jetty-launcher-19-thread-2) [    ] o.a.s.h.c.HttpShardHandlerFactory created with socketTimeout : 90000,urlScheme : https,connTimeout : 15000,maxConnectionsPerHost : 20,maxConnections : 10000,corePoolSize : 0,maximumPoolSize : 2147483647,maxThreadIdleTime : 5,sizeOfQueue : -1,fairnessPolicy : false,useRetries : false,connectionsEvictorSleepDelay : 5000,maxConnectionIdleTime : 40000,
   [junit4]   2> 16810 INFO  (jetty-launcher-19-thread-1) [    ] o.a.s.u.UpdateShardHandler Creating UpdateShardHandler HTTP client with params: socketTimeout=340000&connTimeout=45000&retry=true
   [junit4]   2> 16810 INFO  (jetty-launcher-19-thread-3) [    ] o.a.s.u.UpdateShardHandler Creating UpdateShardHandler HTTP client with params: socketTimeout=340000&connTimeout=45000&retry=true
   [junit4]   2> 16810 INFO  (jetty-launcher-19-thread-2) [    ] o.a.s.u.UpdateShardHandler Creating UpdateShardHandler HTTP client with params: socketTimeout=340000&connTimeout=45000&retry=true
   [junit4]   2> 16811 INFO  (jetty-launcher-19-thread-3) [    ] o.a.s.l.LogWatcher SLF4J impl is org.slf4j.impl.Log4jLoggerFactory
   [junit4]   2> 16811 INFO  (jetty-launcher-19-thread-3) [    ] o.a.s.l.LogWatcher Registering Log Listener [Log4j (org.slf4j.impl.Log4jLoggerFactory)]
   [junit4]   2> 16811 INFO  (jetty-launcher-19-thread-2) [    ] o.a.s.l.LogWatcher SLF4J impl is org.slf4j.impl.Log4jLoggerFactory
   [junit4]   2> 16811 INFO  (jetty-launcher-19-thread-3) [    ] o.a.s.c.ZkContainer Zookeeper client=127.0.0.1:43191/solr
   [junit4]   2> 16811 INFO  (jetty-launcher-19-thread-1) [    ] o.a.s.l.LogWatcher SLF4J impl is org.slf4j.impl.Log4jLoggerFactory
   [junit4]   2> 16811 INFO  (jetty-launcher-19-thread-2) [    ] o.a.s.l.LogWatcher Registering Log Listener [Log4j (org.slf4j.impl.Log4jLoggerFactory)]
   [junit4]   2> 16811 INFO  (jetty-launcher-19-thread-1) [    ] o.a.s.l.LogWatcher Registering Log Listener [Log4j (org.slf4j.impl.Log4jLoggerFactory)]
   [junit4]   2> 16811 INFO  (jetty-launcher-19-thread-1) [    ] o.a.s.c.ZkContainer Zookeeper client=127.0.0.1:43191/solr
   [junit4]   2> 16811 INFO  (jetty-launcher-19-thread-2) [    ] o.a.s.c.ZkContainer Zookeeper client=127.0.0.1:43191/solr
   [junit4]   2> 16822 INFO  (jetty-launcher-19-thread-3) [    ] o.a.s.c.ZkController zkHost includes chroot
   [junit4]   2> 16822 INFO  (jetty-launcher-19-thread-1) [    ] o.a.s.c.ZkController zkHost includes chroot
   [junit4]   2> 16822 INFO  (jetty-launcher-19-thread-2) [    ] o.a.s.c.ZkController zkHost includes chroot
   [junit4]   2> 16822 INFO  (jetty-launcher-19-thread-3) [    ] o.a.s.c.c.SolrZkClient Using default ZkCredentialsProvider
   [junit4]   2> 16822 INFO  (jetty-launcher-19-thread-2) [    ] o.a.s.c.c.SolrZkClient Using default ZkCredentialsProvider
   [junit4]   2> 16822 INFO  (jetty-launcher-19-thread-1) [    ] o.a.s.c.c.SolrZkClient Using default ZkCredentialsProvider
   [junit4]   2> 16823 INFO  (jetty-launcher-19-thread-3) [    ] o.a.s.c.c.ConnectionManager Waiting for client to connect to ZooKeeper
   [junit4]   2> 16825 INFO  (jetty-launcher-19-thread-1) [    ] o.a.s.c.c.ConnectionManager Waiting for client to connect to ZooKeeper
   [junit4]   2> 16825 INFO  (jetty-launcher-19-thread-2) [    ] o.a.s.c.c.ConnectionManager Waiting for client to connect to ZooKeeper
   [junit4]   2> 16827 INFO  (zkCallback-32-thread-1) [    ] o.a.s.c.c.ConnectionManager Watcher org.apache.solr.common.cloud.ConnectionManager@491b3fc0 name:ZooKeeperConnection Watcher:127.0.0.1:43191 got event WatchedEvent state:SyncConnected type:None path:null path:null type:None
   [junit4]   2> 16827 INFO  (jetty-launcher-19-thread-2) [    ] o.a.s.c.c.ConnectionManager Client is connected to ZooKeeper
   [junit4]   2> 16827 INFO  (jetty-launcher-19-thread-2) [    ] o.a.s.c.c.SolrZkClient Using default ZkACLProvider
   [junit4]   2> 16828 INFO  (zkCallback-31-thread-1) [    ] o.a.s.c.c.ConnectionManager Watcher org.apache.solr.common.cloud.ConnectionManager@1db63cc4 name:ZooKeeperConnection Watcher:127.0.0.1:43191 got event WatchedEvent state:SyncConnected type:None path:null path:null type:None
   [junit4]   2> 16828 INFO  (jetty-launcher-19-thread-1) [    ] o.a.s.c.c.ConnectionManager Client is connected to ZooKeeper
   [junit4]   2> 16828 INFO  (jetty-launcher-19-thread-1) [    ] o.a.s.c.c.SolrZkClient Using default ZkACLProvider
   [junit4]   2> 16830 INFO  (zkCallback-30-thread-1) [    ] o.a.s.c.c.ConnectionManager Watcher org.apache.solr.common.cloud.ConnectionManager@3bd45a11 name:ZooKeeperConnection Watcher:127.0.0.1:43191 got event WatchedEvent state:SyncConnected type:None path:null path:null type:None
   [junit4]   2> 16830 INFO  (jetty-launcher-19-thread-3) [    ] o.a.s.c.c.ConnectionManager Client is connected to ZooKeeper
   [junit4]   2> 16831 INFO  (jetty-launcher-19-thread-3) [    ] o.a.s.c.c.SolrZkClient Using default ZkACLProvider
   [junit4]   2> 16845 WARN  (NIOServerCxn.Factory:0.0.0.0/0.0.0.0:0) [    ] o.a.z.s.NIOServerCnxn caught end of stream exception
   [junit4]   2> EndOfStreamException: Unable to read additional data from client sessionid 0x15714dc31ce0005, likely client has closed socket
   [junit4]   2> 	at org.apache.zookeeper.server.NIOServerCnxn.doIO(NIOServerCnxn.java:228)
   [junit4]   2> 	at org.apache.zookeeper.server.NIOServerCnxnFactory.run(NIOServerCnxnFactory.java:208)
   [junit4]   2> 	at java.lang.Thread.run(Thread.java:745)
   [junit4]   2> 16846 WARN  (NIOServerCxn.Factory:0.0.0.0/0.0.0.0:0) [    ] o.a.z.s.NIOServerCnxn caught end of stream exception
   [junit4]   2> EndOfStreamException: Unable to read additional data from client sessionid 0x15714dc31ce0004, likely client has closed socket
   [junit4]   2> 	at org.apache.zookeeper.server.NIOServerCnxn.doIO(NIOServerCnxn.java:228)
   [junit4]   2> 	at org.apache.zookeeper.server.NIOServerCnxnFactory.run(NIOServerCnxnFactory.java:208)
   [junit4]   2> 	at java.lang.Thread.run(Thread.java:745)
   [junit4]   2> 16849 INFO  (jetty-launcher-19-thread-2) [n:127.0.0.1:45291_solr    ] o.a.s.c.ZkController Added new OnReconnect listener org.apache.solr.cloud.ZkController$$Lambda$78/1358662352@50ea68e3
   [junit4]   2> 16849 INFO  (jetty-launcher-19-thread-1) [n:127.0.0.1:37565_solr    ] o.a.s.c.ZkController Added new OnReconnect listener org.apache.solr.cloud.ZkController$$Lambda$78/1358662352@3e5e7144
   [junit4]   2> 16849 INFO  (jetty-launcher-19-thread-3) [n:127.0.0.1:41255_solr    ] o.a.s.c.ZkController Added new OnReconnect listener org.apache.solr.cloud.ZkController$$Lambda$78/1358662352@15dfe98e
   [junit4]   2> 16851 INFO  (jetty-launcher-19-thread-2) [n:127.0.0.1:45291_solr    ] o.a.s.c.c.ConnectionManager Waiting for client to connect to ZooKeeper
   [junit4]   2> 16851 INFO  (jetty-launcher-19-thread-1) [n:127.0.0.1:37565_solr    ] o.a.s.c.c.ConnectionManager Waiting for client to connect to ZooKeeper
   [junit4]   2> 16876 INFO  (jetty-launcher-19-thread-3) [n:127.0.0.1:41255_solr    ] o.a.s.c.c.ConnectionManager Waiting for client to connect to ZooKeeper
   [junit4]   2> 17174 INFO  (zkCallback-35-thread-1-processing-n:127.0.0.1:37565_solr) [n:127.0.0.1:37565_solr    ] o.a.s.c.c.ConnectionManager Watcher org.apache.solr.common.cloud.ConnectionManager@5909fd2b name:ZooKeeperConnection Watcher:127.0.0.1:43191/solr got event WatchedEvent state:SyncConnected type:None path:null path:null type:None
   [junit4]   2> 17174 INFO  (jetty-launcher-19-thread-1) [n:127.0.0.1:37565_solr    ] o.a.s.c.c.ConnectionManager Client is connected to ZooKeeper
   [junit4]   2> 17178 INFO  (zkCallback-34-thread-1-processing-n:127.0.0.1:45291_solr) [n:127.0.0.1:45291_solr    ] o.a.s.c.c.ConnectionManager Watcher org.apache.solr.common.cloud.ConnectionManager@6ffb9b95 name:ZooKeeperConnection Watcher:127.0.0.1:43191/solr got event WatchedEvent state:SyncConnected type:None path:null path:null type:None
   [junit4]   2> 17178 INFO  (jetty-launcher-19-thread-2) [n:127.0.0.1:45291_solr    ] o.a.s.c.c.ConnectionManager Client is connected to ZooKeeper
   [junit4]   2> 17179 INFO  (zkCallback-33-thread-1-processing-n:127.0.0.1:41255_solr) [n:127.0.0.1:41255_solr    ] o.a.s.c.c.ConnectionManager Watcher org.apache.solr.common.cloud.ConnectionManager@6c416721 name:ZooKeeperConnection Watcher:127.0.0.1:43191/solr got event WatchedEvent state:SyncConnected type:None path:null path:null type:None
   [junit4]   2> 17179 INFO  (jetty-launcher-19-thread-3) [n:127.0.0.1:41255_solr    ] o.a.s.c.c.ConnectionManager Client is connected to ZooKeeper
   [junit4]   2> 17182 INFO  (jetty-launcher-19-thread-1) [n:127.0.0.1:37565_solr    ] o.a.s.c.c.SolrZkClient makePath: /overseer/queue
   [junit4]   2> 17182 INFO  (jetty-launcher-19-thread-2) [n:127.0.0.1:45291_solr    ] o.a.s.c.c.SolrZkClient makePath: /overseer/queue
   [junit4]   2> 17182 INFO  (jetty-launcher-19-thread-3) [n:127.0.0.1:41255_solr    ] o.a.s.c.c.SolrZkClient makePath: /overseer/queue
   [junit4]   2> 17187 INFO  (jetty-launcher-19-thread-3) [n:127.0.0.1:41255_solr    ] o.a.s.c.c.SolrZkClient makePath: /overseer/collection-queue-work
   [junit4]   2> 17187 INFO  (jetty-launcher-19-thread-1) [n:127.0.0.1:37565_solr    ] o.a.s.c.c.SolrZkClient makePath: /overseer/collection-queue-work
   [junit4]   2> 17187 INFO  (jetty-launcher-19-thread-2) [n:127.0.0.1:45291_solr    ] o.a.s.c.c.SolrZkClient makePath: /overseer/collection-queue-work
   [junit4]   2> 17191 INFO  (jetty-launcher-19-thread-2) [n:127.0.0.1:45291_solr    ] o.a.s.c.c.SolrZkClient makePath: /overseer/collection-map-running
   [junit4]   2> 17191 INFO  (jetty-launcher-19-thread-3) [n:127.0.0.1:41255_solr    ] o.a.s.c.c.SolrZkClient makePath: /overseer/collection-map-running
   [junit4]   2> 17191 INFO  (jetty-launcher-19-thread-1) [n:127.0.0.1:37565_solr    ] o.a.s.c.c.SolrZkClient makePath: /overseer/collection-map-running
   [junit4]   2> 17194 INFO  (jetty-launcher-19-thread-2) [n:127.0.0.1:45291_solr    ] o.a.s.c.c.SolrZkClient makePath: /overseer/collection-map-completed
   [junit4]   2> 17194 INFO  (jetty-launcher-19-thread-3) [n:127.0.0.1:41255_solr    ] o.a.s.c.c.SolrZkClient makePath: /overseer/collection-map-completed
   [junit4]   2> 17194 INFO  (jetty-launcher-19-thread-1) [n:127.0.0.1:37565_solr    ] o.a.s.c.c.SolrZkClient makePath: /overseer/collection-map-completed
   [junit4]   2> 17196 INFO  (jetty-launcher-19-thread-1) [n:127.0.0.1:37565_solr    ] o.a.s.c.c.SolrZkClient makePath: /overseer/collection-map-failure
   [junit4]   2> 17196 INFO  (jetty-launcher-19-thread-3) [n:127.0.0.1:41255_solr    ] o.a.s.c.c.SolrZkClient makePath: /overseer/collection-map-failure
   [junit4]   2> 17196 INFO  (jetty-launcher-19-thread-2) [n:127.0.0.1:45291_solr    ] o.a.s.c.c.SolrZkClient makePath: /overseer/collection-map-failure
   [junit4]   2> 17203 INFO  (jetty-launcher-19-thread-1) [n:127.0.0.1:37565_solr    ] o.a.s.c.c.SolrZkClient makePath: /live_nodes
   [junit4]   2> 17204 INFO  (jetty-launcher-19-thread-2) [n:127.0.0.1:45291_solr    ] o.a.s.c.c.SolrZkClient makePath: /live_nodes
   [junit4]   2> 17204 INFO  (jetty-launcher-19-thread-3) [n:127.0.0.1:41255_solr    ] o.a.s.c.c.SolrZkClient makePath: /live_nodes
   [junit4]   2> 17205 INFO  (jetty-launcher-19-thread-3) [n:127.0.0.1:41255_solr    ] o.a.s.c.c.SolrZkClient makePath: /collections
   [junit4]   2> 17205 INFO  (jetty-launcher-19-thread-2) [n:127.0.0.1:45291_solr    ] o.a.s.c.c.SolrZkClient makePath: /collections
   [junit4]   2> 17205 INFO  (jetty-launcher-19-thread-1) [n:127.0.0.1:37565_solr    ] o.a.s.c.c.SolrZkClient makePath: /collections
   [junit4]   2> 17206 INFO  (jetty-launcher-19-thread-2) [n:127.0.0.1:45291_solr    ] o.a.s.c.c.SolrZkClient makePath: /aliases.json
   [junit4]   2> 17206 INFO  (jetty-launcher-19-thread-1) [n:127.0.0.1:37565_solr    ] o.a.s.c.c.SolrZkClient makePath: /aliases.json
   [junit4]   2> 17206 INFO  (jetty-launcher-19-thread-3) [n:127.0.0.1:41255_solr    ] o.a.s.c.c.SolrZkClient makePath: /aliases.json
   [junit4]   2> 17207 INFO  (jetty-launcher-19-thread-1) [n:127.0.0.1:37565_solr    ] o.a.s.c.c.SolrZkClient makePath: /clusterstate.json
   [junit4]   2> 17207 INFO  (jetty-launcher-19-thread-3) [n:127.0.0.1:41255_solr    ] o.a.s.c.c.SolrZkClient makePath: /clusterstate.json
   [junit4]   2> 17207 INFO  (jetty-launcher-19-thread-2) [n:127.0.0.1:45291_solr    ] o.a.s.c.c.SolrZkClient makePath: /clusterstate.json
   [junit4]   2> 17209 INFO  (jetty-launcher-19-thread-3) [n:127.0.0.1:41255_solr    ] o.a.s.c.c.SolrZkClient makePath: /security.json
   [junit4]   2> 17209 INFO  (jetty-launcher-19-thread-1) [n:127.0.0.1:37565_solr    ] o.a.s.c.c.SolrZkClient makePath: /security.json
   [junit4]   2> 17209 INFO  (jetty-launcher-19-thread-2) [n:127.0.0.1:45291_solr    ] o.a.s.c.c.SolrZkClient makePath: /security.json
   [junit4]   2> 17210 INFO  (jetty-launcher-19-thread-1) [n:127.0.0.1:37565_solr    ] o.a.s.c.c.ZkStateReader Updating cluster state from ZooKeeper... 
   [junit4]   2> 17210 INFO  (jetty-launcher-19-thread-3) [n:127.0.0.1:41255_solr    ] o.a.s.c.c.ZkStateReader Updating cluster state from ZooKeeper... 
   [junit4]   2> 17211 INFO  (jetty-launcher-19-thread-2) [n:127.0.0.1:45291_solr    ] o.a.s.c.c.ZkStateReader Updating cluster state from ZooKeeper... 
   [junit4]   2> 17211 INFO  (jetty-launcher-19-thread-3) [n:127.0.0.1:41255_solr    ] o.a.s.c.c.ZkStateReader Loaded cluster properties: {urlScheme=https}
   [junit4]   2> 17211 INFO  (jetty-launcher-19-thread-2) [n:127.0.0.1:45291_solr    ] o.a.s.c.c.ZkStateReader Loaded cluster properties: {urlScheme=https}
   [junit4]   2> 17211 INFO  (jetty-launcher-19-thread-1) [n:127.0.0.1:37565_solr    ] o.a.s.c.c.ZkStateReader Loaded cluster properties: {urlScheme=https}
   [junit4]   2> 17215 INFO  (jetty-launcher-19-thread-2) [n:127.0.0.1:45291_solr    ] o.a.s.c.c.ZkStateReader Updated live nodes from ZooKeeper... (0) -> (0)
   [junit4]   2> 17215 INFO  (jetty-launcher-19-thread-1) [n:127.0.0.1:37565_solr    ] o.a.s.c.c.ZkStateReader Updated live nodes from ZooKeeper... (0) -> (0)
   [junit4]   2> 17215 INFO  (jetty-launcher-19-thread-3) [n:127.0.0.1:41255_solr    ] o.a.s.c.c.ZkStateReader Updated live nodes from ZooKeeper... (0) -> (0)
   [junit4]   2> 17226 INFO  (jetty-launcher-19-thread-1) [n:127.0.0.1:37565_solr    ] o.a.s.c.c.SolrZkClient makePath: /overseer_elect
   [junit4]   2> 17226 INFO  (jetty-launcher-19-thread-2) [n:127.0.0.1:45291_solr    ] o.a.s.c.c.SolrZkClient makePath: /overseer_elect
   [junit4]   2> 17226 INFO  (jetty-launcher-19-thread-3) [n:127.0.0.1:41255_solr    ] o.a.s.c.c.SolrZkClient makePath: /overseer_elect
   [junit4]   2> 17227 INFO  (jetty-launcher-19-thread-3) [n:127.0.0.1:41255_solr    ] o.a.s.c.c.SolrZkClient makePath: /overseer_elect/election
   [junit4]   2> 17227 INFO  (jetty-launcher-19-thread-1) [n:127.0.0.1:37565_solr    ] o.a.s.c.c.SolrZkClient makePath: /overseer_elect/election
   [junit4]   2> 17228 INFO  (jetty-launcher-19-thread-1) [n:127.0.0.1:37565_solr    ] o.a.s.c.Overseer Overseer (id=null) closing
   [junit4]   2> 17228 INFO  (jetty-launcher-19-thread-3) [n:127.0.0.1:41255_solr    ] o.a.s.c.Overseer Overseer (id=null) closing
   [junit4]   2> 17229 INFO  (jetty-launcher-19-thread-1) [n:127.0.0.1:37565_solr    ] o.a.s.c.LeaderElector Joined leadership election with path: /overseer_elect/election/96568852972699655-127.0.0.1:37565_solr-n_0000000000
   [junit4]   2> 17229 INFO  (jetty-launcher-19-thread-3) [n:127.0.0.1:41255_solr    ] o.a.s.c.LeaderElector Joined leadership election with path: /overseer_elect/election/96568852972699657-127.0.0.1:41255_solr-n_0000000001
   [junit4]   2> 17230 INFO  (jetty-launcher-19-thread-1) [n:127.0.0.1:37565_solr    ] o.a.s.c.OverseerElectionContext I am going to be the leader 127.0.0.1:37565_solr
   [junit4]   2> 17231 INFO  (jetty-launcher-19-thread-2) [n:127.0.0.1:45291_solr    ] o.a.s.c.Overseer Overseer (id=null) closing
   [junit4]   2> 17232 INFO  (jetty-launcher-19-thread-2) [n:127.0.0.1:45291_solr    ] o.a.s.c.LeaderElector Joined leadership election with path: /overseer_elect/election/96568852972699656-127.0.0.1:45291_solr-n_0000000002
   [junit4]   2> 17232 INFO  (jetty-launcher-19-thread-3) [n:127.0.0.1:41255_solr    ] o.a.s.c.LeaderElector Watching path /overseer_elect/election/96568852972699655-127.0.0.1:37565_solr-n_0000000000 to know if I could be the leader
   [junit4]   2> 17233 INFO  (jetty-launcher-19-thread-1) [n:127.0.0.1:37565_solr    ] o.a.s.c.c.SolrZkClient makePath: /overseer_elect/leader
   [junit4]   2> 17233 INFO  (jetty-launcher-19-thread-3) [n:127.0.0.1:41255_solr    ] o.a.s.c.ZkController Register node as live in ZooKeeper:/live_nodes/127.0.0.1:41255_solr
   [junit4]   2> 17233 INFO  (jetty-launcher-19-thread-3) [n:127.0.0.1:41255_solr    ] o.a.s.c.c.SolrZkClient makePath: /live_nodes/127.0.0.1:41255_solr
   [junit4]   2> 17233 INFO  (jetty-launcher-19-thread-2) [n:127.0.0.1:45291_solr    ] o.a.s.c.LeaderElector Watching path /overseer_elect/election/96568852972699657-127.0.0.1:41255_solr-n_0000000001 to know if I could be the leader
   [junit4]   2> 17234 INFO  (jetty-launcher-19-thread-2) [n:127.0.0.1:45291_solr    ] o.a.s.c.ZkController Register node as live in ZooKeeper:/live_nodes/127.0.0.1:45291_solr
   [junit4]   2> 17234 INFO  (jetty-launcher-19-thread-2) [n:127.0.0.1:45291_solr    ] o.a.s.c.c.SolrZkClient makePath: /live_nodes/127.0.0.1:45291_solr
   [junit4]   2> 17236 INFO  (zkCallback-34-thread-1-processing-n:127.0.0.1:45291_solr) [n:127.0.0.1:45291_solr    ] o.a.s.c.c.ZkStateReader A live node change: [WatchedEvent state:SyncConnected type:NodeChildrenChanged path:/live_nodes], has occurred - updating... (live nodes size: [0])
   [junit4]   2> 17236 INFO  (zkCallback-33-thread-1-processing-n:127.0.0.1:41255_solr) [n:127.0.0.1:41255_solr    ] o.a.s.c.c.ZkStateReader A live node change: [WatchedEvent state:SyncConnected type:NodeChildrenChanged path:/live_nodes], has occurred - updating... (live nodes size: [0])
   [junit4]   2> 17236 INFO  (zkCallback-35-thread-1-processing-n:127.0.0.1:37565_solr) [n:127.0.0.1:37565_solr    ] o.a.s.c.c.ZkStateReader A live node change: [WatchedEvent state:SyncConnected type:NodeChildrenChanged path:/live_nodes], has occurred - updating... (live nodes size: [0])
   [junit4]   2> 17236 INFO  (jetty-launcher-19-thread-1) [n:127.0.0.1:37565_solr    ] o.a.s.c.Overseer Overseer (id=96568852972699655-127.0.0.1:37565_solr-n_0000000000) starting
   [junit4]   2> 17238 INFO  (zkCallback-35-thread-1-processing-n:127.0.0.1:37565_solr) [n:127.0.0.1:37565_solr    ] o.a.s.c.c.ZkStateReader Updated live nodes from ZooKeeper... (0) -> (1)
   [junit4]   2> 17239 INFO  (zkCallback-33-thread-1-processing-n:127.0.0.1:41255_solr) [n:127.0.0.1:41255_solr    ] o.a.s.c.c.ZkStateReader Updated live nodes from ZooKeeper... (0) -> (1)
   [junit4]   2> 17239 INFO  (zkCallback-34-thread-1-processing-n:127.0.0.1:45291_solr) [n:127.0.0.1:45291_solr    ] o.a.s.c.c.ZkStateReader Updated live nodes from ZooKeeper... (0) -> (1)
   [junit4]   2> 17239 INFO  (zkCallback-33-thread-1-processing-n:127.0.0.1:41255_solr) [n:127.0.0.1:41255_solr    ] o.a.s.c.c.ZkStateReader A live node change: [WatchedEvent state:SyncConnected type:NodeChildrenChanged path:/live_nodes], has occurred - updating... (live nodes size: [1])
   [junit4]   2> 17239 INFO  (zkCallback-35-thread-1-processing-n:127.0.0.1:37565_solr) [n:127.0.0.1:37565_solr    ] o.a.s.c.c.ZkStateReader A live node change: [WatchedEvent state:SyncConnected type:NodeChildrenChanged path:/live_nodes], has occurred - updating... (live nodes size: [1])
   [junit4]   2> 17239 INFO  (zkCallback-34-thread-1-processing-n:127.0.0.1:45291_solr) [n:127.0.0.1:45291_solr    ] o.a.s.c.c.ZkStateReader A live node change: [WatchedEvent state:SyncConnected type:NodeChildrenChanged path:/live_nodes], has occurred - updating... (live nodes size: [1])
   [junit4]   2> 17240 INFO  (zkCallback-33-thread-1-processing-n:127.0.0.1:41255_solr) [n:127.0.0.1:41255_solr    ] o.a.s.c.c.ZkStateReader Updated live nodes from ZooKeeper... (1) -> (2)
   [junit4]   2> 17240 INFO  (zkCallback-35-thread-1-processing-n:127.0.0.1:37565_solr) [n:127.0.0.1:37565_solr    ] o.a.s.c.c.ZkStateReader Updated live nodes from ZooKeeper... (1) -> (2)
   [junit4]   2> 17240 INFO  (zkCallback-34-thread-1-processing-n:127.0.0.1:45291_solr) [n:127.0.0.1:45291_solr    ] o.a.s.c.c.ZkStateReader Updated live nodes from ZooKeeper... (1) -> (2)
   [junit4]   2> 17243 INFO  (jetty-launcher-19-thread-1) [n:127.0.0.1:37565_solr    ] o.a.s.c.c.SolrZkClient makePath: /overseer/queue-work
   [junit4]   2> 17293 INFO  (jetty-launcher-19-thread-3) [n:127.0.0.1:41255_solr    ] o.a.s.c.CoreContainer Security conf doesn't exist. Skipping setup for authorization module.
   [junit4]   2> 17293 INFO  (jetty-launcher-19-thread-3) [n:127.0.0.1:41255_solr    ] o.a.s.c.CoreContainer No authentication plugin used.
   [junit4]   2> 17295 INFO  (jetty-launcher-19-thread-3) [n:127.0.0.1:41255_solr    ] o.a.s.c.CorePropertiesLocator Looking for core definitions underneath /home/jenkins/workspace/Lucene-Solr-6.x-Linux/solr/build/solr-core/test/J2/temp/solr.security.BasicAuthIntegrationTest_9EFE537BC715F3D1-001/tempDir-001/node3/.
   [junit4]   2> 17296 INFO  (jetty-launcher-19-thread-3) [n:127.0.0.1:41255_solr    ] o.a.s.c.CorePropertiesLocator Found 0 core definitions
   [junit4]   2> 17303 INFO  (jetty-launcher-19-thread-3) [n:127.0.0.1:41255_solr    ] o.a.s.s.SolrDispatchFilter user.dir=/home/jenkins/workspace/Lucene-Solr-6.x-Linux/solr/build/solr-core/test/J2
   [junit4]   2> 17304 INFO  (jetty-launcher-19-thread-3) [n:127.0.0.1:41255_solr    ] o.a.s.s.SolrDispatchFilter SolrDispatchFilter.init() done
   [junit4]   2> 17304 INFO  (jetty-launcher-19-thread-2) [n:127.0.0.1:45291_solr    ] o.a.s.c.CoreContainer Security conf doesn't exist. Skipping setup for authorization module.
   [junit4]   2> 17304 INFO  (jetty-launcher-19-thread-2) [n:127.0.0.1:45291_solr    ] o.a.s.c.CoreContainer No authentication plugin used.
   [junit4]   2> 17305 INFO  (jetty-launcher-19-thread-2) [n:127.0.0.1:45291_solr    ] o.a.s.c.CorePropertiesLocator Looking for core definitions underneath /home/jenkins/workspace/Lucene-Solr-6.x-Linux/solr/build/solr-core/test/J2/temp/solr.security.BasicAuthIntegrationTest_9EFE537BC715F3D1-001/tempDir-001/node2/.
   [junit4]   2> 17322 INFO  (jetty-launcher-19-thread-1) [n:127.0.0.1:37565_solr    ] o.a.s.c.OverseerAutoReplicaFailoverThread Starting OverseerAutoReplicaFailoverThread autoReplicaFailoverWorkLoopDelay=10000 autoReplicaFailoverWaitAfterExpiration=30000 autoReplicaFailoverBadNodeExpiration=60000
   [junit4]   2> 17325 INFO  (OverseerCollectionConfigSetProcessor-96568852972699655-127.0.0.1:37565_solr-n_0000000000) [n:127.0.0.1:37565_solr    ] o.a.s.c.OverseerTaskProcessor Process current queue of overseer operations
   [junit4]   2> 17325 INFO  (jetty-launcher-19-thread-1) [n:127.0.0.1:37565_solr    ] o.a.s.c.ZkController Publish node=127.0.0.1:37565_solr as DOWN
   [junit4]   2> 17327 INFO  (OverseerStateUpdate-96568852972699655-127.0.0.1:37565_solr-n_0000000000) [n:127.0.0.1:37565_solr    ] o.a.s.c.Overseer Starting to work on the main queue
   [junit4]   2> 17352 INFO  (jetty-launcher-19-thread-2) [n:127.0.0.1:45291_solr    ] o.a.s.c.CorePropertiesLocator Found 0 core definitions
   [junit4]   2> 17353 INFO  (jetty-launcher-19-thread-2) [n:127.0.0.1:45291_solr    ] o.a.s.s.SolrDispatchFilter user.dir=/home/jenkins/workspace/Lucene-Solr-6.x-Linux/solr/build/solr-core/test/J2
   [junit4]   2> 17353 INFO  (jetty-launcher-19-thread-2) [n:127.0.0.1:45291_solr    ] o.a.s.s.SolrDispatchFilter SolrDispatchFilter.init() done
   [junit4]   2> 17353 INFO  (OverseerStateUpdate-96568852972699655-127.0.0.1:37565_solr-n_0000000000) [n:127.0.0.1:37565_solr    ] o.a.s.c.c.ZkStateReader Updated live nodes from ZooKeeper... (2) -> (2)
   [junit4]   2> 17353 INFO  (jetty-launcher-19-thread-1) [n:127.0.0.1:37565_solr    ] o.a.s.c.ZkController Register node as live in ZooKeeper:/live_nodes/127.0.0.1:37565_solr
   [junit4]   2> 17353 INFO  (jetty-launcher-19-thread-1) [n:127.0.0.1:37565_solr    ] o.a.s.c.c.SolrZkClient makePath: /live_nodes/127.0.0.1:37565_solr
   [junit4]   2> 17355 INFO  (zkCallback-34-thread-1-processing-n:127.0.0.1:45291_solr) [n:127.0.0.1:45291_solr    ] o.a.s.c.c.ZkStateReader A live node change: [WatchedEvent state:SyncConnected type:NodeChildrenChanged path:/live_nodes], has occurred - updating... (live nodes size: [2])
   [junit4]   2> 17355 INFO  (zkCallback-33-thread-1-processing-n:127.0.0.1:41255_solr) [n:127.0.0.1:41255_solr    ] o.a.s.c.c.ZkStateReader A live node change: [WatchedEvent state:SyncConnected type:NodeChildrenChanged path:/live_nodes], has occurred - updating... (live nodes size: [2])
   [junit4]   2> 17355 INFO  (zkCallback-35-thread-1-processing-n:127.0.0.1:37565_solr) [n:127.0.0.1:37565_solr    ] o.a.s.c.c.ZkStateReader A live node change: [WatchedEvent state:SyncConnected type:NodeChildrenChanged path:/live_nodes], has occurred - updating... (live nodes size: [2])
   [junit4]   2> 17355 INFO  (zkCallback-33-thread-1-processing-n:127.0.0.1:41255_solr) [n:127.0.0.1:41255_solr    ] o.a.s.c.c.ZkStateReader Updated live nodes from ZooKeeper... (2) -> (3)
   [junit4]   2> 17355 INFO  (zkCallback-35-thread-1-processing-n:127.0.0.1:37565_solr) [n:127.0.0.1:37565_solr    ] o.a.s.c.c.ZkStateReader Updated live nodes from ZooKeeper... (2) -> (3)
   [junit4]   2> 17356 INFO  (zkCallback-34-thread-1-processing-n:127.0.0.1:45291_solr) [n:127.0.0.1:45291_solr    ] o.a.s.c.c.ZkStateReader Updated live nodes from ZooKeeper... (2) -> (3)
   [junit4]   2> 17358 INFO  (OverseerStateUpdate-96568852972699655-127.0.0.1:37565_solr-n_0000000000) [n:127.0.0.1:37565_solr    ] o.a.s.c.Overseer processMessage: queueSize: 1, message = {
   [junit4]   2>   "operation":"downnode",
   [junit4]   2>   "node_name":"127.0.0.1:37565_solr"} current state version: 0
   [junit4]   2> 17361 INFO  (OverseerStateUpdate-96568852972699655-127.0.0.1:37565_solr-n_0000000000) [n:127.0.0.1:37565_solr    ] o.a.s.c.o.NodeMutator DownNode state invoked for node: 127.0.0.1:37565_solr
   [junit4]   2> 17369 INFO  (jetty-launcher-19-thread-1) [n:127.0.0.1:37565_solr    ] o.a.s.c.CoreContainer Security conf doesn't exist. Skipping setup for authorization module.
   [junit4]   2> 17369 INFO  (jetty-launcher-19-thread-1) [n:127.0.0.1:37565_solr    ] o.a.s.c.CoreContainer No authentication plugin used.
   [junit4]   2> 17370 INFO  (jetty-launcher-19-thread-1) [n:127.0.0.1:37565_solr    ] o.a.s.c.CorePropertiesLocator Looking for core definitions underneath /home/jenkins/workspace/Lucene-Solr-6.x-Linux/solr/build/solr-core/test/J2/temp/solr.security.BasicAuthIntegrationTest_9EFE537BC715F3D1-001/tempDir-001/node1/.
   [junit4]   2> 17370 INFO  (jetty-launcher-19-thread-1) [n:127.0.0.1:37565_solr    ] o.a.s.c.CorePropertiesLocator Found 0 core definitions
   [junit4]   2> 17370 INFO  (jetty-launcher-19-thread-1) [n:127.0.0.1:37565_solr    ] o.a.s.s.SolrDispatchFilter user.dir=/home/jenkins/workspace/Lucene-Solr-6.x-Linux/solr/build/solr-core/test/J2
   [junit4]   2> 17370 INFO  (jetty-launcher-19-thread-1) [n:127.0.0.1:37565_solr    ] o.a.s.s.SolrDispatchFilter SolrDispatchFilter.init() done
   [junit4]   2> 17371 INFO  (SUITE-BasicAuthIntegrationTest-seed#[9EFE537BC715F3D1]-worker) [    ] o.a.s.c.c.SolrZkClient Using default ZkCredentialsProvider
   [junit4]   2> 17371 INFO  (SUITE-BasicAuthIntegrationTest-seed#[9EFE537BC715F3D1]-worker) [    ] o.a.s.c.c.ConnectionManager Waiting for client to connect to ZooKeeper
   [junit4]   2> 17376 INFO  (zkCallback-39-thread-1) [    ] o.a.s.c.c.ConnectionManager Watcher org.apache.solr.common.cloud.ConnectionManager@47dfd601 name:ZooKeeperConnection Watcher:127.0.0.1:43191 got event WatchedEvent state:SyncConnected type:None path:null path:null type:None
   [junit4]   2> 17376 INFO  (SUITE-BasicAuthIntegrationTest-seed#[9EFE537BC715F3D1]-worker) [    ] o.a.s.c.c.ConnectionManager Client is connected to ZooKeeper
   [junit4]   2> 17377 INFO  (SUITE-BasicAuthIntegrationTest-seed#[9EFE537BC715F3D1]-worker) [    ] o.a.s.c.c.SolrZkClient Using default ZkACLProvider
   [junit4]   2> 17385 INFO  (SUITE-BasicAuthIntegrationTest-seed#[9EFE537BC715F3D1]-worker) [    ] o.a.s.c.c.SolrZkClient Using default ZkCredentialsProvider
   [junit4]   2> 17385 INFO  (SUITE-BasicAuthIntegrationTest-seed#[9EFE537BC715F3D1]-worker) [    ] o.a.s.c.c.ConnectionManager Waiting for client to connect to ZooKeeper
   [junit4]   2> 17387 INFO  (zkCallback-42-thread-1) [    ] o.a.s.c.c.ConnectionManager Watcher org.apache.solr.common.cloud.ConnectionManager@6b3181aa name:ZooKeeperConnection Watcher:127.0.0.1:43191/solr got event WatchedEvent state:SyncConnected type:None path:null path:null type:None
   [junit4]   2> 17387 INFO  (SUITE-BasicAuthIntegrationTest-seed#[9EFE537BC715F3D1]-worker) [    ] o.a.s.c.c.ConnectionManager Client is connected to ZooKeeper
   [junit4]   2> 17387 INFO  (SUITE-BasicAuthIntegrationTest-seed#[9EFE537BC715F3D1]-worker) [    ] o.a.s.c.c.SolrZkClient Using default ZkACLProvider
   [junit4]   2> 17387 INFO  (SUITE-BasicAuthIntegrationTest-seed#[9EFE537BC715F3D1]-worker) [    ] o.a.s.c.c.ZkStateReader Updating cluster state from ZooKeeper... 
   [junit4]   2> 17388 INFO  (SUITE-BasicAuthIntegrationTest-seed#[9EFE537BC715F3D1]-worker) [    ] o.a.s.c.c.ZkStateReader Loaded cluster properties: {urlScheme=https}
   [junit4]   2> 17389 INFO  (SUITE-BasicAuthIntegrationTest-seed#[9EFE537BC715F3D1]-worker) [    ] o.a.s.c.c.ZkStateReader Updated live nodes from ZooKeeper... (0) -> (3)
   [junit4]   2> 17399 INFO  (SUITE-BasicAuthIntegrationTest-seed#[9EFE537BC715F3D1]-worker) [    ] o.a.s.c.c.SolrZkClient makePath: /configs/conf/solrconfig.xml
   [junit4]   2> 17403 INFO  (SUITE-BasicAuthIntegrationTest-seed#[9EFE537BC715F3D1]-worker) [    ] o.a.s.c.c.SolrZkClient makePath: /configs/conf/schema.xml
   [junit4]   2> 17823 INFO  (qtp1924469875-185) [n:127.0.0.1:45291_solr    ] o.a.s.h.a.CollectionsHandler Invoked Collection Action :create with params replicationFactor=1&collection.configName=conf&name=authCollection&action=CREATE&numShards=3&wt=javabin&version=2 and sendToOCPQueue=true
   [junit4]   2> 17834 INFO  (OverseerCollectionConfigSetProcessor-96568852972699655-127.0.0.1:37565_solr-n_0000000000) [n:127.0.0.1:37565_solr    ] o.a.s.c.OverseerTaskProcessor Overseer Collection Message Handler: Get the message id:/overseer/collection-queue-work/qn-0000000000 message:{
   [junit4]   2>   "name":"authCollection",
   [junit4]   2>   "fromApi":"true",
   [junit4]   2>   "replicationFactor":"1",
   [junit4]   2>   "collection.configName":"conf",
   [junit4]   2>   "numShards":"3",
   [junit4]   2>   "stateFormat":"2",
   [junit4]   2>   "operation":"create"}
   [junit4]   2> 17836 INFO  (OverseerThreadFactory-129-thread-1-processing-n:127.0.0.1:37565_solr) [n:127.0.0.1:37565_solr    ] o.a.s.c.OverseerCollectionMessageHandler OverseerCollectionMessageHandler.processMessage : create , {
   [junit4]   2>   "name":"authCollection",
   [junit4]   2>   "fromApi":"true",
   [junit4]   2>   "replicationFactor":"1",
   [junit4]   2>   "collection.configName":"conf",
   [junit4]   2>   "numShards":"3",
   [junit4]   2>   "stateFormat":"2",
   [junit4]   2>   "operation":"create"}
   [junit4]   2> 17836 INFO  (OverseerThreadFactory-129-thread-1-processing-n:127.0.0.1:37565_solr) [n:127.0.0.1:37565_solr    ] o.a.s.c.CreateCollectionCmd Create collection authCollection
   [junit4]   2> 17840 INFO  (OverseerThreadFactory-129-thread-1-processing-n:127.0.0.1:37565_solr) [n:127.0.0.1:37565_solr    ] o.a.s.c.OverseerCollectionMessageHandler creating collections conf node /collections/authCollection 
   [junit4]   2> 17841 INFO  (OverseerThreadFactory-129-thread-1-processing-n:127.0.0.1:37565_solr) [n:127.0.0.1:37565_solr    ] o.a.s.c.c.SolrZkClient makePath: /collections/authCollection
   [junit4]   2> 17843 INFO  (zkCallback-42-thread-1) [    ] o.a.s.c.c.ZkStateReader A collections change: [WatchedEvent state:SyncConnected type:NodeChildrenChanged path:/collections], has occurred - updating...
   [junit4]   2> 17843 INFO  (zkCallback-33-thread-1-processing-n:127.0.0.1:41255_solr) [n:127.0.0.1:41255_solr    ] o.a.s.c.c.ZkStateReader A collections change: [WatchedEvent state:SyncConnected type:NodeChildrenChanged path:/collections], has occurred - updating...
   [junit4]   2> 17843 INFO  (zkCallback-35-thread-1-processing-n:127.0.0.1:37565_solr) [n:127.0.0.1:37565_solr    ] o.a.s.c.c.ZkStateReader A collections change: [WatchedEvent state:SyncConnected type:NodeChildrenChanged path:/collections], has occurred - updating...
   [junit4]   2> 17845 INFO  (zkCallback-34-thread-1-processing-n:127.0.0.1:45291_solr) [n:127.0.0.1:45291_solr    ] o.a.s.c.c.ZkStateReader A collections change: [WatchedEvent state:SyncConnected type:NodeChildrenChanged path:/collections], has occurred - updating...
   [junit4]   2> 17849 INFO  (OverseerStateUpdate-96568852972699655-127.0.0.1:37565_solr-n_0000000000) [n:127.0.0.1:37565_solr    ] o.a.s.c.Overseer processMessage: queueSize: 1, message = {
   [junit4]   2>   "name":"authCollection",
   [junit4]   2>   "fromApi":"true",
   [junit4]   2>   "replicationFactor":"1",
   [junit4]   2>   "collection.configName":"conf",
   [junit4]   2>   "numShards":"3",
   [junit4]   2>   "stateFormat":"2",
   [junit4]   2>   "operation":"create"} current state version: 0
   [junit4]   2> 17849 INFO  (OverseerStateUpdate-96568852972699655-127.0.0.1:37565_solr-n_0000000000) [n:127.0.0.1:37565_solr    ] o.a.s.c.o.ClusterStateMutator building a new cName: authCollection
   [junit4]   2> 17858 INFO  (OverseerStateUpdate-96568852972699655-127.0.0.1:37565_solr-n_0000000000) [n:127.0.0.1:37565_solr    ] o.a.s.c.o.ZkStateWriter going to create_collection /collections/authCollection/state.json
   [junit4]   2> 17952 INFO  (OverseerThreadFactory-129-thread-1-processing-n:127.0.0.1:37565_solr) [n:127.0.0.1:37565_solr    ] o.a.s.c.CreateCollectionCmd Creating SolrCores for new collection authCollection, shardNames [shard1, shard2, shard3] , replicationFactor : 1
   [junit4]   2> 17952 INFO  (OverseerThreadFactory-129-thread-1-processing-n:127.0.0.1:37565_solr) [n:127.0.0.1:37565_solr    ] o.a.s.c.CreateCollectionCmd Creating core authCollection_shard1_replica1 as part of shard shard1 of collection authCollection on 127.0.0.1:41255_solr
   [junit4]   2> 17955 INFO  (OverseerThreadFactory-129-thread-1-processing-n:127.0.0.1:37565_solr) [n:127.0.0.1:37565_solr    ] o.a.s.c.CreateCollectionCmd Creating core authCollection_shard2_replica1 as part of shard shard2 of collection authCollection on 127.0.0.1:37565_solr
   [junit4]   2> 17955 INFO  (OverseerThreadFactory-129-thread-1-processing-n:127.0.0.1:37565_solr) [n:127.0.0.1:37565_solr    ] o.a.s.c.CreateCollectionCmd Creating core authCollection_shard3_replica1 as part of shard shard3 of collection authCollection on 127.0.0.1:45291_solr
   [junit4]   2> 17995 INFO  (qtp1924469875-173) [n:127.0.0.1:45291_solr    ] o.a.s.h.a.CoreAdminOperation core create command qt=/admin/cores&collection.configName=conf&name=authCollection_shard3_replica1&action=CREATE&numShards=3&collection=authCollection&shard=shard3&wt=javabin&version=2
   [junit4]   2> 17998 INFO  (qtp1924469875-173) [n:127.0.0.1:45291_solr    ] o.a.s.c.CoreDescriptor Created CoreDescriptor: {name=authCollection_shard3_replica1, collection.configName=conf, config=solrconfig.xml, transient=false, schema=schema.xml, loadOnStartup=true, configSetProperties=configsetprops.json, collection=authCollection, numShards=3, dataDir=data/, shard=shard3}
   [junit4]   2> 17999 INFO  (qtp1924469875-173) [n:127.0.0.1:45291_solr c:authCollection s:shard3  x:authCollection_shard3_replica1] o.a.s.c.ZkController publishing state=down
   [junit4]   2> 18002 INFO  (qtp1924469875-173) [n:127.0.0.1:45291_solr c:authCollection s:shard3  x:authCollection_shard3_replica1] o.a.s.c.ZkController Registering watch for collection authCollection
   [junit4]   2> 18002 INFO  (OverseerStateUpdate-96568852972699655-127.0.0.1:37565_solr-n_0000000000) [n:127.0.0.1:37565_solr    ] o.a.s.c.Overseer processMessage: queueSize: 1, message = {
   [junit4]   2>   "core":"authCollection_shard3_replica1",
   [junit4]   2>   "roles":null,
   [junit4]   2>   "base_url":"https://127.0.0.1:45291/solr",
   [junit4]   2>   "node_name":"127.0.0.1:45291_solr",
   [junit4]   2>   "numShards":"3",
   [junit4]   2>   "state":"down",
   [junit4]   2>   "shard":"shard3",
   [junit4]   2>   "collection":"authCollection",
   [junit4]   2>   "operation":"state"} current state version: 0
   [junit4]   2> 18006 INFO  (OverseerStateUpdate-96568852972699655-127.0.0.1:37565_solr-n_0000000000) [n:127.0.0.1:37565_solr    ] o.a.s.c.o.ReplicaMutator Update state numShards=3 message={
   [junit4]   2>   "core":"authCollection_shard3_replica1",
   [junit4]   2>   "roles":null,
   [junit4]   2>   "base_url":"https://127.0.0.1:45291/solr",
   [junit4]   2>   "node_name":"127.0.0.1:45291_solr",
   [junit4]   2>   "numShards":"3",
   [junit4]   2>   "state":"down",
   [junit4]   2>   "shard":"shard3",
   [junit4]   2>   "collection":"authCollection",
   [junit4]   2>   "operation":"state"}
   [junit4]   2> 18009 INFO  (qtp1924469875-173) [n:127.0.0.1:45291_solr c:authCollection s:shard3  x:authCollection_shard3_replica1] o.a.s.c.c.ZkStateReader Add data for [authCollection] ver [0]
   [junit4]   2> 18013 INFO  (qtp1924469875-173) [n:127.0.0.1:45291_solr c:authCollection s:shard3  x:authCollection_shard3_replica1] o.a.s.c.ZkController look for our core node name
   [junit4]   2> 18023 INFO  (qtp7988554-191) [n:127.0.0.1:37565_solr    ] o.a.s.h.a.CoreAdminOperation core create command qt=/admin/cores&collection.configName=conf&name=authCollection_shard2_replica1&action=CREATE&numShards=3&collection=authCollection&shard=shard2&wt=javabin&version=2
   [junit4]   2> 18023 INFO  (qtp7988554-191) [n:127.0.0.1:37565_solr    ] o.a.s.c.CoreDescriptor Created CoreDescriptor: {name=authCollection_shard2_replica1, collection.configName=conf, config=solrconfig.xml, transient=false, schema=schema.xml, loadOnStartup=true, configSetProperties=configsetprops.json, collection=authCollection, numShards=3, dataDir=data/, shard=shard2}
   [junit4]   2> 18024 INFO  (qtp7988554-191) [n:127.0.0.1:37565_solr c:authCollection s:shard2  x:authCollection_shard2_replica1] o.a.s.c.ZkController publishing state=down
   [junit4]   2> 18026 INFO  (qtp7988554-191) [n:127.0.0.1:37565_solr c:authCollection s:shard2  x:authCollection_shard2_replica1] o.a.s.c.ZkController Registering watch for collection authCollection
   [junit4]   2> 18026 INFO  (qtp7988554-191) [n:127.0.0.1:37565_solr c:authCollection s:shard2  x:authCollection_shard2_replica1] o.a.s.c.c.ZkStateReader Add data for [authCollection] ver [0]
   [junit4]   2> 18026 INFO  (OverseerStateUpdate-96568852972699655-127.0.0.1:37565_solr-n_0000000000) [n:127.0.0.1:37565_solr    ] o.a.s.c.Overseer processMessage: queueSize: 1, message = {
   [junit4]   2>   "core":"authCollection_shard2_replica1",
   [junit4]   2>   "roles":null,
   [junit4]   2>   "base_url":"https://127.0.0.1:37565/solr",
   [junit4]   2>   "node_name":"127.0.0.1:37565_solr",
   [junit4]   2>   "numShards":"3",
   [junit4]   2>   "state":"down",
   [junit4]   2>   "shard":"shard2",
   [junit4]   2>   "collection":"authCollection",
   [junit4]   2>   "operation":"state"} current state version: 0
   [junit4]   2> 18027 INFO  (OverseerStateUpdate-96568852972699655-127.0.0.1:37565_solr-n_0000000000) [n:127.0.0.1:37565_solr    ] o.a.s.c.o.ReplicaMutator Update state numShards=3 message={
   [junit4]   2>   "core":"authCollection_shard2_replica1",
   [junit4]   2>   "roles":null,
   [junit4]   2>   "base_url":"https://127.0.0.1:37565/solr",
   [junit4]   2>   "node_name":"127.0.0.1:37565_solr",
   [junit4]   2>   "numShards":"3",
   [junit4]   2>   "state":"down",
   [junit4]   2>   "shard":"shard2",
   [junit4]   2>   "collection":"authCollection",
   [junit4]   2>   "operation":"state"}
   [junit4]   2> 18027 INFO  (qtp7988554-191) [n:127.0.0.1:37565_solr c:authCollection s:shard2  x:authCollection_shard2_replica1] o.a.s.c.ZkController look for our core node name
   [junit4]   2> 18038 INFO  (qtp1963522280-193) [n:127.0.0.1:41255_solr    ] o.a.s.h.a.CoreAdminOperation core create command qt=/admin/cores&collection.configName=conf&name=authCollection_shard1_replica1&action=CREATE&numShards=3&collection=authCollection&shard=shard1&wt=javabin&version=2
   [junit4]   2> 18039 INFO  (qtp1963522280-193) [n:127.0.0.1:41255_solr    ] o.a.s.c.CoreDescriptor Created CoreDescriptor: {name=authCollection_shard1_replica1, collection.configName=conf, config=solrconfig.xml, transient=false, schema=schema.xml, loadOnStartup=true, configSetProperties=configsetprops.json, collection=authCollection, numShards=3, dataDir=data/, shard=shard1}
   [junit4]   2> 18039 INFO  (qtp1963522280-193) [n:127.0.0.1:41255_solr c:authCollection s:shard1  x:authCollection_shard1_replica1] o.a.s.c.ZkController publishing state=down
   [junit4]   2> 18041 INFO  (qtp1963522280-193) [n:127.0.0.1:41255_solr c:authCollection s:shard1  x:authCollection_shard1_replica1] o.a.s.c.ZkController Registering watch for collection authCollection
   [junit4]   2> 18041 INFO  (qtp1963522280-193) [n:127.0.0.1:41255_solr c:authCollection s:shard1  x:authCollection_shard1_replica1] o.a.s.c.c.ZkStateReader Add data for [authCollection] ver [0]
   [junit4]   2> 18041 INFO  (OverseerStateUpdate-96568852972699655-127.0.0.1:37565_solr-n_0000000000) [n:127.0.0.1:37565_solr    ] o.a.s.c.Overseer processMessage: queueSize: 1, message = {
   [junit4]   2>   "core":"authCollection_shard1_replica1",
   [junit4]   2>   "roles":null,
   [junit4]   2>   "base_url":"https://127.0.0.1:41255/solr",
   [junit4]   2>   "node_name":"127.0.0.1:41255_solr",
   [junit4]   2>   "numShards":"3",
   [junit4]   2>   "state":"down",
   [junit4]   2>   "shard":"shard1",
   [junit4]   2>   "collection":"authCollection",
   [junit4]   2>   "operation":"state"} current state version: 0
   [junit4]   2> 18041 INFO  (OverseerStateUpdate-96568852972699655-127.0.0.1:37565_solr-n_0000000000) [n:127.0.0.1:37565_solr    ] o.a.s.c.o.ReplicaMutator Update state numShards=3 message={
   [junit4]   2>   "core":"authCollection_shard1_replica1",
   [junit4]   2>   "roles":null,
   [junit4]   2>   "base_url":"https://127.0.0.1:41255/solr",
   [junit4]   2>   "node_name":"127.0.0.1:41255_solr",
   [junit4]   2>   "numShards":"3",
   [junit4]   2>   "state":"down",
   [junit4]   2>   "shard":"shard1",
   [junit4]   2>   "collection":"authCollection",
   [junit4]   2>   "operation":"state"}
   [junit4]   2> 18041 INFO  (qtp1963522280-193) [n:127.0.0.1:41255_solr c:authCollection s:shard1  x:authCollection_shard1_replica1] o.a.s.c.ZkController look for our core node name
   [junit4]   2> 18145 INFO  (OverseerStateUpdate-96568852972699655-127.0.0.1:37565_solr-n_0000000000) [n:127.0.0.1:37565_solr    ] o.a.s.c.o.ZkStateWriter going to update_collection /collections/authCollection/state.json version: 0
   [junit4]   2> 18148 INFO  (zkCallback-34-thread-1-processing-n:127.0.0.1:45291_solr) [n:127.0.0.1:45291_solr    ] o.a.s.c.c.ZkStateReader A cluster state change: [WatchedEvent state:SyncConnected type:NodeDataChanged path:/collections/authCollection/state.json] for collection [authCollection] has occurred - updating... (live nodes size: [3])
   [junit4]   2> 18148 INFO  (zkCallback-33-thread-1-processing-n:127.0.0.1:41255_solr) [n:127.0.0.1:41255_solr    ] o.a.s.c.c.ZkStateReader A cluster state change: [WatchedEvent state:SyncConnected type:NodeDataChanged path:/collections/authCollection/state.json] for collection [authCollection] has occurred - updating... (live nodes size: [3])
   [junit4]   2> 18148 INFO  (zkCallback-35-thread-2-processing-n:127.0.0.1:37565_solr) [n:127.0.0.1:37565_solr    ] o.a.s.c.c.ZkStateReader A cluster state change: [WatchedEvent state:SyncConnected type:NodeDataChanged path:/collections/authCollection/state.json] for collection [authCollection] has occurred - updating... (live nodes size: [3])
   [junit4]   2> 18149 INFO  (zkCallback-34-thread-1-processing-n:127.0.0.1:45291_solr) [n:127.0.0.1:45291_solr    ] o.a.s.c.c.ZkStateReader Updating data for [authCollection] from [0] to [1]
   [junit4]   2> 18149 INFO  (zkCallback-33-thread-1-processing-n:127.0.0.1:41255_solr) [n:127.0.0.1:41255_solr    ] o.a.s.c.c.ZkStateReader Updating data for [authCollection] from [0] to [1]
   [junit4]   2> 18149 INFO  (zkCallback-35-thread-2-processing-n:127.0.0.1:37565_solr) [n:127.0.0.1:37565_solr    ] o.a.s.c.c.ZkStateReader Updating data for [authCollection] from [0] to [1]
   [junit4]   2> 19013 INFO  (qtp1924469875-173) [n:127.0.0.1:45291_solr c:authCollection s:shard3  x:authCollection_shard3_replica1] o.a.s.c.ZkController waiting to find shard id in clusterstate for authCollection_shard3_replica1
   [junit4]   2> 19013 INFO  (qtp1924469875-173) [n:127.0.0.1:45291_solr c:authCollection s:shard3  x:authCollection_shard3_replica1] o.a.s.c.ZkController Check for collection zkNode:authCollection
   [junit4]   2> 19014 INFO  (qtp1924469875-173) [n:127.0.0.1:45291_solr c:authCollection s:shard3  x:authCollection_shard3_replica1] o.a.s.c.ZkController Collection zkNode exists
   [junit4]   2> 19014 INFO  (qtp1924469875-173) [n:127.0.0.1:45291_solr c:authCollection s:shard3  x:authCollection_shard3_replica1] o.a.s.c.c.ZkStateReader Load collection config from: [/collections/authCollection]
   [junit4]   2> 19016 INFO  (qtp1924469875-173) [n:127.0.0.1:45291_solr c:authCollection s:shard3  x:authCollection_shard3_replica1] o.a.s.c.c.ZkStateReader path=[/collections/authCollection] [configName]=[conf] specified config exists in ZooKeeper
   [junit4]   2> 19017 INFO  (qtp1924469875-173) [n:127.0.0.1:45291_solr c:authCollection s:shard3  x:authCollection_shard3_replica1] o.a.s.c.SolrResourceLoader new SolrResourceLoader for directory: '/home/jenkins/workspace/Lucene-Solr-6.x-Linux/solr/build/solr-core/test/J2/temp/solr.security.BasicAuthIntegrationTest_9EFE537BC715F3D1-001/tempDir-001/node2/authCollection_shard3_replica1'
   [junit4]   2> 19017 INFO  (qtp1924469875-173) [n:127.0.0.1:45291_solr c:authCollection s:shard3  x:authCollection_shard3_replica1] o.a.s.c.SolrResourceLoader JNDI not configured for solr (NoInitialContextEx)
   [junit4]   2> 19017 INFO  (qtp1924469875-173) [n:127.0.0.1:45291_solr c:authCollection s:shard3  x:authCollection_shard3_replica1] o.a.s.c.SolrResourceLoader solr home defaulted to 'solr/' (could not find system property or JNDI)
   [junit4]   2> 19019 INFO  (qtp1924469875-173) [n:127.0.0.1:45291_solr c:authCollection s:shard3  x:authCollection_shard3_replica1] o.a.s.c.Config loaded config solrconfig.xml with version 0 
   [junit4]   2> 19023 INFO  (qtp1924469875-173) [n:127.0.0.1:45291_solr c:authCollection s:shard3  x:authCollection_shard3_replica1] o.a.s.c.SolrConfig current version of requestparams : -1
   [junit4]   2> 19026 INFO  (qtp1924469875-173) [n:127.0.0.1:45291_solr c:authCollection s:shard3  x:authCollection_shard3_replica1] o.a.s.c.SolrConfig Using Lucene MatchVersion: 6.3.0
   [junit4]   2> 19027 INFO  (qtp7988554-191) [n:127.0.0.1:37565_solr c:authCollection s:shard2  x:authCollection_shard2_replica1] o.a.s.c.ZkController waiting to find shard id in clusterstate for authCollection_shard2_replica1
   [junit4]   2> 19027 INFO  (qtp7988554-191) [n:127.0.0.1:37565_solr c:authCollection s:shard2  x:authCollection_shard2_replica1] o.a.s.c.ZkController Check for collection zkNode:authCollection
   [junit4]   2> 19028 INFO  (qtp7988554-191) [n:127.0.0.1:37565_solr c:authCollection s:shard2  x:authCollection_shard2_replica1] o.a.s.c.ZkController Collection zkNode exists
   [junit4]   2> 19028 INFO  (qtp7988554-191) [n:127.0.0.1:37565_solr c:authCollection s:shard2  x:authCollection_shard2_replica1] o.a.s.c.c.ZkStateReader Load collection config from: [/collections/authCollection]
   [junit4]   2> 19031 INFO  (qtp1924469875-173) [n:127.0.0.1:45291_solr c:authCollection s:shard3  x:authCollection_shard3_replica1] o.a.s.c.SolrConfig Loaded SolrConfig: solrconfig.xml
   [junit4]   2> 19033 INFO  (qtp7988554-191) [n:127.0.0.1:37565_solr c:authCollection s:shard2  x:authCollection_shard2_replica1] o.a.s.c.c.ZkStateReader path=[/collections/authCollection] [configName]=[conf] specified config exists in ZooKeeper
   [junit4]   2> 19033 INFO  (qtp7988554-191) [n:127.0.0.1:37565_solr c:authCollection s:shard2  x:authCollection_shard2_replica1] o.a.s.c.SolrResourceLoader new SolrResourceLoader for directory: '/home/jenkins/workspace/Lucene-Solr-6.x-Linux/solr/build/solr-core/test/J2/temp/solr.security.BasicAuthIntegrationTest_9EFE537BC715F3D1-001/tempDir-001/node1/authCollection_shard2_replica1'
   [junit4]   2> 19033 INFO  (qtp7988554-191) [n:127.0.0.1:37565_solr c:authCollection s:shard2  x:authCollection_shard2_replica1] o.a.s.c.SolrResourceLoader JNDI not configured for solr (NoInitialContextEx)
   [junit4]   2> 19033 INFO  (qtp7988554-191) [n:127.0.0.1:37565_solr c:authCollection s:shard2  x:authCollection_shard2_replica1] o.a.s.c.SolrResourceLoader solr home defaulted to 'solr/' (could not find system property or JNDI)
   [junit4]   2> 19034 INFO  (qtp7988554-191) [n:127.0.0.1:37565_solr c:authCollection s:shard2  x:authCollection_shard2_replica1] o.a.s.c.Config loaded config solrconfig.xml with version 0 
   [junit4]   2> 19035 INFO  (qtp1924469875-173) [n:127.0.0.1:45291_solr c:authCollection s:shard3  x:authCollection_shard3_replica1] o.a.s.s.IndexSchema [authCollection_shard3_replica1] Schema name=minimal
   [junit4]   2> 19038 INFO  (qtp7988554-191) [n:127.0.0.1:37565_solr c:authCollection s:shard2  x:authCollection_shard2_replica1] o.a.s.c.SolrConfig current version of requestparams : -1
   [junit4]   2> 19039 INFO  (qtp1924469875-173) [n:127.0.0.1:45291_solr c:authCollection s:shard3  x:authCollection_shard3_replica1] o.a.s.s.IndexSchema unique key field: id
   [junit4]   2> 19040 INFO  (qtp7988554-191) [n:127.0.0.1:37565_solr c:authCollection s:shard2  x:authCollection_shard2_replica1] o.a.s.c.SolrConfig Using Lucene MatchVersion: 6.3.0
   [junit4]   2> 19041 INFO  (qtp1924469875-173) [n:127.0.0.1:45291_solr c:authCollection s:shard3  x:authCollection_shard3_replica1] o.a.s.c.ConfigSetProperties Did not find ConfigSet properties, assuming default properties: Can't find resource 'configsetprops.json' in classpath or '/configs/conf', cwd=/home/jenkins/workspace/Lucene-Solr-6.x-Linux/solr/build/solr-core/test/J2
   [junit4]   2> 19041 INFO  (qtp1924469875-173) [n:127.0.0.1:45291_solr c:authCollection s:shard3  x:authCollection_shard3_replica1] o.a.s.c.CoreContainer Creating SolrCore 'authCollection_shard3_replica1' using configuration from collection authCollection
   [junit4]   2> 19041 INFO  (qtp1924469875-173) [n:127.0.0.1:45291_solr c:authCollection s:shard3 r:core_node1 x:authCollection_shard3_replica1] o.a.s.c.SolrCore org.apache.solr.core.MockDirectoryFactory
   [junit4]   2> 19051 INFO  (qtp1963522280-193) [n:127.0.0.1:41255_solr c:authCollection s:shard1  x:authCollection_shard1_replica1] o.a.s.c.ZkController waiting to find shard id in clusterstate for authCollection_shard1_replica1
   [junit4]   2> 19051 INFO  (qtp1924469875-173) [n:127.0.0.1:45291_solr c:authCollection s:shard3 r:core_node1 x:authCollection_shard3_replica1] o.a.s.c.SolrCore [[authCollection_shard3_replica1] ] Opening new SolrCore at [/home/jenkins/workspace/Lucene-Solr-6.x-Linux/solr/build/solr-core/test/J2/temp/solr.security.BasicAuthIntegrationTest_9EFE537BC715F3D1-001/tempDir-001/node2/authCollection_shard3_replica1], dataDir=[/home/jenkins/workspace/Lucene-Solr-6.x-Linux/solr/build/solr-core/test/J2/temp/solr.security.BasicAuthIntegrationTest_9EFE537BC715F3D1-001/tempDir-001/node2/./authCollection_shard3_replica1/data/]
   [junit4]   2> 19051 INFO  (qtp1924469875-173) [n:127.0.0.1:45291_solr c:authCollection s:shard3 r:core_node1 x:authCollection_shard3_replica1] o.a.s.c.SolrCore JMX monitoring not detected for core: authCollection_shard3_replica1
   [junit4]   2> 19051 INFO  (qtp1963522280-193) [n:127.0.0.1:41255_solr c:authCollection s:shard1  x:authCollection_shard1_replica1] o.a.s.c.ZkController Check for collection zkNode:authCollection
   [junit4]   2> 19052 INFO  (qtp1963522280-193) [n:127.0.0.1:41255_solr c:authCollection s:shard1  x:authCollection_shard1_replica1] o.a.s.c.ZkController Collection zkNode exists
   [junit4]   2> 19052 INFO  (qtp1963522280-193) [n:127.0.0.1:41255_solr c:authCollection s:shard1  x:authCollection_shard1_replica1] o.a.s.c.c.ZkStateReader Load collection config from: [/collections/authCollection]
   [junit4]   2> 19052 INFO  (qtp1924469875-173) [n:127.0.0.1:45291_solr c:authCollection s:shard3 r:core_node1 x:authCollection_shard3_replica1] o.a.s.c.CachingDirectoryFactory return new directory for /home/jenkins/workspace/Lucene-Solr-6.x-Linux/solr/build/solr-core/test/J2/temp/solr.security.BasicAuthIntegrationTest_9EFE537BC715F3D1-001/tempDir-001/node2/./authCollection_shard3_replica1/data/snapshot_metadata
   [junit4]   2> 19052 INFO  (qtp1924469875-173) [n:127.0.0.1:45291_solr c:authCollection s:shard3 r:core_node1 x:authCollection_shard3_replica1] o.a.s.c.s.SolrSnapshotMetaDataManager Loading from snapshot metadata file...
   [junit4]   2> 19053 INFO  (qtp1963522280-193) [n:127.0.0.1:41255_solr c:authCollection s:shard1  x:authCollection_shard1_replica1] o.a.s.c.c.ZkStateReader path=[/collections/authCollection] [configName]=[conf] specified config exists in ZooKeeper
   [junit4]   2> 19053 INFO  (qtp1924469875-173) [n:127.0.0.1:45291_solr c:authCollection s:shard3 r:core_node1 x:authCollection_shard3_replica1] o.a.s.c.CachingDirectoryFactory return new directory for /home/jenkins/workspace/Lucene-Solr-6.x-Linux/solr/build/solr-core/test/J2/temp/solr.security.BasicAuthIntegrationTest_9EFE537BC715F3D1-001/tempDir-001/node2/./authCollection_shard3_replica1/data
   [junit4]   2> 19053 INFO  (qtp1963522280-193) [n:127.0.0.1:41255_solr c:authCollection s:shard1  x:authCollection_shard1_replica1] o.a.s.c.SolrResourceLoader new SolrResourceLoader for directory: '/home/jenkins/workspace/Lucene-Solr-6.x-Linux/solr/build/solr-core/test/J2/temp/solr.security.BasicAuthIntegrationTest_9EFE537BC715F3D1-001/tempDir-001/node3/authCollection_shard1_replica1'
   [junit4]   2> 19053 INFO  (qtp1924469875-173) [n:127.0.0.1:45291_solr c:authCollection s:shard3 r:core_node1 x:authCollection_shard3_replica1] o.a.s.c.SolrCore New index directory detected: old=null new=/home/jenkins/workspace/Lucene-Solr-6.x-Linux/solr/build/solr-core/test/J2/temp/solr.security.BasicAuthIntegrationTest_9EFE537BC715F3D1-001/tempDir-001/node2/./authCollection_shard3_replica1/data/index/
   [junit4]   2> 19053 INFO  (qtp1963522280-193) [n:127.0.0.1:41255_solr c:authCollection s:shard1  x:authCollection_shard1_replica1] o.a.s.c.SolrResourceLoader JNDI not configured for solr (NoInitialContextEx)
   [junit4]   2> 19053 WARN  (qtp1924469875-173) [n:127.0.0.1:45291_solr c:authCollection s:shard3 r:core_node1 x:authCollection_shard3_replica1] o.a.s.c.SolrCore [authCollection_shard3_replica1] Solr index directory '/home/jenkins/workspace/Lucene-Solr-6.x-Linux/solr/build/solr-core/test/J2/temp/solr.security.BasicAuthIntegrationTest_9EFE537BC715F3D1-001/tempDir-001/node2/./authCollection_shard3_replica1/data/index' doesn't exist. Creating new index...
   [junit4]   2> 19053 INFO  (qtp1963522280-193) [n:127.0.0.1:41255_solr c:authCollection s:shard1  x:authCollection_shard1_replica1] o.a.s.c.SolrResourceLoader solr home defaulted to 'solr/' (could not find system property or JNDI)
   [junit4]   2> 19058 INFO  (qtp1924469875-173) [n:127.0.0.1:45291_solr c:authCollection s:shard3 r:core_node1 x:authCollection_shard3_replica1] o.a.s.c.CachingDirectoryFactory return new directory for /home/jenkins/workspace/Lucene-Solr-6.x-Linux/solr/build/solr-core/test/J2/temp/solr.security.BasicAuthIntegrationTest_9EFE537BC715F3D1-001/tempDir-001/node2/./authCollection_shard3_replica1/data/index
   [junit4]   2> 19058 INFO  (qtp1924469875-173) [n:127.0.0.1:45291_solr c:authCollection s:shard3 r:core_node1 x:authCollection_shard3_replica1] o.a.s.c.SolrDeletionPolicy SolrDeletionPolicy.onCommit: commits: num=1
   [junit4]   2> 	commit{dir=MockDirectoryWrapper(RAMDirectory@19fd0328 lockFactory=org.apache.lucene.store.SingleInstanceLockFactory@2985c2b7),segFN=segments_1,generation=1}
   [junit4]   2> 19059 INFO  (qtp1924469875-173) [n:127.0.0.1:45291_solr c:authCollection s:shard3 r:core_node1 x:authCollection_shard3_replica1] o.a.s.c.SolrDeletionPolicy newest commit generation = 1
   [junit4]   2> 19059 INFO  (qtp1963522280-193) [n:127.0.0.1:41255_solr c:authCollection s:shard1  x:authCollection_shard1_replica1] o.a.s.c.Config loaded config solrconfig.xml with version 0 
   [junit4]   2> 19059 INFO  (OldIndexDirectoryCleanupThreadForCore-authCollection_shard3_replica1) [n:127.0.0.1:45291_solr c:authCollection s:shard3 r:core_node1 x:authCollection_shard3_replica1] o.a.s.c.SolrCore Looking for old index directories to cleanup for core authCollection_shard3_replica1 in /home/jenkins/workspace/Lucene-Solr-6.x-Linux/solr/build/solr-core/test/J2/temp/solr.security.BasicAuthIntegrationTest_9EFE537BC715F3D1-001/tempDir-001/node2/./authCollection_shard3_replica1/data/
   [junit4]   2> 19060 WARN  (OldIndexDirectoryCleanupThreadForCore-authCollection_shard3_replica1) [n:127.0.0.1:45291_solr c:authCollection s:shard3 r:core_node1 x:authCollection_shard3_replica1] o.a.s.c.DirectoryFactory /home/jenkins/workspace/Lucene-Solr-6.x-Linux/solr/build/solr-core/test/J2/temp/solr.security.BasicAuthIntegrationTest_9EFE537BC715F3D1-001/tempDir-001/node2/./authCollection_shard3_replica1/data/ does not point to a valid data directory; skipping clean-up of old index directories.
   [junit4]   2> 19061 INFO  (qtp1924469875-173) [n:127.0.0.1:45291_solr c:authCollection s:shard3 r:core_node1 x:authCollection_shard3_replica1] o.a.s.c.SolrCore no updateRequestProcessorChain defined as default, creating implicit default
   [junit4]   2> 19062 INFO  (qtp7988554-191) [n:127.0.0.1:37565_solr c:authCollection s:shard2  x:authCollection_shard2_replica1] o.a.s.c.SolrConfig Loaded SolrConfig: solrconfig.xml
   [junit4]   2> 19063 INFO  (qtp1924469875-173) [n:127.0.0.1:45291_solr c:authCollection s:shard3 r:core_node1 x:authCollection_shard3_replica1] o.a.s.h.l.XMLLoader xsltCacheLifetimeSeconds=60
   [junit4]   2> 19064 INFO  (qtp1924469875-173) [n:127.0.0.1:45291_solr c:authCollection s:shard3 r:core_node1 x:authCollection_shard3_replica1] o.a.s.h.l.XMLLoader xsltCacheLifetimeSeconds=60
   [junit4]   2> 19065 INFO  (qtp1924469875-173) [n:127.0.0.1:45291_solr c:authCollection s:shard3 r:core_node1 x:authCollection_shard3_replica1] o.a.s.h.l.XMLLoader xsltCacheLifetimeSeconds=60
   [junit4]   2> 19065 INFO  (qtp1963522280-193) [n:127.0.0.1:41255_solr c:authCollection s:shard1  x:authCollection_shard1_replica1] o.a.s.c.SolrConfig current version of requestparams : -1
   [junit4]   2> 19066 INFO  (qtp1924469875-173) [n:127.0.0.1:45291_solr c:authCollection s:shard3 r:core_node1 x:authCollection_shard3_replica1] o.a.s.h.l.XMLLoader xsltCacheLifetimeSeconds=60
   [junit4]   2> 19067 INFO  (qtp7988554-191) [n:127.0.0.1:37565_solr c:authCollection s:shard2  x:authCollection_shard2_replica1] o.a.s.s.IndexSchema [authCollection_shard2_replica1] Schema name=minimal
   [junit4]   2> 19068 INFO  (qtp1924469875-173) [n:127.0.0.1:45291_solr c:authCollection s:shard3 r:core_node1 x:authCollection_shard3_replica1] o.a.s.c.RequestHandlers Registered paths: /admin/mbeans,/update/json/docs,/admin/luke,/export,/get,/admin/properties,/update/json,/admin/threads,/update/csv,/sql,/graph,/select,/admin/segments,/admin/system,/replication,/config,/stream,/schema,/admin/plugins,/admin/logging,/admin/ping,/update,/admin/file,/terms
   [junit4]   2> 19068 INFO  (qtp1924469875-173) [n:127.0.0.1:45291_solr c:authCollection s:shard3 r:core_node1 x:authCollection_shard3_replica1] o.a.s.c.SolrCore Using default statsCache cache: org.apache.solr.search.stats.LocalStatsCache
   [junit4]   2> 19069 INFO  (qtp1963522280-193) [n:127.0.0.1:41255_solr c:authCollection s:shard1  x:authCollection_shard1_replica1] o.a.s.c.SolrConfig Using Lucene MatchVersion: 6.3.0
   [junit4]   2> 19069 INFO  (qtp1924469875-173) [n:127.0.0.1:45291_solr c:authCollection s:shard3 r:core_node1 x:authCollection_shard3_replica1] o.a.s.u.UpdateHandler Using UpdateLog implementation: org.apache.solr.update.UpdateLog
   [junit4]   2> 19069 INFO  (qtp1924469875-173) [n:127.0.0.1:45291_solr c:authCollection s:shard3 r:core_node1 x:authCollection_shard3_replica1] o.a.s.u.UpdateLog Initializing UpdateLog: dataDir=null defaultSyncLevel=FLUSH numRecordsToKeep=100 maxNumLogsToKeep=10 numVersionBuckets=65536
   [junit4]   2> 19071 INFO  (qtp7988554-191) [n:127.0.0.1:37565_solr c:authCollection s:shard2  x:authCollection_shard2_replica1] o.a.s.s.IndexSchema unique key field: id
   [junit4]   2> 19072 INFO  (qtp1924469875-173) [n:127.0.0.1:45291_solr c:authCollection s:shard3 r:core_node1 x:authCollection_shard3_replica1] o.a.s.u.CommitTracker Hard AutoCommit: disabled
   [junit4]   2> 19072 INFO  (qtp1924469875-173) [n:127.0.0.1:45291_solr c:authCollection s:shard3 r:core_node1 x:authCollection_shard3_replica1] o.a.s.u.CommitTracker Soft AutoCommit: disabled
   [junit4]   2> 19073 INFO  (qtp7988554-191) [n:127.0.0.1:37565_solr c:authCollection s:shard2  x:authCollection_shard2_replica1] o.a.s.c.ConfigSetProperties Did not find ConfigSet properties, assuming default properties: Can't find resource 'configsetprops.json' in classpath or '/configs/conf', cwd=/home/jenkins/workspace/Lucene-Solr-6.x-Linux/solr/build/solr-core/test/J2
   [junit4]   2> 19073 INFO  (qtp7988554-191) [n:127.0.0.1:37565_solr c:authCollection s:shard2  x:authCollection_shard2_replica1] o.a.s.c.CoreContainer Creating SolrCore 'authCollection_shard2_replica1' using configuration from collection authCollection
   [junit4]   2> 19073 INFO  (qtp7988554-191) [n:127.0.0.1:37565_solr c:authCollection s:shard2 r:core_node2 x:authCollection_shard2_replica1] o.a.s.c.SolrCore org.apache.solr.core.MockDirectoryFactory
   [junit4]   2> 19074 INFO  (qtp7988554-191) [n:127.0.0.1:37565_solr c:authCollection s:shard2 r:core_node2 x:authCollection_shard2_replica1] o.a.s.c.SolrCore [[authCollection_shard2_replica1] ] Opening new SolrCore at [/home/jenkins/workspace/Lucene-Solr-6.x-Linux/solr/build/solr-core/test/J2/temp/solr.security.BasicAuthIntegrationTest_9EFE537BC715F3D1-001/tempDir-001/node1/authCollection_shard2_replica1], dataDir=[/home/jenkins/workspace/Lucene-Solr-6.x-Linux/solr/build/solr-core/test/J2/temp/solr.security.BasicAuthIntegrationTest_9EFE537BC715F3D1-001/tempDir-001/node1/./authCollection_shard2_replica1/data/]
   [junit4]   2> 19074 INFO  (qtp7988554-191) [n:127.0.0.1:37565_solr c:authCollection s:shard2 r:core_node2 x:authCollection_shard2_replica1] o.a.s.c.SolrCore JMX monitoring not detected for core: authCollection_shard2_replica1
   [junit4]   2> 19074 INFO  (qtp7988554-191) [n:127.0.0.1:37565_solr c:authCollection s:shard2 r:core_node2 x:authCollection_shard2_replica1] o.a.s.c.CachingDirectoryFactory return new directory for /home/jenkins/workspace/Lucene-Solr-6.x-Linux/solr/build/solr-core/test/J2/temp/solr.security.BasicAuthIntegrationTest_9EFE537BC715F3D1-001/tempDir-001/node1/./authCollection_shard2_replica1/data/snapshot_metadata
   [junit4]   2> 19074 INFO  (qtp7988554-191) [n:127.0.0.1:37565_solr c:authCollection s:shard2 r:core_node2 x:authCollection_shard2_replica1] o.a.s.c.s.SolrSnapshotMetaDataManager Loading from snapshot metadata file...
   [junit4]   2> 19075 INFO  (qtp7988554-191) [n:127.0.0.1:37565_solr c:authCollection s:shard2 r:core_node2 x:authCollection_shard2_replica1] o.a.s.c.CachingDirectoryFactory return new directory for /home/jenkins/workspace/Lucene-Solr-6.x-Linux/solr/build/solr-core/test/J2/temp/solr.security.BasicAuthIntegrationTest_9EFE537BC715F3D1-001/tempDir-001/node1/./authCollection_shard2_replica1/data
   [junit4]   2> 19075 INFO  (qtp7988554-191) [n:127.0.0.1:37565_solr c:authCollection s:shard2 r:core_node2 x:authCollection_shard2_replica1] o.a.s.c.SolrCore New index directory detected: old=null new=/home/jenkins/workspace/Lucene-Solr-6.x-Linux/solr/build/solr-core/test/J2/temp/solr.security.BasicAuthIntegrationTest_9EFE537BC715F3D1-001/tempDir-001/node1/./authCollection_shard2_replica1/data/index/
   [junit4]   2> 19075 WARN  (qtp7988554-191) [n:127.0.0.1:37565_solr c:authCollection s:shard2 r:core_node2 x:authCollection_shard2_replica1] o.a.s.c.SolrCore [authCollection_shard2_replica1] Solr index directory '/home/jenkins/workspace/Lucene-Solr-6.x-Linux/solr/build/solr-core/test/J2/temp/solr.security.BasicAuthIntegrationTest_9EFE537BC715F3D1-001/tempDir-001/node1/./authCollection_shard2_replica1/data/index' doesn't exist. Creating new index...
   [junit4]   2> 19075 INFO  (qtp7988554-191) [n:127.0.0.1:37565_solr c:authCollection s:shard2 r:core_node2 x:authCollection_shard2_replica1] o.a.s.c.CachingDirectoryFactory return new directory for /home/jenkins/workspace/Lucene-Solr-6.x-Linux/solr/build/solr-core/test/J2/temp/solr.security.BasicAuthIntegrationTest_9EFE537BC715F3D1-001/tempDir-001/node1/./authCollection_shard2_replica1/data/index
   [junit4]   2> 19076 INFO  (qtp1963522280-193) [n:127.0.0.1:41255_solr c:authCollection s:shard1  x:authCollection_shard1_replica1] o.a.s.c.SolrConfig Loaded SolrConfig: solrconfig.xml
   [junit4]   2> 19076 INFO  (qtp7988554-191) [n:127.0.0.1:37565_solr c:authCollection s:shard2 r:core_node2 x:authCollection_shard2_replica1] o.a.s.c.SolrDeletionPolicy SolrDeletionPolicy.onCommit: commits: num=1
   [junit4]   2> 	commit{dir=MockDirectoryWrapper(RAMDirectory@62dcdebb lockFactory=org.apache.lucene.store.SingleInstanceLockFactory@574307ee),segFN=segments_1,generation=1}
   [junit4]   2> 19076 INFO  (qtp7988554-191) [n:127.0.0.1:37565_solr c:authCollection s:shard2 r:core_node2 x:authCollection_shard2_replica1] o.a.s.c.SolrDeletionPolicy newest commit generation = 1
   [junit4]   2> 19076 INFO  (qtp1924469875-173) [n:127.0.0.1:45291_solr c:authCollection s:shard3 r:core_node1 x:authCollection_shard3_replica1] o.a.s.c.SolrDeletionPolicy SolrDeletionPolicy.onInit: commits: num=1
   [junit4]   2> 	commit{dir=MockDirectoryWrapper(RAMDirectory@19fd0328 lockFactory=org.apache.lucene.store.SingleInstanceLockFactory@2985c2b7),segFN=segments_1,generation=1}
   [junit4]   2> 19076 INFO  (qtp1924469875-173) [n:127.0.0.1:45291_solr c:authCollection s:shard3 r:core_node1 x:authCollection_shard3_replica1] o.a.s.c.SolrDeletionPolicy newest commit generation = 1
   [junit4]   2> 19077 INFO  (qtp1924469875-173) [n:127.0.0.1:45291_solr c:authCollection s:shard3 r:core_node1 x:authCollection_shard3_replica1] o.a.s.s.SolrIndexSearcher Opening [Searcher@11c97204[authCollection_shard3_replica1] main]
   [junit4]   2> 19077 INFO  (OldIndexDirectoryCleanupThreadForCore-authCollection_shard2_replica1) [n:127.0.0.1:37565_solr c:authCollection s:shard2 r:core_node2 x:authCollection_shard2_replica1] o.a.s.c.SolrCore Looking for old index directories to cleanup for core authCollection_shard2_replica1 in /home/jenkins/workspace/Lucene-Solr-6.x-Linux/solr/build/solr-core/test/J2/temp/solr.security.BasicAuthIntegrationTest_9EFE537BC715F3D1-001/tempDir-001/node1/./authCollection_shard2_replica1/data/
   [junit4]   2> 19077 INFO  (qtp1924469875-173) [n:12

[...truncated too long message...]

J2/temp/solr.security.BasicAuthIntegrationTest_9EFE537BC715F3D1-001/tempDir-001/node2/./authCollection_shard3_replica1/data;done=false>>]
   [junit4]   2> 22389 INFO  (coreCloseExecutor-162-thread-1) [n:127.0.0.1:45291_solr c:authCollection s:shard3 r:core_node1 x:authCollection_shard3_replica1] o.a.s.c.CachingDirectoryFactory Closing directory, CoreContainer#isShutdown=true
   [junit4]   2> 22389 INFO  (coreCloseExecutor-162-thread-1) [n:127.0.0.1:45291_solr c:authCollection s:shard3 r:core_node1 x:authCollection_shard3_replica1] o.a.s.c.CachingDirectoryFactory Closing directory: /home/jenkins/workspace/Lucene-Solr-6.x-Linux/solr/build/solr-core/test/J2/temp/solr.security.BasicAuthIntegrationTest_9EFE537BC715F3D1-001/tempDir-001/node2/./authCollection_shard3_replica1/data
   [junit4]   2> 22389 INFO  (coreCloseExecutor-162-thread-1) [n:127.0.0.1:45291_solr c:authCollection s:shard3 r:core_node1 x:authCollection_shard3_replica1] o.a.s.c.CachingDirectoryFactory looking to close /home/jenkins/workspace/Lucene-Solr-6.x-Linux/solr/build/solr-core/test/J2/temp/solr.security.BasicAuthIntegrationTest_9EFE537BC715F3D1-001/tempDir-001/node2/./authCollection_shard3_replica1/data/snapshot_metadata [CachedDir<<refCount=0;path=/home/jenkins/workspace/Lucene-Solr-6.x-Linux/solr/build/solr-core/test/J2/temp/solr.security.BasicAuthIntegrationTest_9EFE537BC715F3D1-001/tempDir-001/node2/./authCollection_shard3_replica1/data/snapshot_metadata;done=false>>]
   [junit4]   2> 22389 INFO  (coreCloseExecutor-162-thread-1) [n:127.0.0.1:45291_solr c:authCollection s:shard3 r:core_node1 x:authCollection_shard3_replica1] o.a.s.c.CachingDirectoryFactory Closing directory, CoreContainer#isShutdown=true
   [junit4]   2> 22389 INFO  (coreCloseExecutor-162-thread-1) [n:127.0.0.1:45291_solr c:authCollection s:shard3 r:core_node1 x:authCollection_shard3_replica1] o.a.s.c.CachingDirectoryFactory Closing directory: /home/jenkins/workspace/Lucene-Solr-6.x-Linux/solr/build/solr-core/test/J2/temp/solr.security.BasicAuthIntegrationTest_9EFE537BC715F3D1-001/tempDir-001/node2/./authCollection_shard3_replica1/data/snapshot_metadata
   [junit4]   2> 22389 INFO  (coreCloseExecutor-161-thread-1) [n:127.0.0.1:37565_solr c:authCollection s:shard2 r:core_node2 x:authCollection_shard2_replica1] o.a.s.c.CachingDirectoryFactory Closing directory, CoreContainer#isShutdown=true
   [junit4]   2> 22390 INFO  (coreCloseExecutor-161-thread-1) [n:127.0.0.1:37565_solr c:authCollection s:shard2 r:core_node2 x:authCollection_shard2_replica1] o.a.s.c.CachingDirectoryFactory Closing directory: /home/jenkins/workspace/Lucene-Solr-6.x-Linux/solr/build/solr-core/test/J2/temp/solr.security.BasicAuthIntegrationTest_9EFE537BC715F3D1-001/tempDir-001/node1/./authCollection_shard2_replica1/data/index
   [junit4]   2> 22390 INFO  (zkCallback-35-thread-1-processing-n:127.0.0.1:37565_solr) [n:127.0.0.1:37565_solr    ] o.a.s.c.c.ZkStateReader A live node change: [WatchedEvent state:SyncConnected type:NodeChildrenChanged path:/live_nodes], has occurred - updating... (live nodes size: [3])
   [junit4]   2> 22390 INFO  (zkCallback-34-thread-3-processing-n:127.0.0.1:45291_solr) [n:127.0.0.1:45291_solr    ] o.a.s.c.c.ZkStateReader A live node change: [WatchedEvent state:SyncConnected type:NodeChildrenChanged path:/live_nodes], has occurred - updating... (live nodes size: [3])
   [junit4]   2> 22390 INFO  (zkCallback-47-thread-1-processing-n:127.0.0.1:35535_solr) [n:127.0.0.1:35535_solr    ] o.a.s.c.c.ZkStateReader A live node change: [WatchedEvent state:SyncConnected type:NodeChildrenChanged path:/live_nodes], has occurred - updating... (live nodes size: [3])
   [junit4]   2> 22391 INFO  (coreCloseExecutor-161-thread-1) [n:127.0.0.1:37565_solr c:authCollection s:shard2 r:core_node2 x:authCollection_shard2_replica1] o.a.s.c.CachingDirectoryFactory looking to close /home/jenkins/workspace/Lucene-Solr-6.x-Linux/solr/build/solr-core/test/J2/temp/solr.security.BasicAuthIntegrationTest_9EFE537BC715F3D1-001/tempDir-001/node1/./authCollection_shard2_replica1/data/snapshot_metadata [CachedDir<<refCount=0;path=/home/jenkins/workspace/Lucene-Solr-6.x-Linux/solr/build/solr-core/test/J2/temp/solr.security.BasicAuthIntegrationTest_9EFE537BC715F3D1-001/tempDir-001/node1/./authCollection_shard2_replica1/data/snapshot_metadata;done=false>>]
   [junit4]   2> 22391 INFO  (coreCloseExecutor-161-thread-1) [n:127.0.0.1:37565_solr c:authCollection s:shard2 r:core_node2 x:authCollection_shard2_replica1] o.a.s.c.CachingDirectoryFactory Closing directory, CoreContainer#isShutdown=true
   [junit4]   2> 22391 INFO  (zkCallback-35-thread-1-processing-n:127.0.0.1:37565_solr) [n:127.0.0.1:37565_solr    ] o.a.s.c.c.ZkStateReader Updated live nodes from ZooKeeper... (3) -> (2)
   [junit4]   2> 22391 INFO  (coreCloseExecutor-161-thread-1) [n:127.0.0.1:37565_solr c:authCollection s:shard2 r:core_node2 x:authCollection_shard2_replica1] o.a.s.c.CachingDirectoryFactory Closing directory: /home/jenkins/workspace/Lucene-Solr-6.x-Linux/solr/build/solr-core/test/J2/temp/solr.security.BasicAuthIntegrationTest_9EFE537BC715F3D1-001/tempDir-001/node1/./authCollection_shard2_replica1/data/snapshot_metadata
   [junit4]   2> 22391 INFO  (zkCallback-35-thread-1-processing-n:127.0.0.1:37565_solr) [n:127.0.0.1:37565_solr    ] o.a.s.c.c.ZkStateReader A live node change: [WatchedEvent state:SyncConnected type:NodeChildrenChanged path:/live_nodes], has occurred - updating... (live nodes size: [2])
   [junit4]   2> 22393 WARN  (zkCallback-47-thread-1-processing-n:127.0.0.1:35535_solr) [n:127.0.0.1:35535_solr    ] o.a.s.c.c.ZkStateReader ZooKeeper watch triggered, but Solr cannot talk to ZK: [KeeperErrorCode = Session expired for /live_nodes]
   [junit4]   2> 22394 INFO  (jetty-launcher-19-thread-1) [    ] o.e.j.s.h.ContextHandler Stopped o.e.j.s.ServletContextHandler@16a32dbf{/solr,null,UNAVAILABLE}
   [junit4]   2> 22394 INFO  (jetty-launcher-19-thread-3) [    ] o.a.s.c.Overseer Overseer (id=96568852972699655-127.0.0.1:37565_solr-n_0000000000) closing
   [junit4]   2> 22394 INFO  (OverseerStateUpdate-96568852972699655-127.0.0.1:37565_solr-n_0000000000) [n:127.0.0.1:37565_solr    ] o.a.s.c.Overseer Overseer Loop exiting : 127.0.0.1:37565_solr
   [junit4]   2> 22395 INFO  (zkCallback-35-thread-1-processing-n:127.0.0.1:37565_solr) [n:127.0.0.1:37565_solr    ] o.a.s.c.c.ZkStateReader Updated live nodes from ZooKeeper... (2) -> (1)
   [junit4]   2> 22395 INFO  (zkCallback-35-thread-1-processing-n:127.0.0.1:37565_solr) [n:127.0.0.1:37565_solr    ] o.a.s.c.c.ZkStateReader A live node change: [WatchedEvent state:SyncConnected type:NodeChildrenChanged path:/live_nodes], has occurred - updating... (live nodes size: [1])
   [junit4]   2> 22396 WARN  (zkCallback-35-thread-1-processing-n:127.0.0.1:37565_solr) [n:127.0.0.1:37565_solr    ] o.a.s.c.c.ZkStateReader ZooKeeper watch triggered, but Solr cannot talk to ZK: [KeeperErrorCode = Session expired for /live_nodes]
   [junit4]   2> 22396 INFO  (jetty-launcher-19-thread-3) [    ] o.e.j.s.h.ContextHandler Stopped o.e.j.s.ServletContextHandler@18415b07{/solr,null,UNAVAILABLE}
   [junit4]   2> 23892 WARN  (zkCallback-34-thread-3-processing-n:127.0.0.1:45291_solr) [n:127.0.0.1:45291_solr    ] o.a.s.c.c.ZkStateReader ZooKeeper watch triggered, but Solr cannot talk to ZK: [KeeperErrorCode = Session expired for /live_nodes]
   [junit4]   2> 23893 INFO  (jetty-launcher-19-thread-2) [    ] o.e.j.s.h.ContextHandler Stopped o.e.j.s.ServletContextHandler@b984b93{/solr,null,UNAVAILABLE}
   [junit4]   2> 23894 INFO  (SUITE-BasicAuthIntegrationTest-seed#[9EFE537BC715F3D1]-worker) [    ] o.a.s.c.ZkTestServer connecting to 127.0.0.1:43191 43191
   [junit4]   2> 23984 INFO  (Thread-74) [    ] o.a.s.c.ZkTestServer connecting to 127.0.0.1:43191 43191
   [junit4]   2> 23996 WARN  (Thread-74) [    ] o.a.s.c.ZkTestServer Watch limit violations: 
   [junit4]   2> Maximum concurrent create/delete watches above limit:
   [junit4]   2> 
   [junit4]   2> 	5	/solr/aliases.json
   [junit4]   2> 	4	/solr/security.json
   [junit4]   2> 	4	/solr/configs/conf
   [junit4]   2> 
   [junit4]   2> Maximum concurrent data watches above limit:
   [junit4]   2> 
   [junit4]   2> 	5	/solr/clusterstate.json
   [junit4]   2> 	5	/solr/clusterprops.json
   [junit4]   2> 	4	/solr/collections/authCollection/state.json
   [junit4]   2> 	2	/solr/overseer_elect/election/96568852972699655-127.0.0.1:37565_solr-n_0000000000
   [junit4]   2> 
   [junit4]   2> Maximum concurrent children watches above limit:
   [junit4]   2> 
   [junit4]   2> 	16	/solr/overseer/queue
   [junit4]   2> 	5	/solr/collections
   [junit4]   2> 	5	/solr/overseer/collection-queue-work
   [junit4]   2> 	4	/solr/live_nodes
   [junit4]   2> 	3	/solr/overseer/queue-work
   [junit4]   2> 
   [junit4]   2> 23996 INFO  (SUITE-BasicAuthIntegrationTest-seed#[9EFE537BC715F3D1]-worker) [    ] o.a.s.SolrTestCaseJ4 ###deleteCore
   [junit4]   2> NOTE: leaving temporary files on disk at: /home/jenkins/workspace/Lucene-Solr-6.x-Linux/solr/build/solr-core/test/J2/temp/solr.security.BasicAuthIntegrationTest_9EFE537BC715F3D1-001
   [junit4]   2> Sep 10, 2016 4:09:25 PM com.carrotsearch.randomizedtesting.ThreadLeakControl checkThreadLeaks
   [junit4]   2> WARNING: Will linger awaiting termination of 1 leaked thread(s).
   [junit4]   2> NOTE: test params are: codec=Asserting(Lucene62): {}, docValues:{}, maxPointsInLeafNode=274, maxMBSortInHeap=6.914662565932836, sim=RandomSimilarity(queryNorm=true,coord=crazy): {}, locale=ar-TN, timezone=Etc/Universal
   [junit4]   2> NOTE: Linux 4.4.0-36-generic amd64/Oracle Corporation 1.8.0_102 (64-bit)/cpus=12,threads=1,free=265650240,total=407371776
   [junit4]   2> NOTE: All tests run in this JVM: [TestUtils, TestMergePolicyConfig, PreAnalyzedUpdateProcessorTest, TestFieldCacheVsDocValues, AddBlockUpdateTest, SolrPluginUtilsTest, BasicAuthIntegrationTest]
   [junit4] Completed [18/630 (1!)] on J2 in 8.80s, 1 test, 1 error <<< FAILURES!

[...truncated 62220 lines...]


Mime
View raw message