lucene-dev mailing list archives

Site index · List index
Message view « Date » · « Thread »
Top « Date » · « Thread »
From Policeman Jenkins Server <jenk...@thetaphi.de>
Subject [JENKINS] Lucene-Solr-master-Windows (64bit/jdk1.8.0_102) - Build # 6094 - Still unstable!
Date Fri, 02 Sep 2016 13:40:43 GMT
Build: http://jenkins.thetaphi.de/job/Lucene-Solr-master-Windows/6094/
Java: 64bit/jdk1.8.0_102 -XX:+UseCompressedOops -XX:+UseSerialGC

3 tests failed.
FAILED:  org.apache.solr.cloud.ForceLeaderTest.testReplicasInLIRNoLeader

Error Message:
No live SolrServers available to handle this request:[http://127.0.0.1:58701/iryp/forceleader_test_collection_shard1_replica2]

Stack Trace:
org.apache.solr.client.solrj.impl.CloudSolrClient$RouteException: No live SolrServers available to handle this request:[http://127.0.0.1:58701/iryp/forceleader_test_collection_shard1_replica2]
	at __randomizedtesting.SeedInfo.seed([C2E9814C439D3B54:247EB58C7A1FC235]:0)
	at org.apache.solr.client.solrj.impl.CloudSolrClient.directUpdate(CloudSolrClient.java:755)
	at org.apache.solr.client.solrj.impl.CloudSolrClient.sendRequest(CloudSolrClient.java:1161)
	at org.apache.solr.client.solrj.impl.CloudSolrClient.requestWithRetryOnStaleState(CloudSolrClient.java:1050)
	at org.apache.solr.client.solrj.impl.CloudSolrClient.request(CloudSolrClient.java:992)
	at org.apache.solr.cloud.AbstractFullDistribZkTestBase.sendDocsWithRetry(AbstractFullDistribZkTestBase.java:753)
	at org.apache.solr.cloud.AbstractFullDistribZkTestBase.sendDocsWithRetry(AbstractFullDistribZkTestBase.java:741)
	at org.apache.solr.cloud.ForceLeaderTest.sendDoc(ForceLeaderTest.java:424)
	at org.apache.solr.cloud.ForceLeaderTest.testReplicasInLIRNoLeader(ForceLeaderTest.java:131)
	at sun.reflect.NativeMethodAccessorImpl.invoke0(Native Method)
	at sun.reflect.NativeMethodAccessorImpl.invoke(NativeMethodAccessorImpl.java:62)
	at sun.reflect.DelegatingMethodAccessorImpl.invoke(DelegatingMethodAccessorImpl.java:43)
	at java.lang.reflect.Method.invoke(Method.java:498)
	at com.carrotsearch.randomizedtesting.RandomizedRunner.invoke(RandomizedRunner.java:1764)
	at com.carrotsearch.randomizedtesting.RandomizedRunner$8.evaluate(RandomizedRunner.java:871)
	at com.carrotsearch.randomizedtesting.RandomizedRunner$9.evaluate(RandomizedRunner.java:907)
	at com.carrotsearch.randomizedtesting.RandomizedRunner$10.evaluate(RandomizedRunner.java:921)
	at org.apache.solr.BaseDistributedSearchTestCase$ShardsRepeatRule$ShardsFixedStatement.callStatement(BaseDistributedSearchTestCase.java:985)
	at org.apache.solr.BaseDistributedSearchTestCase$ShardsRepeatRule$ShardsStatement.evaluate(BaseDistributedSearchTestCase.java:960)
	at com.carrotsearch.randomizedtesting.rules.SystemPropertiesRestoreRule$1.evaluate(SystemPropertiesRestoreRule.java:57)
	at org.apache.lucene.util.TestRuleSetupTeardownChained$1.evaluate(TestRuleSetupTeardownChained.java:49)
	at org.apache.lucene.util.AbstractBeforeAfterRule$1.evaluate(AbstractBeforeAfterRule.java:45)
	at org.apache.lucene.util.TestRuleThreadAndTestName$1.evaluate(TestRuleThreadAndTestName.java:48)
	at org.apache.lucene.util.TestRuleIgnoreAfterMaxFailures$1.evaluate(TestRuleIgnoreAfterMaxFailures.java:64)
	at org.apache.lucene.util.TestRuleMarkFailure$1.evaluate(TestRuleMarkFailure.java:47)
	at com.carrotsearch.randomizedtesting.rules.StatementAdapter.evaluate(StatementAdapter.java:36)
	at com.carrotsearch.randomizedtesting.ThreadLeakControl$StatementRunner.run(ThreadLeakControl.java:367)
	at com.carrotsearch.randomizedtesting.ThreadLeakControl.forkTimeoutingTask(ThreadLeakControl.java:809)
	at com.carrotsearch.randomizedtesting.ThreadLeakControl$3.evaluate(ThreadLeakControl.java:460)
	at com.carrotsearch.randomizedtesting.RandomizedRunner.runSingleTest(RandomizedRunner.java:880)
	at com.carrotsearch.randomizedtesting.RandomizedRunner$5.evaluate(RandomizedRunner.java:781)
	at com.carrotsearch.randomizedtesting.RandomizedRunner$6.evaluate(RandomizedRunner.java:816)
	at com.carrotsearch.randomizedtesting.RandomizedRunner$7.evaluate(RandomizedRunner.java:827)
	at com.carrotsearch.randomizedtesting.rules.StatementAdapter.evaluate(StatementAdapter.java:36)
	at com.carrotsearch.randomizedtesting.rules.SystemPropertiesRestoreRule$1.evaluate(SystemPropertiesRestoreRule.java:57)
	at org.apache.lucene.util.AbstractBeforeAfterRule$1.evaluate(AbstractBeforeAfterRule.java:45)
	at com.carrotsearch.randomizedtesting.rules.StatementAdapter.evaluate(StatementAdapter.java:36)
	at org.apache.lucene.util.TestRuleStoreClassName$1.evaluate(TestRuleStoreClassName.java:41)
	at com.carrotsearch.randomizedtesting.rules.NoShadowingOrOverridesOnMethodsRule$1.evaluate(NoShadowingOrOverridesOnMethodsRule.java:40)
	at com.carrotsearch.randomizedtesting.rules.NoShadowingOrOverridesOnMethodsRule$1.evaluate(NoShadowingOrOverridesOnMethodsRule.java:40)
	at com.carrotsearch.randomizedtesting.rules.StatementAdapter.evaluate(StatementAdapter.java:36)
	at com.carrotsearch.randomizedtesting.rules.StatementAdapter.evaluate(StatementAdapter.java:36)
	at com.carrotsearch.randomizedtesting.rules.StatementAdapter.evaluate(StatementAdapter.java:36)
	at org.apache.lucene.util.TestRuleAssertionsRequired$1.evaluate(TestRuleAssertionsRequired.java:53)
	at org.apache.lucene.util.TestRuleMarkFailure$1.evaluate(TestRuleMarkFailure.java:47)
	at org.apache.lucene.util.TestRuleIgnoreAfterMaxFailures$1.evaluate(TestRuleIgnoreAfterMaxFailures.java:64)
	at org.apache.lucene.util.TestRuleIgnoreTestSuites$1.evaluate(TestRuleIgnoreTestSuites.java:54)
	at com.carrotsearch.randomizedtesting.rules.StatementAdapter.evaluate(StatementAdapter.java:36)
	at com.carrotsearch.randomizedtesting.ThreadLeakControl$StatementRunner.run(ThreadLeakControl.java:367)
	at java.lang.Thread.run(Thread.java:745)
Caused by: org.apache.solr.client.solrj.SolrServerException: No live SolrServers available to handle this request:[http://127.0.0.1:58701/iryp/forceleader_test_collection_shard1_replica2]
	at org.apache.solr.client.solrj.impl.LBHttpSolrClient.request(LBHttpSolrClient.java:394)
	at org.apache.solr.client.solrj.impl.CloudSolrClient.lambda$directUpdate$0(CloudSolrClient.java:730)
	at java.util.concurrent.FutureTask.run(FutureTask.java:266)
	at org.apache.solr.common.util.ExecutorUtil$MDCAwareThreadPoolExecutor.lambda$execute$0(ExecutorUtil.java:229)
	at java.util.concurrent.ThreadPoolExecutor.runWorker(ThreadPoolExecutor.java:1142)
	at java.util.concurrent.ThreadPoolExecutor$Worker.run(ThreadPoolExecutor.java:617)
	... 1 more
Caused by: org.apache.solr.client.solrj.SolrServerException: Server refused connection at: http://127.0.0.1:58701/iryp/forceleader_test_collection_shard1_replica2
	at org.apache.solr.client.solrj.impl.HttpSolrClient.executeMethod(HttpSolrClient.java:615)
	at org.apache.solr.client.solrj.impl.HttpSolrClient.request(HttpSolrClient.java:261)
	at org.apache.solr.client.solrj.impl.HttpSolrClient.request(HttpSolrClient.java:250)
	at org.apache.solr.client.solrj.impl.LBHttpSolrClient.doRequest(LBHttpSolrClient.java:415)
	at org.apache.solr.client.solrj.impl.LBHttpSolrClient.request(LBHttpSolrClient.java:383)
	... 6 more
Caused by: org.apache.http.conn.HttpHostConnectException: Connect to 127.0.0.1:58701 [/127.0.0.1] failed: Connection refused: connect
	at org.apache.http.impl.conn.DefaultHttpClientConnectionOperator.connect(DefaultHttpClientConnectionOperator.java:151)
	at org.apache.http.impl.conn.PoolingHttpClientConnectionManager.connect(PoolingHttpClientConnectionManager.java:353)
	at org.apache.http.impl.execchain.MainClientExec.establishRoute(MainClientExec.java:380)
	at org.apache.http.impl.execchain.MainClientExec.execute(MainClientExec.java:236)
	at org.apache.http.impl.execchain.ProtocolExec.execute(ProtocolExec.java:184)
	at org.apache.http.impl.execchain.RetryExec.execute(RetryExec.java:88)
	at org.apache.http.impl.execchain.RedirectExec.execute(RedirectExec.java:110)
	at org.apache.http.impl.client.InternalHttpClient.doExecute(InternalHttpClient.java:184)
	at org.apache.http.impl.client.CloseableHttpClient.execute(CloseableHttpClient.java:82)
	at org.apache.http.impl.client.CloseableHttpClient.execute(CloseableHttpClient.java:55)
	at org.apache.solr.client.solrj.impl.HttpSolrClient.executeMethod(HttpSolrClient.java:513)
	... 10 more
Caused by: java.net.ConnectException: Connection refused: connect
	at java.net.DualStackPlainSocketImpl.waitForConnect(Native Method)
	at java.net.DualStackPlainSocketImpl.socketConnect(DualStackPlainSocketImpl.java:85)
	at java.net.AbstractPlainSocketImpl.doConnect(AbstractPlainSocketImpl.java:350)
	at java.net.AbstractPlainSocketImpl.connectToAddress(AbstractPlainSocketImpl.java:206)
	at java.net.AbstractPlainSocketImpl.connect(AbstractPlainSocketImpl.java:188)
	at java.net.PlainSocketImpl.connect(PlainSocketImpl.java:172)
	at java.net.SocksSocketImpl.connect(SocksSocketImpl.java:392)
	at java.net.Socket.connect(Socket.java:589)
	at org.apache.http.conn.socket.PlainConnectionSocketFactory.connectSocket(PlainConnectionSocketFactory.java:74)
	at org.apache.http.impl.conn.DefaultHttpClientConnectionOperator.connect(DefaultHttpClientConnectionOperator.java:134)
	... 20 more


FAILED:  junit.framework.TestSuite.org.apache.solr.cloud.TestSolrCloudWithSecureImpersonation

Error Message:
java.lang.NullPointerException

Stack Trace:
com.google.common.util.concurrent.UncheckedExecutionException: java.lang.NullPointerException
	at __randomizedtesting.SeedInfo.seed([C2E9814C439D3B54]:0)
	at com.google.common.cache.LocalCache$Segment.get(LocalCache.java:2263)
	at com.google.common.cache.LocalCache.get(LocalCache.java:4000)
	at com.google.common.cache.LocalCache.getOrLoad(LocalCache.java:4004)
	at com.google.common.cache.LocalCache$LocalLoadingCache.get(LocalCache.java:4874)
	at org.apache.hadoop.security.Groups.getGroups(Groups.java:182)
	at org.apache.solr.cloud.TestSolrCloudWithSecureImpersonation.getUsersFirstGroup(TestSolrCloudWithSecureImpersonation.java:64)
	at org.apache.solr.cloud.TestSolrCloudWithSecureImpersonation.getImpersonatorSettings(TestSolrCloudWithSecureImpersonation.java:86)
	at org.apache.solr.cloud.TestSolrCloudWithSecureImpersonation.startup(TestSolrCloudWithSecureImpersonation.java:99)
	at sun.reflect.NativeMethodAccessorImpl.invoke0(Native Method)
	at sun.reflect.NativeMethodAccessorImpl.invoke(NativeMethodAccessorImpl.java:62)
	at sun.reflect.DelegatingMethodAccessorImpl.invoke(DelegatingMethodAccessorImpl.java:43)
	at java.lang.reflect.Method.invoke(Method.java:498)
	at com.carrotsearch.randomizedtesting.RandomizedRunner.invoke(RandomizedRunner.java:1764)
	at com.carrotsearch.randomizedtesting.RandomizedRunner$6.evaluate(RandomizedRunner.java:811)
	at com.carrotsearch.randomizedtesting.RandomizedRunner$7.evaluate(RandomizedRunner.java:827)
	at com.carrotsearch.randomizedtesting.rules.StatementAdapter.evaluate(StatementAdapter.java:36)
	at com.carrotsearch.randomizedtesting.rules.SystemPropertiesRestoreRule$1.evaluate(SystemPropertiesRestoreRule.java:57)
	at org.apache.lucene.util.AbstractBeforeAfterRule$1.evaluate(AbstractBeforeAfterRule.java:45)
	at com.carrotsearch.randomizedtesting.rules.StatementAdapter.evaluate(StatementAdapter.java:36)
	at org.apache.lucene.util.TestRuleStoreClassName$1.evaluate(TestRuleStoreClassName.java:41)
	at com.carrotsearch.randomizedtesting.rules.NoShadowingOrOverridesOnMethodsRule$1.evaluate(NoShadowingOrOverridesOnMethodsRule.java:40)
	at com.carrotsearch.randomizedtesting.rules.NoShadowingOrOverridesOnMethodsRule$1.evaluate(NoShadowingOrOverridesOnMethodsRule.java:40)
	at com.carrotsearch.randomizedtesting.rules.StatementAdapter.evaluate(StatementAdapter.java:36)
	at com.carrotsearch.randomizedtesting.rules.StatementAdapter.evaluate(StatementAdapter.java:36)
	at com.carrotsearch.randomizedtesting.rules.StatementAdapter.evaluate(StatementAdapter.java:36)
	at org.apache.lucene.util.TestRuleAssertionsRequired$1.evaluate(TestRuleAssertionsRequired.java:53)
	at org.apache.lucene.util.TestRuleMarkFailure$1.evaluate(TestRuleMarkFailure.java:47)
	at org.apache.lucene.util.TestRuleIgnoreAfterMaxFailures$1.evaluate(TestRuleIgnoreAfterMaxFailures.java:64)
	at org.apache.lucene.util.TestRuleIgnoreTestSuites$1.evaluate(TestRuleIgnoreTestSuites.java:54)
	at com.carrotsearch.randomizedtesting.rules.StatementAdapter.evaluate(StatementAdapter.java:36)
	at com.carrotsearch.randomizedtesting.ThreadLeakControl$StatementRunner.run(ThreadLeakControl.java:367)
	at java.lang.Thread.run(Thread.java:745)
Caused by: java.lang.NullPointerException
	at java.lang.ProcessBuilder.start(ProcessBuilder.java:1012)
	at org.apache.hadoop.util.Shell.runCommand(Shell.java:483)
	at org.apache.hadoop.util.Shell.run(Shell.java:456)
	at org.apache.hadoop.util.Shell$ShellCommandExecutor.execute(Shell.java:722)
	at org.apache.hadoop.util.Shell.execCommand(Shell.java:815)
	at org.apache.hadoop.util.Shell.execCommand(Shell.java:798)
	at org.apache.hadoop.security.ShellBasedUnixGroupsMapping.getUnixGroups(ShellBasedUnixGroupsMapping.java:84)
	at org.apache.hadoop.security.ShellBasedUnixGroupsMapping.getGroups(ShellBasedUnixGroupsMapping.java:52)
	at org.apache.hadoop.security.JniBasedUnixGroupsMappingWithFallback.getGroups(JniBasedUnixGroupsMappingWithFallback.java:51)
	at org.apache.hadoop.security.Groups$GroupCacheLoader.fetchGroupList(Groups.java:239)
	at org.apache.hadoop.security.Groups$GroupCacheLoader.load(Groups.java:220)
	at org.apache.hadoop.security.Groups$GroupCacheLoader.load(Groups.java:208)
	at com.google.common.cache.LocalCache$LoadingValueReference.loadFuture(LocalCache.java:3599)
	at com.google.common.cache.LocalCache$Segment.loadSync(LocalCache.java:2379)
	at com.google.common.cache.LocalCache$Segment.lockedGetOrLoad(LocalCache.java:2342)
	at com.google.common.cache.LocalCache$Segment.get(LocalCache.java:2257)
	... 31 more


FAILED:  junit.framework.TestSuite.org.apache.solr.cloud.TestSolrCloudWithSecureImpersonation

Error Message:


Stack Trace:
java.lang.NullPointerException
	at __randomizedtesting.SeedInfo.seed([C2E9814C439D3B54]:0)
	at org.apache.solr.cloud.TestSolrCloudWithSecureImpersonation.shutdown(TestSolrCloudWithSecureImpersonation.java:154)
	at sun.reflect.NativeMethodAccessorImpl.invoke0(Native Method)
	at sun.reflect.NativeMethodAccessorImpl.invoke(NativeMethodAccessorImpl.java:62)
	at sun.reflect.DelegatingMethodAccessorImpl.invoke(DelegatingMethodAccessorImpl.java:43)
	at java.lang.reflect.Method.invoke(Method.java:498)
	at com.carrotsearch.randomizedtesting.RandomizedRunner.invoke(RandomizedRunner.java:1764)
	at com.carrotsearch.randomizedtesting.RandomizedRunner$7.evaluate(RandomizedRunner.java:834)
	at com.carrotsearch.randomizedtesting.rules.StatementAdapter.evaluate(StatementAdapter.java:36)
	at com.carrotsearch.randomizedtesting.rules.SystemPropertiesRestoreRule$1.evaluate(SystemPropertiesRestoreRule.java:57)
	at org.apache.lucene.util.AbstractBeforeAfterRule$1.evaluate(AbstractBeforeAfterRule.java:45)
	at com.carrotsearch.randomizedtesting.rules.StatementAdapter.evaluate(StatementAdapter.java:36)
	at org.apache.lucene.util.TestRuleStoreClassName$1.evaluate(TestRuleStoreClassName.java:41)
	at com.carrotsearch.randomizedtesting.rules.NoShadowingOrOverridesOnMethodsRule$1.evaluate(NoShadowingOrOverridesOnMethodsRule.java:40)
	at com.carrotsearch.randomizedtesting.rules.NoShadowingOrOverridesOnMethodsRule$1.evaluate(NoShadowingOrOverridesOnMethodsRule.java:40)
	at com.carrotsearch.randomizedtesting.rules.StatementAdapter.evaluate(StatementAdapter.java:36)
	at com.carrotsearch.randomizedtesting.rules.StatementAdapter.evaluate(StatementAdapter.java:36)
	at com.carrotsearch.randomizedtesting.rules.StatementAdapter.evaluate(StatementAdapter.java:36)
	at org.apache.lucene.util.TestRuleAssertionsRequired$1.evaluate(TestRuleAssertionsRequired.java:53)
	at org.apache.lucene.util.TestRuleMarkFailure$1.evaluate(TestRuleMarkFailure.java:47)
	at org.apache.lucene.util.TestRuleIgnoreAfterMaxFailures$1.evaluate(TestRuleIgnoreAfterMaxFailures.java:64)
	at org.apache.lucene.util.TestRuleIgnoreTestSuites$1.evaluate(TestRuleIgnoreTestSuites.java:54)
	at com.carrotsearch.randomizedtesting.rules.StatementAdapter.evaluate(StatementAdapter.java:36)
	at com.carrotsearch.randomizedtesting.ThreadLeakControl$StatementRunner.run(ThreadLeakControl.java:367)
	at java.lang.Thread.run(Thread.java:745)




Build Log:
[...truncated 10862 lines...]
   [junit4] Suite: org.apache.solr.cloud.ForceLeaderTest
   [junit4]   2> Creating dataDir: C:\Users\jenkins\workspace\Lucene-Solr-master-Windows\solr\build\solr-core\test\J1\temp\solr.cloud.ForceLeaderTest_C2E9814C439D3B54-001\init-core-data-001
   [junit4]   2> 671604 INFO  (SUITE-ForceLeaderTest-seed#[C2E9814C439D3B54]-worker) [    ] o.a.s.SolrTestCaseJ4 Randomized ssl (false) and clientAuth (false) via: @org.apache.solr.SolrTestCaseJ4$SuppressSSL(bugUrl=https://issues.apache.org/jira/browse/SOLR-5776)
   [junit4]   2> 671604 INFO  (SUITE-ForceLeaderTest-seed#[C2E9814C439D3B54]-worker) [    ] o.a.s.BaseDistributedSearchTestCase Setting hostContext system property: /iryp/
   [junit4]   2> 671606 INFO  (TEST-ForceLeaderTest.testLastPublishedStateIsActive-seed#[C2E9814C439D3B54]) [    ] o.a.s.c.ZkTestServer STARTING ZK TEST SERVER
   [junit4]   2> 671607 INFO  (Thread-1164) [    ] o.a.s.c.ZkTestServer client port:0.0.0.0/0.0.0.0:0
   [junit4]   2> 671607 INFO  (Thread-1164) [    ] o.a.s.c.ZkTestServer Starting server
   [junit4]   2> 671708 INFO  (TEST-ForceLeaderTest.testLastPublishedStateIsActive-seed#[C2E9814C439D3B54]) [    ] o.a.s.c.ZkTestServer start zk server on port:58484
   [junit4]   2> 671708 INFO  (TEST-ForceLeaderTest.testLastPublishedStateIsActive-seed#[C2E9814C439D3B54]) [    ] o.a.s.c.c.SolrZkClient Using default ZkCredentialsProvider
   [junit4]   2> 671708 INFO  (TEST-ForceLeaderTest.testLastPublishedStateIsActive-seed#[C2E9814C439D3B54]) [    ] o.a.s.c.c.ConnectionManager Waiting for client to connect to ZooKeeper
   [junit4]   2> 671718 INFO  (zkCallback-720-thread-1) [    ] o.a.s.c.c.ConnectionManager Watcher org.apache.solr.common.cloud.ConnectionManager@542e26a name:ZooKeeperConnection Watcher:127.0.0.1:58484 got event WatchedEvent state:SyncConnected type:None path:null path:null type:None
   [junit4]   2> 671718 INFO  (TEST-ForceLeaderTest.testLastPublishedStateIsActive-seed#[C2E9814C439D3B54]) [    ] o.a.s.c.c.ConnectionManager Client is connected to ZooKeeper
   [junit4]   2> 671718 INFO  (TEST-ForceLeaderTest.testLastPublishedStateIsActive-seed#[C2E9814C439D3B54]) [    ] o.a.s.c.c.SolrZkClient Using default ZkACLProvider
   [junit4]   2> 671719 INFO  (TEST-ForceLeaderTest.testLastPublishedStateIsActive-seed#[C2E9814C439D3B54]) [    ] o.a.s.c.c.SolrZkClient makePath: /solr
   [junit4]   2> 671723 INFO  (TEST-ForceLeaderTest.testLastPublishedStateIsActive-seed#[C2E9814C439D3B54]) [    ] o.a.s.c.c.SolrZkClient Using default ZkCredentialsProvider
   [junit4]   2> 671725 INFO  (TEST-ForceLeaderTest.testLastPublishedStateIsActive-seed#[C2E9814C439D3B54]) [    ] o.a.s.c.c.ConnectionManager Waiting for client to connect to ZooKeeper
   [junit4]   2> 671727 INFO  (zkCallback-721-thread-1) [    ] o.a.s.c.c.ConnectionManager Watcher org.apache.solr.common.cloud.ConnectionManager@30e86897 name:ZooKeeperConnection Watcher:127.0.0.1:58484/solr got event WatchedEvent state:SyncConnected type:None path:null path:null type:None
   [junit4]   2> 671727 INFO  (TEST-ForceLeaderTest.testLastPublishedStateIsActive-seed#[C2E9814C439D3B54]) [    ] o.a.s.c.c.ConnectionManager Client is connected to ZooKeeper
   [junit4]   2> 671727 INFO  (TEST-ForceLeaderTest.testLastPublishedStateIsActive-seed#[C2E9814C439D3B54]) [    ] o.a.s.c.c.SolrZkClient Using default ZkACLProvider
   [junit4]   2> 671727 INFO  (TEST-ForceLeaderTest.testLastPublishedStateIsActive-seed#[C2E9814C439D3B54]) [    ] o.a.s.c.c.SolrZkClient makePath: /collections/collection1
   [junit4]   2> 671730 INFO  (TEST-ForceLeaderTest.testLastPublishedStateIsActive-seed#[C2E9814C439D3B54]) [    ] o.a.s.c.c.SolrZkClient makePath: /collections/collection1/shards
   [junit4]   2> 671731 INFO  (TEST-ForceLeaderTest.testLastPublishedStateIsActive-seed#[C2E9814C439D3B54]) [    ] o.a.s.c.c.SolrZkClient makePath: /collections/control_collection
   [junit4]   2> 671733 INFO  (TEST-ForceLeaderTest.testLastPublishedStateIsActive-seed#[C2E9814C439D3B54]) [    ] o.a.s.c.c.SolrZkClient makePath: /collections/control_collection/shards
   [junit4]   2> 671734 INFO  (TEST-ForceLeaderTest.testLastPublishedStateIsActive-seed#[C2E9814C439D3B54]) [    ] o.a.s.c.AbstractZkTestCase put C:\Users\jenkins\workspace\Lucene-Solr-master-Windows\solr\core\src\test-files\solr\collection1\conf\solrconfig-tlog.xml to /configs/conf1/solrconfig.xml
   [junit4]   2> 671736 INFO  (TEST-ForceLeaderTest.testLastPublishedStateIsActive-seed#[C2E9814C439D3B54]) [    ] o.a.s.c.c.SolrZkClient makePath: /configs/conf1/solrconfig.xml
   [junit4]   2> 671738 INFO  (TEST-ForceLeaderTest.testLastPublishedStateIsActive-seed#[C2E9814C439D3B54]) [    ] o.a.s.c.AbstractZkTestCase put C:\Users\jenkins\workspace\Lucene-Solr-master-Windows\solr\core\src\test-files\solr\collection1\conf\schema.xml to /configs/conf1/schema.xml
   [junit4]   2> 671739 INFO  (TEST-ForceLeaderTest.testLastPublishedStateIsActive-seed#[C2E9814C439D3B54]) [    ] o.a.s.c.c.SolrZkClient makePath: /configs/conf1/schema.xml
   [junit4]   2> 671740 INFO  (TEST-ForceLeaderTest.testLastPublishedStateIsActive-seed#[C2E9814C439D3B54]) [    ] o.a.s.c.AbstractZkTestCase put C:\Users\jenkins\workspace\Lucene-Solr-master-Windows\solr\core\src\test-files\solr\collection1\conf\solrconfig.snippet.randomindexconfig.xml to /configs/conf1/solrconfig.snippet.randomindexconfig.xml
   [junit4]   2> 671740 INFO  (TEST-ForceLeaderTest.testLastPublishedStateIsActive-seed#[C2E9814C439D3B54]) [    ] o.a.s.c.c.SolrZkClient makePath: /configs/conf1/solrconfig.snippet.randomindexconfig.xml
   [junit4]   2> 671742 INFO  (TEST-ForceLeaderTest.testLastPublishedStateIsActive-seed#[C2E9814C439D3B54]) [    ] o.a.s.c.AbstractZkTestCase put C:\Users\jenkins\workspace\Lucene-Solr-master-Windows\solr\core\src\test-files\solr\collection1\conf\stopwords.txt to /configs/conf1/stopwords.txt
   [junit4]   2> 671742 INFO  (TEST-ForceLeaderTest.testLastPublishedStateIsActive-seed#[C2E9814C439D3B54]) [    ] o.a.s.c.c.SolrZkClient makePath: /configs/conf1/stopwords.txt
   [junit4]   2> 671744 INFO  (TEST-ForceLeaderTest.testLastPublishedStateIsActive-seed#[C2E9814C439D3B54]) [    ] o.a.s.c.AbstractZkTestCase put C:\Users\jenkins\workspace\Lucene-Solr-master-Windows\solr\core\src\test-files\solr\collection1\conf\protwords.txt to /configs/conf1/protwords.txt
   [junit4]   2> 671744 INFO  (TEST-ForceLeaderTest.testLastPublishedStateIsActive-seed#[C2E9814C439D3B54]) [    ] o.a.s.c.c.SolrZkClient makePath: /configs/conf1/protwords.txt
   [junit4]   2> 671747 INFO  (TEST-ForceLeaderTest.testLastPublishedStateIsActive-seed#[C2E9814C439D3B54]) [    ] o.a.s.c.AbstractZkTestCase put C:\Users\jenkins\workspace\Lucene-Solr-master-Windows\solr\core\src\test-files\solr\collection1\conf\currency.xml to /configs/conf1/currency.xml
   [junit4]   2> 671747 INFO  (TEST-ForceLeaderTest.testLastPublishedStateIsActive-seed#[C2E9814C439D3B54]) [    ] o.a.s.c.c.SolrZkClient makePath: /configs/conf1/currency.xml
   [junit4]   2> 671749 INFO  (TEST-ForceLeaderTest.testLastPublishedStateIsActive-seed#[C2E9814C439D3B54]) [    ] o.a.s.c.AbstractZkTestCase put C:\Users\jenkins\workspace\Lucene-Solr-master-Windows\solr\core\src\test-files\solr\collection1\conf\enumsConfig.xml to /configs/conf1/enumsConfig.xml
   [junit4]   2> 671749 INFO  (TEST-ForceLeaderTest.testLastPublishedStateIsActive-seed#[C2E9814C439D3B54]) [    ] o.a.s.c.c.SolrZkClient makePath: /configs/conf1/enumsConfig.xml
   [junit4]   2> 671752 INFO  (TEST-ForceLeaderTest.testLastPublishedStateIsActive-seed#[C2E9814C439D3B54]) [    ] o.a.s.c.AbstractZkTestCase put C:\Users\jenkins\workspace\Lucene-Solr-master-Windows\solr\core\src\test-files\solr\collection1\conf\open-exchange-rates.json to /configs/conf1/open-exchange-rates.json
   [junit4]   2> 671752 INFO  (TEST-ForceLeaderTest.testLastPublishedStateIsActive-seed#[C2E9814C439D3B54]) [    ] o.a.s.c.c.SolrZkClient makePath: /configs/conf1/open-exchange-rates.json
   [junit4]   2> 671757 INFO  (TEST-ForceLeaderTest.testLastPublishedStateIsActive-seed#[C2E9814C439D3B54]) [    ] o.a.s.c.AbstractZkTestCase put C:\Users\jenkins\workspace\Lucene-Solr-master-Windows\solr\core\src\test-files\solr\collection1\conf\mapping-ISOLatin1Accent.txt to /configs/conf1/mapping-ISOLatin1Accent.txt
   [junit4]   2> 671757 INFO  (TEST-ForceLeaderTest.testLastPublishedStateIsActive-seed#[C2E9814C439D3B54]) [    ] o.a.s.c.c.SolrZkClient makePath: /configs/conf1/mapping-ISOLatin1Accent.txt
   [junit4]   2> 671759 INFO  (TEST-ForceLeaderTest.testLastPublishedStateIsActive-seed#[C2E9814C439D3B54]) [    ] o.a.s.c.AbstractZkTestCase put C:\Users\jenkins\workspace\Lucene-Solr-master-Windows\solr\core\src\test-files\solr\collection1\conf\old_synonyms.txt to /configs/conf1/old_synonyms.txt
   [junit4]   2> 671759 INFO  (TEST-ForceLeaderTest.testLastPublishedStateIsActive-seed#[C2E9814C439D3B54]) [    ] o.a.s.c.c.SolrZkClient makePath: /configs/conf1/old_synonyms.txt
   [junit4]   2> 671760 INFO  (TEST-ForceLeaderTest.testLastPublishedStateIsActive-seed#[C2E9814C439D3B54]) [    ] o.a.s.c.AbstractZkTestCase put C:\Users\jenkins\workspace\Lucene-Solr-master-Windows\solr\core\src\test-files\solr\collection1\conf\synonyms.txt to /configs/conf1/synonyms.txt
   [junit4]   2> 671760 INFO  (TEST-ForceLeaderTest.testLastPublishedStateIsActive-seed#[C2E9814C439D3B54]) [    ] o.a.s.c.c.SolrZkClient makePath: /configs/conf1/synonyms.txt
   [junit4]   2> 672261 INFO  (TEST-ForceLeaderTest.testLastPublishedStateIsActive-seed#[C2E9814C439D3B54]) [    ] o.a.s.SolrTestCaseJ4 Writing core.properties file to C:\Users\jenkins\workspace\Lucene-Solr-master-Windows\solr\build\solr-core\test\J1\temp\solr.cloud.ForceLeaderTest_C2E9814C439D3B54-001\control-001\cores\collection1
   [junit4]   2> 672276 INFO  (TEST-ForceLeaderTest.testLastPublishedStateIsActive-seed#[C2E9814C439D3B54]) [    ] o.e.j.s.Server jetty-9.3.8.v20160314
   [junit4]   2> 672290 INFO  (TEST-ForceLeaderTest.testLastPublishedStateIsActive-seed#[C2E9814C439D3B54]) [    ] o.e.j.s.h.ContextHandler Started o.e.j.s.ServletContextHandler@6c06cb41{/iryp,null,AVAILABLE}
   [junit4]   2> 672298 INFO  (TEST-ForceLeaderTest.testLastPublishedStateIsActive-seed#[C2E9814C439D3B54]) [    ] o.e.j.s.ServerConnector Started ServerConnector@4b40eaa8{HTTP/1.1,[http/1.1]}{127.0.0.1:58492}
   [junit4]   2> 672298 INFO  (TEST-ForceLeaderTest.testLastPublishedStateIsActive-seed#[C2E9814C439D3B54]) [    ] o.e.j.s.Server Started @676871ms
   [junit4]   2> 672298 INFO  (TEST-ForceLeaderTest.testLastPublishedStateIsActive-seed#[C2E9814C439D3B54]) [    ] o.a.s.c.s.e.JettySolrRunner Jetty properties: {solr.data.dir=C:\Users\jenkins\workspace\Lucene-Solr-master-Windows\solr\build\solr-core\test\J1\temp\solr.cloud.ForceLeaderTest_C2E9814C439D3B54-001\tempDir-001/control/data, hostContext=/iryp, hostPort=58491, coreRootDirectory=C:\Users\jenkins\workspace\Lucene-Solr-master-Windows\solr\build\solr-core\test\J1\temp\solr.cloud.ForceLeaderTest_C2E9814C439D3B54-001\control-001\cores}
   [junit4]   2> 672299 INFO  (TEST-ForceLeaderTest.testLastPublishedStateIsActive-seed#[C2E9814C439D3B54]) [    ] o.a.s.s.SolrDispatchFilter SolrDispatchFilter.init(): sun.misc.Launcher$AppClassLoader@73d16e93
   [junit4]   2> 672299 INFO  (TEST-ForceLeaderTest.testLastPublishedStateIsActive-seed#[C2E9814C439D3B54]) [    ] o.a.s.c.SolrResourceLoader new SolrResourceLoader for directory: 'C:\Users\jenkins\workspace\Lucene-Solr-master-Windows\solr\build\solr-core\test\J1\temp\solr.cloud.ForceLeaderTest_C2E9814C439D3B54-001\control-001'
   [junit4]   2> 672299 INFO  (TEST-ForceLeaderTest.testLastPublishedStateIsActive-seed#[C2E9814C439D3B54]) [    ] o.a.s.c.SolrResourceLoader JNDI not configured for solr (NoInitialContextEx)
   [junit4]   2> 672299 INFO  (TEST-ForceLeaderTest.testLastPublishedStateIsActive-seed#[C2E9814C439D3B54]) [    ] o.a.s.c.SolrResourceLoader solr home defaulted to 'solr/' (could not find system property or JNDI)
   [junit4]   2> 672300 INFO  (TEST-ForceLeaderTest.testLastPublishedStateIsActive-seed#[C2E9814C439D3B54]) [    ] o.a.s.c.c.SolrZkClient Using default ZkCredentialsProvider
   [junit4]   2> 672301 INFO  (TEST-ForceLeaderTest.testLastPublishedStateIsActive-seed#[C2E9814C439D3B54]) [    ] o.a.s.c.c.ConnectionManager Waiting for client to connect to ZooKeeper
   [junit4]   2> 672356 INFO  (zkCallback-722-thread-1) [    ] o.a.s.c.c.ConnectionManager Watcher org.apache.solr.common.cloud.ConnectionManager@5c79feed name:ZooKeeperConnection Watcher:127.0.0.1:58484/solr got event WatchedEvent state:SyncConnected type:None path:null path:null type:None
   [junit4]   2> 672356 INFO  (TEST-ForceLeaderTest.testLastPublishedStateIsActive-seed#[C2E9814C439D3B54]) [    ] o.a.s.c.c.ConnectionManager Client is connected to ZooKeeper
   [junit4]   2> 672357 INFO  (TEST-ForceLeaderTest.testLastPublishedStateIsActive-seed#[C2E9814C439D3B54]) [    ] o.a.s.c.c.SolrZkClient Using default ZkACLProvider
   [junit4]   2> 672361 INFO  (TEST-ForceLeaderTest.testLastPublishedStateIsActive-seed#[C2E9814C439D3B54]) [    ] o.a.s.s.SolrDispatchFilter Loading solr.xml from SolrHome (not found in ZooKeeper)
   [junit4]   2> 672361 INFO  (TEST-ForceLeaderTest.testLastPublishedStateIsActive-seed#[C2E9814C439D3B54]) [    ] o.a.s.c.SolrXmlConfig Loading container configuration from C:\Users\jenkins\workspace\Lucene-Solr-master-Windows\solr\build\solr-core\test\J1\temp\solr.cloud.ForceLeaderTest_C2E9814C439D3B54-001\control-001\solr.xml
   [junit4]   2> 672401 INFO  (TEST-ForceLeaderTest.testLastPublishedStateIsActive-seed#[C2E9814C439D3B54]) [    ] o.a.s.c.CorePropertiesLocator Config-defined core root directory: C:\Users\jenkins\workspace\Lucene-Solr-master-Windows\solr\build\solr-core\test\J1\temp\solr.cloud.ForceLeaderTest_C2E9814C439D3B54-001\control-001\cores
   [junit4]   2> 672401 INFO  (TEST-ForceLeaderTest.testLastPublishedStateIsActive-seed#[C2E9814C439D3B54]) [    ] o.a.s.c.CoreContainer New CoreContainer 4220339
   [junit4]   2> 672401 INFO  (TEST-ForceLeaderTest.testLastPublishedStateIsActive-seed#[C2E9814C439D3B54]) [    ] o.a.s.c.CoreContainer Loading cores into CoreContainer [instanceDir=C:\Users\jenkins\workspace\Lucene-Solr-master-Windows\solr\build\solr-core\test\J1\temp\solr.cloud.ForceLeaderTest_C2E9814C439D3B54-001\control-001]
   [junit4]   2> 672401 WARN  (TEST-ForceLeaderTest.testLastPublishedStateIsActive-seed#[C2E9814C439D3B54]) [    ] o.a.s.c.CoreContainer Couldn't add files from C:\Users\jenkins\workspace\Lucene-Solr-master-Windows\solr\build\solr-core\test\J1\temp\solr.cloud.ForceLeaderTest_C2E9814C439D3B54-001\control-001\lib to classpath: C:\Users\jenkins\workspace\Lucene-Solr-master-Windows\solr\build\solr-core\test\J1\temp\solr.cloud.ForceLeaderTest_C2E9814C439D3B54-001\control-001\lib
   [junit4]   2> 672401 INFO  (TEST-ForceLeaderTest.testLastPublishedStateIsActive-seed#[C2E9814C439D3B54]) [    ] o.a.s.h.c.HttpShardHandlerFactory created with socketTimeout : 90000,urlScheme : ,connTimeout : 15000,maxConnectionsPerHost : 20,maxConnections : 10000,corePoolSize : 0,maximumPoolSize : 2147483647,maxThreadIdleTime : 5,sizeOfQueue : -1,fairnessPolicy : false,
   [junit4]   2> 672412 INFO  (TEST-ForceLeaderTest.testLastPublishedStateIsActive-seed#[C2E9814C439D3B54]) [    ] o.a.s.u.UpdateShardHandler Created UpdateShardHandler HTTP client with params: socketTimeout=340000&connTimeout=45000&maxConnections=100000&maxConnectionsPerHost=100000
   [junit4]   2> 672412 INFO  (TEST-ForceLeaderTest.testLastPublishedStateIsActive-seed#[C2E9814C439D3B54]) [    ] o.a.s.l.LogWatcher SLF4J impl is org.slf4j.impl.Log4jLoggerFactory
   [junit4]   2> 672412 INFO  (TEST-ForceLeaderTest.testLastPublishedStateIsActive-seed#[C2E9814C439D3B54]) [    ] o.a.s.l.LogWatcher Registering Log Listener [Log4j (org.slf4j.impl.Log4jLoggerFactory)]
   [junit4]   2> 672412 INFO  (TEST-ForceLeaderTest.testLastPublishedStateIsActive-seed#[C2E9814C439D3B54]) [    ] o.a.s.c.ZkContainer Zookeeper client=127.0.0.1:58484/solr
   [junit4]   2> 672412 INFO  (TEST-ForceLeaderTest.testLastPublishedStateIsActive-seed#[C2E9814C439D3B54]) [    ] o.a.s.c.ZkController zkHost includes chroot
   [junit4]   2> 672412 INFO  (TEST-ForceLeaderTest.testLastPublishedStateIsActive-seed#[C2E9814C439D3B54]) [    ] o.a.s.c.c.SolrZkClient Using default ZkCredentialsProvider
   [junit4]   2> 672413 INFO  (TEST-ForceLeaderTest.testLastPublishedStateIsActive-seed#[C2E9814C439D3B54]) [    ] o.a.s.c.c.ConnectionManager Waiting for client to connect to ZooKeeper
   [junit4]   2> 672452 INFO  (zkCallback-725-thread-1) [    ] o.a.s.c.c.ConnectionManager Watcher org.apache.solr.common.cloud.ConnectionManager@23479cd4 name:ZooKeeperConnection Watcher:127.0.0.1:58484 got event WatchedEvent state:SyncConnected type:None path:null path:null type:None
   [junit4]   2> 672453 INFO  (TEST-ForceLeaderTest.testLastPublishedStateIsActive-seed#[C2E9814C439D3B54]) [    ] o.a.s.c.c.ConnectionManager Client is connected to ZooKeeper
   [junit4]   2> 672453 INFO  (TEST-ForceLeaderTest.testLastPublishedStateIsActive-seed#[C2E9814C439D3B54]) [    ] o.a.s.c.c.SolrZkClient Using default ZkACLProvider
   [junit4]   2> 672457 INFO  (TEST-ForceLeaderTest.testLastPublishedStateIsActive-seed#[C2E9814C439D3B54]) [n:127.0.0.1:58491_iryp    ] o.a.s.c.ZkController Added new OnReconnect listener org.apache.solr.cloud.ZkController$$Lambda$71/164965549@2e64f299
   [junit4]   2> 672458 INFO  (TEST-ForceLeaderTest.testLastPublishedStateIsActive-seed#[C2E9814C439D3B54]) [n:127.0.0.1:58491_iryp    ] o.a.s.c.c.ConnectionManager Waiting for client to connect to ZooKeeper
   [junit4]   2> 672463 INFO  (zkCallback-726-thread-1-processing-n:127.0.0.1:58491_iryp) [n:127.0.0.1:58491_iryp    ] o.a.s.c.c.ConnectionManager Watcher org.apache.solr.common.cloud.ConnectionManager@4c42272b name:ZooKeeperConnection Watcher:127.0.0.1:58484/solr got event WatchedEvent state:SyncConnected type:None path:null path:null type:None
   [junit4]   2> 672463 INFO  (TEST-ForceLeaderTest.testLastPublishedStateIsActive-seed#[C2E9814C439D3B54]) [n:127.0.0.1:58491_iryp    ] o.a.s.c.c.ConnectionManager Client is connected to ZooKeeper
   [junit4]   2> 672467 INFO  (TEST-ForceLeaderTest.testLastPublishedStateIsActive-seed#[C2E9814C439D3B54]) [n:127.0.0.1:58491_iryp    ] o.a.s.c.c.SolrZkClient makePath: /overseer/queue
   [junit4]   2> 672470 INFO  (TEST-ForceLeaderTest.testLastPublishedStateIsActive-seed#[C2E9814C439D3B54]) [n:127.0.0.1:58491_iryp    ] o.a.s.c.c.SolrZkClient makePath: /overseer/collection-queue-work
   [junit4]   2> 672477 INFO  (TEST-ForceLeaderTest.testLastPublishedStateIsActive-seed#[C2E9814C439D3B54]) [n:127.0.0.1:58491_iryp    ] o.a.s.c.c.SolrZkClient makePath: /overseer/collection-map-running
   [junit4]   2> 672480 INFO  (TEST-ForceLeaderTest.testLastPublishedStateIsActive-seed#[C2E9814C439D3B54]) [n:127.0.0.1:58491_iryp    ] o.a.s.c.c.SolrZkClient makePath: /overseer/collection-map-completed
   [junit4]   2> 672483 INFO  (TEST-ForceLeaderTest.testLastPublishedStateIsActive-seed#[C2E9814C439D3B54]) [n:127.0.0.1:58491_iryp    ] o.a.s.c.c.SolrZkClient makePath: /overseer/collection-map-failure
   [junit4]   2> 672485 INFO  (TEST-ForceLeaderTest.testLastPublishedStateIsActive-seed#[C2E9814C439D3B54]) [n:127.0.0.1:58491_iryp    ] o.a.s.c.c.SolrZkClient makePath: /live_nodes
   [junit4]   2> 672488 INFO  (TEST-ForceLeaderTest.testLastPublishedStateIsActive-seed#[C2E9814C439D3B54]) [n:127.0.0.1:58491_iryp    ] o.a.s.c.c.SolrZkClient makePath: /aliases.json
   [junit4]   2> 672489 INFO  (TEST-ForceLeaderTest.testLastPublishedStateIsActive-seed#[C2E9814C439D3B54]) [n:127.0.0.1:58491_iryp    ] o.a.s.c.c.SolrZkClient makePath: /clusterstate.json
   [junit4]   2> 672490 INFO  (TEST-ForceLeaderTest.testLastPublishedStateIsActive-seed#[C2E9814C439D3B54]) [n:127.0.0.1:58491_iryp    ] o.a.s.c.c.SolrZkClient makePath: /security.json
   [junit4]   2> 672492 INFO  (TEST-ForceLeaderTest.testLastPublishedStateIsActive-seed#[C2E9814C439D3B54]) [n:127.0.0.1:58491_iryp    ] o.a.s.c.c.ZkStateReader Updating cluster state from ZooKeeper... 
   [junit4]   2> 672492 INFO  (TEST-ForceLeaderTest.testLastPublishedStateIsActive-seed#[C2E9814C439D3B54]) [n:127.0.0.1:58491_iryp    ] o.a.s.c.c.ZkStateReader Loaded empty cluster properties
   [junit4]   2> 672493 INFO  (TEST-ForceLeaderTest.testLastPublishedStateIsActive-seed#[C2E9814C439D3B54]) [n:127.0.0.1:58491_iryp    ] o.a.s.c.c.ZkStateReader Updated live nodes from ZooKeeper... (0) -> (0)
   [junit4]   2> 672497 INFO  (TEST-ForceLeaderTest.testLastPublishedStateIsActive-seed#[C2E9814C439D3B54]) [n:127.0.0.1:58491_iryp    ] o.a.s.c.c.SolrZkClient makePath: /overseer_elect
   [junit4]   2> 672499 INFO  (TEST-ForceLeaderTest.testLastPublishedStateIsActive-seed#[C2E9814C439D3B54]) [n:127.0.0.1:58491_iryp    ] o.a.s.c.c.SolrZkClient makePath: /overseer_elect/election
   [junit4]   2> 672500 INFO  (TEST-ForceLeaderTest.testLastPublishedStateIsActive-seed#[C2E9814C439D3B54]) [n:127.0.0.1:58491_iryp    ] o.a.s.c.Overseer Overseer (id=null) closing
   [junit4]   2> 672501 INFO  (TEST-ForceLeaderTest.testLastPublishedStateIsActive-seed#[C2E9814C439D3B54]) [n:127.0.0.1:58491_iryp    ] o.a.s.c.LeaderElector Joined leadership election with path: /overseer_elect/election/96522735044722692-127.0.0.1:58491_iryp-n_0000000000
   [junit4]   2> 672501 INFO  (TEST-ForceLeaderTest.testLastPublishedStateIsActive-seed#[C2E9814C439D3B54]) [n:127.0.0.1:58491_iryp    ] o.a.s.c.OverseerElectionContext I am going to be the leader 127.0.0.1:58491_iryp
   [junit4]   2> 672501 INFO  (TEST-ForceLeaderTest.testLastPublishedStateIsActive-seed#[C2E9814C439D3B54]) [n:127.0.0.1:58491_iryp    ] o.a.s.c.c.SolrZkClient makePath: /overseer_elect/leader
   [junit4]   2> 672503 INFO  (TEST-ForceLeaderTest.testLastPublishedStateIsActive-seed#[C2E9814C439D3B54]) [n:127.0.0.1:58491_iryp    ] o.a.s.c.Overseer Overseer (id=96522735044722692-127.0.0.1:58491_iryp-n_0000000000) starting
   [junit4]   2> 672504 INFO  (TEST-ForceLeaderTest.testLastPublishedStateIsActive-seed#[C2E9814C439D3B54]) [n:127.0.0.1:58491_iryp    ] o.a.s.c.c.SolrZkClient makePath: /overseer/queue-work
   [junit4]   2> 672510 INFO  (TEST-ForceLeaderTest.testLastPublishedStateIsActive-seed#[C2E9814C439D3B54]) [n:127.0.0.1:58491_iryp    ] o.a.s.c.OverseerAutoReplicaFailoverThread Starting OverseerAutoReplicaFailoverThread autoReplicaFailoverWorkLoopDelay=10000 autoReplicaFailoverWaitAfterExpiration=10000 autoReplicaFailoverBadNodeExpiration=60000
   [junit4]   2> 672511 INFO  (TEST-ForceLeaderTest.testLastPublishedStateIsActive-seed#[C2E9814C439D3B54]) [n:127.0.0.1:58491_iryp    ] o.a.s.c.ZkController Register node as live in ZooKeeper:/live_nodes/127.0.0.1:58491_iryp
   [junit4]   2> 672511 INFO  (TEST-ForceLeaderTest.testLastPublishedStateIsActive-seed#[C2E9814C439D3B54]) [n:127.0.0.1:58491_iryp    ] o.a.s.c.c.SolrZkClient makePath: /live_nodes/127.0.0.1:58491_iryp
   [junit4]   2> 672512 INFO  (zkCallback-726-thread-1-processing-n:127.0.0.1:58491_iryp) [n:127.0.0.1:58491_iryp    ] o.a.s.c.c.ZkStateReader A live node change: [WatchedEvent state:SyncConnected type:NodeChildrenChanged path:/live_nodes], has occurred - updating... (live nodes size: [0])
   [junit4]   2> 672514 INFO  (zkCallback-726-thread-1-processing-n:127.0.0.1:58491_iryp) [n:127.0.0.1:58491_iryp    ] o.a.s.c.c.ZkStateReader Updated live nodes from ZooKeeper... (0) -> (1)
   [junit4]   2> 672515 INFO  (OverseerCollectionConfigSetProcessor-96522735044722692-127.0.0.1:58491_iryp-n_0000000000) [n:127.0.0.1:58491_iryp    ] o.a.s.c.OverseerTaskProcessor Process current queue of overseer operations
   [junit4]   2> 672516 INFO  (OverseerStateUpdate-96522735044722692-127.0.0.1:58491_iryp-n_0000000000) [n:127.0.0.1:58491_iryp    ] o.a.s.c.Overseer Starting to work on the main queue
   [junit4]   2> 672521 INFO  (OverseerStateUpdate-96522735044722692-127.0.0.1:58491_iryp-n_0000000000) [n:127.0.0.1:58491_iryp    ] o.a.s.c.c.ZkStateReader Updated live nodes from ZooKeeper... (1) -> (1)
   [junit4]   2> 672546 INFO  (TEST-ForceLeaderTest.testLastPublishedStateIsActive-seed#[C2E9814C439D3B54]) [n:127.0.0.1:58491_iryp    ] o.a.s.c.CoreContainer Security conf doesn't exist. Skipping setup for authorization module.
   [junit4]   2> 672546 INFO  (TEST-ForceLeaderTest.testLastPublishedStateIsActive-seed#[C2E9814C439D3B54]) [n:127.0.0.1:58491_iryp    ] o.a.s.c.CoreContainer No authentication plugin used.
   [junit4]   2> 672549 INFO  (TEST-ForceLeaderTest.testLastPublishedStateIsActive-seed#[C2E9814C439D3B54]) [n:127.0.0.1:58491_iryp    ] o.a.s.c.CorePropertiesLocator Looking for core definitions underneath C:\Users\jenkins\workspace\Lucene-Solr-master-Windows\solr\build\solr-core\test\J1\temp\solr.cloud.ForceLeaderTest_C2E9814C439D3B54-001\control-001\cores
   [junit4]   2> 672553 INFO  (TEST-ForceLeaderTest.testLastPublishedStateIsActive-seed#[C2E9814C439D3B54]) [n:127.0.0.1:58491_iryp    ] o.a.s.c.CoreDescriptor Created CoreDescriptor: {name=collection1, config=solrconfig.xml, transient=false, schema=schema.xml, loadOnStartup=true, configSetProperties=configsetprops.json, collection=control_collection, coreNodeName=, dataDir=data\, shard=}
   [junit4]   2> 672553 INFO  (TEST-ForceLeaderTest.testLastPublishedStateIsActive-seed#[C2E9814C439D3B54]) [n:127.0.0.1:58491_iryp    ] o.a.s.c.CorePropertiesLocator Found core collection1 in C:\Users\jenkins\workspace\Lucene-Solr-master-Windows\solr\build\solr-core\test\J1\temp\solr.cloud.ForceLeaderTest_C2E9814C439D3B54-001\control-001\cores\collection1
   [junit4]   2> 672553 INFO  (TEST-ForceLeaderTest.testLastPublishedStateIsActive-seed#[C2E9814C439D3B54]) [n:127.0.0.1:58491_iryp    ] o.a.s.c.CorePropertiesLocator Found 1 core definitions
   [junit4]   2> 672554 INFO  (TEST-ForceLeaderTest.testLastPublishedStateIsActive-seed#[C2E9814C439D3B54]) [n:127.0.0.1:58491_iryp    ] o.a.s.s.SolrDispatchFilter user.dir=C:\Users\jenkins\workspace\Lucene-Solr-master-Windows\solr\build\solr-core\test\J1
   [junit4]   2> 672554 INFO  (TEST-ForceLeaderTest.testLastPublishedStateIsActive-seed#[C2E9814C439D3B54]) [n:127.0.0.1:58491_iryp    ] o.a.s.s.SolrDispatchFilter SolrDispatchFilter.init() done
   [junit4]   2> 672556 INFO  (coreLoadExecutor-2374-thread-1-processing-n:127.0.0.1:58491_iryp) [n:127.0.0.1:58491_iryp c:control_collection   x:collection1] o.a.s.c.ZkController publishing state=down
   [junit4]   2> 672556 INFO  (coreLoadExecutor-2374-thread-1-processing-n:127.0.0.1:58491_iryp) [n:127.0.0.1:58491_iryp c:control_collection   x:collection1] o.a.s.c.ZkController numShards not found on descriptor - reading it from system property
   [junit4]   2> 672560 INFO  (OverseerStateUpdate-96522735044722692-127.0.0.1:58491_iryp-n_0000000000) [n:127.0.0.1:58491_iryp    ] o.a.s.c.Overseer processMessage: queueSize: 1, message = {
   [junit4]   2>   "core":"collection1",
   [junit4]   2>   "roles":null,
   [junit4]   2>   "base_url":"http://127.0.0.1:58491/iryp",
   [junit4]   2>   "node_name":"127.0.0.1:58491_iryp",
   [junit4]   2>   "numShards":"1",
   [junit4]   2>   "state":"down",
   [junit4]   2>   "shard":null,
   [junit4]   2>   "collection":"control_collection",
   [junit4]   2>   "operation":"state"} current state version: 0
   [junit4]   2> 672560 INFO  (OverseerStateUpdate-96522735044722692-127.0.0.1:58491_iryp-n_0000000000) [n:127.0.0.1:58491_iryp    ] o.a.s.c.o.ReplicaMutator Update state numShards=1 message={
   [junit4]   2>   "core":"collection1",
   [junit4]   2>   "roles":null,
   [junit4]   2>   "base_url":"http://127.0.0.1:58491/iryp",
   [junit4]   2>   "node_name":"127.0.0.1:58491_iryp",
   [junit4]   2>   "numShards":"1",
   [junit4]   2>   "state":"down",
   [junit4]   2>   "shard":null,
   [junit4]   2>   "collection":"control_collection",
   [junit4]   2>   "operation":"state"}
   [junit4]   2> 672561 INFO  (OverseerStateUpdate-96522735044722692-127.0.0.1:58491_iryp-n_0000000000) [n:127.0.0.1:58491_iryp    ] o.a.s.c.o.ClusterStateMutator building a new cName: control_collection
   [junit4]   2> 672561 INFO  (OverseerStateUpdate-96522735044722692-127.0.0.1:58491_iryp-n_0000000000) [n:127.0.0.1:58491_iryp    ] o.a.s.c.o.ReplicaMutator Assigning new node to shard shard=shard1
   [junit4]   2> 672563 INFO  (zkCallback-726-thread-1-processing-n:127.0.0.1:58491_iryp) [n:127.0.0.1:58491_iryp    ] o.a.s.c.c.ZkStateReader A cluster state change: [WatchedEvent state:SyncConnected type:NodeDataChanged path:/clusterstate.json], has occurred - updating... (live nodes size: [1])
   [junit4]   2> 672565 INFO  (coreLoadExecutor-2374-thread-1-processing-n:127.0.0.1:58491_iryp) [n:127.0.0.1:58491_iryp c:control_collection   x:collection1] o.a.s.c.ZkController Collection control_collection not visible yet, but flagging it so a watch is registered when it becomes visible
   [junit4]   2> 672568 INFO  (coreLoadExecutor-2374-thread-1-processing-n:127.0.0.1:58491_iryp) [n:127.0.0.1:58491_iryp c:control_collection   x:collection1] o.a.s.c.c.ZkStateReader Deleting data for [control_collection]
   [junit4]   2> 672577 INFO  (coreLoadExecutor-2374-thread-1-processing-n:127.0.0.1:58491_iryp) [n:127.0.0.1:58491_iryp c:control_collection   x:collection1] o.a.s.c.ZkController look for our core node name
   [junit4]   2> 672577 INFO  (coreLoadExecutor-2374-thread-1-processing-n:127.0.0.1:58491_iryp) [n:127.0.0.1:58491_iryp c:control_collection   x:collection1] o.a.s.c.ZkController waiting to find shard id in clusterstate for collection1
   [junit4]   2> 672577 INFO  (coreLoadExecutor-2374-thread-1-processing-n:127.0.0.1:58491_iryp) [n:127.0.0.1:58491_iryp c:control_collection   x:collection1] o.a.s.c.ZkController Check for collection zkNode:control_collection
   [junit4]   2> 672578 INFO  (coreLoadExecutor-2374-thread-1-processing-n:127.0.0.1:58491_iryp) [n:127.0.0.1:58491_iryp c:control_collection   x:collection1] o.a.s.c.ZkController Collection zkNode exists
   [junit4]   2> 672578 INFO  (coreLoadExecutor-2374-thread-1-processing-n:127.0.0.1:58491_iryp) [n:127.0.0.1:58491_iryp c:control_collection   x:collection1] o.a.s.c.c.ZkStateReader Load collection config from: [/collections/control_collection]
   [junit4]   2> 672579 INFO  (coreLoadExecutor-2374-thread-1-processing-n:127.0.0.1:58491_iryp) [n:127.0.0.1:58491_iryp c:control_collection   x:collection1] o.a.s.c.c.ZkStateReader path=[/collections/control_collection] [configName]=[conf1] specified config exists in ZooKeeper
   [junit4]   2> 672579 INFO  (coreLoadExecutor-2374-thread-1-processing-n:127.0.0.1:58491_iryp) [n:127.0.0.1:58491_iryp c:control_collection   x:collection1] o.a.s.c.SolrResourceLoader new SolrResourceLoader for directory: 'C:\Users\jenkins\workspace\Lucene-Solr-master-Windows\solr\build\solr-core\test\J1\temp\solr.cloud.ForceLeaderTest_C2E9814C439D3B54-001\control-001\cores\collection1'
   [junit4]   2> 672580 INFO  (coreLoadExecutor-2374-thread-1-processing-n:127.0.0.1:58491_iryp) [n:127.0.0.1:58491_iryp c:control_collection   x:collection1] o.a.s.c.SolrResourceLoader JNDI not configured for solr (NoInitialContextEx)
   [junit4]   2> 672580 INFO  (coreLoadExecutor-2374-thread-1-processing-n:127.0.0.1:58491_iryp) [n:127.0.0.1:58491_iryp c:control_collection   x:collection1] o.a.s.c.SolrResourceLoader solr home defaulted to 'solr/' (could not find system property or JNDI)
   [junit4]   2> 672587 INFO  (coreLoadExecutor-2374-thread-1-processing-n:127.0.0.1:58491_iryp) [n:127.0.0.1:58491_iryp c:control_collection   x:collection1] o.a.s.c.Config loaded config solrconfig.xml with version 0 
   [junit4]   2> 672605 INFO  (coreLoadExecutor-2374-thread-1-processing-n:127.0.0.1:58491_iryp) [n:127.0.0.1:58491_iryp c:control_collection   x:collection1] o.a.s.c.SolrConfig current version of requestparams : -1
   [junit4]   2> 672608 WARN  (coreLoadExecutor-2374-thread-1-processing-n:127.0.0.1:58491_iryp) [n:127.0.0.1:58491_iryp c:control_collection   x:collection1] o.a.s.c.Config Beginning with Solr 5.5, <mergePolicy> is deprecated, use <mergePolicyFactory> instead.
   [junit4]   2> 672609 INFO  (coreLoadExecutor-2374-thread-1-processing-n:127.0.0.1:58491_iryp) [n:127.0.0.1:58491_iryp c:control_collection   x:collection1] o.a.s.c.SolrConfig Using Lucene MatchVersion: 7.0.0
   [junit4]   2> 672617 INFO  (coreLoadExecutor-2374-thread-1-processing-n:127.0.0.1:58491_iryp) [n:127.0.0.1:58491_iryp c:control_collection   x:collection1] o.a.s.c.SolrConfig Loaded SolrConfig: solrconfig.xml
   [junit4]   2> 672624 INFO  (coreLoadExecutor-2374-thread-1-processing-n:127.0.0.1:58491_iryp) [n:127.0.0.1:58491_iryp c:control_collection   x:collection1] o.a.s.s.IndexSchema [collection1] Schema name=test
   [junit4]   2> 672702 INFO  (coreLoadExecutor-2374-thread-1-processing-n:127.0.0.1:58491_iryp) [n:127.0.0.1:58491_iryp c:control_collection   x:collection1] o.a.s.s.OpenExchangeRatesOrgProvider Initialized with rates=open-exchange-rates.json, refreshInterval=1440.
   [junit4]   2> 672715 INFO  (coreLoadExecutor-2374-thread-1-processing-n:127.0.0.1:58491_iryp) [n:127.0.0.1:58491_iryp c:control_collection   x:collection1] o.a.s.s.IndexSchema default search field in schema is text
   [junit4]   2> 672716 INFO  (coreLoadExecutor-2374-thread-1-processing-n:127.0.0.1:58491_iryp) [n:127.0.0.1:58491_iryp c:control_collection   x:collection1] o.a.s.s.IndexSchema unique key field: id
   [junit4]   2> 672733 INFO  (coreLoadExecutor-2374-thread-1-processing-n:127.0.0.1:58491_iryp) [n:127.0.0.1:58491_iryp c:control_collection   x:collection1] o.a.s.s.FileExchangeRateProvider Reloading exchange rates from file currency.xml
   [junit4]   2> 672737 INFO  (coreLoadExecutor-2374-thread-1-processing-n:127.0.0.1:58491_iryp) [n:127.0.0.1:58491_iryp c:control_collection   x:collection1] o.a.s.s.FileExchangeRateProvider Reloading exchange rates from file currency.xml
   [junit4]   2> 672739 INFO  (coreLoadExecutor-2374-thread-1-processing-n:127.0.0.1:58491_iryp) [n:127.0.0.1:58491_iryp c:control_collection   x:collection1] o.a.s.s.OpenExchangeRatesOrgProvider Reloading exchange rates from open-exchange-rates.json
   [junit4]   2> 672740 INFO  (coreLoadExecutor-2374-thread-1-processing-n:127.0.0.1:58491_iryp) [n:127.0.0.1:58491_iryp c:control_collection   x:collection1] o.a.s.s.OpenExchangeRatesOrgProvider Reloading exchange rates from open-exchange-rates.json
   [junit4]   2> 672744 INFO  (coreLoadExecutor-2374-thread-1-processing-n:127.0.0.1:58491_iryp) [n:127.0.0.1:58491_iryp c:control_collection   x:collection1] o.a.s.c.ConfigSetProperties Did not find ConfigSet properties, assuming default properties: Can't find resource 'configsetprops.json' in classpath or '/configs/conf1', cwd=C:\Users\jenkins\workspace\Lucene-Solr-master-Windows\solr\build\solr-core\test\J1
   [junit4]   2> 672744 INFO  (coreLoadExecutor-2374-thread-1-processing-n:127.0.0.1:58491_iryp) [n:127.0.0.1:58491_iryp c:control_collection   x:collection1] o.a.s.c.CoreContainer Creating SolrCore 'collection1' using configuration from collection control_collection
   [junit4]   2> 672744 INFO  (coreLoadExecutor-2374-thread-1-processing-n:127.0.0.1:58491_iryp) [n:127.0.0.1:58491_iryp c:control_collection s:shard1 r:core_node1 x:collection1] o.a.s.c.SolrCore org.apache.solr.core.MockDirectoryFactory
   [junit4]   2> 672744 INFO  (coreLoadExecutor-2374-thread-1-processing-n:127.0.0.1:58491_iryp) [n:127.0.0.1:58491_iryp c:control_collection s:shard1 r:core_node1 x:collection1] o.a.s.c.SolrCore [[collection1] ] Opening new SolrCore at [C:\Users\jenkins\workspace\Lucene-Solr-master-Windows\solr\build\solr-core\test\J1\temp\solr.cloud.ForceLeaderTest_C2E9814C439D3B54-001\control-001\cores\collection1], dataDir=[C:\Users\jenkins\workspace\Lucene-Solr-master-Windows\solr\build\solr-core\test\J1\temp\solr.cloud.ForceLeaderTest_C2E9814C439D3B54-001\control-001\cores\collection1\data\]
   [junit4]   2> 672744 INFO  (coreLoadExecutor-2374-thread-1-processing-n:127.0.0.1:58491_iryp) [n:127.0.0.1:58491_iryp c:control_collection s:shard1 r:core_node1 x:collection1] o.a.s.c.JmxMonitoredMap JMX monitoring is enabled. Adding Solr mbeans to JMX Server: com.sun.jmx.mbeanserver.JmxMBeanServer@55d73c41
   [junit4]   2> 672745 INFO  (coreLoadExecutor-2374-thread-1-processing-n:127.0.0.1:58491_iryp) [n:127.0.0.1:58491_iryp c:control_collection s:shard1 r:core_node1 x:collection1] o.a.s.c.CachingDirectoryFactory return new directory for C:\Users\jenkins\workspace\Lucene-Solr-master-Windows\solr\build\solr-core\test\J1\temp\solr.cloud.ForceLeaderTest_C2E9814C439D3B54-001\control-001\cores\collection1\data\snapshot_metadata
   [junit4]   2> 672745 INFO  (coreLoadExecutor-2374-thread-1-processing-n:127.0.0.1:58491_iryp) [n:127.0.0.1:58491_iryp c:control_collection s:shard1 r:core_node1 x:collection1] o.a.s.c.s.SolrSnapshotMetaDataManager Loading from snapshot metadata file...
   [junit4]   2> 672769 INFO  (coreLoadExecutor-2374-thread-1-processing-n:127.0.0.1:58491_iryp) [n:127.0.0.1:58491_iryp c:control_collection s:shard1 r:core_node1 x:collection1] o.a.s.c.CachingDirectoryFactory return new directory for C:\Users\jenkins\workspace\Lucene-Solr-master-Windows\solr\build\solr-core\test\J1\temp\solr.cloud.ForceLeaderTest_C2E9814C439D3B54-001\control-001\cores\collection1\data\
   [junit4]   2> 672769 INFO  (coreLoadExecutor-2374-thread-1-processing-n:127.0.0.1:58491_iryp) [n:127.0.0.1:58491_iryp c:control_collection s:shard1 r:core_node1 x:collection1] o.a.s.c.SolrCore New index directory detected: old=null new=C:\Users\jenkins\workspace\Lucene-Solr-master-Windows\solr\build\solr-core\test\J1\temp\solr.cloud.ForceLeaderTest_C2E9814C439D3B54-001\control-001\cores\collection1\data\index/
   [junit4]   2> 672769 WARN  (coreLoadExecutor-2374-thread-1-processing-n:127.0.0.1:58491_iryp) [n:127.0.0.1:58491_iryp c:control_collection s:shard1 r:core_node1 x:collection1] o.a.s.c.SolrCore [collection1] Solr index directory 'C:\Users\jenkins\workspace\Lucene-Solr-master-Windows\solr\build\solr-core\test\J1\temp\solr.cloud.ForceLeaderTest_C2E9814C439D3B54-001\control-001\cores\collection1\data\index' doesn't exist. Creating new index...
   [junit4]   2> 672769 INFO  (coreLoadExecutor-2374-thread-1-processing-n:127.0.0.1:58491_iryp) [n:127.0.0.1:58491_iryp c:control_collection s:shard1 r:core_node1 x:collection1] o.a.s.c.CachingDirectoryFactory return new directory for C:\Users\jenkins\workspace\Lucene-Solr-master-Windows\solr\build\solr-core\test\J1\temp\solr.cloud.ForceLeaderTest_C2E9814C439D3B54-001\control-001\cores\collection1\data\index
   [junit4]   2> 672769 INFO  (coreLoadExecutor-2374-thread-1-processing-n:127.0.0.1:58491_iryp) [n:127.0.0.1:58491_iryp c:control_collection s:shard1 r:core_node1 x:collection1] o.a.s.u.RandomMergePolicy RandomMergePolicy wrapping class org.apache.lucene.index.LogDocMergePolicy: [LogDocMergePolicy: minMergeSize=1000, mergeFactor=11, maxMergeSize=9223372036854775807, maxMergeSizeForForcedMerge=9223372036854775807, calibrateSizeByDeletes=false, maxMergeDocs=2147483647, maxCFSSegmentSizeMB=8.796093022207999E12, noCFSRatio=0.6924761460825448]
   [junit4]   2> 672770 INFO  (coreLoadExecutor-2374-thread-1-processing-n:127.0.0.1:58491_iryp) [n:127.0.0.1:58491_iryp c:control_collection s:shard1 r:core_node1 x:collection1] o.a.s.c.SolrDeletionPolicy SolrDeletionPolicy.onCommit: commits: num=1
   [junit4]   2> 	commit{dir=MockDirectoryWrapper(RAMDirectory@7f5310f1 lockFactory=org.apache.lucene.store.SingleInstanceLockFactory@4e218cc2),segFN=segments_1,generation=1}
   [junit4]   2> 672770 INFO  (coreLoadExecutor-2374-thread-1-processing-n:127.0.0.1:58491_iryp) [n:127.0.0.1:58491_iryp c:control_collection s:shard1 r:core_node1 x:collection1] o.a.s.c.SolrDeletionPolicy newest commit generation = 1
   [junit4]   2> 672772 INFO  (coreLoadExecutor-2374-thread-1-processing-n:127.0.0.1:58491_iryp) [n:127.0.0.1:58491_iryp c:control_collection s:shard1 r:core_node1 x:collection1] o.a.s.u.p.UpdateRequestProcessorChain creating updateRequestProcessorChain "nodistrib"
   [junit4]   2> 672772 INFO  (coreLoadExecutor-2374-thread-1-processing-n:127.0.0.1:58491_iryp) [n:127.0.0.1:58491_iryp c:control_collection s:shard1 r:core_node1 x:collection1] o.a.s.u.p.UpdateRequestProcessorChain creating updateRequestProcessorChain "dedupe"
   [junit4]   2> 672773 INFO  (coreLoadExecutor-2374-thread-1-processing-n:127.0.0.1:58491_iryp) [n:127.0.0.1:58491_iryp c:control_collection s:shard1 r:core_node1 x:collection1] o.a.s.u.p.UpdateRequestProcessorChain inserting DistributedUpdateProcessorFactory into updateRequestProcessorChain "dedupe"
   [junit4]   2> 672773 INFO  (coreLoadExecutor-2374-thread-1-processing-n:127.0.0.1:58491_iryp) [n:127.0.0.1:58491_iryp c:control_collection s:shard1 r:core_node1 x:collection1] o.a.s.u.p.UpdateRequestProcessorChain creating updateRequestProcessorChain "stored_sig"
   [junit4]   2> 672773 INFO  (coreLoadExecutor-2374-thread-1-processing-n:127.0.0.1:58491_iryp) [n:127.0.0.1:58491_iryp c:control_collection s:shard1 r:core_node1 x:collection1] o.a.s.u.p.UpdateRequestProcessorChain inserting DistributedUpdateProcessorFactory into updateRequestProcessorChain "stored_sig"
   [junit4]   2> 672773 INFO  (coreLoadExecutor-2374-thread-1-processing-n:127.0.0.1:58491_iryp) [n:127.0.0.1:58491_iryp c:control_collection s:shard1 r:core_node1 x:collection1] o.a.s.u.p.UpdateRequestProcessorChain creating updateRequestProcessorChain "distrib-dup-test-chain-explicit"
   [junit4]   2> 672773 INFO  (coreLoadExecutor-2374-thread-1-processing-n:127.0.0.1:58491_iryp) [n:127.0.0.1:58491_iryp c:control_collection s:shard1 r:core_node1 x:collection1] o.a.s.u.p.UpdateRequestProcessorChain creating updateRequestProcessorChain "distrib-dup-test-chain-implicit"
   [junit4]   2> 672773 INFO  (coreLoadExecutor-2374-thread-1-processing-n:127.0.0.1:58491_iryp) [n:127.0.0.1:58491_iryp c:control_collection s:shard1 r:core_node1 x:collection1] o.a.s.u.p.UpdateRequestProcessorChain inserting DistributedUpdateProcessorFactory into updateRequestProcessorChain "distrib-dup-test-chain-implicit"
   [junit4]   2> 672773 INFO  (coreLoadExecutor-2374-thread-1-processing-n:127.0.0.1:58491_iryp) [n:127.0.0.1:58491_iryp c:control_collection s:shard1 r:core_node1 x:collection1] o.a.s.c.SolrCore no updateRequestProcessorChain defined as default, creating implicit default
   [junit4]   2> 672774 WARN  (coreLoadExecutor-2374-thread-1-processing-n:127.0.0.1:58491_iryp) [n:127.0.0.1:58491_iryp c:control_collection s:shard1 r:core_node1 x:collection1] o.a.s.c.RequestHandlers INVALID paramSet a in requestHandler {type = requestHandler,name = /dump,class = DumpRequestHandler,args = {defaults={a=A,b=B}}}
   [junit4]   2> 672779 INFO  (coreLoadExecutor-2374-thread-1-processing-n:127.0.0.1:58491_iryp) [n:127.0.0.1:58491_iryp c:control_collection s:shard1 r:core_node1 x:collection1] o.a.s.h.l.XMLLoader xsltCacheLifetimeSeconds=60
   [junit4]   2> 672781 INFO  (coreLoadExecutor-2374-thread-1-processing-n:127.0.0.1:58491_iryp) [n:127.0.0.1:58491_iryp c:control_collection s:shard1 r:core_node1 x:collection1] o.a.s.h.l.XMLLoader xsltCacheLifetimeSeconds=60
   [junit4]   2> 672782 INFO  (coreLoadExecutor-2374-thread-1-processing-n:127.0.0.1:58491_iryp) [n:127.0.0.1:58491_iryp c:control_collection s:shard1 r:core_node1 x:collection1] o.a.s.h.l.XMLLoader xsltCacheLifetimeSeconds=60
   [junit4]   2> 672783 INFO  (coreLoadExecutor-2374-thread-1-processing-n:127.0.0.1:58491_iryp) [n:127.0.0.1:58491_iryp c:control_collection s:shard1 r:core_node1 x:collection1] o.a.s.h.l.XMLLoader xsltCacheLifetimeSeconds=60
   [junit4]   2> 672785 INFO  (coreLoadExecutor-2374-thread-1-processing-n:127.0.0.1:58491_iryp) [n:127.0.0.1:58491_iryp c:control_collection s:shard1 r:core_node1 x:collection1] o.a.s.c.RequestHandlers Registered paths: /admin/mbeans,standard,/update/json/docs,/admin/luke,/export,/get,/admin/properties,/update/json,/admin/threads,/dump,/update/csv,/sql,/graph,/admin/segments,/admin/system,/replication,/config,/stream,/schema,/admin/plugins,/admin/logging,/admin/ping,/update,/admin/file,/terms
   [junit4]   2> 672787 INFO  (coreLoadExecutor-2374-thread-1-processing-n:127.0.0.1:58491_iryp) [n:127.0.0.1:58491_iryp c:control_collection s:shard1 r:core_node1 x:collection1] o.a.s.c.SolrCore Using default statsCache cache: org.apache.solr.search.stats.LocalStatsCache
   [junit4]   2> 672787 INFO  (coreLoadExecutor-2374-thread-1-processing-n:127.0.0.1:58491_iryp) [n:127.0.0.1:58491_iryp c:control_collection s:shard1 r:core_node1 x:collection1] o.a.s.u.UpdateHandler Using UpdateLog implementation: org.apache.solr.update.UpdateLog
   [junit4]   2> 672787 INFO  (coreLoadExecutor-2374-thread-1-processing-n:127.0.0.1:58491_iryp) [n:127.0.0.1:58491_iryp c:control_collection s:shard1 r:core_node1 x:collection1] o.a.s.u.UpdateLog Initializing UpdateLog: dataDir= defaultSyncLevel=FLUSH numRecordsToKeep=100 maxNumLogsToKeep=10 numVersionBuckets=65536
   [junit4]   2> 672788 INFO  (coreLoadExecutor-2374-thread-1-processing-n:127.0.0.1:58491_iryp) [n:127.0.0.1:58491_iryp c:control_collection s:shard1 r:core_node1 x:collection1] o.a.s.u.CommitTracker Hard AutoCommit: disabled
   [junit4]   2> 672788 INFO  (coreLoadExecutor-2374-thread-1-processing-n:127.0.0.1:58491_iryp) [n:127.0.0.1:58491_iryp c:control_collection s:shard1 r:core_node1 x:collection1] o.a.s.u.CommitTracker Soft AutoCommit: disabled
   [junit4]   2> 672789 INFO  (coreLoadExecutor-2374-thread-1-processing-n:127.0.0.1:58491_iryp) [n:127.0.0.1:58491_iryp c:control_collection s:shard1 r:core_node1 x:collection1] o.a.s.u.RandomMergePolicy RandomMergePolicy wrapping class org.apache.lucene.index.LogByteSizeMergePolicy: [LogByteSizeMergePolicy: minMergeSize=1677721, mergeFactor=17, maxMergeSize=2147483648, maxMergeSizeForForcedMerge=9223372036854775807, calibrateSizeByDeletes=true, maxMergeDocs=2147483647, maxCFSSegmentSizeMB=8.796093022207999E12, noCFSRatio=0.7403961428277313]
   [junit4]   2> 672789 INFO  (OldIndexDirectoryCleanupThreadForCore-collection1) [n:127.0.0.1:58491_iryp c:control_collection s:shard1 r:core_node1 x:collection1] o.a.s.c.SolrCore Looking for old index directories to cleanup for core collection1 in C:\Users\jenkins\workspace\Lucene-Solr-master-Windows\solr\build\solr-core\test\J1\temp\solr.cloud.ForceLeaderTest_C2E9814C439D3B54-001\control-001\cores\collection1\data\
   [junit4]   2> 672790 INFO  (coreLoadExecutor-2374-thread-1-processing-n:127.0.0.1:58491_iryp) [n:127.0.0.1:58491_iryp c:control_collection s:shard1 r:core_node1 x:collection1] o.a.s.c.SolrDeletionPolicy SolrDeletionPolicy.onInit: commits: num=1
   [junit4]   2> 	commit{dir=MockDirectoryWrapper(RAMDirectory@7f5310f1 lockFactory=org.apache.lucene.store.SingleInstanceLockFactory@4e218cc2),segFN=segments_1,generation=1}
   [junit4]   2> 672790 INFO  (coreLoadExecutor-2374-thread-1-processing-n:127.0.0.1:58491_iryp) [n:127.0.0.1:58491_iryp c:control_collection s:shard1 r:core_node1 x:collection1] o.a.s.c.SolrDeletionPolicy newest commit generation = 1
   [junit4]   2> 672790 INFO  (coreLoadExecutor-2374-thread-1-processing-n:127.0.0.1:58491_iryp) [n:127.0.0.1:58491_iryp c:control_collection s:shard1 r:core_node1 x:collection1] o.a.s.s.SolrIndexSearcher Opening [Searcher@f898140[collection1] main]
   [junit4]   2> 672790 INFO  (coreLoadExecutor-2374-thread-1-processing-n:127.0.0.1:58491_iryp) [n:127.0.0.1:58491_iryp c:control_collection s:shard1 r:core_node1 x:collection1] o.a.s.c.c.ZkStateReader Load collection config from: [/collections/control_collection]
   [junit4]   2> 672791 INFO  (coreLoadExecutor-2374-thread-1-processing-n:127.0.0.1:58491_iryp) [n:127.0.0.1:58491_iryp c:control_collection s:shard1 r:core_node1 x:collection1] o.a.s.c.c.ZkStateReader path=[/collections/control_collection] [configName]=[conf1] specified config exists in ZooKeeper
   [junit4]   2> 672791 INFO  (coreLoadExecutor-2374-thread-1-processing-n:127.0.0.1:58491_iryp) [n:127.0.0.1:58491_iryp c:control_collection s:shard1 r:core_node1 x:collection1] o.a.s.r.ManagedResourceStorage Setting up ZooKeeper-based storage for the RestManager with znodeBase: /configs/conf1
   [junit4]   2> 672791 INFO  (coreLoadExecutor-2374-thread-1-processing-n:127.0.0.1:58491_iryp) [n:127.0.0.1:58491_iryp c:control_collection s:shard1 r:core_node1 x:collection1] o.a.s.r.ManagedResourceStorage Configured ZooKeeperStorageIO with znodeBase: /configs/conf1
   [junit4]   2> 672791 INFO  (coreLoadExecutor-2374-thread-1-processing-n:127.0.0.1:58491_iryp) [n:127.0.0.1:58491_iryp c:control_collection s:shard1 r:core_node1 x:collection1] o.a.s.r.RestManager Initializing RestManager with initArgs: {}
   [junit4]   2> 672791 INFO  (coreLoadExecutor-2374-thread-1-processing-n:127.0.0.1:58491_iryp) [n:127.0.0.1:58491_iryp c:control_collection s:shard1 r:core_node1 x:collection1] o.a.s.r.ManagedResourceStorage Reading _rest_managed.json using ZooKeeperStorageIO:path=/configs/conf1
   [junit4]   2> 672791 INFO  (coreLoadExecutor-2374-thread-1-processing-n:127.0.0.1:58491_iryp) [n:127.0.0.1:58491_iryp c:control_collection s:shard1 r:core_node1 x:collection1] o.a.s.r.ManagedResourceStorage No data found for znode /configs/conf1/_rest_managed.json
   [junit4]   2> 672791 INFO  (coreLoadExecutor-2374-thread-1-processing-n:127.0.0.1:58491_iryp) [n:127.0.0.1:58491_iryp c:control_collection s:shard1 r:core_node1 x:collection1] o.a.s.r.ManagedResourceStorage Loaded null at path _rest_managed.json using ZooKeeperStorageIO:path=/configs/conf1
   [junit4]   2> 672792 INFO  (coreLoadExecutor-2374-thread-1-processing-n:127.0.0.1:58491_iryp) [n:127.0.0.1:58491_iryp c:control_collection s:shard1 r:core_node1 x:collection1] o.a.s.r.RestManager Initializing 0 registered ManagedResources
   [junit4]   2> 672792 INFO  (coreLoadExecutor-2374-thread-1-processing-n:127.0.0.1:58491_iryp) [n:127.0.0.1:58491_iryp c:control_collection s:shard1 r:core_node1 x:collection1] o.a.s.h.ReplicationHandler Commits will be reserved for  10000
   [junit4]   2> 672792 INFO  (coreLoadExecutor-2374-thread-1-processing-n:127.0.0.1:58491_iryp) [n:127.0.0.1:58491_iryp c:control_collection s:shard1 r:core_node1 x:collection1] o.a.s.u.UpdateLog Looking up max value of version field to seed version buckets
   [junit4]   2> 672792 INFO  (coreLoadExecutor-2374-thread-1-processing-n:127.0.0.1:58491_iryp) [n:127.0.0.1:58491_iryp c:control_collection s:shard1 r:core_node1 x:collection1] o.a.s.u.VersionInfo Refreshing highest value of _version_ for 65536 version buckets from index
   [junit4]   2> 672792 INFO  (coreLoadExecutor-2374-thread-1-processing-n:127.0.0.1:58491_iryp) [n:127.0.0.1:58491_iryp c:control_collection s:shard1 r:core_node1 x:collection1] o.a.s.u.VersionInfo No terms found for _version_, cannot seed version bucket highest value from index
   [junit4]   2> 672792 INFO  (coreLoadExecutor-2374-thread-1-processing-n:127.0.0.1:58491_iryp) [n:127.0.0.1:58491_iryp c:control_collection s:shard1 r:core_node1 x:collection1] o.a.s.u.UpdateLog Could not find max version in index or recent updates, using new clock 1544363761954979840
   [junit4]   2> 672794 INFO  (coreLoadExecutor-2374-thread-1-processing-n:127.0.0.1:58491_iryp) [n:127.0.0.1:58491_iryp c:control_collection s:shard1 r:core_node1 x:collection1] o.a.s.u.UpdateLog Took 1.0ms to seed version buckets with highest version 1544363761954979840
   [junit4]   2> 672794 INFO  (coreLoadExecutor-2374-thread-1-processing-n:127.0.0.1:58491_iryp) [n:127.0.0.1:58491_iryp c:control_collection s:shard1 r:core_node1 x:collection1] o.a.s.c.ZkController watch zkdir /configs/conf1
   [junit4]   2> 672794 INFO  (coreLoadExecutor-2374-thread-1-processing-n:127.0.0.1:58491_iryp) [n:127.0.0.1:58491_iryp c:control_collection s:shard1 r:core_node1 x:collection1] o.a.s.c.CoreContainer registering core: collection1
   [junit4]   2> 672795 INFO  (searcherExecutor-2375-thread-1-processing-n:127.0.0.1:58491_iryp x:collection1 s:shard1 c:control_collection r:core_node1) [n:127.0.0.1:58491_iryp c:control_collection s:shard1 r:core_node1 x:collection1] o.a.s.c.SolrCore [collection1] Registered new searcher Searcher@f898140[collection1] main{ExitableDirectoryReader(UninvertingDirectoryReader())}
   [junit4]   2> 672796 INFO  (coreZkRegister-2367-thread-1-processing-n:127.0.0.1:58491_iryp x:collection1 s:shard1 c:control_collection r:core_node1) [n:127.0.0.1:58491_iryp c:control_collection s:shard1 r:core_node1 x:collection1] o.a.s.c.ZkController Register replica - core:collection1 address:http://127.0.0.1:58491/iryp collection:control_collection shard:shard1
   [junit4]   2> 672796 INFO  (coreZkRegister-2367-thread-1-processing-n:127.0.0.1:58491_iryp x:collection1 s:shard1 c:control_collection r:core_node1) [n:127.0.0.1:58491_iryp c:control_collection s:shard1 r:core_node1 x:collection1] o.a.s.c.c.SolrZkClient makePath: /collections/control_collection/leader_elect/shard1/election
   [junit4]   2> 672799 INFO  (coreZkRegister-2367-thread-1-processing-n:127.0.0.1:58491_iryp x:collection1 s:shard1 c:control_collection r:core_node1) [n:127.0.0.1:58491_iryp c:control_collection s:shard1 r:core_node1 x:collection1] o.a.s.c.LeaderElector Joined leadership election with path: /collections/control_collection/leader_elect/shard1/election/96522735044722692-core_node1-n_0000000000
   [junit4]   2> 672800 INFO  (coreZkRegister-2367-thread-1-processing-n:127.0.0.1:58491_iryp x:collection1 s:shard1 c:control_collection r:core_node1) [n:127.0.0.1:58491_iryp c:control_collection s:shard1 r:core_node1 x:collection1] o.a.s.c.ShardLeaderElectionContext Running the leader process for shard=shard1 and weAreReplacement=false and leaderVoteWait=10000
   [junit4]   2> 672802 INFO  (OverseerStateUpdate-96522735044722692-127.0.0.1:58491_iryp-n_0000000000) [n:127.0.0.1:58491_iryp    ] o.a.s.c.Overseer processMessage: queueSize: 1, message = {
   [junit4]   2>   "operation":"leader",
   [junit4]   2>   "shard":"shard1",
   [junit4]   2>   "collection":"control_collection"} current state version: 1
   [junit4]   2> 672805 INFO  (coreZkRegister-2367-thread-1-processing-n:127.0.0.1:58491_iryp x:collection1 s:shard1 c:control_collection r:core_node1) [n:127.0.0.1:58491_iryp c:control_collection s:shard1 r:core_node1 x:collection1] o.a.s.c.ShardLeaderElectionContext Enough replicas found to continue.
   [junit4]   2> 672805 INFO  (coreZkRegister-2367-thread-1-processing-n:127.0.0.1:58491_iryp x:collection1 s:shard1 c:control_collection r:core_node1) [n:127.0.0.1:58491_iryp c:control_collection s:shard1 r:core_node1 x:collection1] o.a.s.c.ShardLeaderElectionContext I may be the new leader - try and sync
   [junit4]   2> 672805 INFO  (coreZkRegister-2367-thread-1-processing-n:127.0.0.1:58491_iryp x:collection1 s:shard1 c:control_collection r:core_node1) [n:127.0.0.1:58491_iryp c:control_collection s:shard1 r:core_node1 x:collection1] o.a.s.c.SyncStrategy Sync replicas to http://127.0.0.1:58491/iryp/collection1/
   [junit4]   2> 672805 INFO  (coreZkRegister-2367-thread-1-processing-n:127.0.0.1:58491_iryp x:collection1 s:shard1 c:control_collection r:core_node1) [n:127.0.0.1:58491_iryp c:control_collection s:shard1 r:core_node1 x:collection1] o.a.s.c.SyncStrategy Sync Success - now sync replicas to me
   [junit4]   2> 672805 INFO  (coreZkRegister-2367-thread-1-processing-n:127.0.0.1:58491_iryp x:collection1 s:shard1 c:control_collection r:core_node1) [n:127.0.0.1:58491_iryp c:control_collection s:shard1 r:core_node1 x:collection1] o.a.s.c.SyncStrategy http://127.0.0.1:58491/iryp/collection1/ has no replicas
   [junit4]   2> 672805 INFO  (coreZkRegister-2367-thread-1-processing-n:127.0.0.1:58491_iryp x:collection1 s:shard1 c:control_collection r:core_node1) [n:127.0.0.1:58491_iryp c:control_collection s:shard1 r:core_node1 x:collection1] o.a.s.c.c.SolrZkClient makePath: /collections/control_collection/leaders/shard1
   [junit4]   2> 672807 INFO  (coreZkRegister-2367-thread-1-processing-n:127.0.0.1:58491_iryp x:collection1 s:shard1 c:control_collection r:core_node1) [n:127.0.0.1:58491_iryp c:control_collection s:shard1 r:core_node1 x:collection1] o.a.s.c.ShardLeaderElectionContextBase Creating leader registration node /collections/control_collection/leaders/shard1/leader after winning as /collections/control_collection/leader_elect/shard1/election/96522735044722692-core_node1-n_0000000000
   [junit4]   2> 672811 INFO  (OverseerStateUpdate-96522735044722692-127.0.0.1:58491_iryp-n_0000000000) [n:127.0.0.1:58491_iryp    ] o.a.s.c.Overseer processMessage: queueSize: 1, message = {
   [junit4]   2>   "operation":"leader",
   [junit4]   2>   "shard":"shard1",
   [junit4]   2>   "collection":"control_collection",
   [junit4]   2>   "base_url":"http://127.0.0.1:58491/iryp",
   [junit4]   2>   "core":"collection1",
   [junit4]   2>   "state":"active"} current state version: 1
   [junit4]   2> 672813 INFO  (coreZkRegister-2367-thread-1-processing-n:127.0.0.1:58491_iryp x:collection1 s:shard1 c:control_collection r:core_node1) [n:127.0.0.1:58491_iryp c:control_collection s:shard1 r:core_node1 x:collection1] o.a.s.c.ShardLeaderElectionContext I am the new leader: http://127.0.0.1:58491/iryp/collection1/ shard1
   [junit4]   2> 672916 INFO  (zkCallback-726-thread-5-processing-n:127.0.0.1:58491_iryp) [n:127.0.0.1:58491_iryp    ] o.a.s.c.c.ZkStateReader A cluster state change: [WatchedEvent state:SyncConnected type:NodeDataChanged path:/clusterstate.json], has occurred - updating... (live nodes size: [1])
   [junit4]   2> 672920 INFO  (coreZkRegister-2367-thread-1-processing-n:127.0.0.1:58491_iryp x:collection1 s:shard1 c:control_collection r:core_node1) [n:127.0.0.1:58491_iryp c:control_collection s:shard1 r:core_node1 x:collection1] o.a.s.c.ZkController We are http://127.0.0.1:58491/iryp/collection1/ and leader is http://127.0.0.1:58491/iryp/collection1/
   [junit4]   2> 672920 INFO  (coreZkRegister-2367-thread-1-processing-n:127.0.0.1:58491_iryp x:collection1 s:shard1 c:control_collection r:core_node1) [n:127.0.0.1:58491_iryp c:control_collection s:shard1 r:core_node1 x:collection1] o.a.s.c.ZkController No LogReplay needed for core=collection1 baseURL=http://127.0.0.1:58491/iryp
   [junit4]   2> 672920 INFO  (coreZkRegister-2367-thread-1-processing-n:127.0.0.1:58491_iryp x:collection1 s:shard1 c:control_collection r:core_node1) [n:127.0.0.1:58491_iryp c:control_collection s:shard1 r:core_node1 x:collection1] o.a.s.c.ZkController I am the leader, no recovery necessary
   [junit4]   2> 672920 INFO  (coreZkRegister-2367-thread-1-processing-n:127.0.0.1:58491_iryp x:collection1 s:shard1 c:control_collection r:core_node1) [n:127.0.0.1:58491_iryp c:control_collection s:shard1 r:core_node1 x:collection1] o.a.s.c.ZkController publishing state=active
   [junit4]   2> 672920 INFO  (coreZkRegister-2367-thread-1-processing-n:127.0.0.1:58491_iryp x:collection1 s:shard1 c:control_collection r:core_node1) [n:127.0.0.1:58491_iryp c:control_collection s:shard1 r:core_node1 x:collection1] o.a.s.c.ZkController numShards not found on descriptor - reading it from system property
   [junit4]   2> 672923 INFO  (OverseerStateUpdate-96522735044722692-127.0.0.1:58491_iryp-n_0000000000) [n:127.0.0.1:58491_iryp    ] o.a.s.c.Overseer processMessage: queueSize: 1, message = {
   [junit4]   2>   "core":"collection1",
   [junit4]   2>   "core_node_name":"core_node1",
   [junit4]   2>   "roles":null,
   [junit4]   2>   "base_url":"http://127.0.0.1:58491/iryp",
   [junit4]   2>   "node_name":"127.0.0.1:58491_iryp",
   [junit4]   2>   "numShards":"1",
   [junit4]   2>   "state":"active",
   [junit4]   2>   "shard":"shard1",
   [junit4]   2>   "collection":"control_collection",
   [junit4]   2>   "operation":"state"} current state version: 2
   [junit4]   2> 672923 INFO  (OverseerStateUpdate-96522735044722692-127.0.0.1:58491_iryp-n_0000000000) [n:127.0.0.1:58491_iryp    ] o.a.s.c.o.ReplicaMutator Update state numShards=1 message={
   [junit4]   2>   "core":"collection1",
   [junit4]   2>   "core_node_name":"core_node1",
   [junit4]   2>   "roles":null,
   [junit4]   2>   "base_url":"http://127.0.0.1:58491/iryp",
   [junit4]   2>   "node_name":"127.0.0.1:58491_iryp",
   [junit4]   2>   "numShards":"1",
   [junit4]   2>   "state":"active",
   [junit4]   2>   "shard":"shard1",
   [junit4]   2>   "collection":"control_collection",
   [junit4]   2>   "operation":"state"}
   [junit4]   2> 672925 INFO  (coreZkRegister-2367-thread-1-processing-n:127.0.0.1:58491_iryp x:collection1 s:shard1 c:control_collection r:core_node1) [n:127.0.0.1:58491_iryp c:control_collection s:shard1 r:core_node1 x:collection1] o.a.s.c.c.ZkStateReader Checking legacy cluster state for collection control_collection
   [junit4]   2> 673028 INFO  (zkCallback-726-thread-6-processing-n:127.0.0.1:58491_iryp) [n:127.0.0.1:58491_iryp    ] o.a.s.c.c.ZkStateReader A cluster state change: [WatchedEvent state:SyncConnected type:NodeDataChanged path:/clusterstate.json], has occurred - updating... (live nodes size: [1])
   [junit4]   2> 673057 INFO  (TEST-ForceLeaderTest.testLastPublishedStateIsActive-seed#[C2E9814C439D3B54]) [    ] o.a.s.c.c.SolrZkClient Using default ZkCredentialsProvider
   [junit4]   2> 673058 INFO  (TEST-ForceLeaderTest.testLastPublishedStateIsActive-seed#[C2E9814C439D3B54]) [    ] o.a.s.c.c.ConnectionManager Waiting for client to connect to ZooKeeper
   [junit4]   2> 673060 INFO  (zkCallback-730-thread-1) [    ] o.a.s.c.c.ConnectionManager Watcher org.apache.solr.common.cloud.ConnectionManager@150b22a3 name:ZooKeeperConnection Watcher:127.0.0.1:58484/solr got event WatchedEvent state:SyncConnected type:None path:null path:null type:None
   [junit4]   2> 673060 INFO  (TEST-ForceLeaderTest.testLastPublishedStateIsActive-seed#[C2E9814C439D3B54]) [    ] o.a.s.c.c.ConnectionManager Client is connected to ZooKeeper
   [junit4]   2> 673060 INFO  (TEST-ForceLeaderTest.testLastPublishedStateIsActive-seed#[C2E9814C439D3B54]) [    ] o.a.s.c.c.SolrZkClient Using default ZkACLProvider
   [junit4]   2> 673060 INFO  (TEST-ForceLeaderTest.testLastPublishedStateIsActive-seed#[C2E9814C439D3B54]) [    ] o.a.s.c.c.ZkStateReader Updating cluster state from ZooKeeper... 
   [junit4]   2> 673061 INFO  (TEST-ForceLeaderTest.testLastPublishedStateIsActive-seed#[C2E9814C439D3B54]) [    ] o.a.s.c.c.ZkStateReader Loaded empty cluster properties
   [junit4]   2> 673062 INFO  (TEST-ForceLeaderTest.testLastPublishedStateIsActive-seed#[C2E9814C439D3B54]) [    ] o.a.s.c.c.ZkStateReader Updated live nodes from ZooKeeper... (0) -> (1)
   [junit4]   2> 673063 INFO  (TEST-ForceLeaderTest.testLastPublishedStateIsActive-seed#[C2E9814C439D3B54]) [    ] o.a.s.c.ChaosMonkey monkey: init - expire sessions:false cause connection loss:false
   [junit4]   2> 673063 INFO  (TEST-ForceLeaderTest.testLastPublishedStateIsActive-seed#[C2E9814C439D3B54]) [    ] o.a.s.c.AbstractFullDistribZkTestBase Creating collection1 with stateFormat=2
   [junit4]   2> 673063 INFO  (TEST-ForceLeaderTest.testLastPublishedStateIsActive-seed#[C2E9814C439D3B54]) [    ] o.a.s.c.c.SolrZkClient Using default ZkCredentialsProvider
   [junit4]   2> 673064 INFO  (TEST-ForceLeaderTest.testLastPublishedStateIsActive-seed#[C2E9814C439D3B54]) [    ] o.a.s.c.c.ConnectionManager Waiting for client to connect to ZooKeeper
   [junit4]   2> 673066 INFO  (zkCallback-731-thread-1) [    ] o.a.s.c.c.ConnectionManager Watcher org.apache.solr.common.cloud.ConnectionManager@63e4dfb name:ZooKeeperConnection Watcher:127.0.0.1:58484/solr got event WatchedEvent state:SyncConnected type:None path:null path:null type:None
   [junit4]   2> 673066 INFO  (TEST-ForceLeaderTest.testLastPublishedStateIsActive-seed#[C2E9814C439D3B54]) [    ] o.a.s.c.c.ConnectionManager Client is connected to ZooKeeper
   [junit4]   2> 673066 INFO  (TEST-ForceLeaderTest.testLastPublishedStateIsActive-seed#[C2E9814C439D3B54]) [    ] o.a.s.c.c.SolrZkClient Using default ZkACLProvider
   [junit4]   2> 673068 WARN  (NIOServerCxn.Factory:0.0.0.0/0.0.0.0:0) [    ] o.a.z.s.NIOServerCnxn caught end of stream exception
   [junit4]   2> EndOfStreamException: Unable to read additional data from client sessionid 0x156eaea87170006, likely client has closed socket
   [junit4]   2> 	at org.apache.zookeeper.server.NIOServerCnxn.doIO(NIOServerCnxn.java:228)
   [junit4]   2> 	at org.apache.zookeeper.server.NIOServerCnxnFactory.run(NIOServerCnxnFactory.java:208)
   [junit4]   2> 	at java.lang.Thread.run(Thread.java:745)
   [junit4]   2> 673069 INFO  (OverseerStateUpdate-96522735044722692-127.0.0.1:58491_iryp-n_0000000000) [n:127.0.0.1:58491_iryp    ] o.a.s.c.Overseer processMessage: queueSize: 1, message = {
   [junit4]   2>   "operation":"create",
   [junit4]   2>   "name":"collection1",
   [junit4]   2>   "numShards":"2",
   [junit4]   2>   "stateFormat":"2"} current state version: 3
   [junit4]   2> 673071 INFO  (OverseerStateUpdate-96522735044722692-127.0.0.1:58491_iryp-n_0000000000) [n:127.0.0.1:58491_iryp    ] o.a.s.c.o.ClusterStateMutator building a new cName: collection1
   [junit4]   2> 673179 INFO  (OverseerStateUpdate-96522735044722692-127.0.0.1:58491_iryp-n_0000000000) [n:127.0.0.1:58491_iryp    ] o.a.s.c.o.ZkStateWriter going to create_collection /collections/collection1/state.json
   [junit4]   2> 673539 INFO  (TEST-ForceLeaderTest.testLastPublishedStateIsActive-seed#[C2E9814C439D3B54]) [    ] o.a.s.SolrTestCaseJ4 Writing core.properties file to C:\Users\jenkins\workspace\Lucene-Solr-master-Windows\solr\build\solr-core\test\J1\temp\solr.cloud.ForceLeaderTest_C2E9814C439D3B54-001\shard-1-001\cores\collection1
   [junit4]   2> 673543 INFO  (TEST-ForceLeaderTest.testLastPublishedStateIsActive-seed#[C2E9814C439D3B54]) [    ] o.a.s.c.AbstractFullDistribZkTestBase create jetty 1 in directory C:\Users\jenkins\workspace\Lucene-Solr-master-Windows\solr\build\solr-core\test\J1\temp\solr.cloud.ForceLeaderTest_C2E9814C439D3B54-001\shard-1-001
   [junit4]   2> 673544 INFO  (TEST-ForceLeaderTest.testLastPublishedStateIsActive-seed#[C2E9814C439D3B54]) [    ] o.e.j.s.Server jetty-9.3.8.v20160314
   [junit4]   2> 673545 INFO  (TEST-ForceLeaderTest.testLastPublishedStateIsActive-seed#[C2E9814C439D3B54]) [    ] o.e.j.s.h.ContextHandler Started o.e.j.s.ServletContextHandler@afe2ea2{/iryp,null,AVAILABLE}
   [junit4]   2> 673546 INFO  (TEST-ForceLeaderTest.testLastPublishedStateIsActive-seed#[C2E9814C439D3B54]) [    ] o.e.j.s.ServerConnector Started ServerConnector@63bd91c1{HTTP/1.1,[http/1.1]}{127.0.0.1:58513}
   [junit4]   2> 673547 INFO  (TEST-ForceLeaderTest.testLastPublishedStateIsActive-seed#[C2E9814C439D3B54]) [    ] o.e.j.s.Server Started @678120ms
   [junit4]   2> 673547 INFO  (TEST-ForceLeaderTest.testLastPublishedStateIsActive-seed#[C2E9814C439D3B54]) [    ] o.a.s.c.s.e.JettySolrRunner Jetty properties: {solr.data.dir=C:\Users\jenkins\workspace\Lucene-Solr-master-Windows\solr\build\solr-core\test\J1\temp\solr.cloud.ForceLeaderTest_C2E9814C439D3B54-001\tempDir-001/jetty1, solrconfig=solrconfig.xml, hostContext=/iryp, hostPort=58512, coreRootDirectory=C:\Users\jenkins\workspace\Lucene-Solr-master-Windows\solr\build\solr-core\test\J1\temp\solr.cloud.ForceLeaderTest_C2E9814C439D3B54-001\shard-1-001\cores}
   [junit4]   2> 673547 INFO  (TEST-ForceLeaderTest.testLastPublishedStateIsActive-seed#[C2E9814C439D3B54]) [    ] o.a.s.s.SolrDispatchFilter SolrDispatchFilter.init(): sun.misc.Launcher$AppClassLoader@73d16e93
   [junit4]   2> 673547 INFO  (TEST-ForceLeaderTest.testLastPublishedStateIsActive-seed#[C2E9814C439D3B54]) [    ] o.a.s.c.SolrResourceLoader new SolrResourceLoader for directory: 'C:\Users\jenkins\workspace\Lucene-Solr-master-Windows\solr\build\solr-core\test\J1\temp\solr.cloud.ForceLeaderTest_C2E9814C439D3B54-001\shard-1-001'
   [junit4]   2> 673549 INFO  (TEST-ForceLeaderTest.testLastPublishedStateIsActive-seed#[C2E9814C439D3B54]) [    ] o.a.s.c.SolrResourceLoader JNDI not configured for solr (NoInitialContextEx)
   [junit4]   2> 673549 INFO  (TEST-ForceLeaderTest.testLastPublishedStateIsActive-seed#[C2E9814C439D3B54]) [    ] o.a.s.c.SolrResourceLoader solr home defaulted to 'solr/' (could not find system property or JNDI)
   [junit4]   2> 673549 INFO  (TEST-ForceLeaderTest.testLastPublishedStateIsActive-seed#[C2E9814C439D3B54]) [    ] o.a.s.c.c.SolrZkClient Using default ZkCredentialsProvider
   [junit4]   2> 673551 INFO  (TEST-ForceLeaderTest.testLastPublishedStateIsActive-seed#[C2E9814C439D3B54]) [    ] o.a.s.c.c.ConnectionManager Waiting for client to connect to ZooKeeper
   [junit4]   2> 673553 INFO  (zkCallback-732-thread-1) [    ] o.a.s.c.c.ConnectionManager Watcher org.apache.solr.common.cloud.ConnectionManager@50575257 name:ZooKeeperConnection Watcher:127.0.0.1:58484/solr got event WatchedEvent state:SyncConnected type:None path:null path:null type:None
   [junit4]   2> 673553 INFO  (TEST-ForceLeaderTest.testLastPublishedStateIsActive-seed#[C2E9814C439D3B54]) [    ] o.a.s.c.c.ConnectionManager Client is connected to ZooKeeper
   [junit4]   2> 673553 INFO  (TEST-ForceLeaderTest.testLastPublishedStateIsActive-seed#[C2E9814C439D3B54]) [    ] o.a.s.c.c.SolrZkClient Using default ZkACLProvider
   [junit4]   2> 673556 INFO  (TEST-ForceLeaderTest.testLastPublishedStateIsActive-seed#[C2E9814C439D3B54]) [    ] o.a.s.s.SolrDispatchFilter Loading solr.xml from SolrHome (not found in ZooKeeper)
   [junit4]   2> 673556 INFO  (TEST-ForceLeaderTest.testLastPublishedStateIsActive-seed#[C2E9814C439D3B54]) [    ] o.a.s.c.SolrXmlConfig Loading container configuration from C:\Users\jenkins\workspace\Lucene-Solr-master-Windows\solr\build\solr-core\test\J1\temp\solr.cloud.ForceLeaderTest_C2E9814C439D3B54-001\shard-1-001\solr.xml
   [junit4]   2> 673565 INFO  (TEST-ForceLeaderTest.testLastPublishedStateIsActive-seed#[C2E9814C439D3B54]) [    ] o.a.s.c.CorePropertiesLocator Config-defined core root directory: C:\Users\jenkins\workspace\Lucene-Solr-master-Windows\solr\build\solr-core\test\J1\temp\solr.cloud.ForceLeaderTest_C2E9814C439D3B54-001\shard-1-001\cores
   [junit4]   2> 673565 INFO  (TEST-ForceLeaderTest.testLastPublishedStateIsActive-seed#[C2E9814C439D3B54]) [    ] o.a.s.c.CoreContainer New CoreContainer 2005923703
   [junit4]   2> 673566 INFO  (TEST-ForceLeaderTest.testLastPublishedStateIsActive-seed#[C2E9814C439D3B54]) [    ] o.a.s.c.CoreContainer Loading cores into CoreContainer [instanceDir=C:\Users\jenkins\workspace\Lucene-Solr-master-Windows\solr\build\solr-core\test\J1\temp\solr.cloud.ForceLeaderTest_C2E9814C439D3B54-001\shard-1-001]
   [junit4]   2> 673566 WARN  (TEST-ForceLeaderTest.testLastPublishedStateIsActive-seed#[C2E9814C439D3B54]) [    ] o.a.s.c.CoreContainer Couldn't add files from C:\Users\jenkins\workspace\Lucene-Solr-master-Windows\solr\build\solr-core\test\J1\temp\solr.cloud.ForceLeaderTest_C2E9814C439D3B54-001\shard-1-001\lib to classpath: C:\Users\jenkins\workspace\Lucene-Solr-master-Windows\solr\build\solr-core\test\J1\temp\solr.cloud.ForceLeaderTest_C2E9814C439D3B54-001\shard-1-001\lib
   [junit4]   2> 673566 INFO  (TEST-ForceLeaderTest.testLastPublishedStateIsActive-seed#[C2E9814C439D3B54]) [    ] o.a.s.h.c.HttpShardHandlerFactory created with socketTimeout : 90000,urlScheme : ,connTimeout : 15000,maxConnectionsPerHost : 20,maxConnections : 10000,corePoolSize : 0,maximumPoolSize : 2147483647,maxThreadIdleTime : 5,sizeOfQueue : -1,fairnessPolicy : false,
   [junit4]   2> 673571 INFO  (TEST-ForceLeaderTest.testLastPublishedStateIsActive-seed#[C2E9814C439D3B54]) [    ] o.a.s.u.UpdateShardHandler Created UpdateShardHandler HTTP client with params: socketTimeout=340000&connTimeout=45000&maxConnections=100000&maxConnectionsPerHost=100000
   [junit4]   2> 673571 INFO  (TEST-ForceLeaderTest.testLastPublishedStateIsActive-seed#[C2E9814C439D3B54]) [    ] o.a.s.l.LogWatcher SLF4J impl is org.slf4j.impl.Log4jLoggerFactory
   [junit4]   2> 673571 INFO  (TEST-ForceLeaderTest.testLastPublishedStateIsActive-seed#[C2E9814C439D3B54]) [    ] o.a.s.l.LogWatcher Registering Log Listener [Log4j (org.slf4j.impl.Log4jLoggerFactory)]
   [junit4]   2> 673571 INFO  (TEST-ForceLeaderTest.testLastPublishedStateIsActive-seed#[C2E9814C439D3B54]) [    ] o.a.s.c.ZkContainer Zookeeper client=127.0.0.1:58484/solr
   [junit4]   2> 673571 INFO  (TEST-ForceLeaderTest.testLastPublishedStateIsActive-seed#[C2E9814C439D3B54]) [    ] o.a.s.c.ZkController zkHost includes chroot
   [junit4]   2> 673571 INFO  (TEST-ForceLeaderTest.testLastPublishedStateIsActive-seed#[C2E9814C439D3B54]) [    ] o.a.s.c.c.SolrZkClient Using default ZkCredentialsProvider
   [junit4]   2> 673572 INFO  (TEST-ForceLeaderTest.testLastPublishedStateIsActive-seed#[C2E9814C439D3B54]) [    ] o.a.s.c.c.ConnectionManager Waiting for client to connect to ZooKeeper
   [junit4]   2> 673574 INFO  (zkCallback-735-thread-1) [    ] o.a.s.c.c.ConnectionManager Watcher org.apache.solr.common.cloud.ConnectionManager@6cb94871 name:ZooKeeperConnection Watcher:127.0.0.1:58484 got event WatchedEvent state:SyncConnected type:None path:null path:null type:None
   [junit4]   2> 673575 INFO  (TEST-ForceLeaderTest.testLastPublishedStateIsActive-seed#[C2E9814C439D3B54]) [    ] o.a.s.c.c.ConnectionManager Client is connected to ZooKeeper
   [junit4]   2> 673575 INFO  (TEST-ForceLeaderTest.testLastPublishedStateIsActive-seed#[C2E9814C439D3B54]) [    ] o.a.s.c.c.SolrZkClient Using default ZkACLProvider
   [junit4]   2> 673577 WARN  (NIOServerCxn.Factory:0.0.0.0/0.0.0.0:0) [    ] o.a.z.s.NIOServerCnxn caught end of stream exception
   [junit4]   2> EndOfStreamException: Unable to read additional data from client sessionid 0x156eaea87170008, likely client has closed socket
   [junit4]   2> 	at org.apache.zooke

[...truncated too long message...]

3B54]-worker) [    ] o.a.s.SolrTestCaseJ4 ###deleteCore
   [junit4]   2> NOTE: test params are: codec=CheapBastard, sim=RandomSimilarity(queryNorm=true): {}, locale=el-CY, timezone=America/Kentucky/Louisville
   [junit4]   2> NOTE: Windows 10 10.0 amd64/Oracle Corporation 1.8.0_102 (64-bit)/cpus=3,threads=1,free=252598312,total=518979584
   [junit4]   2> NOTE: All tests run in this JVM: [DistributedSuggestComponentTest, LeaderElectionIntegrationTest, TestReplicaProperties, TestSimpleTrackingShardHandler, TestConfigSetsAPIZkFailure, TestPHPSerializedResponseWriter, SortSpecParsingTest, TestHighFrequencyDictionaryFactory, TestGraphMLResponseWriter, TestDocTermOrds, HdfsDirectoryTest, ConnectionReuseTest, BasicDistributedZk2Test, OverseerModifyCollectionTest, EchoParamsTest, HdfsCollectionsAPIDistributedZkTest, QueryResultKeyTest, TestDistributedMissingSort, SearchHandlerTest, BlockJoinFacetRandomTest, TestBM25SimilarityFactory, TestRawTransformer, DistributedExpandComponentTest, RemoteQueryErrorTest, LukeRequestHandlerTest, TestRuleBasedAuthorizationPlugin, TestSchemaNameResource, TestUseDocValuesAsStored2, ChangedSchemaMergeTest, CollectionsAPIDistributedZkTest, TestFoldingMultitermQuery, CollectionsAPIAsyncDistributedZkTest, QueryParsingTest, PluginInfoTest, DistanceFunctionTest, SignatureUpdateProcessorFactoryTest, BadIndexSchemaTest, OpenCloseCoreStressTest, TestAnalyzeInfixSuggestions, MergeStrategyTest, ResourceLoaderTest, TestRequestStatusCollectionAPI, ChaosMonkeySafeLeaderTest, ConvertedLegacyTest, LeaderFailoverAfterPartitionTest, AddBlockUpdateTest, ForceLeaderTest, InfoHandlerTest, TestMiniSolrCloudCluster, TestWriterPerf, ResponseLogComponentTest, BlockDirectoryTest, TestFastOutputStream, TestDynamicLoading, ConnectionManagerTest, CloudExitableDirectoryReaderTest, ShowFileRequestHandlerTest, TestSolrFieldCacheMBean, DirectUpdateHandlerOptimizeTest, TestSortingResponseWriter, SynonymTokenizerTest, SaslZkACLProviderTest, FileBasedSpellCheckerTest, TestSerializedLuceneMatchVersion, AddSchemaFieldsUpdateProcessorFactoryTest, DateMathParserTest, AnalyticsQueryTest, FieldMutatingUpdateProcessorTest, GraphQueryTest, PeerSyncReplicationTest, WrapperMergePolicyFactoryTest, TestExactStatsCache, BaseCdcrDistributedZkTest, HdfsRestartWhileUpdatingTest, TestStressRecovery, TestScoreJoinQPScore, TestSystemIdResolver, SuggesterWFSTTest, CdcrReplicationDistributedZkTest, TestSmileRequest, MultiTermTest, TestHdfsUpdateLog, TestNamedUpdateProcessors, CustomCollectionTest, TestOrdValues, TestStressUserVersions, FileUtilsTest, DistributedTermsComponentTest, ZkStateReaderTest, TestSubQueryTransformerDistrib, TestLegacyFieldCache, TestInfoStreamLogging, TestQuerySenderListener, TestJettySolrRunner, DistribDocExpirationUpdateProcessorTest, DistributedFacetPivotSmallTest, TestSolrIndexConfig, ClassificationUpdateProcessorFactoryTest, BadCopyFieldTest, TestExpandComponent, NumericFieldsTest, CdcrUpdateLogTest, TestFieldCacheVsDocValues, SortByFunctionTest, BitVectorTest, ShardRoutingCustomTest, TestQueryTypes, FullHLLTest, HighlighterConfigTest, StatsComponentTest, TestSolrCloudWithDelegationTokens, TestBlobHandler, TestZkChroot, TestManagedResourceStorage, SuggestComponentTest, TestCloudSchemaless, DebugComponentTest, TestReqParamsAPI, HLLUtilTest, DefaultValueUpdateProcessorTest, TestOnReconnectListenerSupport, SpellCheckCollatorTest, TestJsonFacets, TestIndexingPerformance, TestQueryUtils, TestInitQParser, SegmentsInfoRequestHandlerTest, TestRandomFaceting, SimpleCollectionCreateDeleteTest, OpenExchangeRatesOrgProviderTest, TestRecoveryHdfs, TestFieldCacheSort, SpatialHeatmapFacetsTest, TestTolerantUpdateProcessorRandomCloud, HdfsChaosMonkeyNothingIsSafeTest, TestGraphTermsQParserPlugin, TestRealTimeGet, TestCharFilters, TestAtomicUpdateErrorCases, SpellCheckComponentTest, TestCoreDiscovery, TestSolrCoreProperties, OutputWriterTest, LeaderInitiatedRecoveryOnShardRestartTest, DocExpirationUpdateProcessorFactoryTest, DocValuesMissingTest, TestCrossCoreJoin, TestNumericTerms64, TestConfigOverlay, BinaryUpdateRequestHandlerTest, TestSolrQueryParserResource, OverseerTest, BasicZkTest, FullSolrCloudDistribCmdsTest, ZkSolrClientTest, TestRandomDVFaceting, TestDistributedSearch, DistributedSpellCheckComponentTest, TestJoin, TestReload, HardAutoCommitTest, TestSolr4Spatial, TestGroupingSearch, SolrCmdDistributorTest, TestSort, BasicFunctionalityTest, TestLazyCores, CurrencyFieldOpenExchangeTest, CurrencyFieldXmlFileTest, SolrIndexSplitterTest, SimplePostToolTest, AnalysisAfterCoreReloadTest, TestExtendedDismaxParser, SuggesterFSTTest, SolrRequestParserTest, DocValuesTest, StatelessScriptUpdateProcessorFactoryTest, CacheHeaderTest, TestSurroundQueryParser, StandardRequestHandlerTest, TestReversedWildcardFilterFactory, DocumentAnalysisRequestHandlerTest, TermsComponentTest, TestValueSourceCache, RequiredFieldsTest, FieldAnalysisRequestHandlerTest, FastVectorHighlighterTest, LoggingHandlerTest, IndexSchemaTest, TestCSVResponseWriter, UniqFieldsUpdateProcessorFactoryTest, PingRequestHandlerTest, SOLR749Test, AlternateDirectoryTest, CopyFieldTest, SolrIndexConfigTest, TestMergePolicyConfig, TestSolrDeletionPolicy2, MinimalSchemaTest, TestElisionMultitermQuery, ExternalFileFieldSortTest, DirectSolrConnectionTest, TestPhraseSuggestions, TestSweetSpotSimilarityFactory, TestPerFieldSimilarity, TestLMDirichletSimilarityFactory, TestIBSimilarityFactory, TimeZoneUtilsTest, TestFastLRUCache, PreAnalyzedFieldTest, PrimUtilsTest, TestSuggestSpellingConverter, DateFieldTest, SpellingQueryConverterTest, DOMUtilTest, RAMDirectoryFactoryTest, ClusterStateTest, TestSolrJ, TestUtils, ZkNodePropsTest, SliceStateTest, UUIDFieldTest, DistributedMLTComponentTest, TestRTGBase, DistributedIntervalFacetingTest, SolrTestCaseJ4Test, ActionThrottleTest, AliasIntegrationTest, AsyncCallRequestStatusResponseTest, CdcrRequestHandlerTest, CollectionStateFormat2Test, CollectionsAPISolrJTest, DeleteReplicaTest, MigrateRouteKeyTest, OverriddenZkACLAndCredentialsProvidersTest, OverseerStatusTest, SSLMigrationTest, SharedFSAutoReplicaFailoverTest, SolrCloudExampleTest, TestCloudDeleteByQuery, TestCloudPseudoReturnFields, TestCollectionAPI, TestDistribDocBasedVersion, TestHdfsCloudBackupRestore, TestLeaderElectionZkExpiry, TestMiniSolrCloudClusterSSL, TestRandomRequestDistribution, TestSolrCloudWithKerberosAlt, TestSolrCloudWithSecureImpersonation]
   [junit4]   2> NOTE: reproduce with: ant test  -Dtestcase=TestSolrCloudWithSecureImpersonation -Dtests.seed=C2E9814C439D3B54 -Dtests.slow=true -Dtests.locale=el-CY -Dtests.timezone=America/Kentucky/Louisville -Dtests.asserts=true -Dtests.file.encoding=UTF-8
   [junit4] ERROR   0.00s J1 | TestSolrCloudWithSecureImpersonation (suite) <<<
   [junit4]    > Throwable #1: com.google.common.util.concurrent.UncheckedExecutionException: java.lang.NullPointerException
   [junit4]    > 	at __randomizedtesting.SeedInfo.seed([C2E9814C439D3B54]:0)
   [junit4]    > 	at com.google.common.cache.LocalCache$Segment.get(LocalCache.java:2263)
   [junit4]    > 	at com.google.common.cache.LocalCache.get(LocalCache.java:4000)
   [junit4]    > 	at com.google.common.cache.LocalCache.getOrLoad(LocalCache.java:4004)
   [junit4]    > 	at com.google.common.cache.LocalCache$LocalLoadingCache.get(LocalCache.java:4874)
   [junit4]    > 	at org.apache.hadoop.security.Groups.getGroups(Groups.java:182)
   [junit4]    > 	at org.apache.solr.cloud.TestSolrCloudWithSecureImpersonation.getUsersFirstGroup(TestSolrCloudWithSecureImpersonation.java:64)
   [junit4]    > 	at org.apache.solr.cloud.TestSolrCloudWithSecureImpersonation.getImpersonatorSettings(TestSolrCloudWithSecureImpersonation.java:86)
   [junit4]    > 	at org.apache.solr.cloud.TestSolrCloudWithSecureImpersonation.startup(TestSolrCloudWithSecureImpersonation.java:99)
   [junit4]    > 	at java.lang.Thread.run(Thread.java:745)
   [junit4]    > Caused by: java.lang.NullPointerException
   [junit4]    > 	at java.lang.ProcessBuilder.start(ProcessBuilder.java:1012)
   [junit4]    > 	at org.apache.hadoop.util.Shell.runCommand(Shell.java:483)
   [junit4]    > 	at org.apache.hadoop.util.Shell.run(Shell.java:456)
   [junit4]    > 	at org.apache.hadoop.util.Shell$ShellCommandExecutor.execute(Shell.java:722)
   [junit4]    > 	at org.apache.hadoop.util.Shell.execCommand(Shell.java:815)
   [junit4]    > 	at org.apache.hadoop.util.Shell.execCommand(Shell.java:798)
   [junit4]    > 	at org.apache.hadoop.security.ShellBasedUnixGroupsMapping.getUnixGroups(ShellBasedUnixGroupsMapping.java:84)
   [junit4]    > 	at org.apache.hadoop.security.ShellBasedUnixGroupsMapping.getGroups(ShellBasedUnixGroupsMapping.java:52)
   [junit4]    > 	at org.apache.hadoop.security.JniBasedUnixGroupsMappingWithFallback.getGroups(JniBasedUnixGroupsMappingWithFallback.java:51)
   [junit4]    > 	at org.apache.hadoop.security.Groups$GroupCacheLoader.fetchGroupList(Groups.java:239)
   [junit4]    > 	at org.apache.hadoop.security.Groups$GroupCacheLoader.load(Groups.java:220)
   [junit4]    > 	at org.apache.hadoop.security.Groups$GroupCacheLoader.load(Groups.java:208)
   [junit4]    > 	at com.google.common.cache.LocalCache$LoadingValueReference.loadFuture(LocalCache.java:3599)
   [junit4]    > 	at com.google.common.cache.LocalCache$Segment.loadSync(LocalCache.java:2379)
   [junit4]    > 	at com.google.common.cache.LocalCache$Segment.lockedGetOrLoad(LocalCache.java:2342)
   [junit4]    > 	at com.google.common.cache.LocalCache$Segment.get(LocalCache.java:2257)
   [junit4]    > 	... 31 moreThrowable #2: java.lang.NullPointerException
   [junit4]    > 	at __randomizedtesting.SeedInfo.seed([C2E9814C439D3B54]:0)
   [junit4]    > 	at org.apache.solr.cloud.TestSolrCloudWithSecureImpersonation.shutdown(TestSolrCloudWithSecureImpersonation.java:154)
   [junit4]    > 	at java.lang.Thread.run(Thread.java:745)
   [junit4] Completed [508/632 (2!)] on J1 in 0.33s, 0 tests, 2 errors <<< FAILURES!

[...truncated 60523 lines...]


Mime
View raw message