lucene-dev mailing list archives

Site index · List index
Message view « Date » · « Thread »
Top « Date » · « Thread »
From Policeman Jenkins Server <jenk...@thetaphi.de>
Subject [JENKINS] Lucene-Solr-master-Solaris (64bit/jdk1.8.0) - Build # 839 - Still Unstable!
Date Sun, 11 Sep 2016 09:06:08 GMT
Build: http://jenkins.thetaphi.de/job/Lucene-Solr-master-Solaris/839/
Java: 64bit/jdk1.8.0 -XX:+UseCompressedOops -XX:+UseParallelGC

1 tests failed.
FAILED:  org.apache.solr.cloud.ForceLeaderTest.testReplicasInLIRNoLeader

Error Message:
org.apache.solr.client.solrj.SolrServerException: No live SolrServers available to handle this request:[http://127.0.0.1:54654/forceleader_test_collection_shard1_replica2]

Stack Trace:
org.apache.solr.client.solrj.SolrServerException: org.apache.solr.client.solrj.SolrServerException: No live SolrServers available to handle this request:[http://127.0.0.1:54654/forceleader_test_collection_shard1_replica2]
	at __randomizedtesting.SeedInfo.seed([B4E494297AAC199E:5273A0E9432EE0FF]:0)
	at org.apache.solr.client.solrj.impl.CloudSolrClient.directUpdate(CloudSolrClient.java:769)
	at org.apache.solr.client.solrj.impl.CloudSolrClient.sendRequest(CloudSolrClient.java:1161)
	at org.apache.solr.client.solrj.impl.CloudSolrClient.requestWithRetryOnStaleState(CloudSolrClient.java:1050)
	at org.apache.solr.client.solrj.impl.CloudSolrClient.request(CloudSolrClient.java:992)
	at org.apache.solr.cloud.AbstractFullDistribZkTestBase.sendDocsWithRetry(AbstractFullDistribZkTestBase.java:753)
	at org.apache.solr.cloud.AbstractFullDistribZkTestBase.sendDocsWithRetry(AbstractFullDistribZkTestBase.java:741)
	at org.apache.solr.cloud.ForceLeaderTest.sendDoc(ForceLeaderTest.java:424)
	at org.apache.solr.cloud.ForceLeaderTest.assertSendDocFails(ForceLeaderTest.java:315)
	at org.apache.solr.cloud.ForceLeaderTest.testReplicasInLIRNoLeader(ForceLeaderTest.java:110)
	at sun.reflect.NativeMethodAccessorImpl.invoke0(Native Method)
	at sun.reflect.NativeMethodAccessorImpl.invoke(NativeMethodAccessorImpl.java:62)
	at sun.reflect.DelegatingMethodAccessorImpl.invoke(DelegatingMethodAccessorImpl.java:43)
	at java.lang.reflect.Method.invoke(Method.java:498)
	at com.carrotsearch.randomizedtesting.RandomizedRunner.invoke(RandomizedRunner.java:1764)
	at com.carrotsearch.randomizedtesting.RandomizedRunner$8.evaluate(RandomizedRunner.java:871)
	at com.carrotsearch.randomizedtesting.RandomizedRunner$9.evaluate(RandomizedRunner.java:907)
	at com.carrotsearch.randomizedtesting.RandomizedRunner$10.evaluate(RandomizedRunner.java:921)
	at org.apache.solr.BaseDistributedSearchTestCase$ShardsRepeatRule$ShardsFixedStatement.callStatement(BaseDistributedSearchTestCase.java:985)
	at org.apache.solr.BaseDistributedSearchTestCase$ShardsRepeatRule$ShardsStatement.evaluate(BaseDistributedSearchTestCase.java:960)
	at com.carrotsearch.randomizedtesting.rules.SystemPropertiesRestoreRule$1.evaluate(SystemPropertiesRestoreRule.java:57)
	at org.apache.lucene.util.TestRuleSetupTeardownChained$1.evaluate(TestRuleSetupTeardownChained.java:49)
	at org.apache.lucene.util.AbstractBeforeAfterRule$1.evaluate(AbstractBeforeAfterRule.java:45)
	at org.apache.lucene.util.TestRuleThreadAndTestName$1.evaluate(TestRuleThreadAndTestName.java:48)
	at org.apache.lucene.util.TestRuleIgnoreAfterMaxFailures$1.evaluate(TestRuleIgnoreAfterMaxFailures.java:64)
	at org.apache.lucene.util.TestRuleMarkFailure$1.evaluate(TestRuleMarkFailure.java:47)
	at com.carrotsearch.randomizedtesting.rules.StatementAdapter.evaluate(StatementAdapter.java:36)
	at com.carrotsearch.randomizedtesting.ThreadLeakControl$StatementRunner.run(ThreadLeakControl.java:367)
	at com.carrotsearch.randomizedtesting.ThreadLeakControl.forkTimeoutingTask(ThreadLeakControl.java:809)
	at com.carrotsearch.randomizedtesting.ThreadLeakControl$3.evaluate(ThreadLeakControl.java:460)
	at com.carrotsearch.randomizedtesting.RandomizedRunner.runSingleTest(RandomizedRunner.java:880)
	at com.carrotsearch.randomizedtesting.RandomizedRunner$5.evaluate(RandomizedRunner.java:781)
	at com.carrotsearch.randomizedtesting.RandomizedRunner$6.evaluate(RandomizedRunner.java:816)
	at com.carrotsearch.randomizedtesting.RandomizedRunner$7.evaluate(RandomizedRunner.java:827)
	at com.carrotsearch.randomizedtesting.rules.StatementAdapter.evaluate(StatementAdapter.java:36)
	at com.carrotsearch.randomizedtesting.rules.SystemPropertiesRestoreRule$1.evaluate(SystemPropertiesRestoreRule.java:57)
	at org.apache.lucene.util.AbstractBeforeAfterRule$1.evaluate(AbstractBeforeAfterRule.java:45)
	at com.carrotsearch.randomizedtesting.rules.StatementAdapter.evaluate(StatementAdapter.java:36)
	at org.apache.lucene.util.TestRuleStoreClassName$1.evaluate(TestRuleStoreClassName.java:41)
	at com.carrotsearch.randomizedtesting.rules.NoShadowingOrOverridesOnMethodsRule$1.evaluate(NoShadowingOrOverridesOnMethodsRule.java:40)
	at com.carrotsearch.randomizedtesting.rules.NoShadowingOrOverridesOnMethodsRule$1.evaluate(NoShadowingOrOverridesOnMethodsRule.java:40)
	at com.carrotsearch.randomizedtesting.rules.StatementAdapter.evaluate(StatementAdapter.java:36)
	at com.carrotsearch.randomizedtesting.rules.StatementAdapter.evaluate(StatementAdapter.java:36)
	at com.carrotsearch.randomizedtesting.rules.StatementAdapter.evaluate(StatementAdapter.java:36)
	at org.apache.lucene.util.TestRuleAssertionsRequired$1.evaluate(TestRuleAssertionsRequired.java:53)
	at org.apache.lucene.util.TestRuleMarkFailure$1.evaluate(TestRuleMarkFailure.java:47)
	at org.apache.lucene.util.TestRuleIgnoreAfterMaxFailures$1.evaluate(TestRuleIgnoreAfterMaxFailures.java:64)
	at org.apache.lucene.util.TestRuleIgnoreTestSuites$1.evaluate(TestRuleIgnoreTestSuites.java:54)
	at com.carrotsearch.randomizedtesting.rules.StatementAdapter.evaluate(StatementAdapter.java:36)
	at com.carrotsearch.randomizedtesting.ThreadLeakControl$StatementRunner.run(ThreadLeakControl.java:367)
	at java.lang.Thread.run(Thread.java:745)
Caused by: org.apache.solr.client.solrj.SolrServerException: No live SolrServers available to handle this request:[http://127.0.0.1:54654/forceleader_test_collection_shard1_replica2]
	at org.apache.solr.client.solrj.impl.LBHttpSolrClient.request(LBHttpSolrClient.java:394)
	at org.apache.solr.client.solrj.impl.CloudSolrClient.directUpdate(CloudSolrClient.java:763)
	... 49 more
Caused by: org.apache.solr.client.solrj.SolrServerException: Server refused connection at: http://127.0.0.1:54654/forceleader_test_collection_shard1_replica2
	at org.apache.solr.client.solrj.impl.HttpSolrClient.executeMethod(HttpSolrClient.java:615)
	at org.apache.solr.client.solrj.impl.HttpSolrClient.request(HttpSolrClient.java:261)
	at org.apache.solr.client.solrj.impl.HttpSolrClient.request(HttpSolrClient.java:250)
	at org.apache.solr.client.solrj.impl.LBHttpSolrClient.doRequest(LBHttpSolrClient.java:415)
	at org.apache.solr.client.solrj.impl.LBHttpSolrClient.request(LBHttpSolrClient.java:383)
	... 50 more
Caused by: org.apache.http.conn.HttpHostConnectException: Connect to 127.0.0.1:54654 [/127.0.0.1] failed: Connection refused
	at org.apache.http.impl.conn.DefaultHttpClientConnectionOperator.connect(DefaultHttpClientConnectionOperator.java:151)
	at org.apache.http.impl.conn.PoolingHttpClientConnectionManager.connect(PoolingHttpClientConnectionManager.java:353)
	at org.apache.http.impl.execchain.MainClientExec.establishRoute(MainClientExec.java:380)
	at org.apache.http.impl.execchain.MainClientExec.execute(MainClientExec.java:236)
	at org.apache.http.impl.execchain.ProtocolExec.execute(ProtocolExec.java:184)
	at org.apache.http.impl.execchain.RetryExec.execute(RetryExec.java:88)
	at org.apache.http.impl.execchain.RedirectExec.execute(RedirectExec.java:110)
	at org.apache.http.impl.client.InternalHttpClient.doExecute(InternalHttpClient.java:184)
	at org.apache.http.impl.client.CloseableHttpClient.execute(CloseableHttpClient.java:82)
	at org.apache.http.impl.client.CloseableHttpClient.execute(CloseableHttpClient.java:55)
	at org.apache.solr.client.solrj.impl.HttpSolrClient.executeMethod(HttpSolrClient.java:513)
	... 54 more
Caused by: java.net.ConnectException: Connection refused
	at java.net.PlainSocketImpl.socketConnect(Native Method)
	at java.net.AbstractPlainSocketImpl.doConnect(AbstractPlainSocketImpl.java:350)
	at java.net.AbstractPlainSocketImpl.connectToAddress(AbstractPlainSocketImpl.java:206)
	at java.net.AbstractPlainSocketImpl.connect(AbstractPlainSocketImpl.java:188)
	at java.net.SocksSocketImpl.connect(SocksSocketImpl.java:392)
	at java.net.Socket.connect(Socket.java:589)
	at org.apache.http.conn.socket.PlainConnectionSocketFactory.connectSocket(PlainConnectionSocketFactory.java:74)
	at org.apache.http.impl.conn.DefaultHttpClientConnectionOperator.connect(DefaultHttpClientConnectionOperator.java:134)
	... 64 more




Build Log:
[...truncated 12008 lines...]
   [junit4] Suite: org.apache.solr.cloud.ForceLeaderTest
   [junit4]   2> Creating dataDir: /export/home/jenkins/workspace/Lucene-Solr-master-Solaris/solr/build/solr-core/test/J1/temp/solr.cloud.ForceLeaderTest_B4E494297AAC199E-001/init-core-data-001
   [junit4]   2> 2226911 INFO  (SUITE-ForceLeaderTest-seed#[B4E494297AAC199E]-worker) [    ] o.a.s.SolrTestCaseJ4 Randomized ssl (false) and clientAuth (false) via: @org.apache.solr.SolrTestCaseJ4$SuppressSSL(bugUrl=https://issues.apache.org/jira/browse/SOLR-5776)
   [junit4]   2> 2226911 INFO  (SUITE-ForceLeaderTest-seed#[B4E494297AAC199E]-worker) [    ] o.a.s.BaseDistributedSearchTestCase Setting hostContext system property: /
   [junit4]   2> 2226913 INFO  (TEST-ForceLeaderTest.testLastPublishedStateIsActive-seed#[B4E494297AAC199E]) [    ] o.a.s.c.ZkTestServer STARTING ZK TEST SERVER
   [junit4]   2> 2226914 INFO  (Thread-7379) [    ] o.a.s.c.ZkTestServer client port:0.0.0.0/0.0.0.0:0
   [junit4]   2> 2226914 INFO  (Thread-7379) [    ] o.a.s.c.ZkTestServer Starting server
   [junit4]   2> 2227015 INFO  (TEST-ForceLeaderTest.testLastPublishedStateIsActive-seed#[B4E494297AAC199E]) [    ] o.a.s.c.ZkTestServer start zk server on port:56789
   [junit4]   2> 2227015 INFO  (TEST-ForceLeaderTest.testLastPublishedStateIsActive-seed#[B4E494297AAC199E]) [    ] o.a.s.c.c.SolrZkClient Using default ZkCredentialsProvider
   [junit4]   2> 2227016 INFO  (TEST-ForceLeaderTest.testLastPublishedStateIsActive-seed#[B4E494297AAC199E]) [    ] o.a.s.c.c.ConnectionManager Waiting for client to connect to ZooKeeper
   [junit4]   2> 2227019 INFO  (zkCallback-3132-thread-1) [    ] o.a.s.c.c.ConnectionManager Watcher org.apache.solr.common.cloud.ConnectionManager@5d695cda name:ZooKeeperConnection Watcher:127.0.0.1:56789 got event WatchedEvent state:SyncConnected type:None path:null path:null type:None
   [junit4]   2> 2227019 INFO  (TEST-ForceLeaderTest.testLastPublishedStateIsActive-seed#[B4E494297AAC199E]) [    ] o.a.s.c.c.ConnectionManager Client is connected to ZooKeeper
   [junit4]   2> 2227019 INFO  (TEST-ForceLeaderTest.testLastPublishedStateIsActive-seed#[B4E494297AAC199E]) [    ] o.a.s.c.c.SolrZkClient Using default ZkACLProvider
   [junit4]   2> 2227019 INFO  (TEST-ForceLeaderTest.testLastPublishedStateIsActive-seed#[B4E494297AAC199E]) [    ] o.a.s.c.c.SolrZkClient makePath: /solr
   [junit4]   2> 2227023 INFO  (TEST-ForceLeaderTest.testLastPublishedStateIsActive-seed#[B4E494297AAC199E]) [    ] o.a.s.c.c.SolrZkClient Using default ZkCredentialsProvider
   [junit4]   2> 2227023 INFO  (TEST-ForceLeaderTest.testLastPublishedStateIsActive-seed#[B4E494297AAC199E]) [    ] o.a.s.c.c.ConnectionManager Waiting for client to connect to ZooKeeper
   [junit4]   2> 2227025 INFO  (zkCallback-3133-thread-1) [    ] o.a.s.c.c.ConnectionManager Watcher org.apache.solr.common.cloud.ConnectionManager@6007803e name:ZooKeeperConnection Watcher:127.0.0.1:56789/solr got event WatchedEvent state:SyncConnected type:None path:null path:null type:None
   [junit4]   2> 2227025 INFO  (TEST-ForceLeaderTest.testLastPublishedStateIsActive-seed#[B4E494297AAC199E]) [    ] o.a.s.c.c.ConnectionManager Client is connected to ZooKeeper
   [junit4]   2> 2227025 INFO  (TEST-ForceLeaderTest.testLastPublishedStateIsActive-seed#[B4E494297AAC199E]) [    ] o.a.s.c.c.SolrZkClient Using default ZkACLProvider
   [junit4]   2> 2227025 INFO  (TEST-ForceLeaderTest.testLastPublishedStateIsActive-seed#[B4E494297AAC199E]) [    ] o.a.s.c.c.SolrZkClient makePath: /collections/collection1
   [junit4]   2> 2227027 INFO  (TEST-ForceLeaderTest.testLastPublishedStateIsActive-seed#[B4E494297AAC199E]) [    ] o.a.s.c.c.SolrZkClient makePath: /collections/collection1/shards
   [junit4]   2> 2227029 INFO  (TEST-ForceLeaderTest.testLastPublishedStateIsActive-seed#[B4E494297AAC199E]) [    ] o.a.s.c.c.SolrZkClient makePath: /collections/control_collection
   [junit4]   2> 2227031 INFO  (TEST-ForceLeaderTest.testLastPublishedStateIsActive-seed#[B4E494297AAC199E]) [    ] o.a.s.c.c.SolrZkClient makePath: /collections/control_collection/shards
   [junit4]   2> 2227034 INFO  (TEST-ForceLeaderTest.testLastPublishedStateIsActive-seed#[B4E494297AAC199E]) [    ] o.a.s.c.AbstractZkTestCase put /export/home/jenkins/workspace/Lucene-Solr-master-Solaris/solr/core/src/test-files/solr/collection1/conf/solrconfig-tlog.xml to /configs/conf1/solrconfig.xml
   [junit4]   2> 2227034 INFO  (TEST-ForceLeaderTest.testLastPublishedStateIsActive-seed#[B4E494297AAC199E]) [    ] o.a.s.c.c.SolrZkClient makePath: /configs/conf1/solrconfig.xml
   [junit4]   2> 2227038 INFO  (TEST-ForceLeaderTest.testLastPublishedStateIsActive-seed#[B4E494297AAC199E]) [    ] o.a.s.c.AbstractZkTestCase put /export/home/jenkins/workspace/Lucene-Solr-master-Solaris/solr/core/src/test-files/solr/collection1/conf/schema.xml to /configs/conf1/schema.xml
   [junit4]   2> 2227038 INFO  (TEST-ForceLeaderTest.testLastPublishedStateIsActive-seed#[B4E494297AAC199E]) [    ] o.a.s.c.c.SolrZkClient makePath: /configs/conf1/schema.xml
   [junit4]   2> 2227041 INFO  (TEST-ForceLeaderTest.testLastPublishedStateIsActive-seed#[B4E494297AAC199E]) [    ] o.a.s.c.AbstractZkTestCase put /export/home/jenkins/workspace/Lucene-Solr-master-Solaris/solr/core/src/test-files/solr/collection1/conf/solrconfig.snippet.randomindexconfig.xml to /configs/conf1/solrconfig.snippet.randomindexconfig.xml
   [junit4]   2> 2227041 INFO  (TEST-ForceLeaderTest.testLastPublishedStateIsActive-seed#[B4E494297AAC199E]) [    ] o.a.s.c.c.SolrZkClient makePath: /configs/conf1/solrconfig.snippet.randomindexconfig.xml
   [junit4]   2> 2227043 INFO  (TEST-ForceLeaderTest.testLastPublishedStateIsActive-seed#[B4E494297AAC199E]) [    ] o.a.s.c.AbstractZkTestCase put /export/home/jenkins/workspace/Lucene-Solr-master-Solaris/solr/core/src/test-files/solr/collection1/conf/stopwords.txt to /configs/conf1/stopwords.txt
   [junit4]   2> 2227043 INFO  (TEST-ForceLeaderTest.testLastPublishedStateIsActive-seed#[B4E494297AAC199E]) [    ] o.a.s.c.c.SolrZkClient makePath: /configs/conf1/stopwords.txt
   [junit4]   2> 2227047 INFO  (TEST-ForceLeaderTest.testLastPublishedStateIsActive-seed#[B4E494297AAC199E]) [    ] o.a.s.c.AbstractZkTestCase put /export/home/jenkins/workspace/Lucene-Solr-master-Solaris/solr/core/src/test-files/solr/collection1/conf/protwords.txt to /configs/conf1/protwords.txt
   [junit4]   2> 2227047 INFO  (TEST-ForceLeaderTest.testLastPublishedStateIsActive-seed#[B4E494297AAC199E]) [    ] o.a.s.c.c.SolrZkClient makePath: /configs/conf1/protwords.txt
   [junit4]   2> 2227049 INFO  (TEST-ForceLeaderTest.testLastPublishedStateIsActive-seed#[B4E494297AAC199E]) [    ] o.a.s.c.AbstractZkTestCase put /export/home/jenkins/workspace/Lucene-Solr-master-Solaris/solr/core/src/test-files/solr/collection1/conf/currency.xml to /configs/conf1/currency.xml
   [junit4]   2> 2227049 INFO  (TEST-ForceLeaderTest.testLastPublishedStateIsActive-seed#[B4E494297AAC199E]) [    ] o.a.s.c.c.SolrZkClient makePath: /configs/conf1/currency.xml
   [junit4]   2> 2227052 INFO  (TEST-ForceLeaderTest.testLastPublishedStateIsActive-seed#[B4E494297AAC199E]) [    ] o.a.s.c.AbstractZkTestCase put /export/home/jenkins/workspace/Lucene-Solr-master-Solaris/solr/core/src/test-files/solr/collection1/conf/enumsConfig.xml to /configs/conf1/enumsConfig.xml
   [junit4]   2> 2227052 INFO  (TEST-ForceLeaderTest.testLastPublishedStateIsActive-seed#[B4E494297AAC199E]) [    ] o.a.s.c.c.SolrZkClient makePath: /configs/conf1/enumsConfig.xml
   [junit4]   2> 2227054 INFO  (TEST-ForceLeaderTest.testLastPublishedStateIsActive-seed#[B4E494297AAC199E]) [    ] o.a.s.c.AbstractZkTestCase put /export/home/jenkins/workspace/Lucene-Solr-master-Solaris/solr/core/src/test-files/solr/collection1/conf/open-exchange-rates.json to /configs/conf1/open-exchange-rates.json
   [junit4]   2> 2227055 INFO  (TEST-ForceLeaderTest.testLastPublishedStateIsActive-seed#[B4E494297AAC199E]) [    ] o.a.s.c.c.SolrZkClient makePath: /configs/conf1/open-exchange-rates.json
   [junit4]   2> 2227057 INFO  (TEST-ForceLeaderTest.testLastPublishedStateIsActive-seed#[B4E494297AAC199E]) [    ] o.a.s.c.AbstractZkTestCase put /export/home/jenkins/workspace/Lucene-Solr-master-Solaris/solr/core/src/test-files/solr/collection1/conf/mapping-ISOLatin1Accent.txt to /configs/conf1/mapping-ISOLatin1Accent.txt
   [junit4]   2> 2227057 INFO  (TEST-ForceLeaderTest.testLastPublishedStateIsActive-seed#[B4E494297AAC199E]) [    ] o.a.s.c.c.SolrZkClient makePath: /configs/conf1/mapping-ISOLatin1Accent.txt
   [junit4]   2> 2227060 INFO  (TEST-ForceLeaderTest.testLastPublishedStateIsActive-seed#[B4E494297AAC199E]) [    ] o.a.s.c.AbstractZkTestCase put /export/home/jenkins/workspace/Lucene-Solr-master-Solaris/solr/core/src/test-files/solr/collection1/conf/old_synonyms.txt to /configs/conf1/old_synonyms.txt
   [junit4]   2> 2227060 INFO  (TEST-ForceLeaderTest.testLastPublishedStateIsActive-seed#[B4E494297AAC199E]) [    ] o.a.s.c.c.SolrZkClient makePath: /configs/conf1/old_synonyms.txt
   [junit4]   2> 2227063 INFO  (TEST-ForceLeaderTest.testLastPublishedStateIsActive-seed#[B4E494297AAC199E]) [    ] o.a.s.c.AbstractZkTestCase put /export/home/jenkins/workspace/Lucene-Solr-master-Solaris/solr/core/src/test-files/solr/collection1/conf/synonyms.txt to /configs/conf1/synonyms.txt
   [junit4]   2> 2227063 INFO  (TEST-ForceLeaderTest.testLastPublishedStateIsActive-seed#[B4E494297AAC199E]) [    ] o.a.s.c.c.SolrZkClient makePath: /configs/conf1/synonyms.txt
   [junit4]   2> 2227208 INFO  (TEST-ForceLeaderTest.testLastPublishedStateIsActive-seed#[B4E494297AAC199E]) [    ] o.a.s.SolrTestCaseJ4 Writing core.properties file to /export/home/jenkins/workspace/Lucene-Solr-master-Solaris/solr/build/solr-core/test/J1/temp/solr.cloud.ForceLeaderTest_B4E494297AAC199E-001/control-001/cores/collection1
   [junit4]   2> 2227209 INFO  (TEST-ForceLeaderTest.testLastPublishedStateIsActive-seed#[B4E494297AAC199E]) [    ] o.e.j.s.Server jetty-9.3.8.v20160314
   [junit4]   2> 2227211 INFO  (TEST-ForceLeaderTest.testLastPublishedStateIsActive-seed#[B4E494297AAC199E]) [    ] o.e.j.s.h.ContextHandler Started o.e.j.s.ServletContextHandler@33999e66{/,null,AVAILABLE}
   [junit4]   2> 2227211 INFO  (TEST-ForceLeaderTest.testLastPublishedStateIsActive-seed#[B4E494297AAC199E]) [    ] o.e.j.s.ServerConnector Started ServerConnector@69ea3f47{HTTP/1.1,[http/1.1]}{127.0.0.1:64317}
   [junit4]   2> 2227211 INFO  (TEST-ForceLeaderTest.testLastPublishedStateIsActive-seed#[B4E494297AAC199E]) [    ] o.e.j.s.Server Started @2230364ms
   [junit4]   2> 2227211 INFO  (TEST-ForceLeaderTest.testLastPublishedStateIsActive-seed#[B4E494297AAC199E]) [    ] o.a.s.c.s.e.JettySolrRunner Jetty properties: {solr.data.dir=/export/home/jenkins/workspace/Lucene-Solr-master-Solaris/solr/build/solr-core/test/J1/temp/solr.cloud.ForceLeaderTest_B4E494297AAC199E-001/tempDir-001/control/data, hostContext=/, hostPort=38046, coreRootDirectory=/export/home/jenkins/workspace/Lucene-Solr-master-Solaris/solr/build/solr-core/test/J1/temp/solr.cloud.ForceLeaderTest_B4E494297AAC199E-001/control-001/cores}
   [junit4]   2> 2227211 INFO  (TEST-ForceLeaderTest.testLastPublishedStateIsActive-seed#[B4E494297AAC199E]) [    ] o.a.s.s.SolrDispatchFilter SolrDispatchFilter.init(): sun.misc.Launcher$AppClassLoader@6d06d69c
   [junit4]   2> 2227211 INFO  (TEST-ForceLeaderTest.testLastPublishedStateIsActive-seed#[B4E494297AAC199E]) [    ] o.a.s.c.SolrResourceLoader new SolrResourceLoader for directory: '/export/home/jenkins/workspace/Lucene-Solr-master-Solaris/solr/build/solr-core/test/J1/temp/solr.cloud.ForceLeaderTest_B4E494297AAC199E-001/control-001'
   [junit4]   2> 2227211 INFO  (TEST-ForceLeaderTest.testLastPublishedStateIsActive-seed#[B4E494297AAC199E]) [    ] o.a.s.c.SolrResourceLoader JNDI not configured for solr (NoInitialContextEx)
   [junit4]   2> 2227212 INFO  (TEST-ForceLeaderTest.testLastPublishedStateIsActive-seed#[B4E494297AAC199E]) [    ] o.a.s.c.SolrResourceLoader solr home defaulted to 'solr/' (could not find system property or JNDI)
   [junit4]   2> 2227212 INFO  (TEST-ForceLeaderTest.testLastPublishedStateIsActive-seed#[B4E494297AAC199E]) [    ] o.a.s.c.c.SolrZkClient Using default ZkCredentialsProvider
   [junit4]   2> 2227212 INFO  (TEST-ForceLeaderTest.testLastPublishedStateIsActive-seed#[B4E494297AAC199E]) [    ] o.a.s.c.c.ConnectionManager Waiting for client to connect to ZooKeeper
   [junit4]   2> 2227214 INFO  (zkCallback-3134-thread-1) [    ] o.a.s.c.c.ConnectionManager Watcher org.apache.solr.common.cloud.ConnectionManager@3c682961 name:ZooKeeperConnection Watcher:127.0.0.1:56789/solr got event WatchedEvent state:SyncConnected type:None path:null path:null type:None
   [junit4]   2> 2227215 INFO  (TEST-ForceLeaderTest.testLastPublishedStateIsActive-seed#[B4E494297AAC199E]) [    ] o.a.s.c.c.ConnectionManager Client is connected to ZooKeeper
   [junit4]   2> 2227215 INFO  (TEST-ForceLeaderTest.testLastPublishedStateIsActive-seed#[B4E494297AAC199E]) [    ] o.a.s.c.c.SolrZkClient Using default ZkACLProvider
   [junit4]   2> 2227216 INFO  (TEST-ForceLeaderTest.testLastPublishedStateIsActive-seed#[B4E494297AAC199E]) [    ] o.a.s.s.SolrDispatchFilter Loading solr.xml from SolrHome (not found in ZooKeeper)
   [junit4]   2> 2227216 INFO  (TEST-ForceLeaderTest.testLastPublishedStateIsActive-seed#[B4E494297AAC199E]) [    ] o.a.s.c.SolrXmlConfig Loading container configuration from /export/home/jenkins/workspace/Lucene-Solr-master-Solaris/solr/build/solr-core/test/J1/temp/solr.cloud.ForceLeaderTest_B4E494297AAC199E-001/control-001/solr.xml
   [junit4]   2> 2227220 INFO  (TEST-ForceLeaderTest.testLastPublishedStateIsActive-seed#[B4E494297AAC199E]) [    ] o.a.s.c.CorePropertiesLocator Config-defined core root directory: /export/home/jenkins/workspace/Lucene-Solr-master-Solaris/solr/build/solr-core/test/J1/temp/solr.cloud.ForceLeaderTest_B4E494297AAC199E-001/control-001/cores
   [junit4]   2> 2227220 INFO  (TEST-ForceLeaderTest.testLastPublishedStateIsActive-seed#[B4E494297AAC199E]) [    ] o.a.s.c.CoreContainer New CoreContainer 71069287
   [junit4]   2> 2227220 INFO  (TEST-ForceLeaderTest.testLastPublishedStateIsActive-seed#[B4E494297AAC199E]) [    ] o.a.s.c.CoreContainer Loading cores into CoreContainer [instanceDir=/export/home/jenkins/workspace/Lucene-Solr-master-Solaris/solr/build/solr-core/test/J1/temp/solr.cloud.ForceLeaderTest_B4E494297AAC199E-001/control-001]
   [junit4]   2> 2227220 WARN  (TEST-ForceLeaderTest.testLastPublishedStateIsActive-seed#[B4E494297AAC199E]) [    ] o.a.s.c.CoreContainer Couldn't add files from /export/home/jenkins/workspace/Lucene-Solr-master-Solaris/solr/build/solr-core/test/J1/temp/solr.cloud.ForceLeaderTest_B4E494297AAC199E-001/control-001/lib to classpath: /export/home/jenkins/workspace/Lucene-Solr-master-Solaris/solr/build/solr-core/test/J1/temp/solr.cloud.ForceLeaderTest_B4E494297AAC199E-001/control-001/lib
   [junit4]   2> 2227221 INFO  (TEST-ForceLeaderTest.testLastPublishedStateIsActive-seed#[B4E494297AAC199E]) [    ] o.a.s.h.c.HttpShardHandlerFactory created with socketTimeout : 90000,urlScheme : ,connTimeout : 15000,maxConnectionsPerHost : 20,maxConnections : 10000,corePoolSize : 0,maximumPoolSize : 2147483647,maxThreadIdleTime : 5,sizeOfQueue : -1,fairnessPolicy : false,
   [junit4]   2> 2227223 INFO  (TEST-ForceLeaderTest.testLastPublishedStateIsActive-seed#[B4E494297AAC199E]) [    ] o.a.s.u.UpdateShardHandler Created UpdateShardHandler HTTP client with params: socketTimeout=340000&connTimeout=45000&maxConnections=100000&maxConnectionsPerHost=100000
   [junit4]   2> 2227223 INFO  (TEST-ForceLeaderTest.testLastPublishedStateIsActive-seed#[B4E494297AAC199E]) [    ] o.a.s.l.LogWatcher SLF4J impl is org.slf4j.impl.Log4jLoggerFactory
   [junit4]   2> 2227223 INFO  (TEST-ForceLeaderTest.testLastPublishedStateIsActive-seed#[B4E494297AAC199E]) [    ] o.a.s.l.LogWatcher Registering Log Listener [Log4j (org.slf4j.impl.Log4jLoggerFactory)]
   [junit4]   2> 2227223 INFO  (TEST-ForceLeaderTest.testLastPublishedStateIsActive-seed#[B4E494297AAC199E]) [    ] o.a.s.c.ZkContainer Zookeeper client=127.0.0.1:56789/solr
   [junit4]   2> 2227223 INFO  (TEST-ForceLeaderTest.testLastPublishedStateIsActive-seed#[B4E494297AAC199E]) [    ] o.a.s.c.ZkController zkHost includes chroot
   [junit4]   2> 2227223 INFO  (TEST-ForceLeaderTest.testLastPublishedStateIsActive-seed#[B4E494297AAC199E]) [    ] o.a.s.c.c.SolrZkClient Using default ZkCredentialsProvider
   [junit4]   2> 2227224 INFO  (TEST-ForceLeaderTest.testLastPublishedStateIsActive-seed#[B4E494297AAC199E]) [    ] o.a.s.c.c.ConnectionManager Waiting for client to connect to ZooKeeper
   [junit4]   2> 2227226 INFO  (zkCallback-3137-thread-1) [    ] o.a.s.c.c.ConnectionManager Watcher org.apache.solr.common.cloud.ConnectionManager@719c5700 name:ZooKeeperConnection Watcher:127.0.0.1:56789 got event WatchedEvent state:SyncConnected type:None path:null path:null type:None
   [junit4]   2> 2227226 INFO  (TEST-ForceLeaderTest.testLastPublishedStateIsActive-seed#[B4E494297AAC199E]) [    ] o.a.s.c.c.ConnectionManager Client is connected to ZooKeeper
   [junit4]   2> 2227227 INFO  (TEST-ForceLeaderTest.testLastPublishedStateIsActive-seed#[B4E494297AAC199E]) [    ] o.a.s.c.c.SolrZkClient Using default ZkACLProvider
   [junit4]   2> 2227228 INFO  (TEST-ForceLeaderTest.testLastPublishedStateIsActive-seed#[B4E494297AAC199E]) [n:127.0.0.1:38046_    ] o.a.s.c.ZkController Added new OnReconnect listener org.apache.solr.cloud.ZkController$$Lambda$65/279308020@26fb977b
   [junit4]   2> 2227228 INFO  (TEST-ForceLeaderTest.testLastPublishedStateIsActive-seed#[B4E494297AAC199E]) [n:127.0.0.1:38046_    ] o.a.s.c.c.ConnectionManager Waiting for client to connect to ZooKeeper
   [junit4]   2> 2227230 INFO  (zkCallback-3138-thread-1-processing-n:127.0.0.1:38046_) [n:127.0.0.1:38046_    ] o.a.s.c.c.ConnectionManager Watcher org.apache.solr.common.cloud.ConnectionManager@3ea8b867 name:ZooKeeperConnection Watcher:127.0.0.1:56789/solr got event WatchedEvent state:SyncConnected type:None path:null path:null type:None
   [junit4]   2> 2227230 INFO  (TEST-ForceLeaderTest.testLastPublishedStateIsActive-seed#[B4E494297AAC199E]) [n:127.0.0.1:38046_    ] o.a.s.c.c.ConnectionManager Client is connected to ZooKeeper
   [junit4]   2> 2227231 INFO  (TEST-ForceLeaderTest.testLastPublishedStateIsActive-seed#[B4E494297AAC199E]) [n:127.0.0.1:38046_    ] o.a.s.c.c.SolrZkClient makePath: /overseer/queue
   [junit4]   2> 2227233 INFO  (TEST-ForceLeaderTest.testLastPublishedStateIsActive-seed#[B4E494297AAC199E]) [n:127.0.0.1:38046_    ] o.a.s.c.c.SolrZkClient makePath: /overseer/collection-queue-work
   [junit4]   2> 2227237 INFO  (TEST-ForceLeaderTest.testLastPublishedStateIsActive-seed#[B4E494297AAC199E]) [n:127.0.0.1:38046_    ] o.a.s.c.c.SolrZkClient makePath: /overseer/collection-map-running
   [junit4]   2> 2227240 INFO  (TEST-ForceLeaderTest.testLastPublishedStateIsActive-seed#[B4E494297AAC199E]) [n:127.0.0.1:38046_    ] o.a.s.c.c.SolrZkClient makePath: /overseer/collection-map-completed
   [junit4]   2> 2227243 INFO  (TEST-ForceLeaderTest.testLastPublishedStateIsActive-seed#[B4E494297AAC199E]) [n:127.0.0.1:38046_    ] o.a.s.c.c.SolrZkClient makePath: /overseer/collection-map-failure
   [junit4]   2> 2227245 INFO  (TEST-ForceLeaderTest.testLastPublishedStateIsActive-seed#[B4E494297AAC199E]) [n:127.0.0.1:38046_    ] o.a.s.c.c.SolrZkClient makePath: /live_nodes
   [junit4]   2> 2227247 INFO  (TEST-ForceLeaderTest.testLastPublishedStateIsActive-seed#[B4E494297AAC199E]) [n:127.0.0.1:38046_    ] o.a.s.c.c.SolrZkClient makePath: /aliases.json
   [junit4]   2> 2227248 INFO  (TEST-ForceLeaderTest.testLastPublishedStateIsActive-seed#[B4E494297AAC199E]) [n:127.0.0.1:38046_    ] o.a.s.c.c.SolrZkClient makePath: /clusterstate.json
   [junit4]   2> 2227250 INFO  (TEST-ForceLeaderTest.testLastPublishedStateIsActive-seed#[B4E494297AAC199E]) [n:127.0.0.1:38046_    ] o.a.s.c.c.SolrZkClient makePath: /security.json
   [junit4]   2> 2227251 INFO  (TEST-ForceLeaderTest.testLastPublishedStateIsActive-seed#[B4E494297AAC199E]) [n:127.0.0.1:38046_    ] o.a.s.c.c.ZkStateReader Updating cluster state from ZooKeeper... 
   [junit4]   2> 2227252 INFO  (TEST-ForceLeaderTest.testLastPublishedStateIsActive-seed#[B4E494297AAC199E]) [n:127.0.0.1:38046_    ] o.a.s.c.c.ZkStateReader Loaded empty cluster properties
   [junit4]   2> 2227253 INFO  (TEST-ForceLeaderTest.testLastPublishedStateIsActive-seed#[B4E494297AAC199E]) [n:127.0.0.1:38046_    ] o.a.s.c.c.ZkStateReader Updated live nodes from ZooKeeper... (0) -> (0)
   [junit4]   2> 2227256 INFO  (TEST-ForceLeaderTest.testLastPublishedStateIsActive-seed#[B4E494297AAC199E]) [n:127.0.0.1:38046_    ] o.a.s.c.c.SolrZkClient makePath: /overseer_elect
   [junit4]   2> 2227258 INFO  (TEST-ForceLeaderTest.testLastPublishedStateIsActive-seed#[B4E494297AAC199E]) [n:127.0.0.1:38046_    ] o.a.s.c.c.SolrZkClient makePath: /overseer_elect/election
   [junit4]   2> 2227260 INFO  (TEST-ForceLeaderTest.testLastPublishedStateIsActive-seed#[B4E494297AAC199E]) [n:127.0.0.1:38046_    ] o.a.s.c.Overseer Overseer (id=null) closing
   [junit4]   2> 2227260 INFO  (TEST-ForceLeaderTest.testLastPublishedStateIsActive-seed#[B4E494297AAC199E]) [n:127.0.0.1:38046_    ] o.a.s.c.LeaderElector Joined leadership election with path: /overseer_elect/election/96572705494138884-127.0.0.1:38046_-n_0000000000
   [junit4]   2> 2227261 INFO  (TEST-ForceLeaderTest.testLastPublishedStateIsActive-seed#[B4E494297AAC199E]) [n:127.0.0.1:38046_    ] o.a.s.c.OverseerElectionContext I am going to be the leader 127.0.0.1:38046_
   [junit4]   2> 2227261 INFO  (TEST-ForceLeaderTest.testLastPublishedStateIsActive-seed#[B4E494297AAC199E]) [n:127.0.0.1:38046_    ] o.a.s.c.c.SolrZkClient makePath: /overseer_elect/leader
   [junit4]   2> 2227262 INFO  (TEST-ForceLeaderTest.testLastPublishedStateIsActive-seed#[B4E494297AAC199E]) [n:127.0.0.1:38046_    ] o.a.s.c.Overseer Overseer (id=96572705494138884-127.0.0.1:38046_-n_0000000000) starting
   [junit4]   2> 2227265 INFO  (TEST-ForceLeaderTest.testLastPublishedStateIsActive-seed#[B4E494297AAC199E]) [n:127.0.0.1:38046_    ] o.a.s.c.c.SolrZkClient makePath: /overseer/queue-work
   [junit4]   2> 2227274 INFO  (TEST-ForceLeaderTest.testLastPublishedStateIsActive-seed#[B4E494297AAC199E]) [n:127.0.0.1:38046_    ] o.a.s.c.OverseerAutoReplicaFailoverThread Starting OverseerAutoReplicaFailoverThread autoReplicaFailoverWorkLoopDelay=10000 autoReplicaFailoverWaitAfterExpiration=10000 autoReplicaFailoverBadNodeExpiration=60000
   [junit4]   2> 2227275 INFO  (OverseerStateUpdate-96572705494138884-127.0.0.1:38046_-n_0000000000) [n:127.0.0.1:38046_    ] o.a.s.c.Overseer Starting to work on the main queue
   [junit4]   2> 2227275 INFO  (OverseerCollectionConfigSetProcessor-96572705494138884-127.0.0.1:38046_-n_0000000000) [n:127.0.0.1:38046_    ] o.a.s.c.OverseerTaskProcessor Process current queue of overseer operations
   [junit4]   2> 2227276 INFO  (TEST-ForceLeaderTest.testLastPublishedStateIsActive-seed#[B4E494297AAC199E]) [n:127.0.0.1:38046_    ] o.a.s.c.ZkController Register node as live in ZooKeeper:/live_nodes/127.0.0.1:38046_
   [junit4]   2> 2227276 INFO  (TEST-ForceLeaderTest.testLastPublishedStateIsActive-seed#[B4E494297AAC199E]) [n:127.0.0.1:38046_    ] o.a.s.c.c.SolrZkClient makePath: /live_nodes/127.0.0.1:38046_
   [junit4]   2> 2227279 INFO  (OverseerStateUpdate-96572705494138884-127.0.0.1:38046_-n_0000000000) [n:127.0.0.1:38046_    ] o.a.s.c.c.ZkStateReader Updated live nodes from ZooKeeper... (0) -> (0)
   [junit4]   2> 2227279 INFO  (zkCallback-3138-thread-1-processing-n:127.0.0.1:38046_) [n:127.0.0.1:38046_    ] o.a.s.c.c.ZkStateReader A live node change: [WatchedEvent state:SyncConnected type:NodeChildrenChanged path:/live_nodes], has occurred - updating... (live nodes size: [0])
   [junit4]   2> 2227282 INFO  (zkCallback-3138-thread-1-processing-n:127.0.0.1:38046_) [n:127.0.0.1:38046_    ] o.a.s.c.c.ZkStateReader Updated live nodes from ZooKeeper... (0) -> (1)
   [junit4]   2> 2227328 INFO  (TEST-ForceLeaderTest.testLastPublishedStateIsActive-seed#[B4E494297AAC199E]) [n:127.0.0.1:38046_    ] o.a.s.c.CoreContainer Security conf doesn't exist. Skipping setup for authorization module.
   [junit4]   2> 2227328 INFO  (TEST-ForceLeaderTest.testLastPublishedStateIsActive-seed#[B4E494297AAC199E]) [n:127.0.0.1:38046_    ] o.a.s.c.CoreContainer No authentication plugin used.
   [junit4]   2> 2227329 INFO  (TEST-ForceLeaderTest.testLastPublishedStateIsActive-seed#[B4E494297AAC199E]) [n:127.0.0.1:38046_    ] o.a.s.c.CorePropertiesLocator Looking for core definitions underneath /export/home/jenkins/workspace/Lucene-Solr-master-Solaris/solr/build/solr-core/test/J1/temp/solr.cloud.ForceLeaderTest_B4E494297AAC199E-001/control-001/cores
   [junit4]   2> 2227330 INFO  (TEST-ForceLeaderTest.testLastPublishedStateIsActive-seed#[B4E494297AAC199E]) [n:127.0.0.1:38046_    ] o.a.s.c.CoreDescriptor Created CoreDescriptor: {name=collection1, config=solrconfig.xml, transient=false, schema=schema.xml, loadOnStartup=true, configSetProperties=configsetprops.json, collection=control_collection, coreNodeName=, dataDir=data/, shard=}
   [junit4]   2> 2227330 INFO  (TEST-ForceLeaderTest.testLastPublishedStateIsActive-seed#[B4E494297AAC199E]) [n:127.0.0.1:38046_    ] o.a.s.c.CorePropertiesLocator Found core collection1 in /export/home/jenkins/workspace/Lucene-Solr-master-Solaris/solr/build/solr-core/test/J1/temp/solr.cloud.ForceLeaderTest_B4E494297AAC199E-001/control-001/cores/collection1
   [junit4]   2> 2227330 INFO  (TEST-ForceLeaderTest.testLastPublishedStateIsActive-seed#[B4E494297AAC199E]) [n:127.0.0.1:38046_    ] o.a.s.c.CorePropertiesLocator Found 1 core definitions
   [junit4]   2> 2227332 INFO  (coreLoadExecutor-10548-thread-1-processing-n:127.0.0.1:38046_) [n:127.0.0.1:38046_ c:control_collection   x:collection1] o.a.s.c.ZkController publishing state=down
   [junit4]   2> 2227332 INFO  (coreLoadExecutor-10548-thread-1-processing-n:127.0.0.1:38046_) [n:127.0.0.1:38046_ c:control_collection   x:collection1] o.a.s.c.ZkController numShards not found on descriptor - reading it from system property
   [junit4]   2> 2227332 INFO  (TEST-ForceLeaderTest.testLastPublishedStateIsActive-seed#[B4E494297AAC199E]) [n:127.0.0.1:38046_    ] o.a.s.s.SolrDispatchFilter user.dir=/export/home/jenkins/workspace/Lucene-Solr-master-Solaris/solr/build/solr-core/test/J1
   [junit4]   2> 2227332 INFO  (TEST-ForceLeaderTest.testLastPublishedStateIsActive-seed#[B4E494297AAC199E]) [n:127.0.0.1:38046_    ] o.a.s.s.SolrDispatchFilter SolrDispatchFilter.init() done
   [junit4]   2> 2227333 INFO  (coreLoadExecutor-10548-thread-1-processing-n:127.0.0.1:38046_) [n:127.0.0.1:38046_ c:control_collection   x:collection1] o.a.s.c.ZkController Collection control_collection not visible yet, but flagging it so a watch is registered when it becomes visible
   [junit4]   2> 2227334 INFO  (coreLoadExecutor-10548-thread-1-processing-n:127.0.0.1:38046_) [n:127.0.0.1:38046_ c:control_collection   x:collection1] o.a.s.c.c.ZkStateReader Deleting data for [control_collection]
   [junit4]   2> 2227335 INFO  (coreLoadExecutor-10548-thread-1-processing-n:127.0.0.1:38046_) [n:127.0.0.1:38046_ c:control_collection   x:collection1] o.a.s.c.ZkController look for our core node name
   [junit4]   2> 2227355 INFO  (OverseerStateUpdate-96572705494138884-127.0.0.1:38046_-n_0000000000) [n:127.0.0.1:38046_    ] o.a.s.c.Overseer processMessage: queueSize: 1, message = {
   [junit4]   2>   "core":"collection1",
   [junit4]   2>   "roles":null,
   [junit4]   2>   "base_url":"http://127.0.0.1:38046",
   [junit4]   2>   "node_name":"127.0.0.1:38046_",
   [junit4]   2>   "numShards":"1",
   [junit4]   2>   "state":"down",
   [junit4]   2>   "shard":null,
   [junit4]   2>   "collection":"control_collection",
   [junit4]   2>   "operation":"state"} current state version: 0
   [junit4]   2> 2227355 INFO  (OverseerStateUpdate-96572705494138884-127.0.0.1:38046_-n_0000000000) [n:127.0.0.1:38046_    ] o.a.s.c.o.ReplicaMutator Update state numShards=1 message={
   [junit4]   2>   "core":"collection1",
   [junit4]   2>   "roles":null,
   [junit4]   2>   "base_url":"http://127.0.0.1:38046",
   [junit4]   2>   "node_name":"127.0.0.1:38046_",
   [junit4]   2>   "numShards":"1",
   [junit4]   2>   "state":"down",
   [junit4]   2>   "shard":null,
   [junit4]   2>   "collection":"control_collection",
   [junit4]   2>   "operation":"state"}
   [junit4]   2> 2227356 INFO  (OverseerStateUpdate-96572705494138884-127.0.0.1:38046_-n_0000000000) [n:127.0.0.1:38046_    ] o.a.s.c.o.ClusterStateMutator building a new cName: control_collection
   [junit4]   2> 2227359 INFO  (OverseerStateUpdate-96572705494138884-127.0.0.1:38046_-n_0000000000) [n:127.0.0.1:38046_    ] o.a.s.c.o.ReplicaMutator Assigning new node to shard shard=shard1
   [junit4]   2> 2227394 INFO  (zkCallback-3138-thread-1-processing-n:127.0.0.1:38046_) [n:127.0.0.1:38046_    ] o.a.s.c.c.ZkStateReader A cluster state change: [WatchedEvent state:SyncConnected type:NodeDataChanged path:/clusterstate.json], has occurred - updating... (live nodes size: [1])
   [junit4]   2> 2228341 INFO  (coreLoadExecutor-10548-thread-1-processing-n:127.0.0.1:38046_) [n:127.0.0.1:38046_ c:control_collection   x:collection1] o.a.s.c.ZkController waiting to find shard id in clusterstate for collection1
   [junit4]   2> 2228341 INFO  (coreLoadExecutor-10548-thread-1-processing-n:127.0.0.1:38046_) [n:127.0.0.1:38046_ c:control_collection   x:collection1] o.a.s.c.ZkController Check for collection zkNode:control_collection
   [junit4]   2> 2228342 INFO  (coreLoadExecutor-10548-thread-1-processing-n:127.0.0.1:38046_) [n:127.0.0.1:38046_ c:control_collection   x:collection1] o.a.s.c.ZkController Collection zkNode exists
   [junit4]   2> 2228342 INFO  (coreLoadExecutor-10548-thread-1-processing-n:127.0.0.1:38046_) [n:127.0.0.1:38046_ c:control_collection   x:collection1] o.a.s.c.c.ZkStateReader Load collection config from: [/collections/control_collection]
   [junit4]   2> 2228343 INFO  (coreLoadExecutor-10548-thread-1-processing-n:127.0.0.1:38046_) [n:127.0.0.1:38046_ c:control_collection   x:collection1] o.a.s.c.c.ZkStateReader path=[/collections/control_collection] [configName]=[conf1] specified config exists in ZooKeeper
   [junit4]   2> 2228343 INFO  (coreLoadExecutor-10548-thread-1-processing-n:127.0.0.1:38046_) [n:127.0.0.1:38046_ c:control_collection   x:collection1] o.a.s.c.SolrResourceLoader new SolrResourceLoader for directory: '/export/home/jenkins/workspace/Lucene-Solr-master-Solaris/solr/build/solr-core/test/J1/temp/solr.cloud.ForceLeaderTest_B4E494297AAC199E-001/control-001/cores/collection1'
   [junit4]   2> 2228343 INFO  (coreLoadExecutor-10548-thread-1-processing-n:127.0.0.1:38046_) [n:127.0.0.1:38046_ c:control_collection   x:collection1] o.a.s.c.SolrResourceLoader JNDI not configured for solr (NoInitialContextEx)
   [junit4]   2> 2228343 INFO  (coreLoadExecutor-10548-thread-1-processing-n:127.0.0.1:38046_) [n:127.0.0.1:38046_ c:control_collection   x:collection1] o.a.s.c.SolrResourceLoader solr home defaulted to 'solr/' (could not find system property or JNDI)
   [junit4]   2> 2228345 INFO  (coreLoadExecutor-10548-thread-1-processing-n:127.0.0.1:38046_) [n:127.0.0.1:38046_ c:control_collection   x:collection1] o.a.s.c.Config loaded config solrconfig.xml with version 0 
   [junit4]   2> 2228350 INFO  (coreLoadExecutor-10548-thread-1-processing-n:127.0.0.1:38046_) [n:127.0.0.1:38046_ c:control_collection   x:collection1] o.a.s.c.SolrConfig current version of requestparams : -1
   [junit4]   2> 2228352 INFO  (coreLoadExecutor-10548-thread-1-processing-n:127.0.0.1:38046_) [n:127.0.0.1:38046_ c:control_collection   x:collection1] o.a.s.c.SolrConfig Using Lucene MatchVersion: 7.0.0
   [junit4]   2> 2228359 INFO  (coreLoadExecutor-10548-thread-1-processing-n:127.0.0.1:38046_) [n:127.0.0.1:38046_ c:control_collection   x:collection1] o.a.s.c.SolrConfig Loaded SolrConfig: solrconfig.xml
   [junit4]   2> 2228363 INFO  (coreLoadExecutor-10548-thread-1-processing-n:127.0.0.1:38046_) [n:127.0.0.1:38046_ c:control_collection   x:collection1] o.a.s.s.IndexSchema [collection1] Schema name=test
   [junit4]   2> 2228446 INFO  (coreLoadExecutor-10548-thread-1-processing-n:127.0.0.1:38046_) [n:127.0.0.1:38046_ c:control_collection   x:collection1] o.a.s.s.OpenExchangeRatesOrgProvider Initialized with rates=open-exchange-rates.json, refreshInterval=1440.
   [junit4]   2> 2228451 INFO  (coreLoadExecutor-10548-thread-1-processing-n:127.0.0.1:38046_) [n:127.0.0.1:38046_ c:control_collection   x:collection1] o.a.s.s.IndexSchema default search field in schema is text
   [junit4]   2> 2228452 INFO  (coreLoadExecutor-10548-thread-1-processing-n:127.0.0.1:38046_) [n:127.0.0.1:38046_ c:control_collection   x:collection1] o.a.s.s.IndexSchema unique key field: id
   [junit4]   2> 2228462 INFO  (coreLoadExecutor-10548-thread-1-processing-n:127.0.0.1:38046_) [n:127.0.0.1:38046_ c:control_collection   x:collection1] o.a.s.s.FileExchangeRateProvider Reloading exchange rates from file currency.xml
   [junit4]   2> 2228465 INFO  (coreLoadExecutor-10548-thread-1-processing-n:127.0.0.1:38046_) [n:127.0.0.1:38046_ c:control_collection   x:collection1] o.a.s.s.FileExchangeRateProvider Reloading exchange rates from file currency.xml
   [junit4]   2> 2228466 INFO  (coreLoadExecutor-10548-thread-1-processing-n:127.0.0.1:38046_) [n:127.0.0.1:38046_ c:control_collection   x:collection1] o.a.s.s.OpenExchangeRatesOrgProvider Reloading exchange rates from open-exchange-rates.json
   [junit4]   2> 2228467 INFO  (coreLoadExecutor-10548-thread-1-processing-n:127.0.0.1:38046_) [n:127.0.0.1:38046_ c:control_collection   x:collection1] o.a.s.s.OpenExchangeRatesOrgProvider Reloading exchange rates from open-exchange-rates.json
   [junit4]   2> 2228469 INFO  (coreLoadExecutor-10548-thread-1-processing-n:127.0.0.1:38046_) [n:127.0.0.1:38046_ c:control_collection   x:collection1] o.a.s.c.ConfigSetProperties Did not find ConfigSet properties, assuming default properties: Can't find resource 'configsetprops.json' in classpath or '/configs/conf1', cwd=/export/home/jenkins/workspace/Lucene-Solr-master-Solaris/solr/build/solr-core/test/J1
   [junit4]   2> 2228469 INFO  (coreLoadExecutor-10548-thread-1-processing-n:127.0.0.1:38046_) [n:127.0.0.1:38046_ c:control_collection   x:collection1] o.a.s.c.CoreContainer Creating SolrCore 'collection1' using configuration from collection control_collection
   [junit4]   2> 2228470 INFO  (coreLoadExecutor-10548-thread-1-processing-n:127.0.0.1:38046_) [n:127.0.0.1:38046_ c:control_collection s:shard1 r:core_node1 x:collection1] o.a.s.c.SolrCore org.apache.solr.core.MockDirectoryFactory
   [junit4]   2> 2228470 INFO  (coreLoadExecutor-10548-thread-1-processing-n:127.0.0.1:38046_) [n:127.0.0.1:38046_ c:control_collection s:shard1 r:core_node1 x:collection1] o.a.s.c.SolrCore [[collection1] ] Opening new SolrCore at [/export/home/jenkins/workspace/Lucene-Solr-master-Solaris/solr/build/solr-core/test/J1/temp/solr.cloud.ForceLeaderTest_B4E494297AAC199E-001/control-001/cores/collection1], dataDir=[/export/home/jenkins/workspace/Lucene-Solr-master-Solaris/solr/build/solr-core/test/J1/temp/solr.cloud.ForceLeaderTest_B4E494297AAC199E-001/control-001/cores/collection1/data/]
   [junit4]   2> 2228470 INFO  (coreLoadExecutor-10548-thread-1-processing-n:127.0.0.1:38046_) [n:127.0.0.1:38046_ c:control_collection s:shard1 r:core_node1 x:collection1] o.a.s.c.JmxMonitoredMap JMX monitoring is enabled. Adding Solr mbeans to JMX Server: com.sun.jmx.mbeanserver.JmxMBeanServer@2fd5ccef
   [junit4]   2> 2228470 INFO  (coreLoadExecutor-10548-thread-1-processing-n:127.0.0.1:38046_) [n:127.0.0.1:38046_ c:control_collection s:shard1 r:core_node1 x:collection1] o.a.s.c.CachingDirectoryFactory return new directory for /export/home/jenkins/workspace/Lucene-Solr-master-Solaris/solr/build/solr-core/test/J1/temp/solr.cloud.ForceLeaderTest_B4E494297AAC199E-001/control-001/cores/collection1/data/snapshot_metadata
   [junit4]   2> 2228470 INFO  (coreLoadExecutor-10548-thread-1-processing-n:127.0.0.1:38046_) [n:127.0.0.1:38046_ c:control_collection s:shard1 r:core_node1 x:collection1] o.a.s.c.s.SolrSnapshotMetaDataManager Loading from snapshot metadata file...
   [junit4]   2> 2228470 INFO  (coreLoadExecutor-10548-thread-1-processing-n:127.0.0.1:38046_) [n:127.0.0.1:38046_ c:control_collection s:shard1 r:core_node1 x:collection1] o.a.s.c.CachingDirectoryFactory return new directory for /export/home/jenkins/workspace/Lucene-Solr-master-Solaris/solr/build/solr-core/test/J1/temp/solr.cloud.ForceLeaderTest_B4E494297AAC199E-001/control-001/cores/collection1/data
   [junit4]   2> 2228470 INFO  (coreLoadExecutor-10548-thread-1-processing-n:127.0.0.1:38046_) [n:127.0.0.1:38046_ c:control_collection s:shard1 r:core_node1 x:collection1] o.a.s.c.SolrCore New index directory detected: old=null new=/export/home/jenkins/workspace/Lucene-Solr-master-Solaris/solr/build/solr-core/test/J1/temp/solr.cloud.ForceLeaderTest_B4E494297AAC199E-001/control-001/cores/collection1/data/index/
   [junit4]   2> 2228470 WARN  (coreLoadExecutor-10548-thread-1-processing-n:127.0.0.1:38046_) [n:127.0.0.1:38046_ c:control_collection s:shard1 r:core_node1 x:collection1] o.a.s.c.SolrCore [collection1] Solr index directory '/export/home/jenkins/workspace/Lucene-Solr-master-Solaris/solr/build/solr-core/test/J1/temp/solr.cloud.ForceLeaderTest_B4E494297AAC199E-001/control-001/cores/collection1/data/index' doesn't exist. Creating new index...
   [junit4]   2> 2228471 INFO  (coreLoadExecutor-10548-thread-1-processing-n:127.0.0.1:38046_) [n:127.0.0.1:38046_ c:control_collection s:shard1 r:core_node1 x:collection1] o.a.s.c.CachingDirectoryFactory return new directory for /export/home/jenkins/workspace/Lucene-Solr-master-Solaris/solr/build/solr-core/test/J1/temp/solr.cloud.ForceLeaderTest_B4E494297AAC199E-001/control-001/cores/collection1/data/index
   [junit4]   2> 2228471 INFO  (coreLoadExecutor-10548-thread-1-processing-n:127.0.0.1:38046_) [n:127.0.0.1:38046_ c:control_collection s:shard1 r:core_node1 x:collection1] o.a.s.u.RandomMergePolicy RandomMergePolicy wrapping class org.apache.lucene.index.AlcoholicMergePolicy: [AlcoholicMergePolicy: minMergeSize=0, mergeFactor=10, maxMergeSize=1520610765, maxMergeSizeForForcedMerge=9223372036854775807, calibrateSizeByDeletes=true, maxMergeDocs=2147483647, maxCFSSegmentSizeMB=8.796093022207999E12, noCFSRatio=0.1]
   [junit4]   2> 2228471 INFO  (coreLoadExecutor-10548-thread-1-processing-n:127.0.0.1:38046_) [n:127.0.0.1:38046_ c:control_collection s:shard1 r:core_node1 x:collection1] o.a.s.c.SolrDeletionPolicy SolrDeletionPolicy.onCommit: commits: num=1
   [junit4]   2> 	commit{dir=MockDirectoryWrapper(RAMDirectory@7a76db55 lockFactory=org.apache.lucene.store.SingleInstanceLockFactory@19ce919b),segFN=segments_1,generation=1}
   [junit4]   2> 2228471 INFO  (coreLoadExecutor-10548-thread-1-processing-n:127.0.0.1:38046_) [n:127.0.0.1:38046_ c:control_collection s:shard1 r:core_node1 x:collection1] o.a.s.c.SolrDeletionPolicy newest commit generation = 1
   [junit4]   2> 2228472 INFO  (OldIndexDirectoryCleanupThreadForCore-collection1) [n:127.0.0.1:38046_ c:control_collection s:shard1 r:core_node1 x:collection1] o.a.s.c.SolrCore Looking for old index directories to cleanup for core collection1 in /export/home/jenkins/workspace/Lucene-Solr-master-Solaris/solr/build/solr-core/test/J1/temp/solr.cloud.ForceLeaderTest_B4E494297AAC199E-001/control-001/cores/collection1/data/
   [junit4]   2> 2228472 WARN  (OldIndexDirectoryCleanupThreadForCore-collection1) [n:127.0.0.1:38046_ c:control_collection s:shard1 r:core_node1 x:collection1] o.a.s.c.DirectoryFactory /export/home/jenkins/workspace/Lucene-Solr-master-Solaris/solr/build/solr-core/test/J1/temp/solr.cloud.ForceLeaderTest_B4E494297AAC199E-001/control-001/cores/collection1/data/ does not point to a valid data directory; skipping clean-up of old index directories.
   [junit4]   2> 2228474 INFO  (coreLoadExecutor-10548-thread-1-processing-n:127.0.0.1:38046_) [n:127.0.0.1:38046_ c:control_collection s:shard1 r:core_node1 x:collection1] o.a.s.u.p.UpdateRequestProcessorChain creating updateRequestProcessorChain "nodistrib"
   [junit4]   2> 2228475 INFO  (coreLoadExecutor-10548-thread-1-processing-n:127.0.0.1:38046_) [n:127.0.0.1:38046_ c:control_collection s:shard1 r:core_node1 x:collection1] o.a.s.u.p.UpdateRequestProcessorChain creating updateRequestProcessorChain "dedupe"
   [junit4]   2> 2228475 INFO  (coreLoadExecutor-10548-thread-1-processing-n:127.0.0.1:38046_) [n:127.0.0.1:38046_ c:control_collection s:shard1 r:core_node1 x:collection1] o.a.s.u.p.UpdateRequestProcessorChain inserting DistributedUpdateProcessorFactory into updateRequestProcessorChain "dedupe"
   [junit4]   2> 2228475 INFO  (coreLoadExecutor-10548-thread-1-processing-n:127.0.0.1:38046_) [n:127.0.0.1:38046_ c:control_collection s:shard1 r:core_node1 x:collection1] o.a.s.u.p.UpdateRequestProcessorChain creating updateRequestProcessorChain "stored_sig"
   [junit4]   2> 2228475 INFO  (coreLoadExecutor-10548-thread-1-processing-n:127.0.0.1:38046_) [n:127.0.0.1:38046_ c:control_collection s:shard1 r:core_node1 x:collection1] o.a.s.u.p.UpdateRequestProcessorChain inserting DistributedUpdateProcessorFactory into updateRequestProcessorChain "stored_sig"
   [junit4]   2> 2228475 INFO  (coreLoadExecutor-10548-thread-1-processing-n:127.0.0.1:38046_) [n:127.0.0.1:38046_ c:control_collection s:shard1 r:core_node1 x:collection1] o.a.s.u.p.UpdateRequestProcessorChain creating updateRequestProcessorChain "distrib-dup-test-chain-explicit"
   [junit4]   2> 2228475 INFO  (coreLoadExecutor-10548-thread-1-processing-n:127.0.0.1:38046_) [n:127.0.0.1:38046_ c:control_collection s:shard1 r:core_node1 x:collection1] o.a.s.u.p.UpdateRequestProcessorChain creating updateRequestProcessorChain "distrib-dup-test-chain-implicit"
   [junit4]   2> 2228475 INFO  (coreLoadExecutor-10548-thread-1-processing-n:127.0.0.1:38046_) [n:127.0.0.1:38046_ c:control_collection s:shard1 r:core_node1 x:collection1] o.a.s.u.p.UpdateRequestProcessorChain inserting DistributedUpdateProcessorFactory into updateRequestProcessorChain "distrib-dup-test-chain-implicit"
   [junit4]   2> 2228475 INFO  (coreLoadExecutor-10548-thread-1-processing-n:127.0.0.1:38046_) [n:127.0.0.1:38046_ c:control_collection s:shard1 r:core_node1 x:collection1] o.a.s.c.SolrCore no updateRequestProcessorChain defined as default, creating implicit default
   [junit4]   2> 2228475 WARN  (coreLoadExecutor-10548-thread-1-processing-n:127.0.0.1:38046_) [n:127.0.0.1:38046_ c:control_collection s:shard1 r:core_node1 x:collection1] o.a.s.c.RequestHandlers INVALID paramSet a in requestHandler {type = requestHandler,name = /dump,class = DumpRequestHandler,args = {defaults={a=A,b=B}}}
   [junit4]   2> 2228477 INFO  (coreLoadExecutor-10548-thread-1-processing-n:127.0.0.1:38046_) [n:127.0.0.1:38046_ c:control_collection s:shard1 r:core_node1 x:collection1] o.a.s.h.l.XMLLoader xsltCacheLifetimeSeconds=60
   [junit4]   2> 2228478 INFO  (coreLoadExecutor-10548-thread-1-processing-n:127.0.0.1:38046_) [n:127.0.0.1:38046_ c:control_collection s:shard1 r:core_node1 x:collection1] o.a.s.h.l.XMLLoader xsltCacheLifetimeSeconds=60
   [junit4]   2> 2228479 INFO  (coreLoadExecutor-10548-thread-1-processing-n:127.0.0.1:38046_) [n:127.0.0.1:38046_ c:control_collection s:shard1 r:core_node1 x:collection1] o.a.s.h.l.XMLLoader xsltCacheLifetimeSeconds=60
   [junit4]   2> 2228479 INFO  (coreLoadExecutor-10548-thread-1-processing-n:127.0.0.1:38046_) [n:127.0.0.1:38046_ c:control_collection s:shard1 r:core_node1 x:collection1] o.a.s.h.l.XMLLoader xsltCacheLifetimeSeconds=60
   [junit4]   2> 2228483 INFO  (coreLoadExecutor-10548-thread-1-processing-n:127.0.0.1:38046_) [n:127.0.0.1:38046_ c:control_collection s:shard1 r:core_node1 x:collection1] o.a.s.c.RequestHandlers Registered paths: /admin/mbeans,standard,/update/json/docs,/admin/luke,/export,/get,/admin/properties,/update/json,/admin/threads,/dump,/update/csv,/sql,/graph,/admin/segments,/admin/system,/replication,/config,/stream,/schema,/admin/plugins,/admin/logging,/admin/ping,/update,/admin/file,/terms
   [junit4]   2> 2228483 INFO  (coreLoadExecutor-10548-thread-1-processing-n:127.0.0.1:38046_) [n:127.0.0.1:38046_ c:control_collection s:shard1 r:core_node1 x:collection1] o.a.s.c.SolrCore Using default statsCache cache: org.apache.solr.search.stats.LocalStatsCache
   [junit4]   2> 2228483 INFO  (coreLoadExecutor-10548-thread-1-processing-n:127.0.0.1:38046_) [n:127.0.0.1:38046_ c:control_collection s:shard1 r:core_node1 x:collection1] o.a.s.u.UpdateHandler Using UpdateLog implementation: org.apache.solr.update.UpdateLog
   [junit4]   2> 2228483 INFO  (coreLoadExecutor-10548-thread-1-processing-n:127.0.0.1:38046_) [n:127.0.0.1:38046_ c:control_collection s:shard1 r:core_node1 x:collection1] o.a.s.u.UpdateLog Initializing UpdateLog: dataDir= defaultSyncLevel=FLUSH numRecordsToKeep=100 maxNumLogsToKeep=10 numVersionBuckets=65536
   [junit4]   2> 2228484 INFO  (coreLoadExecutor-10548-thread-1-processing-n:127.0.0.1:38046_) [n:127.0.0.1:38046_ c:control_collection s:shard1 r:core_node1 x:collection1] o.a.s.u.CommitTracker Hard AutoCommit: disabled
   [junit4]   2> 2228484 INFO  (coreLoadExecutor-10548-thread-1-processing-n:127.0.0.1:38046_) [n:127.0.0.1:38046_ c:control_collection s:shard1 r:core_node1 x:collection1] o.a.s.u.CommitTracker Soft AutoCommit: disabled
   [junit4]   2> 2228484 INFO  (coreLoadExecutor-10548-thread-1-processing-n:127.0.0.1:38046_) [n:127.0.0.1:38046_ c:control_collection s:shard1 r:core_node1 x:collection1] o.a.s.u.RandomMergePolicy RandomMergePolicy wrapping class org.apache.lucene.index.TieredMergePolicy: [TieredMergePolicy: maxMergeAtOnce=27, maxMergeAtOnceExplicit=38, maxMergedSegmentMB=29.4599609375, floorSegmentMB=0.5654296875, forceMergeDeletesPctAllowed=7.247544666825769, segmentsPerTier=41.0, maxCFSSegmentSizeMB=8.796093022207999E12, noCFSRatio=0.42443516696254624
   [junit4]   2> 2228484 INFO  (coreLoadExecutor-10548-thread-1-processing-n:127.0.0.1:38046_) [n:127.0.0.1:38046_ c:control_collection s:shard1 r:core_node1 x:collection1] o.a.s.c.SolrDeletionPolicy SolrDeletionPolicy.onInit: commits: num=1
   [junit4]   2> 	commit{dir=MockDirectoryWrapper(RAMDirectory@7a76db55 lockFactory=org.apache.lucene.store.SingleInstanceLockFactory@19ce919b),segFN=segments_1,generation=1}
   [junit4]   2> 2228484 INFO  (coreLoadExecutor-10548-thread-1-processing-n:127.0.0.1:38046_) [n:127.0.0.1:38046_ c:control_collection s:shard1 r:core_node1 x:collection1] o.a.s.c.SolrDeletionPolicy newest commit generation = 1
   [junit4]   2> 2228485 INFO  (coreLoadExecutor-10548-thread-1-processing-n:127.0.0.1:38046_) [n:127.0.0.1:38046_ c:control_collection s:shard1 r:core_node1 x:collection1] o.a.s.s.SolrIndexSearcher Opening [Searcher@61c4142[collection1] main]
   [junit4]   2> 2228485 INFO  (coreLoadExecutor-10548-thread-1-processing-n:127.0.0.1:38046_) [n:127.0.0.1:38046_ c:control_collection s:shard1 r:core_node1 x:collection1] o.a.s.c.c.ZkStateReader Load collection config from: [/collections/control_collection]
   [junit4]   2> 2228486 INFO  (coreLoadExecutor-10548-thread-1-processing-n:127.0.0.1:38046_) [n:127.0.0.1:38046_ c:control_collection s:shard1 r:core_node1 x:collection1] o.a.s.c.c.ZkStateReader path=[/collections/control_collection] [configName]=[conf1] specified config exists in ZooKeeper
   [junit4]   2> 2228486 INFO  (coreLoadExecutor-10548-thread-1-processing-n:127.0.0.1:38046_) [n:127.0.0.1:38046_ c:control_collection s:shard1 r:core_node1 x:collection1] o.a.s.r.ManagedResourceStorage Setting up ZooKeeper-based storage for the RestManager with znodeBase: /configs/conf1
   [junit4]   2> 2228486 INFO  (coreLoadExecutor-10548-thread-1-processing-n:127.0.0.1:38046_) [n:127.0.0.1:38046_ c:control_collection s:shard1 r:core_node1 x:collection1] o.a.s.r.ManagedResourceStorage Configured ZooKeeperStorageIO with znodeBase: /configs/conf1
   [junit4]   2> 2228486 INFO  (coreLoadExecutor-10548-thread-1-processing-n:127.0.0.1:38046_) [n:127.0.0.1:38046_ c:control_collection s:shard1 r:core_node1 x:collection1] o.a.s.r.RestManager Initializing RestManager with initArgs: {}
   [junit4]   2> 2228486 INFO  (coreLoadExecutor-10548-thread-1-processing-n:127.0.0.1:38046_) [n:127.0.0.1:38046_ c:control_collection s:shard1 r:core_node1 x:collection1] o.a.s.r.ManagedResourceStorage Reading _rest_managed.json using ZooKeeperStorageIO:path=/configs/conf1
   [junit4]   2> 2228487 INFO  (coreLoadExecutor-10548-thread-1-processing-n:127.0.0.1:38046_) [n:127.0.0.1:38046_ c:control_collection s:shard1 r:core_node1 x:collection1] o.a.s.r.ManagedResourceStorage No data found for znode /configs/conf1/_rest_managed.json
   [junit4]   2> 2228487 INFO  (coreLoadExecutor-10548-thread-1-processing-n:127.0.0.1:38046_) [n:127.0.0.1:38046_ c:control_collection s:shard1 r:core_node1 x:collection1] o.a.s.r.ManagedResourceStorage Loaded null at path _rest_managed.json using ZooKeeperStorageIO:path=/configs/conf1
   [junit4]   2> 2228487 INFO  (coreLoadExecutor-10548-thread-1-processing-n:127.0.0.1:38046_) [n:127.0.0.1:38046_ c:control_collection s:shard1 r:core_node1 x:collection1] o.a.s.r.RestManager Initializing 0 registered ManagedResources
   [junit4]   2> 2228487 INFO  (coreLoadExecutor-10548-thread-1-processing-n:127.0.0.1:38046_) [n:127.0.0.1:38046_ c:control_collection s:shard1 r:core_node1 x:collection1] o.a.s.h.ReplicationHandler Commits will be reserved for  10000
   [junit4]   2> 2228488 INFO  (searcherExecutor-10549-thread-1-processing-n:127.0.0.1:38046_ x:collection1 s:shard1 c:control_collection r:core_node1) [n:127.0.0.1:38046_ c:control_collection s:shard1 r:core_node1 x:collection1] o.a.s.c.SolrCore [collection1] Registered new searcher Searcher@61c4142[collection1] main{ExitableDirectoryReader(UninvertingDirectoryReader())}
   [junit4]   2> 2228488 INFO  (coreLoadExecutor-10548-thread-1-processing-n:127.0.0.1:38046_) [n:127.0.0.1:38046_ c:control_collection s:shard1 r:core_node1 x:collection1] o.a.s.u.UpdateLog Looking up max value of version field to seed version buckets
   [junit4]   2> 2228488 INFO  (coreLoadExecutor-10548-thread-1-processing-n:127.0.0.1:38046_) [n:127.0.0.1:38046_ c:control_collection s:shard1 r:core_node1 x:collection1] o.a.s.u.VersionInfo Refreshing highest value of _version_ for 65536 version buckets from index
   [junit4]   2> 2228488 INFO  (coreLoadExecutor-10548-thread-1-processing-n:127.0.0.1:38046_) [n:127.0.0.1:38046_ c:control_collection s:shard1 r:core_node1 x:collection1] o.a.s.u.VersionInfo No terms found for _version_, cannot seed version bucket highest value from index
   [junit4]   2> 2228488 INFO  (coreLoadExecutor-10548-thread-1-processing-n:127.0.0.1:38046_) [n:127.0.0.1:38046_ c:control_collection s:shard1 r:core_node1 x:collection1] o.a.s.u.UpdateLog Could not find max version in index or recent updates, using new clock 1545163289555632128
   [junit4]   2> 2228490 INFO  (coreLoadExecutor-10548-thread-1-processing-n:127.0.0.1:38046_) [n:127.0.0.1:38046_ c:control_collection s:shard1 r:core_node1 x:collection1] o.a.s.u.UpdateLog Took 1.0ms to seed version buckets with highest version 1545163289555632128
   [junit4]   2> 2228490 INFO  (coreLoadExecutor-10548-thread-1-processing-n:127.0.0.1:38046_) [n:127.0.0.1:38046_ c:control_collection s:shard1 r:core_node1 x:collection1] o.a.s.c.ZkController watch zkdir /configs/conf1
   [junit4]   2> 2228490 INFO  (coreLoadExecutor-10548-thread-1-processing-n:127.0.0.1:38046_) [n:127.0.0.1:38046_ c:control_collection s:shard1 r:core_node1 x:collection1] o.a.s.c.CoreContainer registering core: collection1
   [junit4]   2> 2228491 INFO  (coreZkRegister-10541-thread-1-processing-n:127.0.0.1:38046_ x:collection1 s:shard1 c:control_collection r:core_node1) [n:127.0.0.1:38046_ c:control_collection s:shard1 r:core_node1 x:collection1] o.a.s.c.ZkController Register replica - core:collection1 address:http://127.0.0.1:38046 collection:control_collection shard:shard1
   [junit4]   2> 2228492 INFO  (coreZkRegister-10541-thread-1-processing-n:127.0.0.1:38046_ x:collection1 s:shard1 c:control_collection r:core_node1) [n:127.0.0.1:38046_ c:control_collection s:shard1 r:core_node1 x:collection1] o.a.s.c.c.SolrZkClient makePath: /collections/control_collection/leader_elect/shard1/election
   [junit4]   2> 2228497 INFO  (coreZkRegister-10541-thread-1-processing-n:127.0.0.1:38046_ x:collection1 s:shard1 c:control_collection r:core_node1) [n:127.0.0.1:38046_ c:control_collection s:shard1 r:core_node1 x:collection1] o.a.s.c.LeaderElector Joined leadership election with path: /collections/control_collection/leader_elect/shard1/election/96572705494138884-core_node1-n_0000000000
   [junit4]   2> 2228498 INFO  (coreZkRegister-10541-thread-1-processing-n:127.0.0.1:38046_ x:collection1 s:shard1 c:control_collection r:core_node1) [n:127.0.0.1:38046_ c:control_collection s:shard1 r:core_node1 x:collection1] o.a.s.c.ShardLeaderElectionContext Running the leader process for shard=shard1 and weAreReplacement=false and leaderVoteWait=10000
   [junit4]   2> 2228500 INFO  (coreZkRegister-10541-thread-1-processing-n:127.0.0.1:38046_ x:collection1 s:shard1 c:control_collection r:core_node1) [n:127.0.0.1:38046_ c:control_collection s:shard1 r:core_node1 x:collection1] o.a.s.c.ShardLeaderElectionContext Enough replicas found to continue.
   [junit4]   2> 2228500 INFO  (coreZkRegister-10541-thread-1-processing-n:127.0.0.1:38046_ x:collection1 s:shard1 c:control_collection r:core_node1) [n:127.0.0.1:38046_ c:control_collection s:shard1 r:core_node1 x:collection1] o.a.s.c.ShardLeaderElectionContext I may be the new leader - try and sync
   [junit4]   2> 2228500 INFO  (coreZkRegister-10541-thread-1-processing-n:127.0.0.1:38046_ x:collection1 s:shard1 c:control_collection r:core_node1) [n:127.0.0.1:38046_ c:control_collection s:shard1 r:core_node1 x:collection1] o.a.s.c.SyncStrategy Sync replicas to http://127.0.0.1:38046/collection1/
   [junit4]   2> 2228500 INFO  (coreZkRegister-10541-thread-1-processing-n:127.0.0.1:38046_ x:collection1 s:shard1 c:control_collection r:core_node1) [n:127.0.0.1:38046_ c:control_collection s:shard1 r:core_node1 x:collection1] o.a.s.c.SyncStrategy Sync Success - now sync replicas to me
   [junit4]   2> 2228500 INFO  (coreZkRegister-10541-thread-1-processing-n:127.0.0.1:38046_ x:collection1 s:shard1 c:control_collection r:core_node1) [n:127.0.0.1:38046_ c:control_collection s:shard1 r:core_node1 x:collection1] o.a.s.c.SyncStrategy http://127.0.0.1:38046/collection1/ has no replicas
   [junit4]   2> 2228500 INFO  (OverseerStateUpdate-96572705494138884-127.0.0.1:38046_-n_0000000000) [n:127.0.0.1:38046_    ] o.a.s.c.Overseer processMessage: queueSize: 1, message = {
   [junit4]   2>   "operation":"leader",
   [junit4]   2>   "shard":"shard1",
   [junit4]   2>   "collection":"control_collection"} current state version: 1
   [junit4]   2> 2228501 INFO  (coreZkRegister-10541-thread-1-processing-n:127.0.0.1:38046_ x:collection1 s:shard1 c:control_collection r:core_node1) [n:127.0.0.1:38046_ c:control_collection s:shard1 r:core_node1 x:collection1] o.a.s.c.c.SolrZkClient makePath: /collections/control_collection/leaders/shard1
   [junit4]   2> 2228507 INFO  (coreZkRegister-10541-thread-1-processing-n:127.0.0.1:38046_ x:collection1 s:shard1 c:control_collection r:core_node1) [n:127.0.0.1:38046_ c:control_collection s:shard1 r:core_node1 x:collection1] o.a.s.c.ShardLeaderElectionContextBase Creating leader registration node /collections/control_collection/leaders/shard1/leader after winning as /collections/control_collection/leader_elect/shard1/election/96572705494138884-core_node1-n_0000000000
   [junit4]   2> 2228510 INFO  (coreZkRegister-10541-thread-1-processing-n:127.0.0.1:38046_ x:collection1 s:shard1 c:control_collection r:core_node1) [n:127.0.0.1:38046_ c:control_collection s:shard1 r:core_node1 x:collection1] o.a.s.c.ShardLeaderElectionContext I am the new leader: http://127.0.0.1:38046/collection1/ shard1
   [junit4]   2> 2228511 INFO  (OverseerStateUpdate-96572705494138884-127.0.0.1:38046_-n_0000000000) [n:127.0.0.1:38046_    ] o.a.s.c.Overseer processMessage: queueSize: 1, message = {
   [junit4]   2>   "operation":"leader",
   [junit4]   2>   "shard":"shard1",
   [junit4]   2>   "collection":"control_collection",
   [junit4]   2>   "base_url":"http://127.0.0.1:38046",
   [junit4]   2>   "core":"collection1",
   [junit4]   2>   "state":"active"} current state version: 1
   [junit4]   2> 2228615 INFO  (zkCallback-3138-thread-1-processing-n:127.0.0.1:38046_) [n:127.0.0.1:38046_    ] o.a.s.c.c.ZkStateReader A cluster state change: [WatchedEvent state:SyncConnected type:NodeDataChanged path:/clusterstate.json], has occurred - updating... (live nodes size: [1])
   [junit4]   2> 2228662 INFO  (coreZkRegister-10541-thread-1-processing-n:127.0.0.1:38046_ x:collection1 s:shard1 c:control_collection r:core_node1) [n:127.0.0.1:38046_ c:control_collection s:shard1 r:core_node1 x:collection1] o.a.s.c.ZkController We are http://127.0.0.1:38046/collection1/ and leader is http://127.0.0.1:38046/collection1/
   [junit4]   2> 2228662 INFO  (coreZkRegister-10541-thread-1-processing-n:127.0.0.1:38046_ x:collection1 s:shard1 c:control_collection r:core_node1) [n:127.0.0.1:38046_ c:control_collection s:shard1 r:core_node1 x:collection1] o.a.s.c.ZkController No LogReplay needed for core=collection1 baseURL=http://127.0.0.1:38046
   [junit4]   2> 2228662 INFO  (coreZkRegister-10541-thread-1-processing-n:127.0.0.1:38046_ x:collection1 s:shard1 c:control_collection r:core_node1) [n:127.0.0.1:38046_ c:control_collection s:shard1 r:core_node1 x:collection1] o.a.s.c.ZkController I am the leader, no recovery necessary
   [junit4]   2> 2228662 INFO  (coreZkRegister-10541-thread-1-processing-n:127.0.0.1:38046_ x:collection1 s:shard1 c:control_collection r:core_node1) [n:127.0.0.1:38046_ c:control_collection s:shard1 r:core_node1 x:collection1] o.a.s.c.ZkController publishing state=active
   [junit4]   2> 2228662 INFO  (coreZkRegister-10541-thread-1-processing-n:127.0.0.1:38046_ x:collection1 s:shard1 c:control_collection r:core_node1) [n:127.0.0.1:38046_ c:control_collection s:shard1 r:core_node1 x:collection1] o.a.s.c.ZkController numShards not found on descriptor - reading it from system property
   [junit4]   2> 2228663 INFO  (coreZkRegister-10541-thread-1-processing-n:127.0.0.1:38046_ x:collection1 s:shard1 c:control_collection r:core_node1) [n:127.0.0.1:38046_ c:control_collection s:shard1 r:core_node1 x:collection1] o.a.s.c.c.ZkStateReader Checking legacy cluster state for collection control_collection
   [junit4]   2> 2228665 INFO  (OverseerStateUpdate-96572705494138884-127.0.0.1:38046_-n_0000000000) [n:127.0.0.1:38046_    ] o.a.s.c.Overseer processMessage: queueSize: 1, message = {
   [junit4]   2>   "core":"collection1",
   [junit4]   2>   "core_node_name":"core_node1",
   [junit4]   2>   "roles":null,
   [junit4]   2>   "base_url":"http://127.0.0.1:38046",
   [junit4]   2>   "node_name":"127.0.0.1:38046_",
   [junit4]   2>   "numShards":"1",
   [junit4]   2>   "state":"active",
   [junit4]   2>   "shard":"shard1",
   [junit4]   2>   "collection":"control_collection",
   [junit4]   2>   "operation":"state"} current state version: 2
   [junit4]   2> 2228665 INFO  (OverseerStateUpdate-96572705494138884-127.0.0.1:38046_-n_0000000000) [n:127.0.0.1:38046_    ] o.a.s.c.o.ReplicaMutator Update state numShards=1 message={
   [junit4]   2>   "core":"collection1",
   [junit4]   2>   "core_node_name":"core_node1",
   [junit4]   2>   "roles":null,
   [junit4]   2>   "base_url":"http://127.0.0.1:38046",
   [junit4]   2>   "node_name":"127.0.0.1:38046_",
   [junit4]   2>   "numShards":"1",
   [junit4]   2>   "state":"active",
   [junit4]   2>   "shard":"shard1",
   [junit4]   2>   "collection":"control_collection",
   [junit4]   2>   "operation":"state"}
   [junit4]   2> 2228769 INFO  (zkCallback-3138-thread-1-processing-n:127.0.0.1:38046_) [n:127.0.0.1:38046_    ] o.a.s.c.c.ZkStateReader A cluster state change: [WatchedEvent state:SyncConnected type:NodeDataChanged path:/clusterstate.json], has occurred - updating... (live nodes size: [1])
   [junit4]   2> 2228845 INFO  (TEST-ForceLeaderTest.testLastPublishedStateIsActive-seed#[B4E494297AAC199E]) [    ] o.a.s.c.c.SolrZkClient Using default ZkCredentialsProvider
   [junit4]   2> 2228846 INFO  (TEST-ForceLeaderTest.testLastPublishedStateIsActive-seed#[B4E494297AAC199E]) [    ] o.a.s.c.c.ConnectionManager Waiting for client to connect to ZooKeeper
   [junit4]   2> 2228847 INFO  (zkCallback-3142-thread-1) [    ] o.a.s.c.c.ConnectionManager Watcher org.apache.solr.common.cloud.ConnectionManager@60d1c7c9 name:ZooKeeperConnection Watcher:127.0.0.1:56789/solr got event WatchedEvent state:SyncConnected type:None path:null path:null type:None
   [junit4]   2> 2228847 INFO  (TEST-ForceLeaderTest.testLastPublishedStateIsActive-seed#[B4E494297AAC199E]) [    ] o.a.s.c.c.ConnectionManager Client is connected to ZooKeeper
   [junit4]   2> 2228847 INFO  (TEST-ForceLeaderTest.testLastPublishedStateIsActive-seed#[B4E494297AAC199E]) [    ] o.a.s.c.c.SolrZkClient Using default ZkACLProvider
   [junit4]   2> 2228847 INFO  (TEST-ForceLeaderTest.testLastPublishedStateIsActive-seed#[B4E494297AAC199E]) [    ] o.a.s.c.c.ZkStateReader Updating cluster state from ZooKeeper... 
   [junit4]   2> 2228848 INFO  (TEST-ForceLeaderTest.testLastPublishedStateIsActive-seed#[B4E494297AAC199E]) [    ] o.a.s.c.c.ZkStateReader Loaded empty cluster properties
   [junit4]   2> 2228849 INFO  (TEST-ForceLeaderTest.testLastPublishedStateIsActive-seed#[B4E494297AAC199E]) [    ] o.a.s.c.c.ZkStateReader Updated live nodes from ZooKeeper... (0) -> (1)
   [junit4]   2> 2228851 INFO  (TEST-ForceLeaderTest.testLastPublishedStateIsActive-seed#[B4E494297AAC199E]) [    ] o.a.s.c.ChaosMonkey monkey: init - expire sessions:false cause connection loss:false
   [junit4]   2> 2228977 INFO  (TEST-ForceLeaderTest.testLastPublishedStateIsActive-seed#[B4E494297AAC199E]) [    ] o.a.s.SolrTestCaseJ4 Writing core.properties file to /export/home/jenkins/workspace/Lucene-Solr-master-Solaris/solr/build/solr-core/test/J1/temp/solr.cloud.ForceLeaderTest_B4E494297AAC199E-001/shard-1-001/cores/collection1
   [junit4]   2> 2228978 INFO  (TEST-ForceLeaderTest.testLastPublishedStateIsActive-seed#[B4E494297AAC199E]) [    ] o.a.s.c.AbstractFullDistribZkTestBase create jetty 1 in directory /export/home/jenkins/workspace/Lucene-Solr-master-Solaris/solr/build/solr-core/test/J1/temp/solr.cloud.ForceLeaderTest_B4E494297AAC199E-001/shard-1-001
   [junit4]   2> 2228979 INFO  (TEST-ForceLeaderTest.testLastPublishedStateIsActive-seed#[B4E494297AAC199E]) [    ] o.e.j.s.Server jetty-9.3.8.v20160314
   [junit4]   2> 2228981 INFO  (TEST-ForceLeaderTest.testLastPublishedStateIsActive-seed#[B4E494297AAC199E]) [    ] o.e.j.s.h.ContextHandler Started o.e.j.s.ServletContextHandler@5dde5c9b{/,null,AVAILABLE}
   [junit4]   2> 2228981 INFO  (TEST-ForceLeaderTest.testLastPublishedStateIsActive-seed#[B4E494297AAC199E]) [    ] o.e.j.s.ServerConnector Started ServerConnector@776deecb{HTTP/1.1,[http/1.1]}{127.0.0.1:61982}
   [junit4]   2> 2228981 INFO  (TEST-ForceLeaderTest.testLastPublishedStateIsActive-seed#[B4E494297AAC199E]) [    ] o.e.j.s.Server Started @2232134ms
   [junit4]   2> 2228981 INFO  (TEST-ForceLeaderTest.testLastPublishedStateIsActive-seed#[B4E494297AAC199E]) [    ] o.a.s.c.s.e.JettySolrRunner Jetty properties: {solr.data.dir=/export/home/jenkins/workspace/Lucene-Solr-master-Solaris/solr/build/solr-core/test/J1/temp/solr.cloud.ForceLeaderTest_B4E494297AAC199E-001/tempDir-001/jetty1, solrconfig=solrconfig.xml, hostContext=/, hostPort=33251, coreRootDirectory=/export/home/jenkins/workspace/Lucene-Solr-master-Solaris/solr/build/solr-core/test/J1/temp/solr.cloud.ForceLeaderTest_B4E494297AAC199E-001/shard-1-001/cores}
   [junit4]   2> 2228982 INFO  (TEST-ForceLeaderTest.testLastPublishedStateIsActive-seed#[B4E494297AAC199E]) [    ] o.a.s.s.SolrDispatchFilter SolrDispatchFilter.init(): sun.misc.Launcher$AppClassLoader@6d06d69c
   [junit4]   2> 2228982 INFO  (TEST-ForceLeaderTest.testLastPublishedStateIsActive-seed#[B4E494297AAC199E]) [    ] o.a.s.c.SolrResourceLoader new SolrResourceLoader for directory: '/export/home/jenkins/workspace/Lucene-Solr-master-Solaris/solr/build/solr-core/test/J1/temp/solr.cloud.ForceLeaderTest_B4E494297AAC199E-001/shard-1-001'
   [junit4]   2> 2228982 INFO  (TEST-ForceLeaderTest.testLastPublishedStateIsActive-seed#[B4E494297AAC199E]) [    ] o.a.s.c.SolrResourceLoader JNDI not configured for solr (NoInitialContextEx)
   [junit4]   2> 2228982 INFO  (TEST-ForceLeaderTest.testLastPublishedStateIsActive-seed#[B4E494297AAC199E]) [    ] o.a.s.c.SolrResourceLoader solr home defaulted to 'solr/' (could not find system property or JNDI)
   [junit4]   2> 2228982 INFO  (TEST-ForceLeaderTest.testLastPublishedStateIsActive-seed#[B4E494297AAC199E]) [    ] o.a.s.c.c.SolrZkClient Using default ZkCredentialsProvider
   [junit4]   2> 2228983 INFO  (TEST-ForceLeaderTest.testLastPublishedStateIsActive-seed#[B4E494297AAC199E]) [    ] o.a.s.c.c.ConnectionManager Waiting for client to connect to ZooKeeper
   [junit4]   2> 2228984 INFO  (zkCallback-3143-thread-1) [    ] o.a.s.c.c.ConnectionManager Watcher org.apache.solr.common.cloud.ConnectionManager@6eb3f81d name:ZooKeeperConnection Watcher:127.0.0.1:56789/solr got event WatchedEvent state:SyncConnected type:None path:null path:null type:None
   [junit4]   2> 2228985 INFO  (TEST-ForceLeaderTest.testLastPublishedStateIsActive-seed#[B4E494297AAC199E]) [    ] o.a.s.c.c.ConnectionManager Client is connected to ZooKeeper
   [junit4]   2> 2228985 INFO  (TEST-ForceLeaderTest.testLastPublishedStateIsActive-seed#[B4E494297AAC199E]) [    ] o.a.s.c.c.SolrZkClient Using default ZkACLProvider
   [junit4]   2> 2228986 INFO  (TEST-ForceLeaderTest.testLastPublishedStateIsActive-seed#[B4E494297AAC199E]) [    ] o.a.s.s.SolrDispatchFilter Loading solr.xml from SolrHome (not found in ZooKeeper)
   [junit4]   2> 2228987 INFO  (TEST-ForceLeaderTest.testLastPublishedStateIsActive-seed#[B4E494297AAC199E]) [    ] o.a.s.c.SolrXmlConfig Loading container configuration from /export/home/jenkins/workspace/Lucene-Solr-master-Solaris/solr/build/solr-core/test/J1/temp/solr.cloud.ForceLeaderTest_B4E494297AAC199E-001/shard-1-001/solr.xml
   [junit4]   2> 2228990 INFO  (TEST-ForceLeaderTest.testLastPublishedStateIsActive-seed#[B4E494297AAC199E]) [    ] o.a.s.c.CorePropertiesLocator Config-defined core root directory: /export/home/jenkins/workspace/Lucene-Solr-master-Solaris/solr/build/solr-core/test/J1/temp/solr.cloud.ForceLeaderTest_B4E494297AAC199E-001/shard-1-001/cores
   [junit4]   2> 2228990 INFO  (TEST-ForceLeaderTest.testLastPublishedStateIsActive-seed#[B4E494297AAC199E]) [    ] o.a.s.c.CoreContainer New CoreContainer 140930636
   [junit4]   2> 2228991 INFO  (TEST-ForceLeaderTest.testLastPublishedStateIsActive-seed#[B4E494297AAC199E]) [    ] o.a.s.c.CoreContainer Loading cores into CoreContainer [instanceDir=/export/home/jenkins/workspace/Lucene-Solr-master-Solaris/solr/build/solr-core/test/J1/temp/solr.cloud.ForceLeaderTest_B4E494297AAC199E-001/shard-1-001]
   [junit4]   2> 2228991 WARN  (TEST-ForceLeaderTest.testLastPublishedStateIsActive-seed#[B4E494297AAC199E]) [    ] o.a.s.c.CoreContainer Couldn't add files from /export/home/jenkins/workspace/Lucene-Solr-master-Solaris/solr/build/solr-core/test/J1/temp/solr.cloud.ForceLeaderTest_B4E494297AAC199E-001/shard-1-001/lib to classpath: /export/home/jenkins/workspace/Lucene-Solr-master-Solaris/solr/build/solr-core/test/J1/temp/solr.cloud.ForceLeaderTest_B4E494297AAC199E-001/shard-1-001/lib
   [junit4]   2> 2228991 INFO  (TEST-ForceLeaderTest.testLastPublishedStateIsActive-seed#[B4E494297AAC199E]) [    ] o.a.s.h.c.HttpShardHandlerFactory created with socketTimeout : 90000,urlScheme : ,connTimeout : 15000,maxConnectionsPerHost : 20,maxConnections : 10000,corePoolSize : 0,maximumPoolSize : 2147483647,maxThreadIdleTime : 5,sizeOfQueue : -1,fairnessPolicy : false,
   [junit4]   2> 2228993 INFO  (TEST-ForceLeaderTest.testLastPublishedStateIsActive-seed#[B4E494297AAC199E]) [    ] o.a.s.u.UpdateShardHandler Created UpdateShardHandler HTTP client with params: socketTimeout=340000&connTimeout=45000&maxConnections=100000&maxConnectionsPerHost=100000
   [junit4]   2> 2228993 INFO  (TEST-ForceLeaderTest.testLastPublishedStateIsActive-seed#[B4E494297AAC199E]) [    ] o.a.s.l.LogWatcher SLF4J impl is org.slf4j.impl.Log4jLoggerFactory
   [junit4]   2> 2228993 INFO  (TEST-ForceLeaderTest.testLastPublishedStateIsActive-seed#[B4E494297AAC199E]) [    ] o.a.s.l.LogWatcher Registering Log Listener [Log4j (org.slf4j.impl.Log4jLoggerFactory)]
   [junit4]   2> 2228993 INFO  (TEST-ForceLeaderTest.testLastPublishedStateIsActive-seed#[B4E494297AAC199E]) [    ] o.a.s.c.ZkContainer Zookeeper client=127.0.0.1:56789/solr
   [junit4]   2> 2228994 INFO  (TEST-ForceLeaderTest.testLastPublishedStateIsActive-seed#[B4E494297AAC199E]) [    ] o.a.s.c.ZkController zkHost includes chroot
   [junit4]   2> 2228994 INFO  (TEST-ForceLeaderTest.testLastPublishedStateIsActive-seed#[B4E494297AAC199E]) [    ] o.a.s.c.c.SolrZkClient Using default ZkCredentialsProvider
   [junit4]   2> 2228994 INFO  (TEST-ForceLeaderTest.testLastPublishedStateIsActive-seed#[B4E494297AAC199E]) [    ] o.a.s.c.c.ConnectionManager Waiting for client to connect to ZooKeeper
   [junit4]   2> 2228996 INFO  (zkCallback-3146-thread-1) [    ] o.a.s.c.c.ConnectionManager Watcher org.apache.solr.common.cloud.ConnectionManager@36a768b6 name:ZooKeeperConnection Watcher:127.0.0.1:56789 got event WatchedEvent state:SyncConnected type:None path:null path:null type:None
   [junit4]   2> 2228996 INFO  (TEST-ForceLeaderTest.testLastPublishedStateIsActive-seed#[B4E494297AAC199E]) [    ] o.a.s.c.c.ConnectionManager Client is connected to ZooKeeper
   [junit4]   2> 2228996 INFO  (TEST-ForceLeaderTest.testLastPublishedStateIsActive-seed#[B4E494297AAC199E]) [    ] o.a.s.c.c.SolrZkClient Using default ZkACLProvider
   [junit4]   2> 2228998 INFO  (TEST-ForceLeaderTest.testLastPublishedStateIsActive-seed#[B4E494297AAC199E]) [n:127.0.0.1:33251_    ] o.a.s.c.ZkController Added new OnReconnect listener org.apache.solr.cloud.ZkController$$Lambda$65/279308020@7c6d21de
   [junit4]   2> 2228998 INFO  (TEST-ForceLeaderTest.testLastPublishedStateIsActive-seed#[B4E494297AAC199E]) [n:127.0.0.1:33251_    ] o.a.s.c.c.ConnectionManager Waiting for client to connect to ZooKeeper
   [junit4]   2> 2228999 INFO  (zkCallback-3147-thread-1-processing-n:127.0.0.1:33251_) [n:127.0.0.1:33251_    ] o.a.s.c.c.ConnectionManager Watcher org.apache.solr.common.cloud.ConnectionManager@63a53751 name:ZooKeeperConnection Watcher:127.0.0.1:56789/solr got event WatchedEvent state:SyncConnected type:None path:null path:null type:None
   [junit4]   2> 2228999 INFO  (TEST-ForceLeaderTest.testLastPublishedStateIsActive-seed#[B4E494297AAC199E]) [n:127.0.0.1:33251_    ] o.a.s.c.c.ConnectionManager Client is connected to ZooKeeper
   [junit4]   2> 2229008 INFO  (TEST-ForceLeaderTest.testLastPublishedStateIsActive-seed#[B4E494297AAC199E]) [n:127.0.0.1:33251_    ] o.a.s.c.c.ZkStateReader Updating cluster state from ZooKeeper... 
   [junit4]   2> 2229009 INFO  (TEST-ForceLeaderTest.testLastPublishedStateIsActive-seed#[B4E494297AAC199E]) [n:127.0.0.1:33251_    ] o.a.s.c.c.ZkStateReader Loaded empty cluster properties
   [junit4]   2> 2229010 INFO  (TEST-ForceLeaderTest.testLastPublishedStateIsActive-seed#[B4E494297AAC199E]) [n:127.0.0.1:33251_    ] o.a.s.c.c.ZkStateReader Updated live nodes from ZooKeeper... (0) -> (1)
   [junit4]   2> 2229014 INFO  (TEST-ForceLeaderTest.testLastPublishedStateIsActive-seed#[B4E494297AAC199E]) [n:127.0.0.1:33251_    ] o.a.s.c.Overseer Overseer (id=null) closing
   [junit4]   2> 2229015 INFO  (TEST-ForceLeaderTest.testLastPublishedStateIsActive-seed#[B4E494297AAC199E]) [n:127.0.0.1:33251_    ] o.a.s.c.LeaderElector Joined leadership election with path: /overseer_elect/election/96572705494138888-127.0.0.1:33251_-n_0000000001
   [junit4]   2> 2229015 INFO  (TEST-ForceLeaderTest.testLastPublishedStateIsActive-seed#[B4E494297AAC199E]) [n:127.0.0.1:33251_    ] o.a.s.c.LeaderElector Watching path /overseer_elect/election/96572705494138884-127.0.0.1:38046_-n_0000000000 to know if I could be the leader
   [junit4]   2> 2229016 INFO  (TEST-ForceLeaderTest.testLastPublishedStateIsActive-seed#[B4E494297AAC199E]) [n:127.0.0.1:33251_    ] o.a.s.c.ZkController Publish node=127.0.0.1:33251_ as DOWN
   [junit4]   2> 2229017 INFO  (TEST-ForceLeaderTest.testLastPublishedStateIsActive-seed#[B4E494297AAC199E]) [n:127.0.0.1:33251_    ] o.a.s.c.ZkController Register node as live in ZooKeeper:/live_nodes/127.0.0.1:33251_
   [junit4]   2> 2229018 INFO  (TEST-ForceLeaderTest.testLastPublishedStateIsActive-seed#[B4E494297AAC199E]) [n:127.0.0.1:33251_    ] o.a.s.c.c.SolrZkClient makePath: /live_nodes/127.0.0.1:33251_
   [junit4]   2> 2229018 INFO  (OverseerStateUpdate-96572705494138884-127.0.0.1:38046_-n_0000000000) [n:127.0.0.1:38046_    ] o.a.s.c.Overseer processMessage: queueSize: 1, message = {
   [junit4]   2>   "operation":"downnode",
   [junit4]   2>   "node_name":"127.0.0.1:33251_"} current state version: 3
   [junit4]   2> 2229018 INFO  (OverseerStateUpdate-96572705494138884-127.0.0.1:38046_-n_0000000000) [n:127.0.0.1:38046_    ] o.a.s.c.o.NodeMutator DownNode state invoked for node: 127.0.0.1:33251_
   [junit4]   2> 2229020 INFO  (zkCallback-3138-thread-3-processing-n:127.0.0.1:38046_) [n:127.0.0.1:38046_    ] o.a.s.c.c.ZkStateReader A live node change: [WatchedEvent state:SyncConnected type:NodeChildrenChanged path:/live_nodes], has occurred - updating... (live nodes size: [1])
   [junit4]   2> 2229020 INFO  (zkCallback-3142-thread-1) [    ] o.a.s.c.c.ZkStateReader A live node change: [WatchedEvent state:SyncConnected type:NodeChildrenChanged path:/live_nodes], has occurred - updating... (live nodes size: [1])
   [junit4]   2> 2229020 INFO  (zkCallback-3147-thread-1-processing-n:127.0.0.1:33251_) [n:127.0.0.1:33251_    ] o.a.s.c.c.ZkStateReader A live node change: [WatchedEvent state:SyncConnected type:NodeChildrenChanged path:/live_nodes], has occurred - updating... (live nodes size: [1])
   [junit4]   2> 2229021 INFO  (zkCallback-3138-thread-3-processing-n:127.0.0.1:38046_) [n:127.0.0.1:38046_    ] o.a.s.c.c.ZkStateReader Updated live nodes from ZooKeeper... (1) -> (2)
   [junit4]   2> 2229022 INFO  (zkCallback-3142-thread-1) [    ] o.a.s.c.c.ZkStateReader Updated live nodes from ZooKeeper... (1) -> (2)
   [junit4]   2> 2229023 INFO  (zkCallback-3147-thread-1-processing-n:127.0.0.1:33251_) [n:127.0.0.1:33251_    ] o.a.s.c.c.ZkStateReader Updated live nodes from ZooKeeper... (1) -> (2)
   [junit4]   2> 2229049 INFO  (TEST-ForceLeaderTest.testLastPublishedStateIsActive-seed#[B4E494297AAC199E]) [n:127.0.0.1:33251_    ] o.a.s.c.CoreContainer Security conf doesn't exist. Skipping setup for authorization module.
   [junit4]   2> 2229050 INFO  (TEST-ForceLeaderTest.testLastPublishedStateIsActive-seed#[B4E494297AAC199E]) [n:127.0.0.1:33251_    ] o.a.s.c.CoreContainer No authentication plugin used.
   [junit4]   2> 2229050 INFO  (TEST-ForceLeaderTest.testLastPublishedStateIsActive-seed#[B4E494297AAC199E]) [n:127.0.0.1:33251_    ] o.a.s.c.CorePropertiesLocator Looking for core definitions underneath /export/home/jenkins/workspace/Lucene-Solr-master-Solaris/solr/build/solr-core/test/J1/temp/solr.cloud.ForceLeaderTest_B4E494297AAC199E-001/shard-1-001/cores
   [junit4]   2> 2229051 INFO  (TEST-ForceLeaderTest.testLastPublishedStateIsActive-seed#[B4E494297AAC199E]) [n:127.0.0.1:33251_    ] o.a.s.c.CoreDescriptor Created CoreDescriptor: {name=collection1, config=solrconfig.xml, transient=false, schema=schema.xml, loadOnStartup=true, configSetProperties=configsetprops.json, collection=collection1, coreNodeName=, dataDir=data/, shard=}
   [junit4]   2> 2229051 INFO  (TEST-ForceLeaderTest.testLastPublishedStateIsActive-seed#[B4E494297AAC199E]) [n:127.0.0.1:33251_    ] o.a.s.c.CorePropertiesLocator Found core collection1 in /export/home/jenkins/workspace/Lucene-Solr-master-Solaris/solr/build/solr-core/test/J1/temp/solr.cloud.ForceLeaderTest_B4E494297AAC199E-001/shard-1-001/cores/collection1
   [junit4]   2> 2229051 INFO  (TEST-ForceLeaderTest.testLastPublishedStateIsActive-seed#[B4E494297AAC199E]) [n:127.0.0.1:33251_    ] o.a.s.c.CorePropertiesLocator Found 1 core definitions
   [junit4]   2> 2229053 INFO  (TEST-ForceLeaderTest.testLastPublishedStateIsActive-seed#[B4E494297AAC199E]) [n:127.0.0.1:33251_    ] o.a.s.s.SolrDispatchFilter user.dir=/export/home/jenkins/workspace/Lucene-Solr-master-Solaris/solr/build/solr-core/test/J1
   [junit4]   2> 2229053 INFO  (TEST-ForceLeaderTest.testLastPublishedStateIsActive-seed#[B4E494297AAC199E]) [n:127.0.0.1:33251_    ] o.a.s.s.SolrDispatchFilter SolrDispatchFilter.init() done
   [junit4]   2> 2229053 INFO  (coreLoadExecutor-10559-thread-1-processing-n:127.0.0.1:33251_) [n:127.0.0.1:33251_ c:collection1   x:collection1] o.a.s.c.ZkController publishing state=down
   [junit4]   2> 2229053 INFO  (coreLoadExecutor-10559-thread-1-processing-n:127.0.0.1:33251_) [n:127.0.0.1:33251_ c:collection1   x:collection1] o.a.s.c.ZkController numShards not found on descriptor - reading it from system property
   [junit4]   2> 2229054 INFO  (coreLoadExecutor-10559-thread-1-processing-n:127.0.0.1:33251_) [n:127.0.0.1:33251_ c:collection1   x:collection1] o.a.s.c.ZkController Collection collection1 not visible yet, but flagging it so a watch is registered when it becomes visible
   [junit4]   2> 2229055 INFO  (OverseerStateUpdate-96572705494138884-127.0.0.1:38046_-n_0000000000) [n:127.0.0.1:38046_    ] o.a.s.c.Overseer processMessage: queueSize: 1, message = {
   [junit4]   2>   "core":"collection1",
   [junit4]   2>   "roles":null,
   [junit4]   2>   "base_url":"http://127.0.0.1:33251",
   [junit4]   2>   "node_name":"127.0.0.1:33251_",
   [junit4]   2>   "numShards":"2",
   [junit4]   2>   "state":"down",
   [junit4]   2>   "shard":null,
   [junit4]   2>   "collection":"collection1",
   [junit4]   2>   "operation":"state"} current state version: 3
   [junit4]   2> 2229055 INFO  (OverseerStateUpdate-96572705494138884-127.0.0.1:38046_-n_0000000000) [n:127.0.0.1:38046_    ] o.a.s.c.o.ReplicaMutator Update state numShards=2 message={
   [junit4]   2>   "core":"collection1",
   [junit4]   2>   "roles":null,
   [junit4]   2>   "base_url":"http://127.0.0.1:33251",
   [junit4]   2>   "node_name":"127.0.0.1:33251_",
   [junit4]   2>   "numShards":"2",
   [junit4]   2>   "state":"down",
   [junit4]   2>   "shard":null,
   [junit4]   2>   "collection":"collection1",
   [junit4]   2>   "operation":"state"}
   [junit4]   2> 2229055 INFO  (OverseerStateUpdate-96572705494138884-127.0.0.1:38046_-n_0000000000) [n:127.0.0.1:38046_    ] o.a.s.c.o.ClusterStateMutator building a new cName: collection1
   [junit4]   2> 2229055 INFO  (OverseerStateUpdate-96572705494138884-127.0.0.1:38046_-n_0000000000) [n:127.0.0.1:38046_    ] o.a.s.c.o.ReplicaMutator Assigning new node to shard shard=shard2
   [junit4]   2> 2229056 INFO  (coreLoadExecutor-10559-thread-1-processing-n:127.0.0.1:33251_) [n:127.0.0.1:33251_ c:collection1   x:collection1] o.a.s.c.c.ZkStateReader Deleting data for [collection1]
   [junit4]   2> 2229058 INFO  (coreLoadExecutor-10559-thread-1-processing-n:127.0.0.1:33251_) [n:127.0.0.1:33251_ c:collection1   x:collection1] o.a.s.c.ZkController look for our core node name
   [junit4]   2> 2229159 INFO  (zkCallback-3138-thread-3-processing-n:127.0.0.1:38046_) [n:127.0.0.1:38046_    ] o.a.s.c.c.ZkStateReader A cluster state change: [WatchedEvent state:SyncConnected type:NodeDataChanged path:/clusterstate.json], has occurred - updating... (live nodes size: [2])
   [junit4]   2> 2229159 INFO  (zkCallback-3142-thread-1) [    ] o.a.s.c.c.ZkStateReader A cluster state change: [WatchedEvent state:SyncConnected type:NodeDataChanged path:/clusterstate.json], has occurred - updating... (live nodes size: [2])
   [junit4]   2> 2229159 INFO  (zkCallback-3147-thread-1-processing-n:127.0.0.1:33251_) [n:127.0.0.1:33251_    ] o.a.s.c.c.ZkStateReader A cluster state change: [WatchedEvent state:SyncConnected type:NodeDataChanged path:/clusterstate.json], has occurred - updating... (live nodes size: [2])
   [junit4]   2> 2230058 INFO  (coreLoadExecutor-10559-thread-1-processing-n:127.0.0.1:33251_) [n:127.0.0.1:33251_ c:collection1   x:collection1] o.a.s.c.ZkController waiting to find shard id in clusterstate for collection1
   [junit4]   2> 2230059 INFO  (coreLoadExecutor-10559-thread-1-processing-n:127.0.0.1:33251_) [n:127.0.0.1:33251_ c:collection1   x:collection1] o.a.s.c.ZkController Check for collection zkNode:collection1
   [junit4]   2> 2230059 INFO  (coreLoadExecutor-10559-thread-1-processing-n:127.0.0.1:33251_) [n:127.0.0.1:33251_ c:collection1   x:collection1] o.a.s.c.ZkController Collection zkNode exists
   [junit4]   2> 2230059 INFO  (coreLoadExecutor-10559-thread-1-processing-n:127.0.0.1:33251_) [n:127.0.0.1:33251_ c:collection1   x:collection1] o.a.s.c.c.ZkStateReader Load collection config from: [/collections/coll

[...truncated too long message...]

aultHttpClientConnectionOperator.java:151)
   [junit4]    > 	at org.apache.http.impl.conn.PoolingHttpClientConnectionManager.connect(PoolingHttpClientConnectionManager.java:353)
   [junit4]    > 	at org.apache.http.impl.execchain.MainClientExec.establishRoute(MainClientExec.java:380)
   [junit4]    > 	at org.apache.http.impl.execchain.MainClientExec.execute(MainClientExec.java:236)
   [junit4]    > 	at org.apache.http.impl.execchain.ProtocolExec.execute(ProtocolExec.java:184)
   [junit4]    > 	at org.apache.http.impl.execchain.RetryExec.execute(RetryExec.java:88)
   [junit4]    > 	at org.apache.http.impl.execchain.RedirectExec.execute(RedirectExec.java:110)
   [junit4]    > 	at org.apache.http.impl.client.InternalHttpClient.doExecute(InternalHttpClient.java:184)
   [junit4]    > 	at org.apache.http.impl.client.CloseableHttpClient.execute(CloseableHttpClient.java:82)
   [junit4]    > 	at org.apache.http.impl.client.CloseableHttpClient.execute(CloseableHttpClient.java:55)
   [junit4]    > 	at org.apache.solr.client.solrj.impl.HttpSolrClient.executeMethod(HttpSolrClient.java:513)
   [junit4]    > 	... 54 more
   [junit4]    > Caused by: java.net.ConnectException: Connection refused
   [junit4]    > 	at java.net.PlainSocketImpl.socketConnect(Native Method)
   [junit4]    > 	at java.net.AbstractPlainSocketImpl.doConnect(AbstractPlainSocketImpl.java:350)
   [junit4]    > 	at java.net.AbstractPlainSocketImpl.connectToAddress(AbstractPlainSocketImpl.java:206)
   [junit4]    > 	at java.net.AbstractPlainSocketImpl.connect(AbstractPlainSocketImpl.java:188)
   [junit4]    > 	at java.net.SocksSocketImpl.connect(SocksSocketImpl.java:392)
   [junit4]    > 	at java.net.Socket.connect(Socket.java:589)
   [junit4]    > 	at org.apache.http.conn.socket.PlainConnectionSocketFactory.connectSocket(PlainConnectionSocketFactory.java:74)
   [junit4]    > 	at org.apache.http.impl.conn.DefaultHttpClientConnectionOperator.connect(DefaultHttpClientConnectionOperator.java:134)
   [junit4]    > 	... 64 more
   [junit4]   2> 2326207 INFO  (SUITE-ForceLeaderTest-seed#[B4E494297AAC199E]-worker) [    ] o.a.s.SolrTestCaseJ4 ###deleteCore
   [junit4]   2> NOTE: leaving temporary files on disk at: /export/home/jenkins/workspace/Lucene-Solr-master-Solaris/solr/build/solr-core/test/J1/temp/solr.cloud.ForceLeaderTest_B4E494297AAC199E-001
   [junit4]   2> Sep 11, 2016 8:30:41 AM com.carrotsearch.randomizedtesting.ThreadLeakControl checkThreadLeaks
   [junit4]   2> WARNING: Will linger awaiting termination of 4 leaked thread(s).
   [junit4]   2> NOTE: test params are: codec=Asserting(Lucene62): {range_facet_l_dv=PostingsFormat(name=Memory doPackFST= false), _version_=PostingsFormat(name=LuceneVarGapDocFreqInterval), multiDefault=TestBloomFilteredLucenePostings(BloomFilteringPostingsFormat(Lucene50(blocksize=128))), a_t=TestBloomFilteredLucenePostings(BloomFilteringPostingsFormat(Lucene50(blocksize=128))), intDefault=PostingsFormat(name=LuceneVarGapDocFreqInterval), id=PostingsFormat(name=Memory doPackFST= false), range_facet_i_dv=TestBloomFilteredLucenePostings(BloomFilteringPostingsFormat(Lucene50(blocksize=128))), text=BlockTreeOrds(blocksize=128), range_facet_l=TestBloomFilteredLucenePostings(BloomFilteringPostingsFormat(Lucene50(blocksize=128))), timestamp=TestBloomFilteredLucenePostings(BloomFilteringPostingsFormat(Lucene50(blocksize=128)))}, docValues:{range_facet_l_dv=DocValuesFormat(name=Lucene54), range_facet_i_dv=DocValuesFormat(name=Asserting), timestamp=DocValuesFormat(name=Asserting)}, maxPointsInLeafNode=1249, maxMBSortInHeap=5.89535119259836, sim=ClassicSimilarity, locale=tr, timezone=Africa/Freetown
   [junit4]   2> NOTE: SunOS 5.11 amd64/Oracle Corporation 1.8.0_102 (64-bit)/cpus=3,threads=1,free=179066216,total=524288000
   [junit4]   2> NOTE: All tests run in this JVM: [TestSolrXml, TestBadConfig, TestNonDefinedSimilarityFactory, TestSchemaNameResource, OpenCloseCoreStressTest, TestDistribDocBasedVersion, HdfsSyncSliceTest, ConvertedLegacyTest, SimpleCollectionCreateDeleteTest, TestSolrCLIRunExample, TestOrdValues, TestFieldCacheReopen, TestRealTimeGet, TestImplicitCoreProperties, TestUseDocValuesAsStored2, EchoParamsTest, RegexBoostProcessorTest, SecurityConfHandlerTest, TestTolerantUpdateProcessorCloud, HdfsDirectoryFactoryTest, SliceStateTest, TestReversedWildcardFilterFactory, TestSSLRandomization, TestTrie, TestConfigSetsAPIZkFailure, CachingDirectoryFactoryTest, BJQParserTest, MBeansHandlerTest, TestPHPSerializedResponseWriter, BadCopyFieldTest, TestQueryTypes, TestLocalFSCloudBackupRestore, HdfsNNFailoverTest, TestNamedUpdateProcessors, TestExactStatsCache, TestRecoveryHdfs, TestLMJelinekMercerSimilarityFactory, DistributedFacetExistsSmallTest, SharedFSAutoReplicaFailoverTest, AnalyticsQueryTest, TestLMDirichletSimilarityFactory, DistributedFacetPivotLongTailTest, RequestHandlersTest, CdcrUpdateLogTest, UUIDUpdateProcessorFallbackTest, TestRawTransformer, AsyncCallRequestStatusResponseTest, TestStressUserVersions, TestManagedResourceStorage, RAMDirectoryFactoryTest, LeaderFailoverAfterPartitionTest, TestSizeLimitedDistributedMap, TestJoin, HdfsRecoveryZkTest, TestWriterPerf, TestInitParams, TestZkChroot, TestSystemIdResolver, CopyFieldTest, SpatialHeatmapFacetsTest, TestCustomDocTransformer, TestReplicationHandlerBackup, TestCodecSupport, TestCrossCoreJoin, SortSpecParsingTest, TestConfigReload, TestComplexPhraseQParserPlugin, SpellPossibilityIteratorTest, TestDFRSimilarityFactory, MultiThreadedOCPTest, TestExpandComponent, TestSubQueryTransformerDistrib, BaseCdcrDistributedZkTest, LoggingHandlerTest, SpellCheckComponentTest, RequestLoggingTest, TestCloudPseudoReturnFields, TestFieldTypeCollectionResource, SaslZkACLProviderTest, ExternalFileFieldSortTest, TestMergePolicyConfig, TestNoOpRegenerator, TestMiniSolrCloudClusterSSL, OverriddenZkACLAndCredentialsProvidersTest, DebugComponentTest, TestSolrQueryParserResource, RollingRestartTest, TestSearchPerf, TestUtils, TestSolrConfigHandler, FullSolrCloudDistribCmdsTest, SolrCoreCheckLockOnStartupTest, TestConfigSetImmutable, TestHighFrequencyDictionaryFactory, HLLUtilTest, TestStressCloudBlindAtomicUpdates, CdcrReplicationDistributedZkTest, TestFastWriter, BigEndianAscendingWordDeserializerTest, SortByFunctionTest, ConnectionManagerTest, MergeStrategyTest, TestQuerySenderListener, TestRecovery, ZkSolrClientTest, DateMathParserTest, OverseerStatusTest, BitVectorTest, TestLuceneMatchVersion, TestGraphMLResponseWriter, TestSolrCloudWithKerberosAlt, BlockDirectoryTest, TestQuerySenderNoQuery, TestTrackingShardHandlerFactory, BasicDistributedZk2Test, TestDocBasedVersionConstraints, HdfsWriteToMultipleCollectionsTest, RemoteQueryErrorTest, TestSchemaManager, TestOmitPositions, DistributedFacetPivotSmallTest, HdfsBasicDistributedZkTest, DeleteReplicaTest, TestSolrDeletionPolicy2, TestConfig, PeerSyncReplicationTest, SuggestComponentTest, DistributedDebugComponentTest, ZkStateWriterTest, TestCloudSchemaless, TestRestoreCore, DistributedQueryComponentCustomSortTest, TestIndexSearcher, DeleteStatusTest, TestLegacyFieldCache, TestAuthenticationFramework, TestAnalyzeInfixSuggestions, TestGraphTermsQParserPlugin, TestSolr4Spatial, TestRandomFaceting, CollectionsAPIDistributedZkTest, TestQueryWrapperFilter, TestSmileRequest, TestManagedSchema, LukeRequestHandlerTest, DistributedIntervalFacetingTest, RuleEngineTest, HighlighterMaxOffsetTest, TestFuzzyAnalyzedSuggestions, BasicDistributedZkTest, ChaosMonkeySafeLeaderTest, UnloadDistributedZkTest, SyncSliceTest, LeaderElectionIntegrationTest, BasicZkTest, TestRandomDVFaceting, ShardRoutingCustomTest, AutoCommitTest, TestDistributedGrouping, TestFaceting, DistributedSpellCheckComponentTest, TermVectorComponentDistributedTest, TestStressReorder, TestReload, TestStressVersions, DistributedTermsComponentTest, TestRangeQuery, TestCoreContainer, SimpleFacetsTest, StatsComponentTest, TestGroupingSearch, SolrCmdDistributorTest, QueryElevationComponentTest, BadIndexSchemaTest, TestFiltering, TestFunctionQuery, BasicFunctionalityTest, TestLazyCores, HighlighterTest, SoftAutoCommitTest, ShowFileRequestHandlerTest, CurrencyFieldOpenExchangeTest, DistributedQueryElevationComponentTest, CurrencyFieldXmlFileTest, SolrIndexSplitterTest, SimplePostToolTest, TestCoreDiscovery, SignatureUpdateProcessorFactoryTest, SpellCheckCollatorTest, SuggesterFSTTest, CoreAdminHandlerTest, SolrRequestParserTest, TestFoldingMultitermQuery, DocValuesTest, SuggesterTSTTest, SuggesterTest, TestStressLucene, SuggesterWFSTTest, TestCSVLoader, NoCacheHeaderTest, WordBreakSolrSpellCheckerTest, SchemaVersionSpecificBehaviorTest, TestPseudoReturnFields, FieldMutatingUpdateProcessorTest, TestAtomicUpdateErrorCases, QueryEqualityTest, DirectUpdateHandlerOptimizeTest, DefaultValueUpdateProcessorTest, StatelessScriptUpdateProcessorFactoryTest, DocValuesMultiTest, DistanceFunctionTest, SolrInfoMBeanTest, XsltUpdateRequestHandlerTest, CacheHeaderTest, TestSurroundQueryParser, DisMaxRequestHandlerTest, TestQueryUtils, StandardRequestHandlerTest, FileBasedSpellCheckerTest, TestValueSourceCache, PathHierarchyTokenizerFactoryTest, TermVectorComponentTest, TestIndexingPerformance, RequiredFieldsTest, FieldAnalysisRequestHandlerTest, TestSolrQueryParser, FastVectorHighlighterTest, IndexSchemaRuntimeFieldTest, TestJmxIntegration, ReturnFieldsTest, QueryParsingTest, JsonLoaderTest, TestPartialUpdateDeduplication, SearchHandlerTest, HighlighterConfigTest, SOLR749Test, UpdateParamsTest, ResponseLogComponentTest, SolrIndexConfigTest, BadComponentTest, TestStressRecovery, TestHighlightDedupGrouping, ConnectionReuseTest, TestJettySolrRunner, AliasIntegrationTest, CleanupOldIndexTest, CollectionStateFormat2Test, CollectionsAPISolrJTest, DeleteLastCustomShardedReplicaTest, DeleteNodeTest, DeleteShardTest, DistribDocExpirationUpdateProcessorTest, DistributedQueueTest, ForceLeaderTest]
   [junit4] Completed [480/631 (1!)] on J1 in 99.84s, 3 tests, 1 error, 1 skipped <<< FAILURES!

[...truncated 60683 lines...]


Mime
View raw message