lucene-dev mailing list archives

Site index · List index
Message view « Date » · « Thread »
Top « Date » · « Thread »
From Apache Jenkins Server <jenk...@builds.apache.org>
Subject [JENKINS] Lucene-Solr-Tests-master - Build # 1394 - Still Unstable
Date Fri, 16 Sep 2016 22:28:18 GMT
Build: https://builds.apache.org/job/Lucene-Solr-Tests-master/1394/

1 tests failed.
FAILED:  org.apache.solr.cloud.ForceLeaderTest.testReplicasInLIRNoLeader

Error Message:
No live SolrServers available to handle this request:[http://127.0.0.1:53723/forceleader_test_collection_shard1_replica2]

Stack Trace:
org.apache.solr.client.solrj.impl.CloudSolrClient$RouteException: No live SolrServers available to handle this request:[http://127.0.0.1:53723/forceleader_test_collection_shard1_replica2]
	at __randomizedtesting.SeedInfo.seed([5F8F3538EEB1F815:B91801F8D7330174]:0)
	at org.apache.solr.client.solrj.impl.CloudSolrClient.directUpdate(CloudSolrClient.java:755)
	at org.apache.solr.client.solrj.impl.CloudSolrClient.sendRequest(CloudSolrClient.java:1161)
	at org.apache.solr.client.solrj.impl.CloudSolrClient.requestWithRetryOnStaleState(CloudSolrClient.java:1050)
	at org.apache.solr.client.solrj.impl.CloudSolrClient.request(CloudSolrClient.java:992)
	at org.apache.solr.cloud.AbstractFullDistribZkTestBase.sendDocsWithRetry(AbstractFullDistribZkTestBase.java:753)
	at org.apache.solr.cloud.AbstractFullDistribZkTestBase.sendDocsWithRetry(AbstractFullDistribZkTestBase.java:741)
	at org.apache.solr.cloud.ForceLeaderTest.sendDoc(ForceLeaderTest.java:424)
	at org.apache.solr.cloud.ForceLeaderTest.testReplicasInLIRNoLeader(ForceLeaderTest.java:131)
	at sun.reflect.NativeMethodAccessorImpl.invoke0(Native Method)
	at sun.reflect.NativeMethodAccessorImpl.invoke(NativeMethodAccessorImpl.java:62)
	at sun.reflect.DelegatingMethodAccessorImpl.invoke(DelegatingMethodAccessorImpl.java:43)
	at java.lang.reflect.Method.invoke(Method.java:498)
	at com.carrotsearch.randomizedtesting.RandomizedRunner.invoke(RandomizedRunner.java:1764)
	at com.carrotsearch.randomizedtesting.RandomizedRunner$8.evaluate(RandomizedRunner.java:871)
	at com.carrotsearch.randomizedtesting.RandomizedRunner$9.evaluate(RandomizedRunner.java:907)
	at com.carrotsearch.randomizedtesting.RandomizedRunner$10.evaluate(RandomizedRunner.java:921)
	at org.apache.solr.BaseDistributedSearchTestCase$ShardsRepeatRule$ShardsFixedStatement.callStatement(BaseDistributedSearchTestCase.java:985)
	at org.apache.solr.BaseDistributedSearchTestCase$ShardsRepeatRule$ShardsStatement.evaluate(BaseDistributedSearchTestCase.java:960)
	at com.carrotsearch.randomizedtesting.rules.SystemPropertiesRestoreRule$1.evaluate(SystemPropertiesRestoreRule.java:57)
	at org.apache.lucene.util.TestRuleSetupTeardownChained$1.evaluate(TestRuleSetupTeardownChained.java:49)
	at org.apache.lucene.util.AbstractBeforeAfterRule$1.evaluate(AbstractBeforeAfterRule.java:45)
	at org.apache.lucene.util.TestRuleThreadAndTestName$1.evaluate(TestRuleThreadAndTestName.java:48)
	at org.apache.lucene.util.TestRuleIgnoreAfterMaxFailures$1.evaluate(TestRuleIgnoreAfterMaxFailures.java:64)
	at org.apache.lucene.util.TestRuleMarkFailure$1.evaluate(TestRuleMarkFailure.java:47)
	at com.carrotsearch.randomizedtesting.rules.StatementAdapter.evaluate(StatementAdapter.java:36)
	at com.carrotsearch.randomizedtesting.ThreadLeakControl$StatementRunner.run(ThreadLeakControl.java:367)
	at com.carrotsearch.randomizedtesting.ThreadLeakControl.forkTimeoutingTask(ThreadLeakControl.java:809)
	at com.carrotsearch.randomizedtesting.ThreadLeakControl$3.evaluate(ThreadLeakControl.java:460)
	at com.carrotsearch.randomizedtesting.RandomizedRunner.runSingleTest(RandomizedRunner.java:880)
	at com.carrotsearch.randomizedtesting.RandomizedRunner$5.evaluate(RandomizedRunner.java:781)
	at com.carrotsearch.randomizedtesting.RandomizedRunner$6.evaluate(RandomizedRunner.java:816)
	at com.carrotsearch.randomizedtesting.RandomizedRunner$7.evaluate(RandomizedRunner.java:827)
	at com.carrotsearch.randomizedtesting.rules.StatementAdapter.evaluate(StatementAdapter.java:36)
	at com.carrotsearch.randomizedtesting.rules.SystemPropertiesRestoreRule$1.evaluate(SystemPropertiesRestoreRule.java:57)
	at org.apache.lucene.util.AbstractBeforeAfterRule$1.evaluate(AbstractBeforeAfterRule.java:45)
	at com.carrotsearch.randomizedtesting.rules.StatementAdapter.evaluate(StatementAdapter.java:36)
	at org.apache.lucene.util.TestRuleStoreClassName$1.evaluate(TestRuleStoreClassName.java:41)
	at com.carrotsearch.randomizedtesting.rules.NoShadowingOrOverridesOnMethodsRule$1.evaluate(NoShadowingOrOverridesOnMethodsRule.java:40)
	at com.carrotsearch.randomizedtesting.rules.NoShadowingOrOverridesOnMethodsRule$1.evaluate(NoShadowingOrOverridesOnMethodsRule.java:40)
	at com.carrotsearch.randomizedtesting.rules.StatementAdapter.evaluate(StatementAdapter.java:36)
	at com.carrotsearch.randomizedtesting.rules.StatementAdapter.evaluate(StatementAdapter.java:36)
	at com.carrotsearch.randomizedtesting.rules.StatementAdapter.evaluate(StatementAdapter.java:36)
	at org.apache.lucene.util.TestRuleAssertionsRequired$1.evaluate(TestRuleAssertionsRequired.java:53)
	at org.apache.lucene.util.TestRuleMarkFailure$1.evaluate(TestRuleMarkFailure.java:47)
	at org.apache.lucene.util.TestRuleIgnoreAfterMaxFailures$1.evaluate(TestRuleIgnoreAfterMaxFailures.java:64)
	at org.apache.lucene.util.TestRuleIgnoreTestSuites$1.evaluate(TestRuleIgnoreTestSuites.java:54)
	at com.carrotsearch.randomizedtesting.rules.StatementAdapter.evaluate(StatementAdapter.java:36)
	at com.carrotsearch.randomizedtesting.ThreadLeakControl$StatementRunner.run(ThreadLeakControl.java:367)
	at java.lang.Thread.run(Thread.java:745)
Caused by: org.apache.solr.client.solrj.SolrServerException: No live SolrServers available to handle this request:[http://127.0.0.1:53723/forceleader_test_collection_shard1_replica2]
	at org.apache.solr.client.solrj.impl.LBHttpSolrClient.request(LBHttpSolrClient.java:394)
	at org.apache.solr.client.solrj.impl.CloudSolrClient.lambda$directUpdate$0(CloudSolrClient.java:730)
	at java.util.concurrent.FutureTask.run(FutureTask.java:266)
	at org.apache.solr.common.util.ExecutorUtil$MDCAwareThreadPoolExecutor.lambda$execute$0(ExecutorUtil.java:229)
	at java.util.concurrent.ThreadPoolExecutor.runWorker(ThreadPoolExecutor.java:1142)
	at java.util.concurrent.ThreadPoolExecutor$Worker.run(ThreadPoolExecutor.java:617)
	... 1 more
Caused by: org.apache.solr.client.solrj.SolrServerException: Server refused connection at: http://127.0.0.1:53723/forceleader_test_collection_shard1_replica2
	at org.apache.solr.client.solrj.impl.HttpSolrClient.executeMethod(HttpSolrClient.java:615)
	at org.apache.solr.client.solrj.impl.HttpSolrClient.request(HttpSolrClient.java:261)
	at org.apache.solr.client.solrj.impl.HttpSolrClient.request(HttpSolrClient.java:250)
	at org.apache.solr.client.solrj.impl.LBHttpSolrClient.doRequest(LBHttpSolrClient.java:415)
	at org.apache.solr.client.solrj.impl.LBHttpSolrClient.request(LBHttpSolrClient.java:383)
	... 6 more
Caused by: org.apache.http.conn.HttpHostConnectException: Connect to 127.0.0.1:53723 [/127.0.0.1] failed: Connection refused
	at org.apache.http.impl.conn.DefaultHttpClientConnectionOperator.connect(DefaultHttpClientConnectionOperator.java:151)
	at org.apache.http.impl.conn.PoolingHttpClientConnectionManager.connect(PoolingHttpClientConnectionManager.java:353)
	at org.apache.http.impl.execchain.MainClientExec.establishRoute(MainClientExec.java:380)
	at org.apache.http.impl.execchain.MainClientExec.execute(MainClientExec.java:236)
	at org.apache.http.impl.execchain.ProtocolExec.execute(ProtocolExec.java:184)
	at org.apache.http.impl.execchain.RetryExec.execute(RetryExec.java:88)
	at org.apache.http.impl.execchain.RedirectExec.execute(RedirectExec.java:110)
	at org.apache.http.impl.client.InternalHttpClient.doExecute(InternalHttpClient.java:184)
	at org.apache.http.impl.client.CloseableHttpClient.execute(CloseableHttpClient.java:82)
	at org.apache.http.impl.client.CloseableHttpClient.execute(CloseableHttpClient.java:55)
	at org.apache.solr.client.solrj.impl.HttpSolrClient.executeMethod(HttpSolrClient.java:513)
	... 10 more
Caused by: java.net.ConnectException: Connection refused
	at java.net.PlainSocketImpl.socketConnect(Native Method)
	at java.net.AbstractPlainSocketImpl.doConnect(AbstractPlainSocketImpl.java:350)
	at java.net.AbstractPlainSocketImpl.connectToAddress(AbstractPlainSocketImpl.java:206)
	at java.net.AbstractPlainSocketImpl.connect(AbstractPlainSocketImpl.java:188)
	at java.net.SocksSocketImpl.connect(SocksSocketImpl.java:392)
	at java.net.Socket.connect(Socket.java:589)
	at org.apache.http.conn.socket.PlainConnectionSocketFactory.connectSocket(PlainConnectionSocketFactory.java:74)
	at org.apache.http.impl.conn.DefaultHttpClientConnectionOperator.connect(DefaultHttpClientConnectionOperator.java:134)
	... 20 more




Build Log:
[...truncated 10798 lines...]
   [junit4] Suite: org.apache.solr.cloud.ForceLeaderTest
   [junit4]   2> Creating dataDir: /x1/jenkins/jenkins-slave/workspace/Lucene-Solr-Tests-master/solr/build/solr-core/test/J2/temp/solr.cloud.ForceLeaderTest_5F8F3538EEB1F815-001/init-core-data-001
   [junit4]   2> 470951 INFO  (SUITE-ForceLeaderTest-seed#[5F8F3538EEB1F815]-worker) [    ] o.a.s.SolrTestCaseJ4 Randomized ssl (false) and clientAuth (false) via: @org.apache.solr.SolrTestCaseJ4$SuppressSSL(bugUrl=https://issues.apache.org/jira/browse/SOLR-5776)
   [junit4]   2> 470952 INFO  (SUITE-ForceLeaderTest-seed#[5F8F3538EEB1F815]-worker) [    ] o.a.s.BaseDistributedSearchTestCase Setting hostContext system property: /
   [junit4]   2> 471388 INFO  (TEST-ForceLeaderTest.testReplicasInLIRNoLeader-seed#[5F8F3538EEB1F815]) [    ] o.a.s.c.ZkTestServer STARTING ZK TEST SERVER
   [junit4]   2> 471388 INFO  (Thread-585) [    ] o.a.s.c.ZkTestServer client port:0.0.0.0/0.0.0.0:0
   [junit4]   2> 471388 INFO  (Thread-585) [    ] o.a.s.c.ZkTestServer Starting server
   [junit4]   2> 471488 INFO  (TEST-ForceLeaderTest.testReplicasInLIRNoLeader-seed#[5F8F3538EEB1F815]) [    ] o.a.s.c.ZkTestServer start zk server on port:57327
   [junit4]   2> 471488 INFO  (TEST-ForceLeaderTest.testReplicasInLIRNoLeader-seed#[5F8F3538EEB1F815]) [    ] o.a.s.c.c.SolrZkClient Using default ZkCredentialsProvider
   [junit4]   2> 471490 INFO  (TEST-ForceLeaderTest.testReplicasInLIRNoLeader-seed#[5F8F3538EEB1F815]) [    ] o.a.s.c.c.ConnectionManager Waiting for client to connect to ZooKeeper
   [junit4]   2> 471525 INFO  (zkCallback-457-thread-1) [    ] o.a.s.c.c.ConnectionManager Watcher org.apache.solr.common.cloud.ConnectionManager@36d78e96 name:ZooKeeperConnection Watcher:127.0.0.1:57327 got event WatchedEvent state:SyncConnected type:None path:null path:null type:None
   [junit4]   2> 471525 INFO  (TEST-ForceLeaderTest.testReplicasInLIRNoLeader-seed#[5F8F3538EEB1F815]) [    ] o.a.s.c.c.ConnectionManager Client is connected to ZooKeeper
   [junit4]   2> 471525 INFO  (TEST-ForceLeaderTest.testReplicasInLIRNoLeader-seed#[5F8F3538EEB1F815]) [    ] o.a.s.c.c.SolrZkClient Using default ZkACLProvider
   [junit4]   2> 471525 INFO  (TEST-ForceLeaderTest.testReplicasInLIRNoLeader-seed#[5F8F3538EEB1F815]) [    ] o.a.s.c.c.SolrZkClient makePath: /solr
   [junit4]   2> 471538 INFO  (TEST-ForceLeaderTest.testReplicasInLIRNoLeader-seed#[5F8F3538EEB1F815]) [    ] o.a.s.c.c.SolrZkClient Using default ZkCredentialsProvider
   [junit4]   2> 471647 INFO  (TEST-ForceLeaderTest.testReplicasInLIRNoLeader-seed#[5F8F3538EEB1F815]) [    ] o.a.s.c.c.ConnectionManager Waiting for client to connect to ZooKeeper
   [junit4]   2> 471735 INFO  (zkCallback-458-thread-1) [    ] o.a.s.c.c.ConnectionManager Watcher org.apache.solr.common.cloud.ConnectionManager@10ee4151 name:ZooKeeperConnection Watcher:127.0.0.1:57327/solr got event WatchedEvent state:SyncConnected type:None path:null path:null type:None
   [junit4]   2> 471735 INFO  (TEST-ForceLeaderTest.testReplicasInLIRNoLeader-seed#[5F8F3538EEB1F815]) [    ] o.a.s.c.c.ConnectionManager Client is connected to ZooKeeper
   [junit4]   2> 471735 INFO  (TEST-ForceLeaderTest.testReplicasInLIRNoLeader-seed#[5F8F3538EEB1F815]) [    ] o.a.s.c.c.SolrZkClient Using default ZkACLProvider
   [junit4]   2> 471736 INFO  (TEST-ForceLeaderTest.testReplicasInLIRNoLeader-seed#[5F8F3538EEB1F815]) [    ] o.a.s.c.c.SolrZkClient makePath: /collections/collection1
   [junit4]   2> 471737 INFO  (TEST-ForceLeaderTest.testReplicasInLIRNoLeader-seed#[5F8F3538EEB1F815]) [    ] o.a.s.c.c.SolrZkClient makePath: /collections/collection1/shards
   [junit4]   2> 471738 INFO  (TEST-ForceLeaderTest.testReplicasInLIRNoLeader-seed#[5F8F3538EEB1F815]) [    ] o.a.s.c.c.SolrZkClient makePath: /collections/control_collection
   [junit4]   2> 471739 INFO  (TEST-ForceLeaderTest.testReplicasInLIRNoLeader-seed#[5F8F3538EEB1F815]) [    ] o.a.s.c.c.SolrZkClient makePath: /collections/control_collection/shards
   [junit4]   2> 471740 INFO  (TEST-ForceLeaderTest.testReplicasInLIRNoLeader-seed#[5F8F3538EEB1F815]) [    ] o.a.s.c.AbstractZkTestCase put /x1/jenkins/jenkins-slave/workspace/Lucene-Solr-Tests-master/solr/core/src/test-files/solr/collection1/conf/solrconfig-tlog.xml to /configs/conf1/solrconfig.xml
   [junit4]   2> 471741 INFO  (TEST-ForceLeaderTest.testReplicasInLIRNoLeader-seed#[5F8F3538EEB1F815]) [    ] o.a.s.c.c.SolrZkClient makePath: /configs/conf1/solrconfig.xml
   [junit4]   2> 471742 INFO  (TEST-ForceLeaderTest.testReplicasInLIRNoLeader-seed#[5F8F3538EEB1F815]) [    ] o.a.s.c.AbstractZkTestCase put /x1/jenkins/jenkins-slave/workspace/Lucene-Solr-Tests-master/solr/core/src/test-files/solr/collection1/conf/schema.xml to /configs/conf1/schema.xml
   [junit4]   2> 471743 INFO  (TEST-ForceLeaderTest.testReplicasInLIRNoLeader-seed#[5F8F3538EEB1F815]) [    ] o.a.s.c.c.SolrZkClient makePath: /configs/conf1/schema.xml
   [junit4]   2> 471744 INFO  (TEST-ForceLeaderTest.testReplicasInLIRNoLeader-seed#[5F8F3538EEB1F815]) [    ] o.a.s.c.AbstractZkTestCase put /x1/jenkins/jenkins-slave/workspace/Lucene-Solr-Tests-master/solr/core/src/test-files/solr/collection1/conf/solrconfig.snippet.randomindexconfig.xml to /configs/conf1/solrconfig.snippet.randomindexconfig.xml
   [junit4]   2> 471744 INFO  (TEST-ForceLeaderTest.testReplicasInLIRNoLeader-seed#[5F8F3538EEB1F815]) [    ] o.a.s.c.c.SolrZkClient makePath: /configs/conf1/solrconfig.snippet.randomindexconfig.xml
   [junit4]   2> 471746 INFO  (TEST-ForceLeaderTest.testReplicasInLIRNoLeader-seed#[5F8F3538EEB1F815]) [    ] o.a.s.c.AbstractZkTestCase put /x1/jenkins/jenkins-slave/workspace/Lucene-Solr-Tests-master/solr/core/src/test-files/solr/collection1/conf/stopwords.txt to /configs/conf1/stopwords.txt
   [junit4]   2> 471746 INFO  (TEST-ForceLeaderTest.testReplicasInLIRNoLeader-seed#[5F8F3538EEB1F815]) [    ] o.a.s.c.c.SolrZkClient makePath: /configs/conf1/stopwords.txt
   [junit4]   2> 471747 INFO  (TEST-ForceLeaderTest.testReplicasInLIRNoLeader-seed#[5F8F3538EEB1F815]) [    ] o.a.s.c.AbstractZkTestCase put /x1/jenkins/jenkins-slave/workspace/Lucene-Solr-Tests-master/solr/core/src/test-files/solr/collection1/conf/protwords.txt to /configs/conf1/protwords.txt
   [junit4]   2> 471747 INFO  (TEST-ForceLeaderTest.testReplicasInLIRNoLeader-seed#[5F8F3538EEB1F815]) [    ] o.a.s.c.c.SolrZkClient makePath: /configs/conf1/protwords.txt
   [junit4]   2> 471748 INFO  (TEST-ForceLeaderTest.testReplicasInLIRNoLeader-seed#[5F8F3538EEB1F815]) [    ] o.a.s.c.AbstractZkTestCase put /x1/jenkins/jenkins-slave/workspace/Lucene-Solr-Tests-master/solr/core/src/test-files/solr/collection1/conf/currency.xml to /configs/conf1/currency.xml
   [junit4]   2> 471748 INFO  (TEST-ForceLeaderTest.testReplicasInLIRNoLeader-seed#[5F8F3538EEB1F815]) [    ] o.a.s.c.c.SolrZkClient makePath: /configs/conf1/currency.xml
   [junit4]   2> 471749 INFO  (TEST-ForceLeaderTest.testReplicasInLIRNoLeader-seed#[5F8F3538EEB1F815]) [    ] o.a.s.c.AbstractZkTestCase put /x1/jenkins/jenkins-slave/workspace/Lucene-Solr-Tests-master/solr/core/src/test-files/solr/collection1/conf/enumsConfig.xml to /configs/conf1/enumsConfig.xml
   [junit4]   2> 471750 INFO  (TEST-ForceLeaderTest.testReplicasInLIRNoLeader-seed#[5F8F3538EEB1F815]) [    ] o.a.s.c.c.SolrZkClient makePath: /configs/conf1/enumsConfig.xml
   [junit4]   2> 471751 INFO  (TEST-ForceLeaderTest.testReplicasInLIRNoLeader-seed#[5F8F3538EEB1F815]) [    ] o.a.s.c.AbstractZkTestCase put /x1/jenkins/jenkins-slave/workspace/Lucene-Solr-Tests-master/solr/core/src/test-files/solr/collection1/conf/open-exchange-rates.json to /configs/conf1/open-exchange-rates.json
   [junit4]   2> 471751 INFO  (TEST-ForceLeaderTest.testReplicasInLIRNoLeader-seed#[5F8F3538EEB1F815]) [    ] o.a.s.c.c.SolrZkClient makePath: /configs/conf1/open-exchange-rates.json
   [junit4]   2> 471752 INFO  (TEST-ForceLeaderTest.testReplicasInLIRNoLeader-seed#[5F8F3538EEB1F815]) [    ] o.a.s.c.AbstractZkTestCase put /x1/jenkins/jenkins-slave/workspace/Lucene-Solr-Tests-master/solr/core/src/test-files/solr/collection1/conf/mapping-ISOLatin1Accent.txt to /configs/conf1/mapping-ISOLatin1Accent.txt
   [junit4]   2> 471752 INFO  (TEST-ForceLeaderTest.testReplicasInLIRNoLeader-seed#[5F8F3538EEB1F815]) [    ] o.a.s.c.c.SolrZkClient makePath: /configs/conf1/mapping-ISOLatin1Accent.txt
   [junit4]   2> 471753 INFO  (TEST-ForceLeaderTest.testReplicasInLIRNoLeader-seed#[5F8F3538EEB1F815]) [    ] o.a.s.c.AbstractZkTestCase put /x1/jenkins/jenkins-slave/workspace/Lucene-Solr-Tests-master/solr/core/src/test-files/solr/collection1/conf/old_synonyms.txt to /configs/conf1/old_synonyms.txt
   [junit4]   2> 471754 INFO  (TEST-ForceLeaderTest.testReplicasInLIRNoLeader-seed#[5F8F3538EEB1F815]) [    ] o.a.s.c.c.SolrZkClient makePath: /configs/conf1/old_synonyms.txt
   [junit4]   2> 471755 INFO  (TEST-ForceLeaderTest.testReplicasInLIRNoLeader-seed#[5F8F3538EEB1F815]) [    ] o.a.s.c.AbstractZkTestCase put /x1/jenkins/jenkins-slave/workspace/Lucene-Solr-Tests-master/solr/core/src/test-files/solr/collection1/conf/synonyms.txt to /configs/conf1/synonyms.txt
   [junit4]   2> 471755 INFO  (TEST-ForceLeaderTest.testReplicasInLIRNoLeader-seed#[5F8F3538EEB1F815]) [    ] o.a.s.c.c.SolrZkClient makePath: /configs/conf1/synonyms.txt
   [junit4]   2> 472518 INFO  (TEST-ForceLeaderTest.testReplicasInLIRNoLeader-seed#[5F8F3538EEB1F815]) [    ] o.a.s.SolrTestCaseJ4 Writing core.properties file to /x1/jenkins/jenkins-slave/workspace/Lucene-Solr-Tests-master/solr/build/solr-core/test/J2/temp/solr.cloud.ForceLeaderTest_5F8F3538EEB1F815-001/control-001/cores/collection1
   [junit4]   2> 472521 INFO  (TEST-ForceLeaderTest.testReplicasInLIRNoLeader-seed#[5F8F3538EEB1F815]) [    ] o.e.j.s.Server jetty-9.3.8.v20160314
   [junit4]   2> 472534 INFO  (TEST-ForceLeaderTest.testReplicasInLIRNoLeader-seed#[5F8F3538EEB1F815]) [    ] o.e.j.s.h.ContextHandler Started o.e.j.s.ServletContextHandler@a701387{/,null,AVAILABLE}
   [junit4]   2> 472537 INFO  (TEST-ForceLeaderTest.testReplicasInLIRNoLeader-seed#[5F8F3538EEB1F815]) [    ] o.e.j.s.ServerConnector Started ServerConnector@50080d2f{HTTP/1.1,[http/1.1]}{127.0.0.1:49729}
   [junit4]   2> 472537 INFO  (TEST-ForceLeaderTest.testReplicasInLIRNoLeader-seed#[5F8F3538EEB1F815]) [    ] o.e.j.s.Server Started @479367ms
   [junit4]   2> 472537 INFO  (TEST-ForceLeaderTest.testReplicasInLIRNoLeader-seed#[5F8F3538EEB1F815]) [    ] o.a.s.c.s.e.JettySolrRunner Jetty properties: {solr.data.dir=/x1/jenkins/jenkins-slave/workspace/Lucene-Solr-Tests-master/solr/build/solr-core/test/J2/temp/solr.cloud.ForceLeaderTest_5F8F3538EEB1F815-001/tempDir-001/control/data, hostContext=/, hostPort=53723, coreRootDirectory=/x1/jenkins/jenkins-slave/workspace/Lucene-Solr-Tests-master/solr/build/solr-core/test/J2/temp/solr.cloud.ForceLeaderTest_5F8F3538EEB1F815-001/control-001/cores}
   [junit4]   2> 472537 INFO  (TEST-ForceLeaderTest.testReplicasInLIRNoLeader-seed#[5F8F3538EEB1F815]) [    ] o.a.s.s.SolrDispatchFilter SolrDispatchFilter.init(): sun.misc.Launcher$AppClassLoader@73d16e93
   [junit4]   2> 472538 INFO  (TEST-ForceLeaderTest.testReplicasInLIRNoLeader-seed#[5F8F3538EEB1F815]) [    ] o.a.s.c.SolrResourceLoader new SolrResourceLoader for directory: '/x1/jenkins/jenkins-slave/workspace/Lucene-Solr-Tests-master/solr/build/solr-core/test/J2/temp/solr.cloud.ForceLeaderTest_5F8F3538EEB1F815-001/control-001'
   [junit4]   2> 472538 INFO  (TEST-ForceLeaderTest.testReplicasInLIRNoLeader-seed#[5F8F3538EEB1F815]) [    ] o.a.s.c.SolrResourceLoader JNDI not configured for solr (NoInitialContextEx)
   [junit4]   2> 472538 INFO  (TEST-ForceLeaderTest.testReplicasInLIRNoLeader-seed#[5F8F3538EEB1F815]) [    ] o.a.s.c.SolrResourceLoader solr home defaulted to 'solr/' (could not find system property or JNDI)
   [junit4]   2> 472538 INFO  (TEST-ForceLeaderTest.testReplicasInLIRNoLeader-seed#[5F8F3538EEB1F815]) [    ] o.a.s.c.c.SolrZkClient Using default ZkCredentialsProvider
   [junit4]   2> 472562 INFO  (TEST-ForceLeaderTest.testReplicasInLIRNoLeader-seed#[5F8F3538EEB1F815]) [    ] o.a.s.c.c.ConnectionManager Waiting for client to connect to ZooKeeper
   [junit4]   2> 472563 INFO  (zkCallback-459-thread-1) [    ] o.a.s.c.c.ConnectionManager Watcher org.apache.solr.common.cloud.ConnectionManager@4299b25d name:ZooKeeperConnection Watcher:127.0.0.1:57327/solr got event WatchedEvent state:SyncConnected type:None path:null path:null type:None
   [junit4]   2> 472563 INFO  (TEST-ForceLeaderTest.testReplicasInLIRNoLeader-seed#[5F8F3538EEB1F815]) [    ] o.a.s.c.c.ConnectionManager Client is connected to ZooKeeper
   [junit4]   2> 472563 INFO  (TEST-ForceLeaderTest.testReplicasInLIRNoLeader-seed#[5F8F3538EEB1F815]) [    ] o.a.s.c.c.SolrZkClient Using default ZkACLProvider
   [junit4]   2> 472579 INFO  (TEST-ForceLeaderTest.testReplicasInLIRNoLeader-seed#[5F8F3538EEB1F815]) [    ] o.a.s.s.SolrDispatchFilter Loading solr.xml from SolrHome (not found in ZooKeeper)
   [junit4]   2> 472579 INFO  (TEST-ForceLeaderTest.testReplicasInLIRNoLeader-seed#[5F8F3538EEB1F815]) [    ] o.a.s.c.SolrXmlConfig Loading container configuration from /x1/jenkins/jenkins-slave/workspace/Lucene-Solr-Tests-master/solr/build/solr-core/test/J2/temp/solr.cloud.ForceLeaderTest_5F8F3538EEB1F815-001/control-001/solr.xml
   [junit4]   2> 472584 INFO  (TEST-ForceLeaderTest.testReplicasInLIRNoLeader-seed#[5F8F3538EEB1F815]) [    ] o.a.s.c.CorePropertiesLocator Config-defined core root directory: /x1/jenkins/jenkins-slave/workspace/Lucene-Solr-Tests-master/solr/build/solr-core/test/J2/temp/solr.cloud.ForceLeaderTest_5F8F3538EEB1F815-001/control-001/cores
   [junit4]   2> 472584 INFO  (TEST-ForceLeaderTest.testReplicasInLIRNoLeader-seed#[5F8F3538EEB1F815]) [    ] o.a.s.c.CoreContainer New CoreContainer 1847811539
   [junit4]   2> 472584 INFO  (TEST-ForceLeaderTest.testReplicasInLIRNoLeader-seed#[5F8F3538EEB1F815]) [    ] o.a.s.c.CoreContainer Loading cores into CoreContainer [instanceDir=/x1/jenkins/jenkins-slave/workspace/Lucene-Solr-Tests-master/solr/build/solr-core/test/J2/temp/solr.cloud.ForceLeaderTest_5F8F3538EEB1F815-001/control-001]
   [junit4]   2> 472584 WARN  (TEST-ForceLeaderTest.testReplicasInLIRNoLeader-seed#[5F8F3538EEB1F815]) [    ] o.a.s.c.CoreContainer Couldn't add files from /x1/jenkins/jenkins-slave/workspace/Lucene-Solr-Tests-master/solr/build/solr-core/test/J2/temp/solr.cloud.ForceLeaderTest_5F8F3538EEB1F815-001/control-001/lib to classpath: /x1/jenkins/jenkins-slave/workspace/Lucene-Solr-Tests-master/solr/build/solr-core/test/J2/temp/solr.cloud.ForceLeaderTest_5F8F3538EEB1F815-001/control-001/lib
   [junit4]   2> 472584 INFO  (TEST-ForceLeaderTest.testReplicasInLIRNoLeader-seed#[5F8F3538EEB1F815]) [    ] o.a.s.h.c.HttpShardHandlerFactory created with socketTimeout : 90000,urlScheme : ,connTimeout : 15000,maxConnectionsPerHost : 20,maxConnections : 10000,corePoolSize : 0,maximumPoolSize : 2147483647,maxThreadIdleTime : 5,sizeOfQueue : -1,fairnessPolicy : false,
   [junit4]   2> 472605 INFO  (TEST-ForceLeaderTest.testReplicasInLIRNoLeader-seed#[5F8F3538EEB1F815]) [    ] o.a.s.u.UpdateShardHandler Created UpdateShardHandler HTTP client with params: socketTimeout=340000&connTimeout=45000&maxConnections=100000&maxConnectionsPerHost=100000
   [junit4]   2> 472605 INFO  (TEST-ForceLeaderTest.testReplicasInLIRNoLeader-seed#[5F8F3538EEB1F815]) [    ] o.a.s.l.LogWatcher SLF4J impl is org.slf4j.impl.Log4jLoggerFactory
   [junit4]   2> 472605 INFO  (TEST-ForceLeaderTest.testReplicasInLIRNoLeader-seed#[5F8F3538EEB1F815]) [    ] o.a.s.l.LogWatcher Registering Log Listener [Log4j (org.slf4j.impl.Log4jLoggerFactory)]
   [junit4]   2> 472605 INFO  (TEST-ForceLeaderTest.testReplicasInLIRNoLeader-seed#[5F8F3538EEB1F815]) [    ] o.a.s.c.ZkContainer Zookeeper client=127.0.0.1:57327/solr
   [junit4]   2> 472606 INFO  (TEST-ForceLeaderTest.testReplicasInLIRNoLeader-seed#[5F8F3538EEB1F815]) [    ] o.a.s.c.ZkController zkHost includes chroot
   [junit4]   2> 472606 INFO  (TEST-ForceLeaderTest.testReplicasInLIRNoLeader-seed#[5F8F3538EEB1F815]) [    ] o.a.s.c.c.SolrZkClient Using default ZkCredentialsProvider
   [junit4]   2> 472610 INFO  (TEST-ForceLeaderTest.testReplicasInLIRNoLeader-seed#[5F8F3538EEB1F815]) [    ] o.a.s.c.c.ConnectionManager Waiting for client to connect to ZooKeeper
   [junit4]   2> 472612 INFO  (zkCallback-462-thread-1) [    ] o.a.s.c.c.ConnectionManager Watcher org.apache.solr.common.cloud.ConnectionManager@f099432 name:ZooKeeperConnection Watcher:127.0.0.1:57327 got event WatchedEvent state:SyncConnected type:None path:null path:null type:None
   [junit4]   2> 472617 INFO  (TEST-ForceLeaderTest.testReplicasInLIRNoLeader-seed#[5F8F3538EEB1F815]) [    ] o.a.s.c.c.ConnectionManager Client is connected to ZooKeeper
   [junit4]   2> 472617 INFO  (TEST-ForceLeaderTest.testReplicasInLIRNoLeader-seed#[5F8F3538EEB1F815]) [    ] o.a.s.c.c.SolrZkClient Using default ZkACLProvider
   [junit4]   2> 472619 INFO  (TEST-ForceLeaderTest.testReplicasInLIRNoLeader-seed#[5F8F3538EEB1F815]) [n:127.0.0.1:53723_    ] o.a.s.c.ZkController Added new OnReconnect listener org.apache.solr.cloud.ZkController$$Lambda$92/1343065651@72812b7e
   [junit4]   2> 472660 INFO  (TEST-ForceLeaderTest.testReplicasInLIRNoLeader-seed#[5F8F3538EEB1F815]) [n:127.0.0.1:53723_    ] o.a.s.c.c.ConnectionManager Waiting for client to connect to ZooKeeper
   [junit4]   2> 472669 INFO  (zkCallback-463-thread-1-processing-n:127.0.0.1:53723_) [n:127.0.0.1:53723_    ] o.a.s.c.c.ConnectionManager Watcher org.apache.solr.common.cloud.ConnectionManager@1cabba4e name:ZooKeeperConnection Watcher:127.0.0.1:57327/solr got event WatchedEvent state:SyncConnected type:None path:null path:null type:None
   [junit4]   2> 472669 INFO  (TEST-ForceLeaderTest.testReplicasInLIRNoLeader-seed#[5F8F3538EEB1F815]) [n:127.0.0.1:53723_    ] o.a.s.c.c.ConnectionManager Client is connected to ZooKeeper
   [junit4]   2> 472670 INFO  (TEST-ForceLeaderTest.testReplicasInLIRNoLeader-seed#[5F8F3538EEB1F815]) [n:127.0.0.1:53723_    ] o.a.s.c.c.SolrZkClient makePath: /overseer/queue
   [junit4]   2> 472672 INFO  (TEST-ForceLeaderTest.testReplicasInLIRNoLeader-seed#[5F8F3538EEB1F815]) [n:127.0.0.1:53723_    ] o.a.s.c.c.SolrZkClient makePath: /overseer/collection-queue-work
   [junit4]   2> 472674 INFO  (TEST-ForceLeaderTest.testReplicasInLIRNoLeader-seed#[5F8F3538EEB1F815]) [n:127.0.0.1:53723_    ] o.a.s.c.c.SolrZkClient makePath: /overseer/collection-map-running
   [junit4]   2> 472676 INFO  (TEST-ForceLeaderTest.testReplicasInLIRNoLeader-seed#[5F8F3538EEB1F815]) [n:127.0.0.1:53723_    ] o.a.s.c.c.SolrZkClient makePath: /overseer/collection-map-completed
   [junit4]   2> 472677 INFO  (TEST-ForceLeaderTest.testReplicasInLIRNoLeader-seed#[5F8F3538EEB1F815]) [n:127.0.0.1:53723_    ] o.a.s.c.c.SolrZkClient makePath: /overseer/collection-map-failure
   [junit4]   2> 472679 INFO  (TEST-ForceLeaderTest.testReplicasInLIRNoLeader-seed#[5F8F3538EEB1F815]) [n:127.0.0.1:53723_    ] o.a.s.c.c.SolrZkClient makePath: /live_nodes
   [junit4]   2> 472680 INFO  (TEST-ForceLeaderTest.testReplicasInLIRNoLeader-seed#[5F8F3538EEB1F815]) [n:127.0.0.1:53723_    ] o.a.s.c.c.SolrZkClient makePath: /aliases.json
   [junit4]   2> 472681 INFO  (TEST-ForceLeaderTest.testReplicasInLIRNoLeader-seed#[5F8F3538EEB1F815]) [n:127.0.0.1:53723_    ] o.a.s.c.c.SolrZkClient makePath: /clusterstate.json
   [junit4]   2> 472682 INFO  (TEST-ForceLeaderTest.testReplicasInLIRNoLeader-seed#[5F8F3538EEB1F815]) [n:127.0.0.1:53723_    ] o.a.s.c.c.SolrZkClient makePath: /security.json
   [junit4]   2> 472683 INFO  (TEST-ForceLeaderTest.testReplicasInLIRNoLeader-seed#[5F8F3538EEB1F815]) [n:127.0.0.1:53723_    ] o.a.s.c.c.ZkStateReader Updating cluster state from ZooKeeper... 
   [junit4]   2> 472683 INFO  (TEST-ForceLeaderTest.testReplicasInLIRNoLeader-seed#[5F8F3538EEB1F815]) [n:127.0.0.1:53723_    ] o.a.s.c.c.ZkStateReader Loaded empty cluster properties
   [junit4]   2> 472684 INFO  (TEST-ForceLeaderTest.testReplicasInLIRNoLeader-seed#[5F8F3538EEB1F815]) [n:127.0.0.1:53723_    ] o.a.s.c.c.ZkStateReader Updated live nodes from ZooKeeper... (0) -> (0)
   [junit4]   2> 472686 INFO  (TEST-ForceLeaderTest.testReplicasInLIRNoLeader-seed#[5F8F3538EEB1F815]) [n:127.0.0.1:53723_    ] o.a.s.c.c.SolrZkClient makePath: /overseer_elect
   [junit4]   2> 472687 INFO  (TEST-ForceLeaderTest.testReplicasInLIRNoLeader-seed#[5F8F3538EEB1F815]) [n:127.0.0.1:53723_    ] o.a.s.c.c.SolrZkClient makePath: /overseer_elect/election
   [junit4]   2> 472688 INFO  (TEST-ForceLeaderTest.testReplicasInLIRNoLeader-seed#[5F8F3538EEB1F815]) [n:127.0.0.1:53723_    ] o.a.s.c.Overseer Overseer (id=null) closing
   [junit4]   2> 472688 INFO  (TEST-ForceLeaderTest.testReplicasInLIRNoLeader-seed#[5F8F3538EEB1F815]) [n:127.0.0.1:53723_    ] o.a.s.c.LeaderElector Joined leadership election with path: /overseer_elect/election/96603987479166980-127.0.0.1:53723_-n_0000000000
   [junit4]   2> 472689 INFO  (TEST-ForceLeaderTest.testReplicasInLIRNoLeader-seed#[5F8F3538EEB1F815]) [n:127.0.0.1:53723_    ] o.a.s.c.OverseerElectionContext I am going to be the leader 127.0.0.1:53723_
   [junit4]   2> 472689 INFO  (TEST-ForceLeaderTest.testReplicasInLIRNoLeader-seed#[5F8F3538EEB1F815]) [n:127.0.0.1:53723_    ] o.a.s.c.c.SolrZkClient makePath: /overseer_elect/leader
   [junit4]   2> 472690 INFO  (TEST-ForceLeaderTest.testReplicasInLIRNoLeader-seed#[5F8F3538EEB1F815]) [n:127.0.0.1:53723_    ] o.a.s.c.Overseer Overseer (id=96603987479166980-127.0.0.1:53723_-n_0000000000) starting
   [junit4]   2> 472691 INFO  (TEST-ForceLeaderTest.testReplicasInLIRNoLeader-seed#[5F8F3538EEB1F815]) [n:127.0.0.1:53723_    ] o.a.s.c.c.SolrZkClient makePath: /overseer/queue-work
   [junit4]   2> 472696 INFO  (TEST-ForceLeaderTest.testReplicasInLIRNoLeader-seed#[5F8F3538EEB1F815]) [n:127.0.0.1:53723_    ] o.a.s.c.OverseerAutoReplicaFailoverThread Starting OverseerAutoReplicaFailoverThread autoReplicaFailoverWorkLoopDelay=10000 autoReplicaFailoverWaitAfterExpiration=10000 autoReplicaFailoverBadNodeExpiration=60000
   [junit4]   2> 472702 INFO  (OverseerStateUpdate-96603987479166980-127.0.0.1:53723_-n_0000000000) [n:127.0.0.1:53723_    ] o.a.s.c.Overseer Starting to work on the main queue
   [junit4]   2> 472723 INFO  (TEST-ForceLeaderTest.testReplicasInLIRNoLeader-seed#[5F8F3538EEB1F815]) [n:127.0.0.1:53723_    ] o.a.s.c.ZkController Register node as live in ZooKeeper:/live_nodes/127.0.0.1:53723_
   [junit4]   2> 472723 INFO  (TEST-ForceLeaderTest.testReplicasInLIRNoLeader-seed#[5F8F3538EEB1F815]) [n:127.0.0.1:53723_    ] o.a.s.c.c.SolrZkClient makePath: /live_nodes/127.0.0.1:53723_
   [junit4]   2> 472723 INFO  (OverseerCollectionConfigSetProcessor-96603987479166980-127.0.0.1:53723_-n_0000000000) [n:127.0.0.1:53723_    ] o.a.s.c.OverseerTaskProcessor Process current queue of overseer operations
   [junit4]   2> 472724 INFO  (OverseerStateUpdate-96603987479166980-127.0.0.1:53723_-n_0000000000) [n:127.0.0.1:53723_    ] o.a.s.c.c.ZkStateReader Updated live nodes from ZooKeeper... (0) -> (0)
   [junit4]   2> 472725 INFO  (zkCallback-463-thread-1-processing-n:127.0.0.1:53723_) [n:127.0.0.1:53723_    ] o.a.s.c.c.ZkStateReader A live node change: [WatchedEvent state:SyncConnected type:NodeChildrenChanged path:/live_nodes], has occurred - updating... (live nodes size: [0])
   [junit4]   2> 472725 INFO  (zkCallback-463-thread-1-processing-n:127.0.0.1:53723_) [n:127.0.0.1:53723_    ] o.a.s.c.c.ZkStateReader Updated live nodes from ZooKeeper... (0) -> (1)
   [junit4]   2> 472802 INFO  (TEST-ForceLeaderTest.testReplicasInLIRNoLeader-seed#[5F8F3538EEB1F815]) [n:127.0.0.1:53723_    ] o.a.s.c.CoreContainer Security conf doesn't exist. Skipping setup for authorization module.
   [junit4]   2> 472802 INFO  (TEST-ForceLeaderTest.testReplicasInLIRNoLeader-seed#[5F8F3538EEB1F815]) [n:127.0.0.1:53723_    ] o.a.s.c.CoreContainer No authentication plugin used.
   [junit4]   2> 472803 INFO  (TEST-ForceLeaderTest.testReplicasInLIRNoLeader-seed#[5F8F3538EEB1F815]) [n:127.0.0.1:53723_    ] o.a.s.c.CorePropertiesLocator Looking for core definitions underneath /x1/jenkins/jenkins-slave/workspace/Lucene-Solr-Tests-master/solr/build/solr-core/test/J2/temp/solr.cloud.ForceLeaderTest_5F8F3538EEB1F815-001/control-001/cores
   [junit4]   2> 472804 INFO  (TEST-ForceLeaderTest.testReplicasInLIRNoLeader-seed#[5F8F3538EEB1F815]) [n:127.0.0.1:53723_    ] o.a.s.c.CoreDescriptor Created CoreDescriptor: {name=collection1, config=solrconfig.xml, transient=false, schema=schema.xml, loadOnStartup=true, configSetProperties=configsetprops.json, collection=control_collection, coreNodeName=, dataDir=data/, shard=}
   [junit4]   2> 472804 INFO  (TEST-ForceLeaderTest.testReplicasInLIRNoLeader-seed#[5F8F3538EEB1F815]) [n:127.0.0.1:53723_    ] o.a.s.c.CorePropertiesLocator Found core collection1 in /x1/jenkins/jenkins-slave/workspace/Lucene-Solr-Tests-master/solr/build/solr-core/test/J2/temp/solr.cloud.ForceLeaderTest_5F8F3538EEB1F815-001/control-001/cores/collection1
   [junit4]   2> 472804 INFO  (TEST-ForceLeaderTest.testReplicasInLIRNoLeader-seed#[5F8F3538EEB1F815]) [n:127.0.0.1:53723_    ] o.a.s.c.CorePropertiesLocator Found 1 core definitions
   [junit4]   2> 472806 INFO  (coreLoadExecutor-1267-thread-1-processing-n:127.0.0.1:53723_) [n:127.0.0.1:53723_ c:control_collection   x:collection1] o.a.s.c.ZkController publishing state=down
   [junit4]   2> 472806 INFO  (coreLoadExecutor-1267-thread-1-processing-n:127.0.0.1:53723_) [n:127.0.0.1:53723_ c:control_collection   x:collection1] o.a.s.c.ZkController numShards not found on descriptor - reading it from system property
   [junit4]   2> 472807 INFO  (TEST-ForceLeaderTest.testReplicasInLIRNoLeader-seed#[5F8F3538EEB1F815]) [n:127.0.0.1:53723_    ] o.a.s.s.SolrDispatchFilter user.dir=/x1/jenkins/jenkins-slave/workspace/Lucene-Solr-Tests-master/solr/build/solr-core/test/J2
   [junit4]   2> 472807 INFO  (TEST-ForceLeaderTest.testReplicasInLIRNoLeader-seed#[5F8F3538EEB1F815]) [n:127.0.0.1:53723_    ] o.a.s.s.SolrDispatchFilter SolrDispatchFilter.init() done
   [junit4]   2> 472808 INFO  (coreLoadExecutor-1267-thread-1-processing-n:127.0.0.1:53723_) [n:127.0.0.1:53723_ c:control_collection   x:collection1] o.a.s.c.ZkController Collection control_collection not visible yet, but flagging it so a watch is registered when it becomes visible
   [junit4]   2> 472808 INFO  (OverseerStateUpdate-96603987479166980-127.0.0.1:53723_-n_0000000000) [n:127.0.0.1:53723_    ] o.a.s.c.Overseer processMessage: queueSize: 1, message = {
   [junit4]   2>   "core":"collection1",
   [junit4]   2>   "roles":null,
   [junit4]   2>   "base_url":"http://127.0.0.1:53723",
   [junit4]   2>   "node_name":"127.0.0.1:53723_",
   [junit4]   2>   "numShards":"1",
   [junit4]   2>   "state":"down",
   [junit4]   2>   "shard":null,
   [junit4]   2>   "collection":"control_collection",
   [junit4]   2>   "operation":"state"} current state version: 0
   [junit4]   2> 472808 INFO  (OverseerStateUpdate-96603987479166980-127.0.0.1:53723_-n_0000000000) [n:127.0.0.1:53723_    ] o.a.s.c.o.ReplicaMutator Update state numShards=1 message={
   [junit4]   2>   "core":"collection1",
   [junit4]   2>   "roles":null,
   [junit4]   2>   "base_url":"http://127.0.0.1:53723",
   [junit4]   2>   "node_name":"127.0.0.1:53723_",
   [junit4]   2>   "numShards":"1",
   [junit4]   2>   "state":"down",
   [junit4]   2>   "shard":null,
   [junit4]   2>   "collection":"control_collection",
   [junit4]   2>   "operation":"state"}
   [junit4]   2> 472809 INFO  (OverseerStateUpdate-96603987479166980-127.0.0.1:53723_-n_0000000000) [n:127.0.0.1:53723_    ] o.a.s.c.o.ClusterStateMutator building a new cName: control_collection
   [junit4]   2> 472809 INFO  (coreLoadExecutor-1267-thread-1-processing-n:127.0.0.1:53723_) [n:127.0.0.1:53723_ c:control_collection   x:collection1] o.a.s.c.c.ZkStateReader Deleting data for [control_collection]
   [junit4]   2> 472810 INFO  (OverseerStateUpdate-96603987479166980-127.0.0.1:53723_-n_0000000000) [n:127.0.0.1:53723_    ] o.a.s.c.o.ReplicaMutator Assigning new node to shard shard=shard1
   [junit4]   2> 472811 INFO  (zkCallback-463-thread-1-processing-n:127.0.0.1:53723_) [n:127.0.0.1:53723_    ] o.a.s.c.c.ZkStateReader A cluster state change: [WatchedEvent state:SyncConnected type:NodeDataChanged path:/clusterstate.json], has occurred - updating... (live nodes size: [1])
   [junit4]   2> 472814 INFO  (coreLoadExecutor-1267-thread-1-processing-n:127.0.0.1:53723_) [n:127.0.0.1:53723_ c:control_collection   x:collection1] o.a.s.c.ZkController look for our core node name
   [junit4]   2> 472814 INFO  (coreLoadExecutor-1267-thread-1-processing-n:127.0.0.1:53723_) [n:127.0.0.1:53723_ c:control_collection   x:collection1] o.a.s.c.ZkController waiting to find shard id in clusterstate for collection1
   [junit4]   2> 472814 INFO  (coreLoadExecutor-1267-thread-1-processing-n:127.0.0.1:53723_) [n:127.0.0.1:53723_ c:control_collection   x:collection1] o.a.s.c.ZkController Check for collection zkNode:control_collection
   [junit4]   2> 472814 INFO  (coreLoadExecutor-1267-thread-1-processing-n:127.0.0.1:53723_) [n:127.0.0.1:53723_ c:control_collection   x:collection1] o.a.s.c.ZkController Collection zkNode exists
   [junit4]   2> 472814 INFO  (coreLoadExecutor-1267-thread-1-processing-n:127.0.0.1:53723_) [n:127.0.0.1:53723_ c:control_collection   x:collection1] o.a.s.c.SolrResourceLoader new SolrResourceLoader for directory: '/x1/jenkins/jenkins-slave/workspace/Lucene-Solr-Tests-master/solr/build/solr-core/test/J2/temp/solr.cloud.ForceLeaderTest_5F8F3538EEB1F815-001/control-001/cores/collection1'
   [junit4]   2> 472815 INFO  (coreLoadExecutor-1267-thread-1-processing-n:127.0.0.1:53723_) [n:127.0.0.1:53723_ c:control_collection   x:collection1] o.a.s.c.SolrResourceLoader JNDI not configured for solr (NoInitialContextEx)
   [junit4]   2> 472815 INFO  (coreLoadExecutor-1267-thread-1-processing-n:127.0.0.1:53723_) [n:127.0.0.1:53723_ c:control_collection   x:collection1] o.a.s.c.SolrResourceLoader solr home defaulted to 'solr/' (could not find system property or JNDI)
   [junit4]   2> 472816 INFO  (coreLoadExecutor-1267-thread-1-processing-n:127.0.0.1:53723_) [n:127.0.0.1:53723_ c:control_collection   x:collection1] o.a.s.c.Config loaded config solrconfig.xml with version 0 
   [junit4]   2> 472877 INFO  (coreLoadExecutor-1267-thread-1-processing-n:127.0.0.1:53723_) [n:127.0.0.1:53723_ c:control_collection   x:collection1] o.a.s.c.SolrConfig current version of requestparams : -1
   [junit4]   2> 472880 WARN  (coreLoadExecutor-1267-thread-1-processing-n:127.0.0.1:53723_) [n:127.0.0.1:53723_ c:control_collection   x:collection1] o.a.s.c.Config Beginning with Solr 5.5, <mergePolicy> is deprecated, use <mergePolicyFactory> instead.
   [junit4]   2> 472881 INFO  (coreLoadExecutor-1267-thread-1-processing-n:127.0.0.1:53723_) [n:127.0.0.1:53723_ c:control_collection   x:collection1] o.a.s.c.SolrConfig Using Lucene MatchVersion: 7.0.0
   [junit4]   2> 472916 INFO  (coreLoadExecutor-1267-thread-1-processing-n:127.0.0.1:53723_) [n:127.0.0.1:53723_ c:control_collection   x:collection1] o.a.s.c.SolrConfig Loaded SolrConfig: solrconfig.xml
   [junit4]   2> 473179 INFO  (coreLoadExecutor-1267-thread-1-processing-n:127.0.0.1:53723_) [n:127.0.0.1:53723_ c:control_collection   x:collection1] o.a.s.s.IndexSchema [collection1] Schema name=test
   [junit4]   2> 473452 INFO  (coreLoadExecutor-1267-thread-1-processing-n:127.0.0.1:53723_) [n:127.0.0.1:53723_ c:control_collection   x:collection1] o.a.s.s.OpenExchangeRatesOrgProvider Initialized with rates=open-exchange-rates.json, refreshInterval=1440.
   [junit4]   2> 473474 INFO  (coreLoadExecutor-1267-thread-1-processing-n:127.0.0.1:53723_) [n:127.0.0.1:53723_ c:control_collection   x:collection1] o.a.s.s.IndexSchema default search field in schema is text
   [junit4]   2> 473475 INFO  (coreLoadExecutor-1267-thread-1-processing-n:127.0.0.1:53723_) [n:127.0.0.1:53723_ c:control_collection   x:collection1] o.a.s.s.IndexSchema unique key field: id
   [junit4]   2> 473549 INFO  (coreLoadExecutor-1267-thread-1-processing-n:127.0.0.1:53723_) [n:127.0.0.1:53723_ c:control_collection   x:collection1] o.a.s.s.FileExchangeRateProvider Reloading exchange rates from file currency.xml
   [junit4]   2> 473552 INFO  (coreLoadExecutor-1267-thread-1-processing-n:127.0.0.1:53723_) [n:127.0.0.1:53723_ c:control_collection   x:collection1] o.a.s.s.FileExchangeRateProvider Reloading exchange rates from file currency.xml
   [junit4]   2> 473563 INFO  (coreLoadExecutor-1267-thread-1-processing-n:127.0.0.1:53723_) [n:127.0.0.1:53723_ c:control_collection   x:collection1] o.a.s.s.OpenExchangeRatesOrgProvider Reloading exchange rates from open-exchange-rates.json
   [junit4]   2> 473573 INFO  (coreLoadExecutor-1267-thread-1-processing-n:127.0.0.1:53723_) [n:127.0.0.1:53723_ c:control_collection   x:collection1] o.a.s.s.OpenExchangeRatesOrgProvider Reloading exchange rates from open-exchange-rates.json
   [junit4]   2> 473586 INFO  (coreLoadExecutor-1267-thread-1-processing-n:127.0.0.1:53723_) [n:127.0.0.1:53723_ c:control_collection   x:collection1] o.a.s.c.ConfigSetProperties Did not find ConfigSet properties, assuming default properties: Can't find resource 'configsetprops.json' in classpath or '/configs/conf1', cwd=/x1/jenkins/jenkins-slave/workspace/Lucene-Solr-Tests-master/solr/build/solr-core/test/J2
   [junit4]   2> 473586 INFO  (coreLoadExecutor-1267-thread-1-processing-n:127.0.0.1:53723_) [n:127.0.0.1:53723_ c:control_collection   x:collection1] o.a.s.c.CoreContainer Creating SolrCore 'collection1' using configuration from collection control_collection
   [junit4]   2> 473587 INFO  (coreLoadExecutor-1267-thread-1-processing-n:127.0.0.1:53723_) [n:127.0.0.1:53723_ c:control_collection s:shard1 r:core_node1 x:collection1] o.a.s.c.SolrCore org.apache.solr.core.MockDirectoryFactory
   [junit4]   2> 473587 INFO  (coreLoadExecutor-1267-thread-1-processing-n:127.0.0.1:53723_) [n:127.0.0.1:53723_ c:control_collection s:shard1 r:core_node1 x:collection1] o.a.s.c.SolrCore [[collection1] ] Opening new SolrCore at [/x1/jenkins/jenkins-slave/workspace/Lucene-Solr-Tests-master/solr/build/solr-core/test/J2/temp/solr.cloud.ForceLeaderTest_5F8F3538EEB1F815-001/control-001/cores/collection1], dataDir=[/x1/jenkins/jenkins-slave/workspace/Lucene-Solr-Tests-master/solr/build/solr-core/test/J2/temp/solr.cloud.ForceLeaderTest_5F8F3538EEB1F815-001/control-001/cores/collection1/data/]
   [junit4]   2> 473587 INFO  (coreLoadExecutor-1267-thread-1-processing-n:127.0.0.1:53723_) [n:127.0.0.1:53723_ c:control_collection s:shard1 r:core_node1 x:collection1] o.a.s.c.JmxMonitoredMap JMX monitoring is enabled. Adding Solr mbeans to JMX Server: com.sun.jmx.mbeanserver.JmxMBeanServer@41b387d1
   [junit4]   2> 473587 INFO  (coreLoadExecutor-1267-thread-1-processing-n:127.0.0.1:53723_) [n:127.0.0.1:53723_ c:control_collection s:shard1 r:core_node1 x:collection1] o.a.s.c.CachingDirectoryFactory return new directory for /x1/jenkins/jenkins-slave/workspace/Lucene-Solr-Tests-master/solr/build/solr-core/test/J2/temp/solr.cloud.ForceLeaderTest_5F8F3538EEB1F815-001/control-001/cores/collection1/data/snapshot_metadata
   [junit4]   2> 473588 INFO  (coreLoadExecutor-1267-thread-1-processing-n:127.0.0.1:53723_) [n:127.0.0.1:53723_ c:control_collection s:shard1 r:core_node1 x:collection1] o.a.s.c.s.SolrSnapshotMetaDataManager Loading from snapshot metadata file...
   [junit4]   2> 473588 INFO  (coreLoadExecutor-1267-thread-1-processing-n:127.0.0.1:53723_) [n:127.0.0.1:53723_ c:control_collection s:shard1 r:core_node1 x:collection1] o.a.s.c.CachingDirectoryFactory return new directory for /x1/jenkins/jenkins-slave/workspace/Lucene-Solr-Tests-master/solr/build/solr-core/test/J2/temp/solr.cloud.ForceLeaderTest_5F8F3538EEB1F815-001/control-001/cores/collection1/data
   [junit4]   2> 473588 INFO  (coreLoadExecutor-1267-thread-1-processing-n:127.0.0.1:53723_) [n:127.0.0.1:53723_ c:control_collection s:shard1 r:core_node1 x:collection1] o.a.s.c.SolrCore New index directory detected: old=null new=/x1/jenkins/jenkins-slave/workspace/Lucene-Solr-Tests-master/solr/build/solr-core/test/J2/temp/solr.cloud.ForceLeaderTest_5F8F3538EEB1F815-001/control-001/cores/collection1/data/index/
   [junit4]   2> 473588 WARN  (coreLoadExecutor-1267-thread-1-processing-n:127.0.0.1:53723_) [n:127.0.0.1:53723_ c:control_collection s:shard1 r:core_node1 x:collection1] o.a.s.c.SolrCore [collection1] Solr index directory '/x1/jenkins/jenkins-slave/workspace/Lucene-Solr-Tests-master/solr/build/solr-core/test/J2/temp/solr.cloud.ForceLeaderTest_5F8F3538EEB1F815-001/control-001/cores/collection1/data/index' doesn't exist. Creating new index...
   [junit4]   2> 473588 INFO  (coreLoadExecutor-1267-thread-1-processing-n:127.0.0.1:53723_) [n:127.0.0.1:53723_ c:control_collection s:shard1 r:core_node1 x:collection1] o.a.s.c.CachingDirectoryFactory return new directory for /x1/jenkins/jenkins-slave/workspace/Lucene-Solr-Tests-master/solr/build/solr-core/test/J2/temp/solr.cloud.ForceLeaderTest_5F8F3538EEB1F815-001/control-001/cores/collection1/data/index
   [junit4]   2> 473588 INFO  (coreLoadExecutor-1267-thread-1-processing-n:127.0.0.1:53723_) [n:127.0.0.1:53723_ c:control_collection s:shard1 r:core_node1 x:collection1] o.a.s.u.RandomMergePolicy RandomMergePolicy wrapping class org.apache.lucene.index.LogDocMergePolicy: [LogDocMergePolicy: minMergeSize=1000, mergeFactor=23, maxMergeSize=9223372036854775807, maxMergeSizeForForcedMerge=9223372036854775807, calibrateSizeByDeletes=true, maxMergeDocs=2147483647, maxCFSSegmentSizeMB=8.796093022207999E12, noCFSRatio=0.801977577281104]
   [junit4]   2> 473597 INFO  (coreLoadExecutor-1267-thread-1-processing-n:127.0.0.1:53723_) [n:127.0.0.1:53723_ c:control_collection s:shard1 r:core_node1 x:collection1] o.a.s.c.SolrDeletionPolicy SolrDeletionPolicy.onCommit: commits: num=1
   [junit4]   2> 	commit{dir=MockDirectoryWrapper(RAMDirectory@24b5bef5 lockFactory=org.apache.lucene.store.SingleInstanceLockFactory@372bf9d8),segFN=segments_1,generation=1}
   [junit4]   2> 473597 INFO  (coreLoadExecutor-1267-thread-1-processing-n:127.0.0.1:53723_) [n:127.0.0.1:53723_ c:control_collection s:shard1 r:core_node1 x:collection1] o.a.s.c.SolrDeletionPolicy newest commit generation = 1
   [junit4]   2> 473615 INFO  (coreLoadExecutor-1267-thread-1-processing-n:127.0.0.1:53723_) [n:127.0.0.1:53723_ c:control_collection s:shard1 r:core_node1 x:collection1] o.a.s.u.p.UpdateRequestProcessorChain creating updateRequestProcessorChain "nodistrib"
   [junit4]   2> 473615 INFO  (coreLoadExecutor-1267-thread-1-processing-n:127.0.0.1:53723_) [n:127.0.0.1:53723_ c:control_collection s:shard1 r:core_node1 x:collection1] o.a.s.u.p.UpdateRequestProcessorChain creating updateRequestProcessorChain "dedupe"
   [junit4]   2> 473615 INFO  (coreLoadExecutor-1267-thread-1-processing-n:127.0.0.1:53723_) [n:127.0.0.1:53723_ c:control_collection s:shard1 r:core_node1 x:collection1] o.a.s.u.p.UpdateRequestProcessorChain inserting DistributedUpdateProcessorFactory into updateRequestProcessorChain "dedupe"
   [junit4]   2> 473615 INFO  (coreLoadExecutor-1267-thread-1-processing-n:127.0.0.1:53723_) [n:127.0.0.1:53723_ c:control_collection s:shard1 r:core_node1 x:collection1] o.a.s.u.p.UpdateRequestProcessorChain creating updateRequestProcessorChain "stored_sig"
   [junit4]   2> 473615 INFO  (coreLoadExecutor-1267-thread-1-processing-n:127.0.0.1:53723_) [n:127.0.0.1:53723_ c:control_collection s:shard1 r:core_node1 x:collection1] o.a.s.u.p.UpdateRequestProcessorChain inserting DistributedUpdateProcessorFactory into updateRequestProcessorChain "stored_sig"
   [junit4]   2> 473615 INFO  (coreLoadExecutor-1267-thread-1-processing-n:127.0.0.1:53723_) [n:127.0.0.1:53723_ c:control_collection s:shard1 r:core_node1 x:collection1] o.a.s.u.p.UpdateRequestProcessorChain creating updateRequestProcessorChain "distrib-dup-test-chain-explicit"
   [junit4]   2> 473615 INFO  (coreLoadExecutor-1267-thread-1-processing-n:127.0.0.1:53723_) [n:127.0.0.1:53723_ c:control_collection s:shard1 r:core_node1 x:collection1] o.a.s.u.p.UpdateRequestProcessorChain creating updateRequestProcessorChain "distrib-dup-test-chain-implicit"
   [junit4]   2> 473615 INFO  (coreLoadExecutor-1267-thread-1-processing-n:127.0.0.1:53723_) [n:127.0.0.1:53723_ c:control_collection s:shard1 r:core_node1 x:collection1] o.a.s.u.p.UpdateRequestProcessorChain inserting DistributedUpdateProcessorFactory into updateRequestProcessorChain "distrib-dup-test-chain-implicit"
   [junit4]   2> 473615 INFO  (coreLoadExecutor-1267-thread-1-processing-n:127.0.0.1:53723_) [n:127.0.0.1:53723_ c:control_collection s:shard1 r:core_node1 x:collection1] o.a.s.c.SolrCore no updateRequestProcessorChain defined as default, creating implicit default
   [junit4]   2> 473616 WARN  (coreLoadExecutor-1267-thread-1-processing-n:127.0.0.1:53723_) [n:127.0.0.1:53723_ c:control_collection s:shard1 r:core_node1 x:collection1] o.a.s.c.RequestHandlers INVALID paramSet a in requestHandler {type = requestHandler,name = /dump,class = DumpRequestHandler,args = {defaults={a=A,b=B}}}
   [junit4]   2> 473621 INFO  (coreLoadExecutor-1267-thread-1-processing-n:127.0.0.1:53723_) [n:127.0.0.1:53723_ c:control_collection s:shard1 r:core_node1 x:collection1] o.a.s.h.l.XMLLoader xsltCacheLifetimeSeconds=60
   [junit4]   2> 473622 INFO  (coreLoadExecutor-1267-thread-1-processing-n:127.0.0.1:53723_) [n:127.0.0.1:53723_ c:control_collection s:shard1 r:core_node1 x:collection1] o.a.s.h.l.XMLLoader xsltCacheLifetimeSeconds=60
   [junit4]   2> 473623 INFO  (coreLoadExecutor-1267-thread-1-processing-n:127.0.0.1:53723_) [n:127.0.0.1:53723_ c:control_collection s:shard1 r:core_node1 x:collection1] o.a.s.h.l.XMLLoader xsltCacheLifetimeSeconds=60
   [junit4]   2> 473624 INFO  (coreLoadExecutor-1267-thread-1-processing-n:127.0.0.1:53723_) [n:127.0.0.1:53723_ c:control_collection s:shard1 r:core_node1 x:collection1] o.a.s.h.l.XMLLoader xsltCacheLifetimeSeconds=60
   [junit4]   2> 473627 INFO  (coreLoadExecutor-1267-thread-1-processing-n:127.0.0.1:53723_) [n:127.0.0.1:53723_ c:control_collection s:shard1 r:core_node1 x:collection1] o.a.s.c.RequestHandlers Registered paths: /admin/mbeans,standard,/update/json/docs,/admin/luke,/export,/get,/admin/properties,/update/json,/admin/threads,/dump,/update/csv,/sql,/graph,/admin/segments,/admin/system,/replication,/config,/stream,/schema,/admin/plugins,/admin/logging,/admin/ping,/update,/admin/file,/terms
   [junit4]   2> 473627 INFO  (coreLoadExecutor-1267-thread-1-processing-n:127.0.0.1:53723_) [n:127.0.0.1:53723_ c:control_collection s:shard1 r:core_node1 x:collection1] o.a.s.c.SolrCore Using default statsCache cache: org.apache.solr.search.stats.LocalStatsCache
   [junit4]   2> 473628 INFO  (OldIndexDirectoryCleanupThreadForCore-collection1) [n:127.0.0.1:53723_ c:control_collection s:shard1 r:core_node1 x:collection1] o.a.s.c.SolrCore Looking for old index directories to cleanup for core collection1 in /x1/jenkins/jenkins-slave/workspace/Lucene-Solr-Tests-master/solr/build/solr-core/test/J2/temp/solr.cloud.ForceLeaderTest_5F8F3538EEB1F815-001/control-001/cores/collection1/data/
   [junit4]   2> 473628 WARN  (OldIndexDirectoryCleanupThreadForCore-collection1) [n:127.0.0.1:53723_ c:control_collection s:shard1 r:core_node1 x:collection1] o.a.s.c.DirectoryFactory /x1/jenkins/jenkins-slave/workspace/Lucene-Solr-Tests-master/solr/build/solr-core/test/J2/temp/solr.cloud.ForceLeaderTest_5F8F3538EEB1F815-001/control-001/cores/collection1/data/ does not point to a valid data directory; skipping clean-up of old index directories.
   [junit4]   2> 473649 INFO  (coreLoadExecutor-1267-thread-1-processing-n:127.0.0.1:53723_) [n:127.0.0.1:53723_ c:control_collection s:shard1 r:core_node1 x:collection1] o.a.s.u.UpdateHandler Using UpdateLog implementation: org.apache.solr.update.UpdateLog
   [junit4]   2> 473653 INFO  (coreLoadExecutor-1267-thread-1-processing-n:127.0.0.1:53723_) [n:127.0.0.1:53723_ c:control_collection s:shard1 r:core_node1 x:collection1] o.a.s.u.UpdateLog Initializing UpdateLog: dataDir= defaultSyncLevel=FLUSH numRecordsToKeep=100 maxNumLogsToKeep=10 numVersionBuckets=65536
   [junit4]   2> 473654 INFO  (coreLoadExecutor-1267-thread-1-processing-n:127.0.0.1:53723_) [n:127.0.0.1:53723_ c:control_collection s:shard1 r:core_node1 x:collection1] o.a.s.u.CommitTracker Hard AutoCommit: disabled
   [junit4]   2> 473654 INFO  (coreLoadExecutor-1267-thread-1-processing-n:127.0.0.1:53723_) [n:127.0.0.1:53723_ c:control_collection s:shard1 r:core_node1 x:collection1] o.a.s.u.CommitTracker Soft AutoCommit: disabled
   [junit4]   2> 473655 INFO  (coreLoadExecutor-1267-thread-1-processing-n:127.0.0.1:53723_) [n:127.0.0.1:53723_ c:control_collection s:shard1 r:core_node1 x:collection1] o.a.s.u.RandomMergePolicy RandomMergePolicy wrapping class org.apache.lucene.index.LogByteSizeMergePolicy: [LogByteSizeMergePolicy: minMergeSize=1677721, mergeFactor=25, maxMergeSize=2147483648, maxMergeSizeForForcedMerge=9223372036854775807, calibrateSizeByDeletes=false, maxMergeDocs=2147483647, maxCFSSegmentSizeMB=8.796093022207999E12, noCFSRatio=0.28248416632359596]
   [junit4]   2> 473657 INFO  (coreLoadExecutor-1267-thread-1-processing-n:127.0.0.1:53723_) [n:127.0.0.1:53723_ c:control_collection s:shard1 r:core_node1 x:collection1] o.a.s.c.SolrDeletionPolicy SolrDeletionPolicy.onInit: commits: num=1
   [junit4]   2> 	commit{dir=MockDirectoryWrapper(RAMDirectory@24b5bef5 lockFactory=org.apache.lucene.store.SingleInstanceLockFactory@372bf9d8),segFN=segments_1,generation=1}
   [junit4]   2> 473657 INFO  (coreLoadExecutor-1267-thread-1-processing-n:127.0.0.1:53723_) [n:127.0.0.1:53723_ c:control_collection s:shard1 r:core_node1 x:collection1] o.a.s.c.SolrDeletionPolicy newest commit generation = 1
   [junit4]   2> 473657 INFO  (coreLoadExecutor-1267-thread-1-processing-n:127.0.0.1:53723_) [n:127.0.0.1:53723_ c:control_collection s:shard1 r:core_node1 x:collection1] o.a.s.s.SolrIndexSearcher Opening [Searcher@f4c3383[collection1] main]
   [junit4]   2> 473658 INFO  (coreLoadExecutor-1267-thread-1-processing-n:127.0.0.1:53723_) [n:127.0.0.1:53723_ c:control_collection s:shard1 r:core_node1 x:collection1] o.a.s.r.ManagedResourceStorage Setting up ZooKeeper-based storage for the RestManager with znodeBase: /configs/conf1
   [junit4]   2> 473659 INFO  (coreLoadExecutor-1267-thread-1-processing-n:127.0.0.1:53723_) [n:127.0.0.1:53723_ c:control_collection s:shard1 r:core_node1 x:collection1] o.a.s.r.ManagedResourceStorage Configured ZooKeeperStorageIO with znodeBase: /configs/conf1
   [junit4]   2> 473659 INFO  (coreLoadExecutor-1267-thread-1-processing-n:127.0.0.1:53723_) [n:127.0.0.1:53723_ c:control_collection s:shard1 r:core_node1 x:collection1] o.a.s.r.RestManager Initializing RestManager with initArgs: {}
   [junit4]   2> 473659 INFO  (coreLoadExecutor-1267-thread-1-processing-n:127.0.0.1:53723_) [n:127.0.0.1:53723_ c:control_collection s:shard1 r:core_node1 x:collection1] o.a.s.r.ManagedResourceStorage Reading _rest_managed.json using ZooKeeperStorageIO:path=/configs/conf1
   [junit4]   2> 473659 INFO  (coreLoadExecutor-1267-thread-1-processing-n:127.0.0.1:53723_) [n:127.0.0.1:53723_ c:control_collection s:shard1 r:core_node1 x:collection1] o.a.s.r.ManagedResourceStorage No data found for znode /configs/conf1/_rest_managed.json
   [junit4]   2> 473659 INFO  (coreLoadExecutor-1267-thread-1-processing-n:127.0.0.1:53723_) [n:127.0.0.1:53723_ c:control_collection s:shard1 r:core_node1 x:collection1] o.a.s.r.ManagedResourceStorage Loaded null at path _rest_managed.json using ZooKeeperStorageIO:path=/configs/conf1
   [junit4]   2> 473659 INFO  (coreLoadExecutor-1267-thread-1-processing-n:127.0.0.1:53723_) [n:127.0.0.1:53723_ c:control_collection s:shard1 r:core_node1 x:collection1] o.a.s.r.RestManager Initializing 0 registered ManagedResources
   [junit4]   2> 473659 INFO  (coreLoadExecutor-1267-thread-1-processing-n:127.0.0.1:53723_) [n:127.0.0.1:53723_ c:control_collection s:shard1 r:core_node1 x:collection1] o.a.s.h.ReplicationHandler Commits will be reserved for  10000
   [junit4]   2> 473660 INFO  (coreLoadExecutor-1267-thread-1-processing-n:127.0.0.1:53723_) [n:127.0.0.1:53723_ c:control_collection s:shard1 r:core_node1 x:collection1] o.a.s.u.UpdateLog Looking up max value of version field to seed version buckets
   [junit4]   2> 473660 INFO  (coreLoadExecutor-1267-thread-1-processing-n:127.0.0.1:53723_) [n:127.0.0.1:53723_ c:control_collection s:shard1 r:core_node1 x:collection1] o.a.s.u.VersionInfo Refreshing highest value of _version_ for 65536 version buckets from index
   [junit4]   2> 473660 INFO  (coreLoadExecutor-1267-thread-1-processing-n:127.0.0.1:53723_) [n:127.0.0.1:53723_ c:control_collection s:shard1 r:core_node1 x:collection1] o.a.s.u.VersionInfo No terms found for _version_, cannot seed version bucket highest value from index
   [junit4]   2> 473660 INFO  (coreLoadExecutor-1267-thread-1-processing-n:127.0.0.1:53723_) [n:127.0.0.1:53723_ c:control_collection s:shard1 r:core_node1 x:collection1] o.a.s.u.UpdateLog Could not find max version in index or recent updates, using new clock 1545663802047987712
   [junit4]   2> 473662 INFO  (coreLoadExecutor-1267-thread-1-processing-n:127.0.0.1:53723_) [n:127.0.0.1:53723_ c:control_collection s:shard1 r:core_node1 x:collection1] o.a.s.u.UpdateLog Took 1.0ms to seed version buckets with highest version 1545663802047987712
   [junit4]   2> 473662 INFO  (coreLoadExecutor-1267-thread-1-processing-n:127.0.0.1:53723_) [n:127.0.0.1:53723_ c:control_collection s:shard1 r:core_node1 x:collection1] o.a.s.c.ZkController watch zkdir /configs/conf1
   [junit4]   2> 473663 INFO  (searcherExecutor-1268-thread-1-processing-n:127.0.0.1:53723_ x:collection1 s:shard1 c:control_collection r:core_node1) [n:127.0.0.1:53723_ c:control_collection s:shard1 r:core_node1 x:collection1] o.a.s.c.SolrCore [collection1] Registered new searcher Searcher@f4c3383[collection1] main{ExitableDirectoryReader(UninvertingDirectoryReader())}
   [junit4]   2> 473664 INFO  (coreLoadExecutor-1267-thread-1-processing-n:127.0.0.1:53723_) [n:127.0.0.1:53723_ c:control_collection s:shard1 r:core_node1 x:collection1] o.a.s.c.CoreContainer registering core: collection1
   [junit4]   2> 473680 INFO  (coreZkRegister-1260-thread-1-processing-n:127.0.0.1:53723_ x:collection1 s:shard1 c:control_collection r:core_node1) [n:127.0.0.1:53723_ c:control_collection s:shard1 r:core_node1 x:collection1] o.a.s.c.ZkController Register replica - core:collection1 address:http://127.0.0.1:53723 collection:control_collection shard:shard1
   [junit4]   2> 473681 INFO  (coreZkRegister-1260-thread-1-processing-n:127.0.0.1:53723_ x:collection1 s:shard1 c:control_collection r:core_node1) [n:127.0.0.1:53723_ c:control_collection s:shard1 r:core_node1 x:collection1] o.a.s.c.c.SolrZkClient makePath: /collections/control_collection/leader_elect/shard1/election
   [junit4]   2> 473684 INFO  (coreZkRegister-1260-thread-1-processing-n:127.0.0.1:53723_ x:collection1 s:shard1 c:control_collection r:core_node1) [n:127.0.0.1:53723_ c:control_collection s:shard1 r:core_node1 x:collection1] o.a.s.c.LeaderElector Joined leadership election with path: /collections/control_collection/leader_elect/shard1/election/96603987479166980-core_node1-n_0000000000
   [junit4]   2> 473684 INFO  (coreZkRegister-1260-thread-1-processing-n:127.0.0.1:53723_ x:collection1 s:shard1 c:control_collection r:core_node1) [n:127.0.0.1:53723_ c:control_collection s:shard1 r:core_node1 x:collection1] o.a.s.c.ShardLeaderElectionContext Running the leader process for shard=shard1 and weAreReplacement=false and leaderVoteWait=10000
   [junit4]   2> 473686 INFO  (coreZkRegister-1260-thread-1-processing-n:127.0.0.1:53723_ x:collection1 s:shard1 c:control_collection r:core_node1) [n:127.0.0.1:53723_ c:control_collection s:shard1 r:core_node1 x:collection1] o.a.s.c.ShardLeaderElectionContext Enough replicas found to continue.
   [junit4]   2> 473686 INFO  (coreZkRegister-1260-thread-1-processing-n:127.0.0.1:53723_ x:collection1 s:shard1 c:control_collection r:core_node1) [n:127.0.0.1:53723_ c:control_collection s:shard1 r:core_node1 x:collection1] o.a.s.c.ShardLeaderElectionContext I may be the new leader - try and sync
   [junit4]   2> 473686 INFO  (coreZkRegister-1260-thread-1-processing-n:127.0.0.1:53723_ x:collection1 s:shard1 c:control_collection r:core_node1) [n:127.0.0.1:53723_ c:control_collection s:shard1 r:core_node1 x:collection1] o.a.s.c.SyncStrategy Sync replicas to http://127.0.0.1:53723/collection1/
   [junit4]   2> 473686 INFO  (coreZkRegister-1260-thread-1-processing-n:127.0.0.1:53723_ x:collection1 s:shard1 c:control_collection r:core_node1) [n:127.0.0.1:53723_ c:control_collection s:shard1 r:core_node1 x:collection1] o.a.s.c.SyncStrategy Sync Success - now sync replicas to me
   [junit4]   2> 473686 INFO  (coreZkRegister-1260-thread-1-processing-n:127.0.0.1:53723_ x:collection1 s:shard1 c:control_collection r:core_node1) [n:127.0.0.1:53723_ c:control_collection s:shard1 r:core_node1 x:collection1] o.a.s.c.SyncStrategy http://127.0.0.1:53723/collection1/ has no replicas
   [junit4]   2> 473686 INFO  (OverseerStateUpdate-96603987479166980-127.0.0.1:53723_-n_0000000000) [n:127.0.0.1:53723_    ] o.a.s.c.Overseer processMessage: queueSize: 1, message = {
   [junit4]   2>   "operation":"leader",
   [junit4]   2>   "shard":"shard1",
   [junit4]   2>   "collection":"control_collection"} current state version: 1
   [junit4]   2> 473687 INFO  (coreZkRegister-1260-thread-1-processing-n:127.0.0.1:53723_ x:collection1 s:shard1 c:control_collection r:core_node1) [n:127.0.0.1:53723_ c:control_collection s:shard1 r:core_node1 x:collection1] o.a.s.c.c.SolrZkClient makePath: /collections/control_collection/leaders/shard1
   [junit4]   2> 473690 INFO  (coreZkRegister-1260-thread-1-processing-n:127.0.0.1:53723_ x:collection1 s:shard1 c:control_collection r:core_node1) [n:127.0.0.1:53723_ c:control_collection s:shard1 r:core_node1 x:collection1] o.a.s.c.ShardLeaderElectionContextBase Creating leader registration node /collections/control_collection/leaders/shard1/leader after winning as /collections/control_collection/leader_elect/shard1/election/96603987479166980-core_node1-n_0000000000
   [junit4]   2> 473698 INFO  (coreZkRegister-1260-thread-1-processing-n:127.0.0.1:53723_ x:collection1 s:shard1 c:control_collection r:core_node1) [n:127.0.0.1:53723_ c:control_collection s:shard1 r:core_node1 x:collection1] o.a.s.c.ShardLeaderElectionContext I am the new leader: http://127.0.0.1:53723/collection1/ shard1
   [junit4]   2> 473702 INFO  (OverseerStateUpdate-96603987479166980-127.0.0.1:53723_-n_0000000000) [n:127.0.0.1:53723_    ] o.a.s.c.Overseer processMessage: queueSize: 1, message = {
   [junit4]   2>   "operation":"leader",
   [junit4]   2>   "shard":"shard1",
   [junit4]   2>   "collection":"control_collection",
   [junit4]   2>   "base_url":"http://127.0.0.1:53723",
   [junit4]   2>   "core":"collection1",
   [junit4]   2>   "state":"active"} current state version: 1
   [junit4]   2> 473805 INFO  (zkCallback-463-thread-4-processing-n:127.0.0.1:53723_) [n:127.0.0.1:53723_    ] o.a.s.c.c.ZkStateReader A cluster state change: [WatchedEvent state:SyncConnected type:NodeDataChanged path:/clusterstate.json], has occurred - updating... (live nodes size: [1])
   [junit4]   2> 473849 INFO  (coreZkRegister-1260-thread-1-processing-n:127.0.0.1:53723_ x:collection1 s:shard1 c:control_collection r:core_node1) [n:127.0.0.1:53723_ c:control_collection s:shard1 r:core_node1 x:collection1] o.a.s.c.ZkController We are http://127.0.0.1:53723/collection1/ and leader is http://127.0.0.1:53723/collection1/
   [junit4]   2> 473849 INFO  (coreZkRegister-1260-thread-1-processing-n:127.0.0.1:53723_ x:collection1 s:shard1 c:control_collection r:core_node1) [n:127.0.0.1:53723_ c:control_collection s:shard1 r:core_node1 x:collection1] o.a.s.c.ZkController No LogReplay needed for core=collection1 baseURL=http://127.0.0.1:53723
   [junit4]   2> 473849 INFO  (coreZkRegister-1260-thread-1-processing-n:127.0.0.1:53723_ x:collection1 s:shard1 c:control_collection r:core_node1) [n:127.0.0.1:53723_ c:control_collection s:shard1 r:core_node1 x:collection1] o.a.s.c.ZkController I am the leader, no recovery necessary
   [junit4]   2> 473849 INFO  (coreZkRegister-1260-thread-1-processing-n:127.0.0.1:53723_ x:collection1 s:shard1 c:control_collection r:core_node1) [n:127.0.0.1:53723_ c:control_collection s:shard1 r:core_node1 x:collection1] o.a.s.c.ZkController publishing state=active
   [junit4]   2> 473849 INFO  (coreZkRegister-1260-thread-1-processing-n:127.0.0.1:53723_ x:collection1 s:shard1 c:control_collection r:core_node1) [n:127.0.0.1:53723_ c:control_collection s:shard1 r:core_node1 x:collection1] o.a.s.c.ZkController numShards not found on descriptor - reading it from system property
   [junit4]   2> 473850 INFO  (coreZkRegister-1260-thread-1-processing-n:127.0.0.1:53723_ x:collection1 s:shard1 c:control_collection r:core_node1) [n:127.0.0.1:53723_ c:control_collection s:shard1 r:core_node1 x:collection1] o.a.s.c.c.ZkStateReader Checking legacy cluster state for collection control_collection
   [junit4]   2> 473851 INFO  (OverseerStateUpdate-96603987479166980-127.0.0.1:53723_-n_0000000000) [n:127.0.0.1:53723_    ] o.a.s.c.Overseer processMessage: queueSize: 1, message = {
   [junit4]   2>   "core":"collection1",
   [junit4]   2>   "core_node_name":"core_node1",
   [junit4]   2>   "roles":null,
   [junit4]   2>   "base_url":"http://127.0.0.1:53723",
   [junit4]   2>   "node_name":"127.0.0.1:53723_",
   [junit4]   2>   "numShards":"1",
   [junit4]   2>   "state":"active",
   [junit4]   2>   "shard":"shard1",
   [junit4]   2>   "collection":"control_collection",
   [junit4]   2>   "operation":"state"} current state version: 2
   [junit4]   2> 473851 INFO  (OverseerStateUpdate-96603987479166980-127.0.0.1:53723_-n_0000000000) [n:127.0.0.1:53723_    ] o.a.s.c.o.ReplicaMutator Update state numShards=1 message={
   [junit4]   2>   "core":"collection1",
   [junit4]   2>   "core_node_name":"core_node1",
   [junit4]   2>   "roles":null,
   [junit4]   2>   "base_url":"http://127.0.0.1:53723",
   [junit4]   2>   "node_name":"127.0.0.1:53723_",
   [junit4]   2>   "numShards":"1",
   [junit4]   2>   "state":"active",
   [junit4]   2>   "shard":"shard1",
   [junit4]   2>   "collection":"control_collection",
   [junit4]   2>   "operation":"state"}
   [junit4]   2> 473873 INFO  (TEST-ForceLeaderTest.testReplicasInLIRNoLeader-seed#[5F8F3538EEB1F815]) [    ] o.a.s.c.c.SolrZkClient Using default ZkCredentialsProvider
   [junit4]   2> 473885 INFO  (TEST-ForceLeaderTest.testReplicasInLIRNoLeader-seed#[5F8F3538EEB1F815]) [    ] o.a.s.c.c.ConnectionManager Waiting for client to connect to ZooKeeper
   [junit4]   2> 473897 INFO  (zkCallback-467-thread-1) [    ] o.a.s.c.c.ConnectionManager Watcher org.apache.solr.common.cloud.ConnectionManager@34c23eec name:ZooKeeperConnection Watcher:127.0.0.1:57327/solr got event WatchedEvent state:SyncConnected type:None path:null path:null type:None
   [junit4]   2> 473897 INFO  (TEST-ForceLeaderTest.testReplicasInLIRNoLeader-seed#[5F8F3538EEB1F815]) [    ] o.a.s.c.c.ConnectionManager Client is connected to ZooKeeper
   [junit4]   2> 473897 INFO  (TEST-ForceLeaderTest.testReplicasInLIRNoLeader-seed#[5F8F3538EEB1F815]) [    ] o.a.s.c.c.SolrZkClient Using default ZkACLProvider
   [junit4]   2> 473897 INFO  (TEST-ForceLeaderTest.testReplicasInLIRNoLeader-seed#[5F8F3538EEB1F815]) [    ] o.a.s.c.c.ZkStateReader Updating cluster state from ZooKeeper... 
   [junit4]   2> 473898 INFO  (TEST-ForceLeaderTest.testReplicasInLIRNoLeader-seed#[5F8F3538EEB1F815]) [    ] o.a.s.c.c.ZkStateReader Loaded empty cluster properties
   [junit4]   2> 473899 INFO  (TEST-ForceLeaderTest.testReplicasInLIRNoLeader-seed#[5F8F3538EEB1F815]) [    ] o.a.s.c.c.ZkStateReader Updated live nodes from ZooKeeper... (0) -> (1)
   [junit4]   2> 473905 INFO  (TEST-ForceLeaderTest.testReplicasInLIRNoLeader-seed#[5F8F3538EEB1F815]) [    ] o.a.s.c.ChaosMonkey monkey: init - expire sessions:false cause connection loss:false
   [junit4]   2> 473905 INFO  (TEST-ForceLeaderTest.testReplicasInLIRNoLeader-seed#[5F8F3538EEB1F815]) [    ] o.a.s.c.AbstractFullDistribZkTestBase Creating collection1 with stateFormat=2
   [junit4]   2> 473906 INFO  (TEST-ForceLeaderTest.testReplicasInLIRNoLeader-seed#[5F8F3538EEB1F815]) [    ] o.a.s.c.c.SolrZkClient Using default ZkCredentialsProvider
   [junit4]   2> 473908 INFO  (TEST-ForceLeaderTest.testReplicasInLIRNoLeader-seed#[5F8F3538EEB1F815]) [    ] o.a.s.c.c.ConnectionManager Waiting for client to connect to ZooKeeper
   [junit4]   2> 473924 INFO  (zkCallback-468-thread-1) [    ] o.a.s.c.c.ConnectionManager Watcher org.apache.solr.common.cloud.ConnectionManager@50ec7742 name:ZooKeeperConnection Watcher:127.0.0.1:57327/solr got event WatchedEvent state:SyncConnected type:None path:null path:null type:None
   [junit4]   2> 473924 INFO  (TEST-ForceLeaderTest.testReplicasInLIRNoLeader-seed#[5F8F3538EEB1F815]) [    ] o.a.s.c.c.ConnectionManager Client is connected to ZooKeeper
   [junit4]   2> 473924 INFO  (TEST-ForceLeaderTest.testReplicasInLIRNoLeader-seed#[5F8F3538EEB1F815]) [    ] o.a.s.c.c.SolrZkClient Using default ZkACLProvider
   [junit4]   2> 474281 INFO  (OverseerStateUpdate-96603987479166980-127.0.0.1:53723_-n_0000000000) [n:127.0.0.1:53723_    ] o.a.s.c.Overseer processMessage: queueSize: 1, message = {
   [junit4]   2>   "operation":"create",
   [junit4]   2>   "name":"collection1",
   [junit4]   2>   "numShards":"2",
   [junit4]   2>   "stateFormat":"2"} current state version: 2
   [junit4]   2> 474281 INFO  (OverseerStateUpdate-96603987479166980-127.0.0.1:53723_-n_0000000000) [n:127.0.0.1:53723_    ] o.a.s.c.o.ClusterStateMutator building a new cName: collection1
   [junit4]   2> 474285 INFO  (zkCallback-467-thread-1) [    ] o.a.s.c.c.ZkStateReader A cluster state change: [WatchedEvent state:SyncConnected type:NodeDataChanged path:/clusterstate.json], has occurred - updating... (live nodes size: [1])
   [junit4]   2> 474285 INFO  (zkCallback-463-thread-2-processing-n:127.0.0.1:53723_) [n:127.0.0.1:53723_    ] o.a.s.c.c.ZkStateReader A cluster state change: [WatchedEvent state:SyncConnected type:NodeDataChanged path:/clusterstate.json], has occurred - updating... (live nodes size: [1])
   [junit4]   2> 474394 INFO  (TEST-ForceLeaderTest.testReplicasInLIRNoLeader-seed#[5F8F3538EEB1F815]) [    ] o.a.s.SolrTestCaseJ4 Writing core.properties file to /x1/jenkins/jenkins-slave/workspace/Lucene-Solr-Tests-master/solr/build/solr-core/test/J2/temp/solr.cloud.ForceLeaderTest_5F8F3538EEB1F815-001/shard-1-001/cores/collection1
   [junit4]   2> 474395 INFO  (TEST-ForceLeaderTest.testReplicasInLIRNoLeader-seed#[5F8F3538EEB1F815]) [    ] o.a.s.c.AbstractFullDistribZkTestBase create jetty 1 in directory /x1/jenkins/jenkins-slave/workspace/Lucene-Solr-Tests-master/solr/build/solr-core/test/J2/temp/solr.cloud.ForceLeaderTest_5F8F3538EEB1F815-001/shard-1-001
   [junit4]   2> 474396 INFO  (TEST-ForceLeaderTest.testReplicasInLIRNoLeader-seed#[5F8F3538EEB1F815]) [    ] o.e.j.s.Server jetty-9.3.8.v20160314
   [junit4]   2> 474397 INFO  (OverseerStateUpdate-96603987479166980-127.0.0.1:53723_-n_0000000000) [n:127.0.0.1:53723_    ] o.a.s.c.o.ZkStateWriter going to create_collection /collections/collection1/state.json
   [junit4]   2> 474405 INFO  (TEST-ForceLeaderTest.testReplicasInLIRNoLeader-seed#[5F8F3538EEB1F815]) [    ] o.e.j.s.h.ContextHandler Started o.e.j.s.ServletContextHandler@55521f52{/,null,AVAILABLE}
   [junit4]   2> 474406 INFO  (TEST-ForceLeaderTest.testReplicasInLIRNoLeader-seed#[5F8F3538EEB1F815]) [    ] o.e.j.s.ServerConnector Started ServerConnector@29b11c1e{HTTP/1.1,[http/1.1]}{127.0.0.1:51930}
   [junit4]   2> 474406 INFO  (TEST-ForceLeaderTest.testReplicasInLIRNoLeader-seed#[5F8F3538EEB1F815]) [    ] o.e.j.s.Server Started @481236ms
   [junit4]   2> 474406 INFO  (TEST-ForceLeaderTest.testReplicasInLIRNoLeader-seed#[5F8F3538EEB1F815]) [    ] o.a.s.c.s.e.JettySolrRunner Jetty properties: {solr.data.dir=/x1/jenkins/jenkins-slave/workspace/Lucene-Solr-Tests-master/solr/build/solr-core/test/J2/temp/solr.cloud.ForceLeaderTest_5F8F3538EEB1F815-001/tempDir-001/jetty1, solrconfig=solrconfig.xml, hostContext=/, hostPort=35747, coreRootDirectory=/x1/jenkins/jenkins-slave/workspace/Lucene-Solr-Tests-master/solr/build/solr-core/test/J2/temp/solr.cloud.ForceLeaderTest_5F8F3538EEB1F815-001/shard-1-001/cores}
   [junit4]   2> 474406 INFO  (TEST-ForceLeaderTest.testReplicasInLIRNoLeader-seed#[5F8F3538EEB1F815]) [    ] o.a.s.s.SolrDispatchFilter SolrDispatchFilter.init(): sun.misc.Launcher$AppClassLoader@73d16e93
   [junit4]   2> 474406 INFO  (TEST-ForceLeaderTest.testReplicasInLIRNoLeader-seed#[5F8F3538EEB1F815]) [    ] o.a.s.c.SolrResourceLoader new SolrResourceLoader for directory: '/x1/jenkins/jenkins-slave/workspace/Lucene-Solr-Tests-master/solr/build/solr-core/test/J2/temp/solr.cloud.ForceLeaderTest_5F8F3538EEB1F815-001/shard-1-001'
   [junit4]   2> 474406 INFO  (TEST-ForceLeaderTest.testReplicasInLIRNoLeader-seed#[5F8F3538EEB1F815]) [    ] o.a.s.c.SolrResourceLoader JNDI not configured for solr (NoInitialContextEx)
   [junit4]   2> 474406 INFO  (TEST-ForceLeaderTest.testReplicasInLIRNoLeader-seed#[5F8F3538EEB1F815]) [    ] o.a.s.c.SolrResourceLoader solr home defaulted to 'solr/' (could not find system property or JNDI)
   [junit4]   2> 474407 INFO  (TEST-ForceLeaderTest.testReplicasInLIRNoLeader-seed#[5F8F3538EEB1F815]) [    ] o.a.s.c.c.SolrZkClient Using default ZkCredentialsProvider
   [junit4]   2> 474417 INFO  (TEST-ForceLeaderTest.testReplicasInLIRNoLeader-seed#[5F8F3538EEB1F815]) [    ] o.a.s.c.c.ConnectionManager Waiting for client to connect to ZooKeeper
   [junit4]   2> 474436 INFO  (zkCallback-469-thread-1) [    ] o.a.s.c.c.ConnectionManager Watcher org.apache.solr.common.cloud.ConnectionManager@61b2053d name:ZooKeeperConnection Watcher:127.0.0.1:57327/solr got event WatchedEvent state:SyncConnected type:None path:null path:null type:None
   [junit4]   2> 474436 INFO  (TEST-ForceLeaderTest.testReplicasInLIRNoLeader-seed#[5F8F3538EEB1F815]) [    ] o.a.s.c.c.ConnectionManager Client is connected to ZooKeeper
   [junit4]   2> 474437 INFO  (TEST-ForceLeaderTest.testReplicasInLIRNoLeader-seed#[5F8F3538EEB1F815]) [    ] o.a.s.c.c.SolrZkClient Using default ZkACLProvider
   [junit4]   2> 474475 INFO  (TEST-ForceLeaderTest.testReplicasInLIRNoLeader-seed#[5F8F3538EEB1F815]) [    ] o.a.s.s.SolrDispatchFilter Loading solr.xml from SolrHome (not found in ZooKeeper)
   [junit4]   2> 474475 INFO  (TEST-ForceLeaderTest.testReplicasInLIRNoLeader-seed#[5F8F3538EEB1F815]) [    ] o.a.s.c.SolrXmlConfig Loading container configuration from /x1/jenkins/jenkins-slave/workspace/Lucene-Solr-Tests-master/solr/build/solr-core/test/J2/temp/solr.cloud.ForceLeaderTest_5F8F3538EEB1F815-001/shard-1-001/solr.xml
   [junit4]   2> 474604 INFO  (TEST-ForceLeaderTest.testReplicasInLIRNoLeader-seed#[5F8F3538EEB1F815]) [    ] o.a.s.c.CorePropertiesLocator Config-defined core root directory: /x1/jenkins/jenkins-slave/workspace/Lucene-Solr-Tests-master/solr/build/solr-core/test/J2/temp/solr.cloud.ForceLeaderTest_5F8F3538EEB1F815-001/shard-1-001/cores
   [junit4]   2> 474605 INFO  (TEST-ForceLeaderTest.testReplicasInLIRNoLeader-seed#[5F8F3538EEB1F815]) [    ] o.a.s.c.CoreContainer New CoreContainer 1301848347
   [junit4]   2> 474605 INFO  (TEST-ForceLeaderTest.testReplicasInLIRNoLeader-seed#[5F8F3538EEB1F815]) [    ] o.a.s.c.CoreContainer Loading cores into CoreContainer [instanceDir=/x1/jenkins/jenkins-slave/workspace/Lucene-Solr-Tests-master/solr/build/solr-core/test/J2/temp/solr.cloud.ForceLeaderTest_5F8F3538EEB1F815-001/shard-1-001]
   [junit4]   2> 474605 WARN  (TEST-ForceLeaderTest.testReplicasInLIRNoLeader-seed#[5F8F3538EEB1F815]) [    ] o.a.s.c.CoreContainer Couldn't add files from /x1/jenkins/jenkins-slave/workspace/Lucene-Solr-Tests-master/solr/build/solr-core/test/J2/temp/solr.cloud.ForceLeaderTest_5F8F3538EEB1F815-001/shard-1-001/lib to classpath: /x1/jenkins/jenkins-slave/workspace/Lucene-Solr-Tests-master/solr/build/solr-core/test/J2/temp/solr.cloud.ForceLeaderTest_5F8F3538EEB1F815-001/shard-1-001/lib
   [junit4]   2> 474605 INFO  (TEST-ForceLeaderTest.testReplicasInLIRNoLeader-seed#[5F8F3538EEB1F815]) [    ] o.a.s.h.c.HttpShardHandlerFactory created with socketTimeout : 90000,urlScheme : ,connTimeout : 15000,maxConnectionsPerHost : 20,maxConnections : 10000,corePoolSize : 0,maximumPoolSize : 2147483647,maxThreadIdleTime : 5,sizeOfQueue : -1,fairnessPolicy : false,
   [junit4]   2> 474639 INFO  (TEST-ForceLeaderTest.testReplicasInLIRNoLeader-seed#[5F8F3538EEB1F815]) [    ] o.a.s.u.UpdateShardHandler Created UpdateShardHandler HTTP client with params: socketTimeout=340000&connTimeout=45000&maxConnections=100000&maxConnectionsPerHost=100000
   [junit4]   2> 474639 INFO  (TEST-ForceLeaderTest.testReplicasInLIRNoLeader-seed#[5F8F3538EEB1F815]) [    ] o.a.s.l.LogWatcher SLF4J impl is org.slf4j.impl.Log4jLoggerFactory
   [junit4]   2> 474639 INFO  (TEST-ForceLeaderTest.testReplicasInLIRNoLeader-seed#[5F8F3538EEB1F815]) [    ] o.a.s.l.LogWatcher Registering Log Listener [Log4j (org.slf4j.impl.Log4jLoggerFactory)]
   [junit4]   2> 474639 INFO  (TEST-ForceLeaderTest.testReplicasInLIRNoLeader-seed#[5F8F3538EEB1F815]) [    ] o.a.s.c.ZkContainer Zookeeper client=127.0.0.1:57327/solr
   [junit4]   2> 474639 INFO  (TEST-ForceLeaderTest.testReplicasInLIRNoLeader-seed#[5F8F3538EEB1F815]) [    ] o.a.s.c.ZkController zkHost includes chroot
   [junit4]   2> 474639 INFO  (TEST-ForceLeaderTest.testReplicasInLIRNoLeader-seed#[5F8F3538EEB1F815]) [    ] o.a.s.c.c.SolrZkClient Using default ZkCredentialsProvider
   [junit4]   2> 474685 INFO  (TEST-ForceLeaderTest.testReplicasInLIRNoLeader-seed#[5F8F3538EEB1F815]) [    ] o.a.s.c.c.ConnectionManager Waiting for client to connect to ZooKeeper
   [junit4]   2> 474697 INFO  (zkCallback-472-thread-1) [    ] o.a.s.c.c.ConnectionManager Watcher org.apache.solr.common.cloud.ConnectionManager@a681627 name:ZooKeeperConnection Watcher:127.0.0.1:57327 got event WatchedEvent state:SyncConnected type:None path:null path:null type:None
   [junit4]   2> 474705 INFO  (TEST-ForceLeaderTest.testReplicasInLIRNoLeader-seed#[5F8F3538EEB1F815]) [    ] o.a.s.c.c.ConnectionManager Client is connected to ZooKeeper
   [junit4]   2> 474706 INFO  (TEST-ForceLeaderTest.testReplicasInLIRNoLeader-seed#[5F8F3538EEB1F815]) [    ] o.a.s.c.c.SolrZkClient Using default ZkACLProvider
   [junit4]   2> 474707 INFO  (TEST-ForceLeaderTest.testReplicasInLIRNoLeader-seed#[5F8F3538EEB1F815]) [n:127.0.0.1:35747_    ] o.a.s.c.ZkController Added new OnReconnect listener org.apache.solr.cloud.ZkController$$Lambda$92/1343065651@36fcab1d
   [junit4]   2> 474707 WARN  (NIOServerCxn.Factory:0.0.0.0/0.0.0.0:0) [    ] o.a.z.s.NIOServerCnxn caught end of stream exception
   [junit4]   2> EndOfStreamException: Unable to read additional data from client sessionid 0x15734d095950008, likely client has closed socket
   [junit4]   2> 	at org.apache.zookeeper.server.NIOServerCnxn.doIO(NIOServerCnxn.java:228)
   [junit4]   2> 	at org.apache.zookeeper.server.NIOServerCnxnFactory.run(NIOServerCnxnFactory.java:208)
   [junit4]   2> 	at java.lang.Thread.run(Thread.java:745)
   [junit4]   2> 474729 INFO  (TEST-ForceLeaderTest.testReplicasInLIRNoLeader-seed#[5F8F3538EEB1F815]) [n:127.0.0.1:35747_    ] o.a.s.c.c.ConnectionManager Waiting for client to connect to ZooKeeper
   [junit4]   2> 474782 INFO  (zkCallback-473-thread-1-processing-n:127.0.0.1:35747_) [n:127.0.0.1:35747_    ] o.a.s.c.c.ConnectionManager Watcher org.apache.solr.common.cloud.ConnectionManager@7a1b3357 name:ZooKeeperConnection Watcher:127.0.0.1:57327/solr got event WatchedEvent state:SyncConnected type:None path:null path:null type:None
   [junit4]   2> 474783 INFO  (TEST-ForceLeaderTest.testReplicasInLIRNoLeader-seed#[5F8F3538EEB1F815]) [n:127.0.0.1:35747_    ] o.a.s.c.c.ConnectionManager Client is connected to ZooKeeper
   [junit4]   2> 474821 INFO  (TEST-ForceLeaderTest.testReplicasInLIRNoLeader-seed#[5F8F3538EEB1F815]) [n:127.0.0.1:35747_    ] o.a.s.c.c.ZkStateReader Updating cluster state from ZooKeeper... 
   [junit4]   2> 474822 INFO  (TEST-ForceLeaderTest.testReplicasInLIRNoLeader-seed#[5F8F3538EEB1F815]) [n:127.0.0.1:35747_    ] o.a.s.c.c.ZkStateReader Loaded empty cluster properties
   [junit4]   2> 474823 INFO  (TEST-ForceLeaderTest.testReplicasInLIRNoLeader-seed#[5F8F3538EEB1F815]) [n:127.0.0.1:35747_    ] o.a.s.c.c.ZkStateReader Updated live nodes from ZooKeeper... (0) -> (1)
   [junit4]   2> 474827 INFO  (TEST-ForceLeaderTest.testReplicasInLIRNoLeader-seed#[5F8F3538EEB1F815]) [n:127.0.0.1:35747_    ] o.a.s.c.Overseer Overseer (id=null) closing
   [junit4]   2> 474828 INFO  (TEST-ForceLeaderTest.testReplicasInLIRNoLeader-seed#[5F8F3538EEB1F815]) [n:127.0.0.1:35747_    ] o.a.s.c.LeaderElector Joined leadership election with path: /overseer_elect/election/96603987479166985-127.0.0.1:35747_-n_0000000001
   [junit4]   2> 474829 INFO  (TEST-ForceLeaderTest.testReplicasInLIRNoLeader-seed#[5F8F3538EEB1F815]) [n:127.0.0.1:35747_    ] o.a.s.c.LeaderElector Watching path /overseer_elect/election/96603987479166980-127.0.0.1:53723_-n_0000000000 to know if I could be the leader
   [junit4]   2> 474829 INFO  (TEST-ForceLeaderTest.testReplicasInLIRNoLeader-seed#[5F8F3538EEB1F815]) [n:127.0.0.1:35747_    ] o.a.s.c.ZkController Publish node=127.0.0.1:35747_ as DOWN
   [junit4]   2> 474830 INFO  (TEST-ForceLeaderTest.testReplicasInLIRNoLeader-seed#[5F8F3538EEB1F815]) [n:127.0.0.1:35747_    ] o.a.s.c.ZkController Register node as live in ZooKeeper:/live_nodes/127.0.0.1:35747_
   [junit4]   2> 474830 INFO  (TEST-ForceLeaderTest.testReplicasInLIRNoLeader-seed#[5F8F3538EEB1F815]) [n:127.0.0.1:35747_    ] o.a.s.c.c.SolrZkClient makePath: /live_nodes/127.0.0.1:35747_
   [junit4]   2> 474831 INFO  (zkCallback-473-thread-1-processing-n:127.0.0.1:35747_) [n:127.0.0.1:35747_    ] o.a.s.c.c.ZkStateReader A live node change: [WatchedEvent state:SyncConnected type:NodeChildrenChanged path:/live_nodes], has occurred - updating... (live nodes size: [1])
   [junit4]   2> 474833 INFO  (zkCallback-463-thread-3-processing-n:127.0.0.1:53723_) [n:127.0.0.1:53723_    ] o.a.s.c.c.ZkStateReader A live node change: [WatchedEvent state:SyncConnected type:NodeChildrenChanged path:/live_nodes], has occurred - updating... (live nodes size: [1])
   [junit4]   2> 474833 INFO  (zkCallback-467-thread-1) [    ] o.a.s.c.c.ZkStateReader A live node change: [WatchedEvent state:SyncConnected type:NodeChildrenChanged path:/live_nodes], has occurred - updating... (live nodes size: [1])
   [junit4]   2> 474834 INFO  (zkCallback-467-thread-1) [    ] o.a.s.c.c.ZkStateReader Updated live nodes from ZooKeeper... (1) -> (2)
   [junit4]   2> 474834 INFO  (zkCallback-463-thread-3-processing-n:127.0.0.1:53723_) [n:127.0.0.1:53723_    ] o.a.s.c.c.ZkStateReader Updated live nodes from ZooKeeper... (1) -> (2)
   [junit4]   2> 474845 INFO  (zkCallback-473-thread-1-processing-n:127.0.0.1:35747_) [n:127.0.0.1:35747_    ] o.a.s.c.c.ZkStateReader Updated live nodes from ZooKeeper... (1) -> (2)
   [junit4]   2> 474846 INFO  (OverseerStateUpdate-96603987479166980-127.0.0.1:53723_-n_0000000000) [n:127.0.0.1:53723_    ] o.a.s.c.Overseer processMessage: queueSize: 1, message = {
   [junit4]   2>   "operation":"downnode",
   [junit4]   2>   "node_name":"127.0.0.1:35747_"} current state version: 3
   [junit4]   2> 474846 INFO  (OverseerStateUpdate-96603987479166980-127.0.0.1:53723_-n_0000000000) [n:127.0.0.1:53723_    ] o.a.s.c.o.NodeMutator DownNode state invoked for node: 127.0.0.1:35747_
   [junit4]   2> 474847 INFO  (zkCallback-467-thread-1) [    ] o.a.s.c.c.ZkStateReader A cluster state change: [WatchedEvent state:SyncConnected type:NodeDataChanged path:/clusterstate.json], has occurred - updating... (live nodes size: [2])
   [junit4]   2> 474848 INFO  (zkCallback-473-thread-1-processing-n:127.0.0.1:35747_) [n:127.0.0.1:35747_    ] o.a.s.c.c.ZkStateReader A cluster state change: [WatchedEvent state:SyncConnected type:NodeDataChanged path:/clusterstate.json], has occurred - updating... (live nodes size: [2])
   [junit4]   2> 474853 INFO  (zkCallback-463-thread-3-processing-n:127.0.0.1:53723_) [n:127.0.0.1:53723_    ] o.a.s.c.c.ZkStateReader A cluster state change: [WatchedEvent state:SyncConnected type:NodeDataChanged path:/clusterstate.json], has occurred - updating... (live nodes size: [2])
   [junit4]   2> 474870 INFO  (TEST-ForceLeaderTest.testReplicasInLIRNoLeader-seed#[5F8F3538EEB1F815]) [n:127.0.0.1:35747_    ] o.a.s.c.CoreContainer Security conf doesn't exist. Skipping setup for authorization module.
   [junit4]   2> 474870 INFO  (TEST-ForceLeaderTest.testReplicasInLIRNoLeader-seed#[5F8F3538EEB1F815]) [n:127.0.0.1:35747_    ] o.a.s.c.CoreContainer No authentication plugin used.
   [junit4]   2> 474870 INFO  (TEST-ForceLeaderTest.testReplicasInLIRNoLeader-seed#[5F8F3538EEB1F815]) [n:127.0.0.1:35747_    ] o.a.s.c.CorePropertiesLocator Looking for core definitions underneath /x1/jenkins/jenkins-slave/workspace/Lucene-Solr-Tests-master/solr/build/solr-core/test/J2/temp/solr.cloud.ForceLeaderTest_5F8F3538EEB1F815-001/shard-1-001/cores
   [junit4]   2> 474871 INFO  (TEST-ForceLeaderTest.testReplicasInLIRNoLeader-seed#[5F8F3538EEB1F815]) [n:127.0.0.1:35747_    ] o.a.s.c.CoreDescriptor Created CoreDescriptor: {name=collection1, config=solrconfig.xml, transient=false, schema=schema.xml, loadOnStartup=true, configSetProperties=configsetprops.json, collection=collection1, coreNodeName=, dataDir=data/, shard=}
   [junit4]   2> 474871 INFO  (TEST-ForceLeaderTest.testReplicasInLIRNoLeader-seed#[5F8F3538EEB1F815]) [n:127.0.0.1:35747_    ] o.a.s.c.CorePropertiesLocator Found core collection1 in /x1/jenkins/jenkins-slave/workspace/Lucene-Solr-Tests-master/solr/build/solr-core/test/J2/temp/solr.cloud.ForceLeaderTest_5F8F3538EEB1F815-001/shard-1-001/cores/collection1
   [junit4]   2> 474871 INFO  (TEST-ForceLeaderTest.testReplicasInLIRNoLeader-seed#[5F8F3538EEB1F815]) [n:127.0.0.1:35747_    ] o.a.s.c.CorePropertiesLocator Found 1 core definitions
   [junit4]   2> 474898 INFO  (TEST-ForceLeaderTest.testReplicasInLIRNoLeader-seed#[5F8F3538EEB1F815]) [n:127.0.0.1:35747_    ] o.a.s.s.SolrDispatchFilter user.dir=/x1/jenkins/jenkins-slave/workspace/Lucene-Solr-Tests-master/solr/build/solr-core/test/J2
   [junit4]   2> 474898 INFO  (TEST-ForceLeaderTest.testReplicasInLIRNoLeader-seed#[5F8F3538EEB1F815]) [n:127.0.0.1:35747_    ] o.a.s.s.SolrDispatchFilter SolrDispatchFilter.init() done
   [junit4]   2> 474898 INFO  (coreLoadExecutor-1278-thread-1-processing-n:127.0.0.1:35747_) [n:127.0.0.1:35747_ c:collection1   x:collection1] o.a.s.c.ZkController publishing state=down
   [junit4]   2> 474898 INFO  (coreLoadExecutor-1278-thread-1-processing-n:127.0.0.1:35747_) [n:127.0.0.1:35747_ c:collection1   x:collection1] o.a.s.c.ZkController numShards not found on descriptor - reading it from system property
   [junit4]   2> 474899 INFO  (coreLoadExecutor-1278-thread-1-processing-n:127.0.0.1:35747_) [n:127.0.0.1:35747_ c:collection1   x:collection1] o.a.s.c.ZkController Registering watch for collection collection1
   [junit4]   2> 474899 INFO  (coreLoadExecutor-1278-thread-1-processing-n:127.0.0.1:35747_) [n:127.0.0.1:35747_ c:collection1   x:collection1] o.a.s.c.c.ZkStateReader Add data for [collection1] ver [0]
   [junit4]   2> 474906 INFO  (OverseerStateUpdate-96603987479166980-127.0.0.1:53723_-n_0000000000) [n:127.0.0.1:53723_    ] o.a.s.c.Overseer processMessage: queueSize: 1, message = {
   [junit4]   2>   "core":"collection1",
   [junit4]   2>   "roles":null,
   [junit4]   2>   "base_url":"http://127.0.0.1:35747",
   [junit4]   2>   "node_name":"127.0.0.1:35747_",
   [junit4]   2>   "numShards":"2",
   [junit4]   2>   "state":"down",
   [junit4]   2>   "shard":null,
   [junit4]   2>   "collection":"collection1",
   [junit4]   2>   "operation":"state"} current state version: 4
   [junit4]   2> 474906 INFO  (OverseerStateUpdate-96603987479166980-127.0.0.1:53723_-n_0000000000) [n:127.0.0.1:53723_    ] o.a.s.c.o.ReplicaMutator Update state numShards=2 message={
   [junit4]   2>   "core":"collection1",
   [junit4]   2>   "roles":null,
   [junit4]   2>   "base_url":"http://127.0.0.1:35747",
   [junit4]   2>   "node_name":"127.0.0.1:35747_",
   [junit4]   2>   "numShards":"2",
   [junit4]   2>   "state":"down",
   [junit4]   2>   "shard":null,
   [junit4]   2>   "collection":"collection1",
   [junit4]   2>   "operation":"state"}
   [junit4]   2> 474906 INFO  (OverseerStateUpdate-96603987479166980-127.0.0.1:53723_-n_0000000000) [n:127.0.0.1:53723_    ] o.a.s.c.o.ReplicaMutator Collection already exists with numShards=2
   [junit4]   2> 474906 INFO  (OverseerStateUpdate-96603987479166980-127.0.0.1:53723_-n_0000000000) [n:127.0.0.1:53723_    ] o.a.s.c.o.ReplicaMutator Assigning new node to shard shard=shard2
   [junit4]   2> 474925 INFO  (coreLoadExecutor-1278-thread-1-processing-n:127.0.0.1:35747_) [n:127.0.0.1:35747_ c:collection1   x:collection1] o.a.s.c.ZkControll

[...truncated too long message...]

ping recovery for core=[collection1] coreNodeName=[core_node3]
   [junit4]   2> 601757 INFO  (zkCallback-502-thread-3) [    ] o.a.s.c.c.ZkStateReader A cluster state change: [WatchedEvent state:SyncConnected type:NodeDataChanged path:/clusterstate.json], has occurred - updating... (live nodes size: [1])
   [junit4]   2> 601757 INFO  (coreCloseExecutor-1408-thread-1) [n:127.0.0.1:36528_ c:collection1 s:shard2 r:core_node3 x:collection1] o.a.s.u.DefaultSolrCoreState SolrCoreState ref count has reached 0 - closing IndexWriter
   [junit4]   2> 601758 INFO  (coreCloseExecutor-1408-thread-1) [n:127.0.0.1:36528_ c:collection1 s:shard2 r:core_node3 x:collection1] o.a.s.u.DefaultSolrCoreState closing IndexWriter with IndexWriterCloser
   [junit4]   2> 601758 INFO  (coreCloseExecutor-1408-thread-1) [n:127.0.0.1:36528_ c:collection1 s:shard2 r:core_node3 x:collection1] o.a.s.c.SolrCore [collection1] Closing main searcher on request.
   [junit4]   2> 601806 INFO  (coreCloseExecutor-1408-thread-1) [n:127.0.0.1:36528_ c:collection1 s:shard2 r:core_node3 x:collection1] o.a.s.c.CachingDirectoryFactory Closing MockDirectoryFactory - 3 directories currently being tracked
   [junit4]   2> 601806 INFO  (coreCloseExecutor-1408-thread-1) [n:127.0.0.1:36528_ c:collection1 s:shard2 r:core_node3 x:collection1] o.a.s.c.CachingDirectoryFactory looking to close /x1/jenkins/jenkins-slave/workspace/Lucene-Solr-Tests-master/solr/build/solr-core/test/J2/temp/solr.cloud.ForceLeaderTest_5F8F3538EEB1F815-001/shard-3-002/cores/collection1/data/snapshot_metadata [CachedDir<<refCount=0;path=/x1/jenkins/jenkins-slave/workspace/Lucene-Solr-Tests-master/solr/build/solr-core/test/J2/temp/solr.cloud.ForceLeaderTest_5F8F3538EEB1F815-001/shard-3-002/cores/collection1/data/snapshot_metadata;done=false>>]
   [junit4]   2> 601806 INFO  (coreCloseExecutor-1408-thread-1) [n:127.0.0.1:36528_ c:collection1 s:shard2 r:core_node3 x:collection1] o.a.s.c.CachingDirectoryFactory Closing directory, CoreContainer#isShutdown=true
   [junit4]   2> 601806 INFO  (coreCloseExecutor-1408-thread-1) [n:127.0.0.1:36528_ c:collection1 s:shard2 r:core_node3 x:collection1] o.a.s.c.CachingDirectoryFactory Closing directory: /x1/jenkins/jenkins-slave/workspace/Lucene-Solr-Tests-master/solr/build/solr-core/test/J2/temp/solr.cloud.ForceLeaderTest_5F8F3538EEB1F815-001/shard-3-002/cores/collection1/data/snapshot_metadata
   [junit4]   2> 601809 INFO  (coreCloseExecutor-1408-thread-1) [n:127.0.0.1:36528_ c:collection1 s:shard2 r:core_node3 x:collection1] o.a.s.c.CachingDirectoryFactory looking to close /x1/jenkins/jenkins-slave/workspace/Lucene-Solr-Tests-master/solr/build/solr-core/test/J2/temp/solr.cloud.ForceLeaderTest_5F8F3538EEB1F815-001/shard-3-002/cores/collection1/data/index [CachedDir<<refCount=0;path=/x1/jenkins/jenkins-slave/workspace/Lucene-Solr-Tests-master/solr/build/solr-core/test/J2/temp/solr.cloud.ForceLeaderTest_5F8F3538EEB1F815-001/shard-3-002/cores/collection1/data/index;done=false>>]
   [junit4]   2> 601809 INFO  (coreCloseExecutor-1408-thread-1) [n:127.0.0.1:36528_ c:collection1 s:shard2 r:core_node3 x:collection1] o.a.s.c.CachingDirectoryFactory Closing directory, CoreContainer#isShutdown=true
   [junit4]   2> 601809 INFO  (coreCloseExecutor-1408-thread-1) [n:127.0.0.1:36528_ c:collection1 s:shard2 r:core_node3 x:collection1] o.a.s.c.CachingDirectoryFactory Closing directory: /x1/jenkins/jenkins-slave/workspace/Lucene-Solr-Tests-master/solr/build/solr-core/test/J2/temp/solr.cloud.ForceLeaderTest_5F8F3538EEB1F815-001/shard-3-002/cores/collection1/data/index
   [junit4]   2> 601809 INFO  (coreCloseExecutor-1408-thread-1) [n:127.0.0.1:36528_ c:collection1 s:shard2 r:core_node3 x:collection1] o.a.s.c.CachingDirectoryFactory looking to close /x1/jenkins/jenkins-slave/workspace/Lucene-Solr-Tests-master/solr/build/solr-core/test/J2/temp/solr.cloud.ForceLeaderTest_5F8F3538EEB1F815-001/shard-3-002/cores/collection1/data [CachedDir<<refCount=0;path=/x1/jenkins/jenkins-slave/workspace/Lucene-Solr-Tests-master/solr/build/solr-core/test/J2/temp/solr.cloud.ForceLeaderTest_5F8F3538EEB1F815-001/shard-3-002/cores/collection1/data;done=false>>]
   [junit4]   2> 601809 INFO  (coreCloseExecutor-1408-thread-1) [n:127.0.0.1:36528_ c:collection1 s:shard2 r:core_node3 x:collection1] o.a.s.c.CachingDirectoryFactory Closing directory, CoreContainer#isShutdown=true
   [junit4]   2> 601809 INFO  (coreCloseExecutor-1408-thread-1) [n:127.0.0.1:36528_ c:collection1 s:shard2 r:core_node3 x:collection1] o.a.s.c.CachingDirectoryFactory Closing directory: /x1/jenkins/jenkins-slave/workspace/Lucene-Solr-Tests-master/solr/build/solr-core/test/J2/temp/solr.cloud.ForceLeaderTest_5F8F3538EEB1F815-001/shard-3-002/cores/collection1/data
   [junit4]   2> 601810 INFO  (TEST-ForceLeaderTest.testLastPublishedStateIsActive-seed#[5F8F3538EEB1F815]) [    ] o.a.s.c.Overseer Overseer (id=96603990890119183-127.0.0.1:36528_-n_0000000003) closing
   [junit4]   2> 601810 INFO  (OverseerStateUpdate-96603990890119183-127.0.0.1:36528_-n_0000000003) [n:127.0.0.1:36528_    ] o.a.s.c.Overseer Overseer Loop exiting : 127.0.0.1:36528_
   [junit4]   2> 601811 INFO  (zkCallback-520-thread-1-processing-n:127.0.0.1:36528_) [n:127.0.0.1:36528_    ] o.a.s.c.c.ZkStateReader A live node change: [WatchedEvent state:SyncConnected type:NodeChildrenChanged path:/live_nodes], has occurred - updating... (live nodes size: [1])
   [junit4]   2> 601813 INFO  (zkCallback-502-thread-3) [    ] o.a.s.c.c.ZkStateReader A live node change: [WatchedEvent state:SyncConnected type:NodeChildrenChanged path:/live_nodes], has occurred - updating... (live nodes size: [1])
   [junit4]   2> 601935 INFO  (zkCallback-502-thread-3) [    ] o.a.s.c.c.ZkStateReader Updated live nodes from ZooKeeper... (1) -> (0)
   [junit4]   2> 603312 WARN  (zkCallback-520-thread-1-processing-n:127.0.0.1:36528_) [n:127.0.0.1:36528_    ] o.a.s.c.c.ZkStateReader ZooKeeper watch triggered, but Solr cannot talk to ZK: [KeeperErrorCode = Session expired for /live_nodes]
   [junit4]   2> 603314 INFO  (TEST-ForceLeaderTest.testLastPublishedStateIsActive-seed#[5F8F3538EEB1F815]) [    ] o.e.j.s.ServerConnector Stopped ServerConnector@69f2a6f9{HTTP/1.1,[http/1.1]}{127.0.0.1:0}
   [junit4]   2> 603314 INFO  (TEST-ForceLeaderTest.testLastPublishedStateIsActive-seed#[5F8F3538EEB1F815]) [    ] o.e.j.s.h.ContextHandler Stopped o.e.j.s.ServletContextHandler@6abe6881{/,null,UNAVAILABLE}
   [junit4]   2> 603337 INFO  (TEST-ForceLeaderTest.testLastPublishedStateIsActive-seed#[5F8F3538EEB1F815]) [    ] o.a.s.c.ChaosMonkey monkey: stop shard! 58419
   [junit4]   2> 603346 INFO  (TEST-ForceLeaderTest.testLastPublishedStateIsActive-seed#[5F8F3538EEB1F815]) [    ] o.a.s.c.ZkTestServer connecting to 127.0.0.1:44510 44510
   [junit4]   2> 603449 INFO  (Thread-632) [    ] o.a.s.c.ZkTestServer connecting to 127.0.0.1:44510 44510
   [junit4]   2> 603453 WARN  (Thread-632) [    ] o.a.s.c.ZkTestServer Watch limit violations: 
   [junit4]   2> Maximum concurrent create/delete watches above limit:
   [junit4]   2> 
   [junit4]   2> 	5	/solr/aliases.json
   [junit4]   2> 	5	/solr/clusterprops.json
   [junit4]   2> 	4	/solr/security.json
   [junit4]   2> 	4	/solr/configs/conf1
   [junit4]   2> 
   [junit4]   2> Maximum concurrent data watches above limit:
   [junit4]   2> 
   [junit4]   2> 	5	/solr/clusterstate.json
   [junit4]   2> 	3	/solr/collections/forceleader_last_published/state.json
   [junit4]   2> 	3	/solr/collections/collection1/state.json
   [junit4]   2> 
   [junit4]   2> Maximum concurrent children watches above limit:
   [junit4]   2> 
   [junit4]   2> 	73	/solr/overseer/collection-queue-work
   [junit4]   2> 	47	/solr/overseer/queue
   [junit4]   2> 	15	/solr/overseer/queue-work
   [junit4]   2> 	5	/solr/live_nodes
   [junit4]   2> 	5	/solr/collections
   [junit4]   2> 
   [junit4]   2> 603470 WARN  (TEST-ForceLeaderTest.testLastPublishedStateIsActive-seed#[5F8F3538EEB1F815]) [    ] o.a.s.c.SocketProxy Closing 6 connections to: http://127.0.0.1:50379/, target: http://127.0.0.1:51188/
   [junit4]   2> 603470 WARN  (TEST-ForceLeaderTest.testLastPublishedStateIsActive-seed#[5F8F3538EEB1F815]) [    ] o.a.s.c.SocketProxy Closing 1 connections to: http://127.0.0.1:58419/, target: http://127.0.0.1:32862/
   [junit4]   2> 603470 WARN  (TEST-ForceLeaderTest.testLastPublishedStateIsActive-seed#[5F8F3538EEB1F815]) [    ] o.a.s.c.SocketProxy Closing 3 connections to: http://127.0.0.1:37902/, target: http://127.0.0.1:53996/
   [junit4]   2> 603470 WARN  (TEST-ForceLeaderTest.testLastPublishedStateIsActive-seed#[5F8F3538EEB1F815]) [    ] o.a.s.c.SocketProxy Closing 7 connections to: http://127.0.0.1:36528/, target: http://127.0.0.1:54718/
   [junit4]   2> 603471 INFO  (SUITE-ForceLeaderTest-seed#[5F8F3538EEB1F815]-worker) [    ] o.a.s.SolrTestCaseJ4 ###deleteCore
   [junit4]   2> NOTE: leaving temporary files on disk at: /x1/jenkins/jenkins-slave/workspace/Lucene-Solr-Tests-master/solr/build/solr-core/test/J2/temp/solr.cloud.ForceLeaderTest_5F8F3538EEB1F815-001
   [junit4]   2> Sep 16, 2016 9:06:39 PM com.carrotsearch.randomizedtesting.ThreadLeakControl checkThreadLeaks
   [junit4]   2> WARNING: Will linger awaiting termination of 1 leaked thread(s).
   [junit4]   2> NOTE: test params are: codec=Asserting(Lucene62), sim=RandomSimilarity(queryNorm=true): {}, locale=ko-KR, timezone=Asia/Seoul
   [junit4]   2> NOTE: Linux 3.13.0-85-generic amd64/Oracle Corporation 1.8.0_102 (64-bit)/cpus=4,threads=1,free=95355784,total=423100416
   [junit4]   2> NOTE: All tests run in this JVM: [RequestHandlersTest, TestSearcherReuse, CustomCollectionTest, TestMiniSolrCloudCluster, TestRecovery, TestTestInjection, CollectionsAPIAsyncDistributedZkTest, RuleEngineTest, TestDistribIDF, QueryResultKeyTest, ZkStateReaderTest, TestMissingGroups, MinimalSchemaTest, TestSolrJ, SimpleFacetsTest, ForceLeaderTest]
   [junit4] Completed [93/631 (1!)] on J2 in 133.11s, 3 tests, 1 error, 1 skipped <<< FAILURES!

[...truncated 61947 lines...]



Mime
View raw message