lucene-dev mailing list archives

Site index · List index
Message view « Date » · « Thread »
Top « Date » · « Thread »
From Policeman Jenkins Server <jenk...@thetaphi.de>
Subject [JENKINS-EA] Lucene-Solr-master-Linux (32bit/jdk-9-ea+134) - Build # 17798 - Still Unstable!
Date Sun, 11 Sep 2016 04:22:51 GMT
Build: http://jenkins.thetaphi.de/job/Lucene-Solr-master-Linux/17798/
Java: 32bit/jdk-9-ea+134 -client -XX:+UseG1GC

2 tests failed.
FAILED:  junit.framework.TestSuite.org.apache.solr.handler.TestSolrConfigHandlerCloud

Error Message:
Suite timeout exceeded (>= 7200000 msec).

Stack Trace:
java.lang.Exception: Suite timeout exceeded (>= 7200000 msec).
	at __randomizedtesting.SeedInfo.seed([1F47A2C9DA27B742]:0)


FAILED:  org.apache.solr.handler.TestSolrConfigHandlerCloud.test

Error Message:
Test abandoned because suite timeout was reached.

Stack Trace:
java.lang.Exception: Test abandoned because suite timeout was reached.
	at __randomizedtesting.SeedInfo.seed([1F47A2C9DA27B742]:0)




Build Log:
[...truncated 12658 lines...]
   [junit4] Suite: org.apache.solr.handler.TestSolrConfigHandlerCloud
   [junit4]   2> Creating dataDir: /home/jenkins/workspace/Lucene-Solr-master-Linux/solr/build/solr-core/test/J0/temp/solr.handler.TestSolrConfigHandlerCloud_1F47A2C9DA27B742-001/init-core-data-001
   [junit4]   2> 1046755 INFO  (SUITE-TestSolrConfigHandlerCloud-seed#[1F47A2C9DA27B742]-worker) [    ] o.a.s.SolrTestCaseJ4 Randomized ssl (true) and clientAuth (false) via: @org.apache.solr.util.RandomizeSSL(reason="", ssl=0.0/0.0, value=0.0/0.0, clientAuth=0.0/0.0)
   [junit4]   2> 1046755 INFO  (SUITE-TestSolrConfigHandlerCloud-seed#[1F47A2C9DA27B742]-worker) [    ] o.a.s.BaseDistributedSearchTestCase Setting hostContext system property: /
   [junit4]   2> 1046756 INFO  (TEST-TestSolrConfigHandlerCloud.test-seed#[1F47A2C9DA27B742]) [    ] o.a.s.c.ZkTestServer STARTING ZK TEST SERVER
   [junit4]   2> 1046757 INFO  (Thread-2083) [    ] o.a.s.c.ZkTestServer client port:0.0.0.0/0.0.0.0:0
   [junit4]   2> 1046757 INFO  (Thread-2083) [    ] o.a.s.c.ZkTestServer Starting server
   [junit4]   2> 1046857 INFO  (TEST-TestSolrConfigHandlerCloud.test-seed#[1F47A2C9DA27B742]) [    ] o.a.s.c.ZkTestServer start zk server on port:37609
   [junit4]   2> 1046857 INFO  (TEST-TestSolrConfigHandlerCloud.test-seed#[1F47A2C9DA27B742]) [    ] o.a.s.c.c.SolrZkClient Using default ZkCredentialsProvider
   [junit4]   2> 1046857 INFO  (TEST-TestSolrConfigHandlerCloud.test-seed#[1F47A2C9DA27B742]) [    ] o.a.s.c.c.ConnectionManager Waiting for client to connect to ZooKeeper
   [junit4]   2> 1046859 INFO  (zkCallback-1226-thread-1) [    ] o.a.s.c.c.ConnectionManager Watcher org.apache.solr.common.cloud.ConnectionManager@176d0df name:ZooKeeperConnection Watcher:127.0.0.1:37609 got event WatchedEvent state:SyncConnected type:None path:null path:null type:None
   [junit4]   2> 1046859 INFO  (TEST-TestSolrConfigHandlerCloud.test-seed#[1F47A2C9DA27B742]) [    ] o.a.s.c.c.ConnectionManager Client is connected to ZooKeeper
   [junit4]   2> 1046859 INFO  (TEST-TestSolrConfigHandlerCloud.test-seed#[1F47A2C9DA27B742]) [    ] o.a.s.c.c.SolrZkClient Using default ZkACLProvider
   [junit4]   2> 1046859 INFO  (TEST-TestSolrConfigHandlerCloud.test-seed#[1F47A2C9DA27B742]) [    ] o.a.s.c.c.SolrZkClient makePath: /solr
   [junit4]   2> 1046860 INFO  (TEST-TestSolrConfigHandlerCloud.test-seed#[1F47A2C9DA27B742]) [    ] o.a.s.c.c.SolrZkClient Using default ZkCredentialsProvider
   [junit4]   2> 1046860 INFO  (TEST-TestSolrConfigHandlerCloud.test-seed#[1F47A2C9DA27B742]) [    ] o.a.s.c.c.ConnectionManager Waiting for client to connect to ZooKeeper
   [junit4]   2> 1046861 INFO  (zkCallback-1227-thread-1) [    ] o.a.s.c.c.ConnectionManager Watcher org.apache.solr.common.cloud.ConnectionManager@12aab72 name:ZooKeeperConnection Watcher:127.0.0.1:37609/solr got event WatchedEvent state:SyncConnected type:None path:null path:null type:None
   [junit4]   2> 1046861 INFO  (TEST-TestSolrConfigHandlerCloud.test-seed#[1F47A2C9DA27B742]) [    ] o.a.s.c.c.ConnectionManager Client is connected to ZooKeeper
   [junit4]   2> 1046861 INFO  (TEST-TestSolrConfigHandlerCloud.test-seed#[1F47A2C9DA27B742]) [    ] o.a.s.c.c.SolrZkClient Using default ZkACLProvider
   [junit4]   2> 1046861 INFO  (TEST-TestSolrConfigHandlerCloud.test-seed#[1F47A2C9DA27B742]) [    ] o.a.s.c.c.SolrZkClient makePath: /collections/collection1
   [junit4]   2> 1046862 INFO  (TEST-TestSolrConfigHandlerCloud.test-seed#[1F47A2C9DA27B742]) [    ] o.a.s.c.c.SolrZkClient makePath: /collections/collection1/shards
   [junit4]   2> 1046862 INFO  (TEST-TestSolrConfigHandlerCloud.test-seed#[1F47A2C9DA27B742]) [    ] o.a.s.c.c.SolrZkClient makePath: /collections/control_collection
   [junit4]   2> 1046863 INFO  (TEST-TestSolrConfigHandlerCloud.test-seed#[1F47A2C9DA27B742]) [    ] o.a.s.c.c.SolrZkClient makePath: /collections/control_collection/shards
   [junit4]   2> 1046863 INFO  (TEST-TestSolrConfigHandlerCloud.test-seed#[1F47A2C9DA27B742]) [    ] o.a.s.c.AbstractZkTestCase put /home/jenkins/workspace/Lucene-Solr-master-Linux/solr/core/src/test-files/solr/collection1/conf/solrconfig-tlog.xml to /configs/conf1/solrconfig.xml
   [junit4]   2> 1046863 INFO  (TEST-TestSolrConfigHandlerCloud.test-seed#[1F47A2C9DA27B742]) [    ] o.a.s.c.c.SolrZkClient makePath: /configs/conf1/solrconfig.xml
   [junit4]   2> 1046864 INFO  (TEST-TestSolrConfigHandlerCloud.test-seed#[1F47A2C9DA27B742]) [    ] o.a.s.c.AbstractZkTestCase put /home/jenkins/workspace/Lucene-Solr-master-Linux/solr/core/src/test-files/solr/collection1/conf/schema.xml to /configs/conf1/schema.xml
   [junit4]   2> 1046864 INFO  (TEST-TestSolrConfigHandlerCloud.test-seed#[1F47A2C9DA27B742]) [    ] o.a.s.c.c.SolrZkClient makePath: /configs/conf1/schema.xml
   [junit4]   2> 1046866 INFO  (TEST-TestSolrConfigHandlerCloud.test-seed#[1F47A2C9DA27B742]) [    ] o.a.s.c.AbstractZkTestCase put /home/jenkins/workspace/Lucene-Solr-master-Linux/solr/core/src/test-files/solr/collection1/conf/solrconfig.snippet.randomindexconfig.xml to /configs/conf1/solrconfig.snippet.randomindexconfig.xml
   [junit4]   2> 1046866 INFO  (TEST-TestSolrConfigHandlerCloud.test-seed#[1F47A2C9DA27B742]) [    ] o.a.s.c.c.SolrZkClient makePath: /configs/conf1/solrconfig.snippet.randomindexconfig.xml
   [junit4]   2> 1046866 INFO  (TEST-TestSolrConfigHandlerCloud.test-seed#[1F47A2C9DA27B742]) [    ] o.a.s.c.AbstractZkTestCase put /home/jenkins/workspace/Lucene-Solr-master-Linux/solr/core/src/test-files/solr/collection1/conf/stopwords.txt to /configs/conf1/stopwords.txt
   [junit4]   2> 1046867 INFO  (TEST-TestSolrConfigHandlerCloud.test-seed#[1F47A2C9DA27B742]) [    ] o.a.s.c.c.SolrZkClient makePath: /configs/conf1/stopwords.txt
   [junit4]   2> 1046867 INFO  (TEST-TestSolrConfigHandlerCloud.test-seed#[1F47A2C9DA27B742]) [    ] o.a.s.c.AbstractZkTestCase put /home/jenkins/workspace/Lucene-Solr-master-Linux/solr/core/src/test-files/solr/collection1/conf/protwords.txt to /configs/conf1/protwords.txt
   [junit4]   2> 1046867 INFO  (TEST-TestSolrConfigHandlerCloud.test-seed#[1F47A2C9DA27B742]) [    ] o.a.s.c.c.SolrZkClient makePath: /configs/conf1/protwords.txt
   [junit4]   2> 1046868 INFO  (TEST-TestSolrConfigHandlerCloud.test-seed#[1F47A2C9DA27B742]) [    ] o.a.s.c.AbstractZkTestCase put /home/jenkins/workspace/Lucene-Solr-master-Linux/solr/core/src/test-files/solr/collection1/conf/currency.xml to /configs/conf1/currency.xml
   [junit4]   2> 1046868 INFO  (TEST-TestSolrConfigHandlerCloud.test-seed#[1F47A2C9DA27B742]) [    ] o.a.s.c.c.SolrZkClient makePath: /configs/conf1/currency.xml
   [junit4]   2> 1046868 INFO  (TEST-TestSolrConfigHandlerCloud.test-seed#[1F47A2C9DA27B742]) [    ] o.a.s.c.AbstractZkTestCase put /home/jenkins/workspace/Lucene-Solr-master-Linux/solr/core/src/test-files/solr/collection1/conf/enumsConfig.xml to /configs/conf1/enumsConfig.xml
   [junit4]   2> 1046868 INFO  (TEST-TestSolrConfigHandlerCloud.test-seed#[1F47A2C9DA27B742]) [    ] o.a.s.c.c.SolrZkClient makePath: /configs/conf1/enumsConfig.xml
   [junit4]   2> 1046869 INFO  (TEST-TestSolrConfigHandlerCloud.test-seed#[1F47A2C9DA27B742]) [    ] o.a.s.c.AbstractZkTestCase put /home/jenkins/workspace/Lucene-Solr-master-Linux/solr/core/src/test-files/solr/collection1/conf/open-exchange-rates.json to /configs/conf1/open-exchange-rates.json
   [junit4]   2> 1046869 INFO  (TEST-TestSolrConfigHandlerCloud.test-seed#[1F47A2C9DA27B742]) [    ] o.a.s.c.c.SolrZkClient makePath: /configs/conf1/open-exchange-rates.json
   [junit4]   2> 1046869 INFO  (TEST-TestSolrConfigHandlerCloud.test-seed#[1F47A2C9DA27B742]) [    ] o.a.s.c.AbstractZkTestCase put /home/jenkins/workspace/Lucene-Solr-master-Linux/solr/core/src/test-files/solr/collection1/conf/mapping-ISOLatin1Accent.txt to /configs/conf1/mapping-ISOLatin1Accent.txt
   [junit4]   2> 1046869 INFO  (TEST-TestSolrConfigHandlerCloud.test-seed#[1F47A2C9DA27B742]) [    ] o.a.s.c.c.SolrZkClient makePath: /configs/conf1/mapping-ISOLatin1Accent.txt
   [junit4]   2> 1046870 INFO  (TEST-TestSolrConfigHandlerCloud.test-seed#[1F47A2C9DA27B742]) [    ] o.a.s.c.AbstractZkTestCase put /home/jenkins/workspace/Lucene-Solr-master-Linux/solr/core/src/test-files/solr/collection1/conf/old_synonyms.txt to /configs/conf1/old_synonyms.txt
   [junit4]   2> 1046870 INFO  (TEST-TestSolrConfigHandlerCloud.test-seed#[1F47A2C9DA27B742]) [    ] o.a.s.c.c.SolrZkClient makePath: /configs/conf1/old_synonyms.txt
   [junit4]   2> 1046871 INFO  (TEST-TestSolrConfigHandlerCloud.test-seed#[1F47A2C9DA27B742]) [    ] o.a.s.c.AbstractZkTestCase put /home/jenkins/workspace/Lucene-Solr-master-Linux/solr/core/src/test-files/solr/collection1/conf/synonyms.txt to /configs/conf1/synonyms.txt
   [junit4]   2> 1046871 INFO  (TEST-TestSolrConfigHandlerCloud.test-seed#[1F47A2C9DA27B742]) [    ] o.a.s.c.c.SolrZkClient makePath: /configs/conf1/synonyms.txt
   [junit4]   2> 1046872 INFO  (TEST-TestSolrConfigHandlerCloud.test-seed#[1F47A2C9DA27B742]) [    ] o.a.s.c.c.SolrZkClient Using default ZkCredentialsProvider
   [junit4]   2> 1046872 INFO  (TEST-TestSolrConfigHandlerCloud.test-seed#[1F47A2C9DA27B742]) [    ] o.a.s.c.c.ConnectionManager Waiting for client to connect to ZooKeeper
   [junit4]   2> 1046872 INFO  (zkCallback-1229-thread-1) [    ] o.a.s.c.c.ConnectionManager Watcher org.apache.solr.common.cloud.ConnectionManager@109d030 name:ZooKeeperConnection Watcher:127.0.0.1:37609/solr got event WatchedEvent state:SyncConnected type:None path:null path:null type:None
   [junit4]   2> 1046872 INFO  (TEST-TestSolrConfigHandlerCloud.test-seed#[1F47A2C9DA27B742]) [    ] o.a.s.c.c.ConnectionManager Client is connected to ZooKeeper
   [junit4]   2> 1046873 INFO  (TEST-TestSolrConfigHandlerCloud.test-seed#[1F47A2C9DA27B742]) [    ] o.a.s.c.c.SolrZkClient Using default ZkACLProvider
   [junit4]   2> 1046941 INFO  (TEST-TestSolrConfigHandlerCloud.test-seed#[1F47A2C9DA27B742]) [    ] o.a.s.SolrTestCaseJ4 Writing core.properties file to /home/jenkins/workspace/Lucene-Solr-master-Linux/solr/build/solr-core/test/J0/temp/solr.handler.TestSolrConfigHandlerCloud_1F47A2C9DA27B742-001/control-001/cores/collection1
   [junit4]   2> 1046943 INFO  (TEST-TestSolrConfigHandlerCloud.test-seed#[1F47A2C9DA27B742]) [    ] o.e.j.s.Server jetty-9.3.8.v20160314
   [junit4]   2> 1046943 INFO  (TEST-TestSolrConfigHandlerCloud.test-seed#[1F47A2C9DA27B742]) [    ] o.e.j.s.h.ContextHandler Started o.e.j.s.ServletContextHandler@b7e741{/,null,AVAILABLE}
   [junit4]   2> 1046944 INFO  (TEST-TestSolrConfigHandlerCloud.test-seed#[1F47A2C9DA27B742]) [    ] o.e.j.s.ServerConnector Started ServerConnector@71e64f{SSL,[ssl, http/1.1]}{127.0.0.1:40230}
   [junit4]   2> 1046944 INFO  (TEST-TestSolrConfigHandlerCloud.test-seed#[1F47A2C9DA27B742]) [    ] o.e.j.s.Server Started @1049321ms
   [junit4]   2> 1046944 INFO  (TEST-TestSolrConfigHandlerCloud.test-seed#[1F47A2C9DA27B742]) [    ] o.a.s.c.s.e.JettySolrRunner Jetty properties: {hostContext=/, solr.data.dir=/home/jenkins/workspace/Lucene-Solr-master-Linux/solr/build/solr-core/test/J0/temp/solr.handler.TestSolrConfigHandlerCloud_1F47A2C9DA27B742-001/tempDir-001/control/data, hostPort=40230, coreRootDirectory=/home/jenkins/workspace/Lucene-Solr-master-Linux/solr/build/solr-core/test/J0/temp/solr.handler.TestSolrConfigHandlerCloud_1F47A2C9DA27B742-001/control-001/cores}
   [junit4]   2> 1046945 INFO  (TEST-TestSolrConfigHandlerCloud.test-seed#[1F47A2C9DA27B742]) [    ] o.a.s.s.SolrDispatchFilter SolrDispatchFilter.init(): jdk.internal.loader.ClassLoaders$AppClassLoader@1223dd8
   [junit4]   2> 1046945 INFO  (TEST-TestSolrConfigHandlerCloud.test-seed#[1F47A2C9DA27B742]) [    ] o.a.s.c.SolrResourceLoader new SolrResourceLoader for directory: '/home/jenkins/workspace/Lucene-Solr-master-Linux/solr/build/solr-core/test/J0/temp/solr.handler.TestSolrConfigHandlerCloud_1F47A2C9DA27B742-001/control-001'
   [junit4]   2> 1046945 INFO  (TEST-TestSolrConfigHandlerCloud.test-seed#[1F47A2C9DA27B742]) [    ] o.a.s.c.SolrResourceLoader JNDI not configured for solr (NoInitialContextEx)
   [junit4]   2> 1046945 INFO  (TEST-TestSolrConfigHandlerCloud.test-seed#[1F47A2C9DA27B742]) [    ] o.a.s.c.SolrResourceLoader solr home defaulted to 'solr/' (could not find system property or JNDI)
   [junit4]   2> 1046945 INFO  (TEST-TestSolrConfigHandlerCloud.test-seed#[1F47A2C9DA27B742]) [    ] o.a.s.c.c.SolrZkClient Using default ZkCredentialsProvider
   [junit4]   2> 1046946 INFO  (TEST-TestSolrConfigHandlerCloud.test-seed#[1F47A2C9DA27B742]) [    ] o.a.s.c.c.ConnectionManager Waiting for client to connect to ZooKeeper
   [junit4]   2> 1046946 INFO  (zkCallback-1230-thread-1) [    ] o.a.s.c.c.ConnectionManager Watcher org.apache.solr.common.cloud.ConnectionManager@b8d03a name:ZooKeeperConnection Watcher:127.0.0.1:37609/solr got event WatchedEvent state:SyncConnected type:None path:null path:null type:None
   [junit4]   2> 1046946 INFO  (TEST-TestSolrConfigHandlerCloud.test-seed#[1F47A2C9DA27B742]) [    ] o.a.s.c.c.ConnectionManager Client is connected to ZooKeeper
   [junit4]   2> 1046947 INFO  (TEST-TestSolrConfigHandlerCloud.test-seed#[1F47A2C9DA27B742]) [    ] o.a.s.c.c.SolrZkClient Using default ZkACLProvider
   [junit4]   2> 1046947 INFO  (TEST-TestSolrConfigHandlerCloud.test-seed#[1F47A2C9DA27B742]) [    ] o.a.s.s.SolrDispatchFilter Loading solr.xml from SolrHome (not found in ZooKeeper)
   [junit4]   2> 1046947 INFO  (TEST-TestSolrConfigHandlerCloud.test-seed#[1F47A2C9DA27B742]) [    ] o.a.s.c.SolrXmlConfig Loading container configuration from /home/jenkins/workspace/Lucene-Solr-master-Linux/solr/build/solr-core/test/J0/temp/solr.handler.TestSolrConfigHandlerCloud_1F47A2C9DA27B742-001/control-001/solr.xml
   [junit4]   2> 1046951 INFO  (TEST-TestSolrConfigHandlerCloud.test-seed#[1F47A2C9DA27B742]) [    ] o.a.s.c.CorePropertiesLocator Config-defined core root directory: /home/jenkins/workspace/Lucene-Solr-master-Linux/solr/build/solr-core/test/J0/temp/solr.handler.TestSolrConfigHandlerCloud_1F47A2C9DA27B742-001/control-001/cores
   [junit4]   2> 1046951 INFO  (TEST-TestSolrConfigHandlerCloud.test-seed#[1F47A2C9DA27B742]) [    ] o.a.s.c.CoreContainer New CoreContainer 32122928
   [junit4]   2> 1046951 INFO  (TEST-TestSolrConfigHandlerCloud.test-seed#[1F47A2C9DA27B742]) [    ] o.a.s.c.CoreContainer Loading cores into CoreContainer [instanceDir=/home/jenkins/workspace/Lucene-Solr-master-Linux/solr/build/solr-core/test/J0/temp/solr.handler.TestSolrConfigHandlerCloud_1F47A2C9DA27B742-001/control-001]
   [junit4]   2> 1046951 WARN  (TEST-TestSolrConfigHandlerCloud.test-seed#[1F47A2C9DA27B742]) [    ] o.a.s.c.CoreContainer Couldn't add files from /home/jenkins/workspace/Lucene-Solr-master-Linux/solr/build/solr-core/test/J0/temp/solr.handler.TestSolrConfigHandlerCloud_1F47A2C9DA27B742-001/control-001/lib to classpath: /home/jenkins/workspace/Lucene-Solr-master-Linux/solr/build/solr-core/test/J0/temp/solr.handler.TestSolrConfigHandlerCloud_1F47A2C9DA27B742-001/control-001/lib
   [junit4]   2> 1046952 INFO  (TEST-TestSolrConfigHandlerCloud.test-seed#[1F47A2C9DA27B742]) [    ] o.a.s.h.c.HttpShardHandlerFactory created with socketTimeout : 90000,urlScheme : ,connTimeout : 15000,maxConnectionsPerHost : 20,maxConnections : 10000,corePoolSize : 0,maximumPoolSize : 2147483647,maxThreadIdleTime : 5,sizeOfQueue : -1,fairnessPolicy : false,
   [junit4]   2> 1046953 INFO  (TEST-TestSolrConfigHandlerCloud.test-seed#[1F47A2C9DA27B742]) [    ] o.a.s.u.UpdateShardHandler Created UpdateShardHandler HTTP client with params: socketTimeout=340000&connTimeout=45000&maxConnections=100000&maxConnectionsPerHost=100000
   [junit4]   2> 1046953 INFO  (TEST-TestSolrConfigHandlerCloud.test-seed#[1F47A2C9DA27B742]) [    ] o.a.s.l.LogWatcher SLF4J impl is org.slf4j.impl.Log4jLoggerFactory
   [junit4]   2> 1046953 INFO  (TEST-TestSolrConfigHandlerCloud.test-seed#[1F47A2C9DA27B742]) [    ] o.a.s.l.LogWatcher Registering Log Listener [Log4j (org.slf4j.impl.Log4jLoggerFactory)]
   [junit4]   2> 1046953 INFO  (TEST-TestSolrConfigHandlerCloud.test-seed#[1F47A2C9DA27B742]) [    ] o.a.s.c.ZkContainer Zookeeper client=127.0.0.1:37609/solr
   [junit4]   2> 1046953 INFO  (TEST-TestSolrConfigHandlerCloud.test-seed#[1F47A2C9DA27B742]) [    ] o.a.s.c.ZkController zkHost includes chroot
   [junit4]   2> 1046954 INFO  (TEST-TestSolrConfigHandlerCloud.test-seed#[1F47A2C9DA27B742]) [    ] o.a.s.c.c.SolrZkClient Using default ZkCredentialsProvider
   [junit4]   2> 1046954 INFO  (TEST-TestSolrConfigHandlerCloud.test-seed#[1F47A2C9DA27B742]) [    ] o.a.s.c.c.ConnectionManager Waiting for client to connect to ZooKeeper
   [junit4]   2> 1046954 INFO  (zkCallback-1233-thread-1) [    ] o.a.s.c.c.ConnectionManager Watcher org.apache.solr.common.cloud.ConnectionManager@1ee1ba2 name:ZooKeeperConnection Watcher:127.0.0.1:37609 got event WatchedEvent state:SyncConnected type:None path:null path:null type:None
   [junit4]   2> 1046954 INFO  (TEST-TestSolrConfigHandlerCloud.test-seed#[1F47A2C9DA27B742]) [    ] o.a.s.c.c.ConnectionManager Client is connected to ZooKeeper
   [junit4]   2> 1046955 INFO  (TEST-TestSolrConfigHandlerCloud.test-seed#[1F47A2C9DA27B742]) [    ] o.a.s.c.c.SolrZkClient Using default ZkACLProvider
   [junit4]   2> 1046955 INFO  (TEST-TestSolrConfigHandlerCloud.test-seed#[1F47A2C9DA27B742]) [    ] o.a.s.c.ZkController Added new OnReconnect listener org.apache.solr.cloud.ZkController$$Lambda$216/22669171@1fdab4
   [junit4]   2> 1046955 INFO  (TEST-TestSolrConfigHandlerCloud.test-seed#[1F47A2C9DA27B742]) [    ] o.a.s.c.c.ConnectionManager Waiting for client to connect to ZooKeeper
   [junit4]   2> 1046956 INFO  (zkCallback-1234-thread-1) [    ] o.a.s.c.c.ConnectionManager Watcher org.apache.solr.common.cloud.ConnectionManager@440a52 name:ZooKeeperConnection Watcher:127.0.0.1:37609/solr got event WatchedEvent state:SyncConnected type:None path:null path:null type:None
   [junit4]   2> 1046956 INFO  (TEST-TestSolrConfigHandlerCloud.test-seed#[1F47A2C9DA27B742]) [    ] o.a.s.c.c.ConnectionManager Client is connected to ZooKeeper
   [junit4]   2> 1046956 INFO  (TEST-TestSolrConfigHandlerCloud.test-seed#[1F47A2C9DA27B742]) [    ] o.a.s.c.c.SolrZkClient makePath: /overseer/queue
   [junit4]   2> 1046957 INFO  (TEST-TestSolrConfigHandlerCloud.test-seed#[1F47A2C9DA27B742]) [    ] o.a.s.c.c.SolrZkClient makePath: /overseer/collection-queue-work
   [junit4]   2> 1046958 INFO  (TEST-TestSolrConfigHandlerCloud.test-seed#[1F47A2C9DA27B742]) [    ] o.a.s.c.c.SolrZkClient makePath: /overseer/collection-map-running
   [junit4]   2> 1046959 INFO  (TEST-TestSolrConfigHandlerCloud.test-seed#[1F47A2C9DA27B742]) [    ] o.a.s.c.c.SolrZkClient makePath: /overseer/collection-map-completed
   [junit4]   2> 1046960 INFO  (TEST-TestSolrConfigHandlerCloud.test-seed#[1F47A2C9DA27B742]) [    ] o.a.s.c.c.SolrZkClient makePath: /overseer/collection-map-failure
   [junit4]   2> 1046960 INFO  (TEST-TestSolrConfigHandlerCloud.test-seed#[1F47A2C9DA27B742]) [    ] o.a.s.c.c.SolrZkClient makePath: /live_nodes
   [junit4]   2> 1046961 INFO  (TEST-TestSolrConfigHandlerCloud.test-seed#[1F47A2C9DA27B742]) [    ] o.a.s.c.c.SolrZkClient makePath: /aliases.json
   [junit4]   2> 1046962 INFO  (TEST-TestSolrConfigHandlerCloud.test-seed#[1F47A2C9DA27B742]) [    ] o.a.s.c.c.SolrZkClient makePath: /clusterstate.json
   [junit4]   2> 1046962 INFO  (TEST-TestSolrConfigHandlerCloud.test-seed#[1F47A2C9DA27B742]) [    ] o.a.s.c.c.SolrZkClient makePath: /security.json
   [junit4]   2> 1046963 INFO  (TEST-TestSolrConfigHandlerCloud.test-seed#[1F47A2C9DA27B742]) [    ] o.a.s.c.c.ZkStateReader Updating cluster state from ZooKeeper... 
   [junit4]   2> 1046963 INFO  (TEST-TestSolrConfigHandlerCloud.test-seed#[1F47A2C9DA27B742]) [    ] o.a.s.c.c.ZkStateReader Loaded cluster properties: {urlScheme=https}
   [junit4]   2> 1046963 INFO  (TEST-TestSolrConfigHandlerCloud.test-seed#[1F47A2C9DA27B742]) [    ] o.a.s.c.c.ZkStateReader Updated live nodes from ZooKeeper... (0) -> (0)
   [junit4]   2> 1046964 INFO  (TEST-TestSolrConfigHandlerCloud.test-seed#[1F47A2C9DA27B742]) [    ] o.a.s.c.c.SolrZkClient makePath: /overseer_elect
   [junit4]   2> 1046965 INFO  (TEST-TestSolrConfigHandlerCloud.test-seed#[1F47A2C9DA27B742]) [    ] o.a.s.c.c.SolrZkClient makePath: /overseer_elect/election
   [junit4]   2> 1046965 INFO  (TEST-TestSolrConfigHandlerCloud.test-seed#[1F47A2C9DA27B742]) [    ] o.a.s.c.Overseer Overseer (id=null) closing
   [junit4]   2> 1046965 INFO  (TEST-TestSolrConfigHandlerCloud.test-seed#[1F47A2C9DA27B742]) [    ] o.a.s.c.LeaderElector Joined leadership election with path: /overseer_elect/election/96571226466353157-127.0.0.1:40230_-n_0000000000
   [junit4]   2> 1046965 INFO  (TEST-TestSolrConfigHandlerCloud.test-seed#[1F47A2C9DA27B742]) [    ] o.a.s.c.OverseerElectionContext I am going to be the leader 127.0.0.1:40230_
   [junit4]   2> 1046965 INFO  (TEST-TestSolrConfigHandlerCloud.test-seed#[1F47A2C9DA27B742]) [    ] o.a.s.c.c.SolrZkClient makePath: /overseer_elect/leader
   [junit4]   2> 1046966 INFO  (TEST-TestSolrConfigHandlerCloud.test-seed#[1F47A2C9DA27B742]) [    ] o.a.s.c.Overseer Overseer (id=96571226466353157-127.0.0.1:40230_-n_0000000000) starting
   [junit4]   2> 1046966 INFO  (TEST-TestSolrConfigHandlerCloud.test-seed#[1F47A2C9DA27B742]) [    ] o.a.s.c.c.SolrZkClient makePath: /overseer/queue-work
   [junit4]   2> 1046968 INFO  (TEST-TestSolrConfigHandlerCloud.test-seed#[1F47A2C9DA27B742]) [    ] o.a.s.c.OverseerAutoReplicaFailoverThread Starting OverseerAutoReplicaFailoverThread autoReplicaFailoverWorkLoopDelay=10000 autoReplicaFailoverWaitAfterExpiration=10000 autoReplicaFailoverBadNodeExpiration=60000
   [junit4]   2> 1046969 INFO  (OverseerCollectionConfigSetProcessor-96571226466353157-127.0.0.1:40230_-n_0000000000) [    ] o.a.s.c.OverseerTaskProcessor Process current queue of overseer operations
   [junit4]   2> 1046969 INFO  (OverseerStateUpdate-96571226466353157-127.0.0.1:40230_-n_0000000000) [    ] o.a.s.c.Overseer Starting to work on the main queue
   [junit4]   2> 1046969 INFO  (TEST-TestSolrConfigHandlerCloud.test-seed#[1F47A2C9DA27B742]) [    ] o.a.s.c.ZkController Register node as live in ZooKeeper:/live_nodes/127.0.0.1:40230_
   [junit4]   2> 1046969 INFO  (TEST-TestSolrConfigHandlerCloud.test-seed#[1F47A2C9DA27B742]) [    ] o.a.s.c.c.SolrZkClient makePath: /live_nodes/127.0.0.1:40230_
   [junit4]   2> 1046969 INFO  (OverseerStateUpdate-96571226466353157-127.0.0.1:40230_-n_0000000000) [    ] o.a.s.c.c.ZkStateReader Updated live nodes from ZooKeeper... (0) -> (0)
   [junit4]   2> 1046970 INFO  (zkCallback-1234-thread-1) [    ] o.a.s.c.c.ZkStateReader A live node change: [WatchedEvent state:SyncConnected type:NodeChildrenChanged path:/live_nodes], has occurred - updating... (live nodes size: [0])
   [junit4]   2> 1046970 INFO  (zkCallback-1234-thread-1) [    ] o.a.s.c.c.ZkStateReader Updated live nodes from ZooKeeper... (0) -> (1)
   [junit4]   2> 1046983 INFO  (TEST-TestSolrConfigHandlerCloud.test-seed#[1F47A2C9DA27B742]) [    ] o.a.s.c.CoreContainer Security conf doesn't exist. Skipping setup for authorization module.
   [junit4]   2> 1046983 INFO  (TEST-TestSolrConfigHandlerCloud.test-seed#[1F47A2C9DA27B742]) [    ] o.a.s.c.CoreContainer No authentication plugin used.
   [junit4]   2> 1046983 INFO  (TEST-TestSolrConfigHandlerCloud.test-seed#[1F47A2C9DA27B742]) [    ] o.a.s.c.CorePropertiesLocator Looking for core definitions underneath /home/jenkins/workspace/Lucene-Solr-master-Linux/solr/build/solr-core/test/J0/temp/solr.handler.TestSolrConfigHandlerCloud_1F47A2C9DA27B742-001/control-001/cores
   [junit4]   2> 1046984 INFO  (TEST-TestSolrConfigHandlerCloud.test-seed#[1F47A2C9DA27B742]) [    ] o.a.s.c.CoreDescriptor Created CoreDescriptor: {schema=schema.xml, dataDir=data/, collection=control_collection, loadOnStartup=true, coreNodeName=, transient=false, name=collection1, shard=, config=solrconfig.xml, configSetProperties=configsetprops.json}
   [junit4]   2> 1046984 INFO  (TEST-TestSolrConfigHandlerCloud.test-seed#[1F47A2C9DA27B742]) [    ] o.a.s.c.CorePropertiesLocator Found core collection1 in /home/jenkins/workspace/Lucene-Solr-master-Linux/solr/build/solr-core/test/J0/temp/solr.handler.TestSolrConfigHandlerCloud_1F47A2C9DA27B742-001/control-001/cores/collection1
   [junit4]   2> 1046984 INFO  (TEST-TestSolrConfigHandlerCloud.test-seed#[1F47A2C9DA27B742]) [    ] o.a.s.c.CorePropertiesLocator Found 1 core definitions
   [junit4]   2> 1046984 INFO  (coreLoadExecutor-4455-thread-1) [    ] o.a.s.c.ZkController publishing state=down
   [junit4]   2> 1046984 INFO  (coreLoadExecutor-4455-thread-1) [    ] o.a.s.c.ZkController numShards not found on descriptor - reading it from system property
   [junit4]   2> 1046984 INFO  (TEST-TestSolrConfigHandlerCloud.test-seed#[1F47A2C9DA27B742]) [    ] o.a.s.s.SolrDispatchFilter user.dir=/home/jenkins/workspace/Lucene-Solr-master-Linux/solr/build/solr-core/test/J0
   [junit4]   2> 1046984 INFO  (TEST-TestSolrConfigHandlerCloud.test-seed#[1F47A2C9DA27B742]) [    ] o.a.s.s.SolrDispatchFilter SolrDispatchFilter.init() done
   [junit4]   2> 1046986 INFO  (coreLoadExecutor-4455-thread-1) [    ] o.a.s.c.ZkController Collection control_collection not visible yet, but flagging it so a watch is registered when it becomes visible
   [junit4]   2> 1046986 INFO  (OverseerStateUpdate-96571226466353157-127.0.0.1:40230_-n_0000000000) [    ] o.a.s.c.Overseer processMessage: queueSize: 1, message = {
   [junit4]   2>   "core":"collection1",
   [junit4]   2>   "roles":null,
   [junit4]   2>   "base_url":"https://127.0.0.1:40230",
   [junit4]   2>   "node_name":"127.0.0.1:40230_",
   [junit4]   2>   "numShards":"1",
   [junit4]   2>   "state":"down",
   [junit4]   2>   "shard":null,
   [junit4]   2>   "collection":"control_collection",
   [junit4]   2>   "operation":"state"} current state version: 0
   [junit4]   2> 1046986 INFO  (OverseerStateUpdate-96571226466353157-127.0.0.1:40230_-n_0000000000) [    ] o.a.s.c.o.ReplicaMutator Update state numShards=1 message={
   [junit4]   2>   "core":"collection1",
   [junit4]   2>   "roles":null,
   [junit4]   2>   "base_url":"https://127.0.0.1:40230",
   [junit4]   2>   "node_name":"127.0.0.1:40230_",
   [junit4]   2>   "numShards":"1",
   [junit4]   2>   "state":"down",
   [junit4]   2>   "shard":null,
   [junit4]   2>   "collection":"control_collection",
   [junit4]   2>   "operation":"state"}
   [junit4]   2> 1046986 INFO  (coreLoadExecutor-4455-thread-1) [    ] o.a.s.c.c.ZkStateReader Deleting data for [control_collection]
   [junit4]   2> 1046986 INFO  (OverseerStateUpdate-96571226466353157-127.0.0.1:40230_-n_0000000000) [    ] o.a.s.c.o.ClusterStateMutator building a new cName: control_collection
   [junit4]   2> 1046987 INFO  (OverseerStateUpdate-96571226466353157-127.0.0.1:40230_-n_0000000000) [    ] o.a.s.c.o.ReplicaMutator Assigning new node to shard shard=shard1
   [junit4]   2> 1046987 INFO  (coreLoadExecutor-4455-thread-1) [    ] o.a.s.c.ZkController look for our core node name
   [junit4]   2> 1046987 INFO  (zkCallback-1234-thread-1) [    ] o.a.s.c.c.ZkStateReader A cluster state change: [WatchedEvent state:SyncConnected type:NodeDataChanged path:/clusterstate.json], has occurred - updating... (live nodes size: [1])
   [junit4]   2> 1047987 INFO  (coreLoadExecutor-4455-thread-1) [    ] o.a.s.c.ZkController waiting to find shard id in clusterstate for collection1
   [junit4]   2> 1047987 INFO  (coreLoadExecutor-4455-thread-1) [    ] o.a.s.c.ZkController Check for collection zkNode:control_collection
   [junit4]   2> 1047987 INFO  (coreLoadExecutor-4455-thread-1) [    ] o.a.s.c.ZkController Collection zkNode exists
   [junit4]   2> 1047987 INFO  (coreLoadExecutor-4455-thread-1) [    ] o.a.s.c.c.ZkStateReader Load collection config from: [/collections/control_collection]
   [junit4]   2> 1047988 INFO  (coreLoadExecutor-4455-thread-1) [    ] o.a.s.c.c.ZkStateReader path=[/collections/control_collection] [configName]=[conf1] specified config exists in ZooKeeper
   [junit4]   2> 1047988 INFO  (coreLoadExecutor-4455-thread-1) [    ] o.a.s.c.SolrResourceLoader new SolrResourceLoader for directory: '/home/jenkins/workspace/Lucene-Solr-master-Linux/solr/build/solr-core/test/J0/temp/solr.handler.TestSolrConfigHandlerCloud_1F47A2C9DA27B742-001/control-001/cores/collection1'
   [junit4]   2> 1047988 INFO  (coreLoadExecutor-4455-thread-1) [    ] o.a.s.c.SolrResourceLoader JNDI not configured for solr (NoInitialContextEx)
   [junit4]   2> 1047988 INFO  (coreLoadExecutor-4455-thread-1) [    ] o.a.s.c.SolrResourceLoader solr home defaulted to 'solr/' (could not find system property or JNDI)
   [junit4]   2> 1047989 INFO  (coreLoadExecutor-4455-thread-1) [    ] o.a.s.c.Config loaded config solrconfig.xml with version 0 
   [junit4]   2> 1047992 INFO  (coreLoadExecutor-4455-thread-1) [    ] o.a.s.c.SolrConfig current version of requestparams : -1
   [junit4]   2> 1047995 INFO  (coreLoadExecutor-4455-thread-1) [    ] o.a.s.c.SolrConfig Using Lucene MatchVersion: 7.0.0
   [junit4]   2> 1048000 INFO  (coreLoadExecutor-4455-thread-1) [    ] o.a.s.c.SolrConfig Loaded SolrConfig: solrconfig.xml
   [junit4]   2> 1048004 INFO  (coreLoadExecutor-4455-thread-1) [    ] o.a.s.s.IndexSchema [collection1] Schema name=test
   [junit4]   2> 1048056 INFO  (coreLoadExecutor-4455-thread-1) [    ] o.a.s.s.OpenExchangeRatesOrgProvider Initialized with rates=open-exchange-rates.json, refreshInterval=1440.
   [junit4]   2> 1048060 INFO  (coreLoadExecutor-4455-thread-1) [    ] o.a.s.s.IndexSchema default search field in schema is text
   [junit4]   2> 1048061 INFO  (coreLoadExecutor-4455-thread-1) [    ] o.a.s.s.IndexSchema unique key field: id
   [junit4]   2> 1048065 INFO  (coreLoadExecutor-4455-thread-1) [    ] o.a.s.s.FileExchangeRateProvider Reloading exchange rates from file currency.xml
   [junit4]   2> 1048066 INFO  (coreLoadExecutor-4455-thread-1) [    ] o.a.s.s.FileExchangeRateProvider Reloading exchange rates from file currency.xml
   [junit4]   2> 1048067 INFO  (coreLoadExecutor-4455-thread-1) [    ] o.a.s.s.OpenExchangeRatesOrgProvider Reloading exchange rates from open-exchange-rates.json
   [junit4]   2> 1048067 INFO  (coreLoadExecutor-4455-thread-1) [    ] o.a.s.s.OpenExchangeRatesOrgProvider Reloading exchange rates from open-exchange-rates.json
   [junit4]   2> 1048068 INFO  (coreLoadExecutor-4455-thread-1) [    ] o.a.s.c.ConfigSetProperties Did not find ConfigSet properties, assuming default properties: Can't find resource 'configsetprops.json' in classpath or '/configs/conf1', cwd=/home/jenkins/workspace/Lucene-Solr-master-Linux/solr/build/solr-core/test/J0
   [junit4]   2> 1048068 INFO  (coreLoadExecutor-4455-thread-1) [    ] o.a.s.c.CoreContainer Creating SolrCore 'collection1' using configuration from collection control_collection
   [junit4]   2> 1048068 INFO  (coreLoadExecutor-4455-thread-1) [    ] o.a.s.c.SolrCore org.apache.solr.core.MockDirectoryFactory
   [junit4]   2> 1048068 INFO  (coreLoadExecutor-4455-thread-1) [    ] o.a.s.c.SolrCore [[collection1] ] Opening new SolrCore at [/home/jenkins/workspace/Lucene-Solr-master-Linux/solr/build/solr-core/test/J0/temp/solr.handler.TestSolrConfigHandlerCloud_1F47A2C9DA27B742-001/control-001/cores/collection1], dataDir=[/home/jenkins/workspace/Lucene-Solr-master-Linux/solr/build/solr-core/test/J0/temp/solr.handler.TestSolrConfigHandlerCloud_1F47A2C9DA27B742-001/control-001/cores/collection1/data/]
   [junit4]   2> 1048068 INFO  (coreLoadExecutor-4455-thread-1) [    ] o.a.s.c.JmxMonitoredMap JMX monitoring is enabled. Adding Solr mbeans to JMX Server: com.sun.jmx.mbeanserver.JmxMBeanServer@194bf52
   [junit4]   2> 1048069 INFO  (coreLoadExecutor-4455-thread-1) [    ] o.a.s.c.CachingDirectoryFactory return new directory for /home/jenkins/workspace/Lucene-Solr-master-Linux/solr/build/solr-core/test/J0/temp/solr.handler.TestSolrConfigHandlerCloud_1F47A2C9DA27B742-001/control-001/cores/collection1/data/snapshot_metadata
   [junit4]   2> 1048069 INFO  (coreLoadExecutor-4455-thread-1) [    ] o.a.s.c.s.SolrSnapshotMetaDataManager Loading from snapshot metadata file...
   [junit4]   2> 1048069 INFO  (coreLoadExecutor-4455-thread-1) [    ] o.a.s.c.CachingDirectoryFactory return new directory for /home/jenkins/workspace/Lucene-Solr-master-Linux/solr/build/solr-core/test/J0/temp/solr.handler.TestSolrConfigHandlerCloud_1F47A2C9DA27B742-001/control-001/cores/collection1/data
   [junit4]   2> 1048069 INFO  (coreLoadExecutor-4455-thread-1) [    ] o.a.s.c.SolrCore New index directory detected: old=null new=/home/jenkins/workspace/Lucene-Solr-master-Linux/solr/build/solr-core/test/J0/temp/solr.handler.TestSolrConfigHandlerCloud_1F47A2C9DA27B742-001/control-001/cores/collection1/data/index/
   [junit4]   2> 1048069 WARN  (coreLoadExecutor-4455-thread-1) [    ] o.a.s.c.SolrCore [collection1] Solr index directory '/home/jenkins/workspace/Lucene-Solr-master-Linux/solr/build/solr-core/test/J0/temp/solr.handler.TestSolrConfigHandlerCloud_1F47A2C9DA27B742-001/control-001/cores/collection1/data/index' doesn't exist. Creating new index...
   [junit4]   2> 1048069 INFO  (coreLoadExecutor-4455-thread-1) [    ] o.a.s.c.CachingDirectoryFactory return new directory for /home/jenkins/workspace/Lucene-Solr-master-Linux/solr/build/solr-core/test/J0/temp/solr.handler.TestSolrConfigHandlerCloud_1F47A2C9DA27B742-001/control-001/cores/collection1/data/index
   [junit4]   2> 1048069 INFO  (coreLoadExecutor-4455-thread-1) [    ] o.a.s.u.RandomMergePolicy RandomMergePolicy wrapping class org.apache.lucene.index.LogByteSizeMergePolicy: [LogByteSizeMergePolicy: minMergeSize=1677721, mergeFactor=30, maxMergeSize=2147483648, maxMergeSizeForForcedMerge=9223372036854775807, calibrateSizeByDeletes=true, maxMergeDocs=2147483647, maxCFSSegmentSizeMB=8.796093022207999E12, noCFSRatio=0.8525563029375415]
   [junit4]   2> 1048069 INFO  (coreLoadExecutor-4455-thread-1) [    ] o.a.s.c.SolrDeletionPolicy SolrDeletionPolicy.onCommit: commits: num=1
   [junit4]   2> 	commit{dir=MockDirectoryWrapper(RAMDirectory@1ac9e45 lockFactory=org.apache.lucene.store.SingleInstanceLockFactory@342f7d),segFN=segments_1,generation=1}
   [junit4]   2> 1048069 INFO  (coreLoadExecutor-4455-thread-1) [    ] o.a.s.c.SolrDeletionPolicy newest commit generation = 1
   [junit4]   2> 1048070 INFO  (OldIndexDirectoryCleanupThreadForCore-collection1) [    ] o.a.s.c.SolrCore Looking for old index directories to cleanup for core collection1 in /home/jenkins/workspace/Lucene-Solr-master-Linux/solr/build/solr-core/test/J0/temp/solr.handler.TestSolrConfigHandlerCloud_1F47A2C9DA27B742-001/control-001/cores/collection1/data/
   [junit4]   2> 1048070 WARN  (OldIndexDirectoryCleanupThreadForCore-collection1) [    ] o.a.s.c.DirectoryFactory /home/jenkins/workspace/Lucene-Solr-master-Linux/solr/build/solr-core/test/J0/temp/solr.handler.TestSolrConfigHandlerCloud_1F47A2C9DA27B742-001/control-001/cores/collection1/data/ does not point to a valid data directory; skipping clean-up of old index directories.
   [junit4]   2> 1048072 INFO  (coreLoadExecutor-4455-thread-1) [    ] o.a.s.u.p.UpdateRequestProcessorChain creating updateRequestProcessorChain "nodistrib"
   [junit4]   2> 1048072 INFO  (coreLoadExecutor-4455-thread-1) [    ] o.a.s.u.p.UpdateRequestProcessorChain creating updateRequestProcessorChain "dedupe"
   [junit4]   2> 1048072 INFO  (coreLoadExecutor-4455-thread-1) [    ] o.a.s.u.p.UpdateRequestProcessorChain inserting DistributedUpdateProcessorFactory into updateRequestProcessorChain "dedupe"
   [junit4]   2> 1048072 INFO  (coreLoadExecutor-4455-thread-1) [    ] o.a.s.u.p.UpdateRequestProcessorChain creating updateRequestProcessorChain "stored_sig"
   [junit4]   2> 1048072 INFO  (coreLoadExecutor-4455-thread-1) [    ] o.a.s.u.p.UpdateRequestProcessorChain inserting DistributedUpdateProcessorFactory into updateRequestProcessorChain "stored_sig"
   [junit4]   2> 1048072 INFO  (coreLoadExecutor-4455-thread-1) [    ] o.a.s.u.p.UpdateRequestProcessorChain creating updateRequestProcessorChain "distrib-dup-test-chain-explicit"
   [junit4]   2> 1048072 INFO  (coreLoadExecutor-4455-thread-1) [    ] o.a.s.u.p.UpdateRequestProcessorChain creating updateRequestProcessorChain "distrib-dup-test-chain-implicit"
   [junit4]   2> 1048072 INFO  (coreLoadExecutor-4455-thread-1) [    ] o.a.s.u.p.UpdateRequestProcessorChain inserting DistributedUpdateProcessorFactory into updateRequestProcessorChain "distrib-dup-test-chain-implicit"
   [junit4]   2> 1048072 INFO  (coreLoadExecutor-4455-thread-1) [    ] o.a.s.c.SolrCore no updateRequestProcessorChain defined as default, creating implicit default
   [junit4]   2> 1048072 WARN  (coreLoadExecutor-4455-thread-1) [    ] o.a.s.c.RequestHandlers INVALID paramSet a in requestHandler {type = requestHandler,name = /dump,class = DumpRequestHandler,args = {defaults={a=A,b=B}}}
   [junit4]   2> 1048073 INFO  (coreLoadExecutor-4455-thread-1) [    ] o.a.s.h.l.XMLLoader xsltCacheLifetimeSeconds=60
   [junit4]   2> 1048074 INFO  (coreLoadExecutor-4455-thread-1) [    ] o.a.s.h.l.XMLLoader xsltCacheLifetimeSeconds=60
   [junit4]   2> 1048074 INFO  (coreLoadExecutor-4455-thread-1) [    ] o.a.s.h.l.XMLLoader xsltCacheLifetimeSeconds=60
   [junit4]   2> 1048075 INFO  (coreLoadExecutor-4455-thread-1) [    ] o.a.s.h.l.XMLLoader xsltCacheLifetimeSeconds=60
   [junit4]   2> 1048077 INFO  (coreLoadExecutor-4455-thread-1) [    ] o.a.s.c.RequestHandlers Registered paths: /admin/mbeans,standard,/update/json/docs,/admin/luke,/export,/get,/admin/properties,/update/json,/admin/threads,/dump,/update/csv,/sql,/graph,/admin/segments,/admin/system,/replication,/config,/stream,/schema,/admin/plugins,/admin/logging,/admin/ping,/update,/admin/file,/terms
   [junit4]   2> 1048077 INFO  (coreLoadExecutor-4455-thread-1) [    ] o.a.s.c.SolrCore Using default statsCache cache: org.apache.solr.search.stats.LocalStatsCache
   [junit4]   2> 1048077 INFO  (coreLoadExecutor-4455-thread-1) [    ] o.a.s.u.UpdateHandler Using UpdateLog implementation: org.apache.solr.update.UpdateLog
   [junit4]   2> 1048077 INFO  (coreLoadExecutor-4455-thread-1) [    ] o.a.s.u.UpdateLog Initializing UpdateLog: dataDir= defaultSyncLevel=FLUSH numRecordsToKeep=100 maxNumLogsToKeep=10 numVersionBuckets=65536
   [junit4]   2> 1048078 INFO  (coreLoadExecutor-4455-thread-1) [    ] o.a.s.u.CommitTracker Hard AutoCommit: disabled
   [junit4]   2> 1048078 INFO  (coreLoadExecutor-4455-thread-1) [    ] o.a.s.u.CommitTracker Soft AutoCommit: disabled
   [junit4]   2> 1048078 INFO  (coreLoadExecutor-4455-thread-1) [    ] o.a.s.u.RandomMergePolicy RandomMergePolicy wrapping class org.apache.lucene.index.TieredMergePolicy: [TieredMergePolicy: maxMergeAtOnce=32, maxMergeAtOnceExplicit=49, maxMergedSegmentMB=15.0244140625, floorSegmentMB=0.2666015625, forceMergeDeletesPctAllowed=1.9951762988281863, segmentsPerTier=50.0, maxCFSSegmentSizeMB=8.796093022207999E12, noCFSRatio=0.0
   [junit4]   2> 1048078 INFO  (coreLoadExecutor-4455-thread-1) [    ] o.a.s.c.SolrDeletionPolicy SolrDeletionPolicy.onInit: commits: num=1
   [junit4]   2> 	commit{dir=MockDirectoryWrapper(RAMDirectory@1ac9e45 lockFactory=org.apache.lucene.store.SingleInstanceLockFactory@342f7d),segFN=segments_1,generation=1}
   [junit4]   2> 1048078 INFO  (coreLoadExecutor-4455-thread-1) [    ] o.a.s.c.SolrDeletionPolicy newest commit generation = 1
   [junit4]   2> 1048078 INFO  (coreLoadExecutor-4455-thread-1) [    ] o.a.s.s.SolrIndexSearcher Opening [Searcher@9f7c6[collection1] main]
   [junit4]   2> 1048079 INFO  (coreLoadExecutor-4455-thread-1) [    ] o.a.s.c.c.ZkStateReader Load collection config from: [/collections/control_collection]
   [junit4]   2> 1048079 INFO  (coreLoadExecutor-4455-thread-1) [    ] o.a.s.c.c.ZkStateReader path=[/collections/control_collection] [configName]=[conf1] specified config exists in ZooKeeper
   [junit4]   2> 1048079 INFO  (coreLoadExecutor-4455-thread-1) [    ] o.a.s.r.ManagedResourceStorage Setting up ZooKeeper-based storage for the RestManager with znodeBase: /configs/conf1
   [junit4]   2> 1048079 INFO  (coreLoadExecutor-4455-thread-1) [    ] o.a.s.r.ManagedResourceStorage Configured ZooKeeperStorageIO with znodeBase: /configs/conf1
   [junit4]   2> 1048079 INFO  (coreLoadExecutor-4455-thread-1) [    ] o.a.s.r.RestManager Initializing RestManager with initArgs: {}
   [junit4]   2> 1048079 INFO  (coreLoadExecutor-4455-thread-1) [    ] o.a.s.r.ManagedResourceStorage Reading _rest_managed.json using ZooKeeperStorageIO:path=/configs/conf1
   [junit4]   2> 1048079 INFO  (coreLoadExecutor-4455-thread-1) [    ] o.a.s.r.ManagedResourceStorage No data found for znode /configs/conf1/_rest_managed.json
   [junit4]   2> 1048079 INFO  (coreLoadExecutor-4455-thread-1) [    ] o.a.s.r.ManagedResourceStorage Loaded null at path _rest_managed.json using ZooKeeperStorageIO:path=/configs/conf1
   [junit4]   2> 1048079 INFO  (coreLoadExecutor-4455-thread-1) [    ] o.a.s.r.RestManager Initializing 0 registered ManagedResources
   [junit4]   2> 1048079 INFO  (coreLoadExecutor-4455-thread-1) [    ] o.a.s.h.ReplicationHandler Commits will be reserved for  10000
   [junit4]   2> 1048080 INFO  (searcherExecutor-4456-thread-1) [    ] o.a.s.c.SolrCore [collection1] Registered new searcher Searcher@9f7c6[collection1] main{ExitableDirectoryReader(UninvertingDirectoryReader())}
   [junit4]   2> 1048080 INFO  (coreLoadExecutor-4455-thread-1) [    ] o.a.s.u.UpdateLog Looking up max value of version field to seed version buckets
   [junit4]   2> 1048080 INFO  (coreLoadExecutor-4455-thread-1) [    ] o.a.s.u.VersionInfo Refreshing highest value of _version_ for 65536 version buckets from index
   [junit4]   2> 1048080 INFO  (coreLoadExecutor-4455-thread-1) [    ] o.a.s.u.VersionInfo No terms found for _version_, cannot seed version bucket highest value from index
   [junit4]   2> 1048080 INFO  (coreLoadExecutor-4455-thread-1) [    ] o.a.s.u.UpdateLog Could not find max version in index or recent updates, using new clock 1545139624847867904
   [junit4]   2> 1048081 INFO  (coreLoadExecutor-4455-thread-1) [    ] o.a.s.u.UpdateLog Took 1.0ms to seed version buckets with highest version 1545139624847867904
   [junit4]   2> 1048082 INFO  (coreLoadExecutor-4455-thread-1) [    ] o.a.s.c.ZkController watch zkdir /configs/conf1
   [junit4]   2> 1048082 INFO  (coreLoadExecutor-4455-thread-1) [    ] o.a.s.c.CoreContainer registering core: collection1
   [junit4]   2> 1048082 INFO  (coreZkRegister-4448-thread-1) [    ] o.a.s.c.ZkController Register replica - core:collection1 address:https://127.0.0.1:40230 collection:control_collection shard:shard1
   [junit4]   2> 1048082 INFO  (coreZkRegister-4448-thread-1) [    ] o.a.s.c.c.SolrZkClient makePath: /collections/control_collection/leader_elect/shard1/election
   [junit4]   2> 1048083 INFO  (coreZkRegister-4448-thread-1) [    ] o.a.s.c.LeaderElector Joined leadership election with path: /collections/control_collection/leader_elect/shard1/election/96571226466353157-core_node1-n_0000000000
   [junit4]   2> 1048084 INFO  (coreZkRegister-4448-thread-1) [    ] o.a.s.c.ShardLeaderElectionContext Running the leader process for shard=shard1 and weAreReplacement=false and leaderVoteWait=10000
   [junit4]   2> 1048084 INFO  (coreZkRegister-4448-thread-1) [    ] o.a.s.c.ShardLeaderElectionContext Enough replicas found to continue.
   [junit4]   2> 1048084 INFO  (coreZkRegister-4448-thread-1) [    ] o.a.s.c.ShardLeaderElectionContext I may be the new leader - try and sync
   [junit4]   2> 1048084 INFO  (OverseerStateUpdate-96571226466353157-127.0.0.1:40230_-n_0000000000) [    ] o.a.s.c.Overseer processMessage: queueSize: 1, message = {
   [junit4]   2>   "operation":"leader",
   [junit4]   2>   "shard":"shard1",
   [junit4]   2>   "collection":"control_collection"} current state version: 1
   [junit4]   2> 1048084 INFO  (coreZkRegister-4448-thread-1) [    ] o.a.s.c.SyncStrategy Sync replicas to https://127.0.0.1:40230/collection1/
   [junit4]   2> 1048084 INFO  (coreZkRegister-4448-thread-1) [    ] o.a.s.c.SyncStrategy Sync Success - now sync replicas to me
   [junit4]   2> 1048084 INFO  (coreZkRegister-4448-thread-1) [    ] o.a.s.c.SyncStrategy https://127.0.0.1:40230/collection1/ has no replicas
   [junit4]   2> 1048085 INFO  (coreZkRegister-4448-thread-1) [    ] o.a.s.c.c.SolrZkClient makePath: /collections/control_collection/leaders/shard1
   [junit4]   2> 1048086 INFO  (coreZkRegister-4448-thread-1) [    ] o.a.s.c.ShardLeaderElectionContextBase Creating leader registration node /collections/control_collection/leaders/shard1/leader after winning as /collections/control_collection/leader_elect/shard1/election/96571226466353157-core_node1-n_0000000000
   [junit4]   2> 1048086 INFO  (coreZkRegister-4448-thread-1) [    ] o.a.s.c.ShardLeaderElectionContext I am the new leader: https://127.0.0.1:40230/collection1/ shard1
   [junit4]   2> 1048087 INFO  (OverseerStateUpdate-96571226466353157-127.0.0.1:40230_-n_0000000000) [    ] o.a.s.c.Overseer processMessage: queueSize: 1, message = {
   [junit4]   2>   "operation":"leader",
   [junit4]   2>   "shard":"shard1",
   [junit4]   2>   "collection":"control_collection",
   [junit4]   2>   "base_url":"https://127.0.0.1:40230",
   [junit4]   2>   "core":"collection1",
   [junit4]   2>   "state":"active"} current state version: 1
   [junit4]   2> 1048188 INFO  (zkCallback-1234-thread-1) [    ] o.a.s.c.c.ZkStateReader A cluster state change: [WatchedEvent state:SyncConnected type:NodeDataChanged path:/clusterstate.json], has occurred - updating... (live nodes size: [1])
   [junit4]   2> 1048237 INFO  (coreZkRegister-4448-thread-1) [    ] o.a.s.c.ZkController We are https://127.0.0.1:40230/collection1/ and leader is https://127.0.0.1:40230/collection1/
   [junit4]   2> 1048237 INFO  (coreZkRegister-4448-thread-1) [    ] o.a.s.c.ZkController No LogReplay needed for core=collection1 baseURL=https://127.0.0.1:40230
   [junit4]   2> 1048237 INFO  (coreZkRegister-4448-thread-1) [    ] o.a.s.c.ZkController I am the leader, no recovery necessary
   [junit4]   2> 1048237 INFO  (coreZkRegister-4448-thread-1) [    ] o.a.s.c.ZkController publishing state=active
   [junit4]   2> 1048237 INFO  (coreZkRegister-4448-thread-1) [    ] o.a.s.c.ZkController numShards not found on descriptor - reading it from system property
   [junit4]   2> 1048238 INFO  (coreZkRegister-4448-thread-1) [    ] o.a.s.c.c.ZkStateReader Checking legacy cluster state for collection control_collection
   [junit4]   2> 1048238 INFO  (OverseerStateUpdate-96571226466353157-127.0.0.1:40230_-n_0000000000) [    ] o.a.s.c.Overseer processMessage: queueSize: 1, message = {
   [junit4]   2>   "core":"collection1",
   [junit4]   2>   "core_node_name":"core_node1",
   [junit4]   2>   "roles":null,
   [junit4]   2>   "base_url":"https://127.0.0.1:40230",
   [junit4]   2>   "node_name":"127.0.0.1:40230_",
   [junit4]   2>   "numShards":"1",
   [junit4]   2>   "state":"active",
   [junit4]   2>   "shard":"shard1",
   [junit4]   2>   "collection":"control_collection",
   [junit4]   2>   "operation":"state"} current state version: 2
   [junit4]   2> 1048238 INFO  (OverseerStateUpdate-96571226466353157-127.0.0.1:40230_-n_0000000000) [    ] o.a.s.c.o.ReplicaMutator Update state numShards=1 message={
   [junit4]   2>   "core":"collection1",
   [junit4]   2>   "core_node_name":"core_node1",
   [junit4]   2>   "roles":null,
   [junit4]   2>   "base_url":"https://127.0.0.1:40230",
   [junit4]   2>   "node_name":"127.0.0.1:40230_",
   [junit4]   2>   "numShards":"1",
   [junit4]   2>   "state":"active",
   [junit4]   2>   "shard":"shard1",
   [junit4]   2>   "collection":"control_collection",
   [junit4]   2>   "operation":"state"}
   [junit4]   2> 1048339 INFO  (zkCallback-1234-thread-1) [    ] o.a.s.c.c.ZkStateReader A cluster state change: [WatchedEvent state:SyncConnected type:NodeDataChanged path:/clusterstate.json], has occurred - updating... (live nodes size: [1])
   [junit4]   2> 1048487 INFO  (TEST-TestSolrConfigHandlerCloud.test-seed#[1F47A2C9DA27B742]) [    ] o.a.s.c.c.SolrZkClient Using default ZkCredentialsProvider
   [junit4]   2> 1048487 INFO  (TEST-TestSolrConfigHandlerCloud.test-seed#[1F47A2C9DA27B742]) [    ] o.a.s.c.c.ConnectionManager Waiting for client to connect to ZooKeeper
   [junit4]   2> 1048488 INFO  (zkCallback-1238-thread-1) [    ] o.a.s.c.c.ConnectionManager Watcher org.apache.solr.common.cloud.ConnectionManager@1e76583 name:ZooKeeperConnection Watcher:127.0.0.1:37609/solr got event WatchedEvent state:SyncConnected type:None path:null path:null type:None
   [junit4]   2> 1048488 INFO  (TEST-TestSolrConfigHandlerCloud.test-seed#[1F47A2C9DA27B742]) [    ] o.a.s.c.c.ConnectionManager Client is connected to ZooKeeper
   [junit4]   2> 1048489 INFO  (TEST-TestSolrConfigHandlerCloud.test-seed#[1F47A2C9DA27B742]) [    ] o.a.s.c.c.SolrZkClient Using default ZkACLProvider
   [junit4]   2> 1048489 INFO  (TEST-TestSolrConfigHandlerCloud.test-seed#[1F47A2C9DA27B742]) [    ] o.a.s.c.c.ZkStateReader Updating cluster state from ZooKeeper... 
   [junit4]   2> 1048489 INFO  (TEST-TestSolrConfigHandlerCloud.test-seed#[1F47A2C9DA27B742]) [    ] o.a.s.c.c.ZkStateReader Loaded cluster properties: {urlScheme=https}
   [junit4]   2> 1048489 INFO  (TEST-TestSolrConfigHandlerCloud.test-seed#[1F47A2C9DA27B742]) [    ] o.a.s.c.c.ZkStateReader Updated live nodes from ZooKeeper... (0) -> (1)
   [junit4]   2> 1048490 INFO  (TEST-TestSolrConfigHandlerCloud.test-seed#[1F47A2C9DA27B742]) [    ] o.a.s.c.ChaosMonkey monkey: init - expire sessions:false cause connection loss:false
   [junit4]   2> 1048552 INFO  (TEST-TestSolrConfigHandlerCloud.test-seed#[1F47A2C9DA27B742]) [    ] o.a.s.SolrTestCaseJ4 Writing core.properties file to /home/jenkins/workspace/Lucene-Solr-master-Linux/solr/build/solr-core/test/J0/temp/solr.handler.TestSolrConfigHandlerCloud_1F47A2C9DA27B742-001/shard-1-001/cores/collection1
   [junit4]   2> 1048553 INFO  (TEST-TestSolrConfigHandlerCloud.test-seed#[1F47A2C9DA27B742]) [    ] o.a.s.c.AbstractFullDistribZkTestBase create jetty 1 in directory /home/jenkins/workspace/Lucene-Solr-master-Linux/solr/build/solr-core/test/J0/temp/solr.handler.TestSolrConfigHandlerCloud_1F47A2C9DA27B742-001/shard-1-001
   [junit4]   2> 1048554 INFO  (TEST-TestSolrConfigHandlerCloud.test-seed#[1F47A2C9DA27B742]) [    ] o.e.j.s.Server jetty-9.3.8.v20160314
   [junit4]   2> 1048555 INFO  (TEST-TestSolrConfigHandlerCloud.test-seed#[1F47A2C9DA27B742]) [    ] o.e.j.s.h.ContextHandler Started o.e.j.s.ServletContextHandler@1062ccb{/,null,AVAILABLE}
   [junit4]   2> 1048556 INFO  (TEST-TestSolrConfigHandlerCloud.test-seed#[1F47A2C9DA27B742]) [    ] o.e.j.s.ServerConnector Started ServerConnector@1881ed2{SSL,[ssl, http/1.1]}{127.0.0.1:33568}
   [junit4]   2> 1048556 INFO  (TEST-TestSolrConfigHandlerCloud.test-seed#[1F47A2C9DA27B742]) [    ] o.e.j.s.Server Started @1050933ms
   [junit4]   2> 1048556 INFO  (TEST-TestSolrConfigHandlerCloud.test-seed#[1F47A2C9DA27B742]) [    ] o.a.s.c.s.e.JettySolrRunner Jetty properties: {hostContext=/, solrconfig=solrconfig.xml, solr.data.dir=/home/jenkins/workspace/Lucene-Solr-master-Linux/solr/build/solr-core/test/J0/temp/solr.handler.TestSolrConfigHandlerCloud_1F47A2C9DA27B742-001/tempDir-001/jetty1, hostPort=33568, coreRootDirectory=/home/jenkins/workspace/Lucene-Solr-master-Linux/solr/build/solr-core/test/J0/temp/solr.handler.TestSolrConfigHandlerCloud_1F47A2C9DA27B742-001/shard-1-001/cores}
   [junit4]   2> 1048556 INFO  (TEST-TestSolrConfigHandlerCloud.test-seed#[1F47A2C9DA27B742]) [    ] o.a.s.s.SolrDispatchFilter SolrDispatchFilter.init(): jdk.internal.loader.ClassLoaders$AppClassLoader@1223dd8
   [junit4]   2> 1048556 INFO  (TEST-TestSolrConfigHandlerCloud.test-seed#[1F47A2C9DA27B742]) [    ] o.a.s.c.SolrResourceLoader new SolrResourceLoader for directory: '/home/jenkins/workspace/Lucene-Solr-master-Linux/solr/build/solr-core/test/J0/temp/solr.handler.TestSolrConfigHandlerCloud_1F47A2C9DA27B742-001/shard-1-001'
   [junit4]   2> 1048556 INFO  (TEST-TestSolrConfigHandlerCloud.test-seed#[1F47A2C9DA27B742]) [    ] o.a.s.c.SolrResourceLoader JNDI not configured for solr (NoInitialContextEx)
   [junit4]   2> 1048556 INFO  (TEST-TestSolrConfigHandlerCloud.test-seed#[1F47A2C9DA27B742]) [    ] o.a.s.c.SolrResourceLoader solr home defaulted to 'solr/' (could not find system property or JNDI)
   [junit4]   2> 1048557 INFO  (TEST-TestSolrConfigHandlerCloud.test-seed#[1F47A2C9DA27B742]) [    ] o.a.s.c.c.SolrZkClient Using default ZkCredentialsProvider
   [junit4]   2> 1048557 INFO  (TEST-TestSolrConfigHandlerCloud.test-seed#[1F47A2C9DA27B742]) [    ] o.a.s.c.c.ConnectionManager Waiting for client to connect to ZooKeeper
   [junit4]   2> 1048558 INFO  (zkCallback-1239-thread-1) [    ] o.a.s.c.c.ConnectionManager Watcher org.apache.solr.common.cloud.ConnectionManager@12b26f name:ZooKeeperConnection Watcher:127.0.0.1:37609/solr got event WatchedEvent state:SyncConnected type:None path:null path:null type:None
   [junit4]   2> 1048558 INFO  (TEST-TestSolrConfigHandlerCloud.test-seed#[1F47A2C9DA27B742]) [    ] o.a.s.c.c.ConnectionManager Client is connected to ZooKeeper
   [junit4]   2> 1048558 INFO  (TEST-TestSolrConfigHandlerCloud.test-seed#[1F47A2C9DA27B742]) [    ] o.a.s.c.c.SolrZkClient Using default ZkACLProvider
   [junit4]   2> 1048559 INFO  (TEST-TestSolrConfigHandlerCloud.test-seed#[1F47A2C9DA27B742]) [    ] o.a.s.s.SolrDispatchFilter Loading solr.xml from SolrHome (not found in ZooKeeper)
   [junit4]   2> 1048559 INFO  (TEST-TestSolrConfigHandlerCloud.test-seed#[1F47A2C9DA27B742]) [    ] o.a.s.c.SolrXmlConfig Loading container configuration from /home/jenkins/workspace/Lucene-Solr-master-Linux/solr/build/solr-core/test/J0/temp/solr.handler.TestSolrConfigHandlerCloud_1F47A2C9DA27B742-001/shard-1-001/solr.xml
   [junit4]   2> 1048562 INFO  (TEST-TestSolrConfigHandlerCloud.test-seed#[1F47A2C9DA27B742]) [    ] o.a.s.c.CorePropertiesLocator Config-defined core root directory: /home/jenkins/workspace/Lucene-Solr-master-Linux/solr/build/solr-core/test/J0/temp/solr.handler.TestSolrConfigHandlerCloud_1F47A2C9DA27B742-001/shard-1-001/cores
   [junit4]   2> 1048562 INFO  (TEST-TestSolrConfigHandlerCloud.test-seed#[1F47A2C9DA27B742]) [    ] o.a.s.c.CoreContainer New CoreContainer 9407846
   [junit4]   2> 1048562 INFO  (TEST-TestSolrConfigHandlerCloud.test-seed#[1F47A2C9DA27B742]) [    ] o.a.s.c.CoreContainer Loading cores into CoreContainer [instanceDir=/home/jenkins/workspace/Lucene-Solr-master-Linux/solr/build/solr-core/test/J0/temp/solr.handler.TestSolrConfigHandlerCloud_1F47A2C9DA27B742-001/shard-1-001]
   [junit4]   2> 1048562 WARN  (TEST-TestSolrConfigHandlerCloud.test-seed#[1F47A2C9DA27B742]) [    ] o.a.s.c.CoreContainer Couldn't add files from /home/jenkins/workspace/Lucene-Solr-master-Linux/solr/build/solr-core/test/J0/temp/solr.handler.TestSolrConfigHandlerCloud_1F47A2C9DA27B742-001/shard-1-001/lib to classpath: /home/jenkins/workspace/Lucene-Solr-master-Linux/solr/build/solr-core/test/J0/temp/solr.handler.TestSolrConfigHandlerCloud_1F47A2C9DA27B742-001/shard-1-001/lib
   [junit4]   2> 1048562 INFO  (TEST-TestSolrConfigHandlerCloud.test-seed#[1F47A2C9DA27B742]) [    ] o.a.s.h.c.HttpShardHandlerFactory created with socketTimeout : 90000,urlScheme : ,connTimeout : 15000,maxConnectionsPerHost : 20,maxConnections : 10000,corePoolSize : 0,maximumPoolSize : 2147483647,maxThreadIdleTime : 5,sizeOfQueue : -1,fairnessPolicy : false,
   [junit4]   2> 1048564 INFO  (TEST-TestSolrConfigHandlerCloud.test-seed#[1F47A2C9DA27B742]) [    ] o.a.s.u.UpdateShardHandler Created UpdateShardHandler HTTP client with params: socketTimeout=340000&connTimeout=45000&maxConnections=100000&maxConnectionsPerHost=100000
   [junit4]   2> 1048564 INFO  (TEST-TestSolrConfigHandlerCloud.test-seed#[1F47A2C9DA27B742]) [    ] o.a.s.l.LogWatcher SLF4J impl is org.slf4j.impl.Log4jLoggerFactory
   [junit4]   2> 1048564 INFO  (TEST-TestSolrConfigHandlerCloud.test-seed#[1F47A2C9DA27B742]) [    ] o.a.s.l.LogWatcher Registering Log Listener [Log4j (org.slf4j.impl.Log4jLoggerFactory)]
   [junit4]   2> 1048564 INFO  (TEST-TestSolrConfigHandlerCloud.test-seed#[1F47A2C9DA27B742]) [    ] o.a.s.c.ZkContainer Zookeeper client=127.0.0.1:37609/solr
   [junit4]   2> 1048564 INFO  (TEST-TestSolrConfigHandlerCloud.test-seed#[1F47A2C9DA27B742]) [    ] o.a.s.c.ZkController zkHost includes chroot
   [junit4]   2> 1048564 INFO  (TEST-TestSolrConfigHandlerCloud.test-seed#[1F47A2C9DA27B742]) [    ] o.a.s.c.c.SolrZkClient Using default ZkCredentialsProvider
   [junit4]   2> 1048565 INFO  (TEST-TestSolrConfigHandlerCloud.test-seed#[1F47A2C9DA27B742]) [    ] o.a.s.c.c.ConnectionManager Waiting for client to connect to ZooKeeper
   [junit4]   2> 1048565 INFO  (zkCallback-1242-thread-1) [    ] o.a.s.c.c.ConnectionManager Watcher org.apache.solr.common.cloud.ConnectionManager@e94519 name:ZooKeeperConnection Watcher:127.0.0.1:37609 got event WatchedEvent state:SyncConnected type:None path:null path:null type:None
   [junit4]   2> 1048565 INFO  (TEST-TestSolrConfigHandlerCloud.test-seed#[1F47A2C9DA27B742]) [    ] o.a.s.c.c.ConnectionManager Client is connected to ZooKeeper
   [junit4]   2> 1048566 INFO  (TEST-TestSolrConfigHandlerCloud.test-seed#[1F47A2C9DA27B742]) [    ] o.a.s.c.c.SolrZkClient Using default ZkACLProvider
   [junit4]   2> 1048566 INFO  (TEST-TestSolrConfigHandlerCloud.test-seed#[1F47A2C9DA27B742]) [    ] o.a.s.c.ZkController Added new OnReconnect listener org.apache.solr.cloud.ZkController$$Lambda$216/22669171@1d2a4e9
   [junit4]   2> 1048566 INFO  (TEST-TestSolrConfigHandlerCloud.test-seed#[1F47A2C9DA27B742]) [    ] o.a.s.c.c.ConnectionManager Waiting for client to connect to ZooKeeper
   [junit4]   2> 1048567 INFO  (zkCallback-1243-thread-1) [    ] o.a.s.c.c.ConnectionManager Watcher org.apache.solr.common.cloud.ConnectionManager@de0aa5 name:ZooKeeperConnection Watcher:127.0.0.1:37609/solr got event WatchedEvent state:SyncConnected type:None path:null path:null type:None
   [junit4]   2> 1048567 INFO  (TEST-TestSolrConfigHandlerCloud.test-seed#[1F47A2C9DA27B742]) [    ] o.a.s.c.c.ConnectionManager Client is connected to ZooKeeper
   [junit4]   2> 1048569 INFO  (TEST-TestSolrConfigHandlerCloud.test-seed#[1F47A2C9DA27B742]) [    ] o.a.s.c.c.ZkStateReader Updating cluster state from ZooKeeper... 
   [junit4]   2> 1048570 INFO  (TEST-TestSolrConfigHandlerCloud.test-seed#[1F47A2C9DA27B742]) [    ] o.a.s.c.c.ZkStateReader Loaded cluster properties: {urlScheme=https}
   [junit4]   2> 1048570 INFO  (TEST-TestSolrConfigHandlerCloud.test-seed#[1F47A2C9DA27B742]) [    ] o.a.s.c.c.ZkStateReader Updated live nodes from ZooKeeper... (0) -> (1)
   [junit4]   2> 1048571 INFO  (TEST-TestSolrConfigHandlerCloud.test-seed#[1F47A2C9DA27B742]) [    ] o.a.s.c.Overseer Overseer (id=null) closing
   [junit4]   2> 1048571 INFO  (TEST-TestSolrConfigHandlerCloud.test-seed#[1F47A2C9DA27B742]) [    ] o.a.s.c.LeaderElector Joined leadership election with path: /overseer_elect/election/96571226466353161-127.0.0.1:33568_-n_0000000001
   [junit4]   2> 1048571 INFO  (TEST-TestSolrConfigHandlerCloud.test-seed#[1F47A2C9DA27B742]) [    ] o.a.s.c.LeaderElector Watching path /overseer_elect/election/96571226466353157-127.0.0.1:40230_-n_0000000000 to know if I could be the leader
   [junit4]   2> 1048571 INFO  (TEST-TestSolrConfigHandlerCloud.test-seed#[1F47A2C9DA27B742]) [    ] o.a.s.c.ZkController Publish node=127.0.0.1:33568_ as DOWN
   [junit4]   2> 1048571 INFO  (TEST-TestSolrConfigHandlerCloud.test-seed#[1F47A2C9DA27B742]) [    ] o.a.s.c.ZkController Register node as live in ZooKeeper:/live_nodes/127.0.0.1:33568_
   [junit4]   2> 1048572 INFO  (TEST-TestSolrConfigHandlerCloud.test-seed#[1F47A2C9DA27B742]) [    ] o.a.s.c.c.SolrZkClient makePath: /live_nodes/127.0.0.1:33568_
   [junit4]   2> 1048572 INFO  (OverseerStateUpdate-96571226466353157-127.0.0.1:40230_-n_0000000000) [    ] o.a.s.c.Overseer processMessage: queueSize: 1, message = {
   [junit4]   2>   "operation":"downnode",
   [junit4]   2>   "node_name":"127.0.0.1:33568_"} current state version: 3
   [junit4]   2> 1048572 INFO  (zkCallback-1238-thread-1) [    ] o.a.s.c.c.ZkStateReader A live node change: [WatchedEvent state:SyncConnected type:NodeChildrenChanged path:/live_nodes], has occurred - updating... (live nodes size: [1])
   [junit4]   2> 1048572 INFO  (zkCallback-1243-thread-1) [    ] o.a.s.c.c.ZkStateReader A live node change: [WatchedEvent state:SyncConnected type:NodeChildrenChanged path:/live_nodes], has occurred - updating... (live nodes size: [1])
   [junit4]   2> 1048572 INFO  (OverseerStateUpdate-96571226466353157-127.0.0.1:40230_-n_0000000000) [    ] o.a.s.c.o.NodeMutator DownNode state invoked for node: 127.0.0.1:33568_
   [junit4]   2> 1048572 INFO  (zkCallback-1234-thread-2) [    ] o.a.s.c.c.ZkStateReader A live node change: [WatchedEvent state:SyncConnected type:NodeChildrenChanged path:/live_nodes], has occurred - updating... (live nodes size: [1])
   [junit4]   2> 1048572 INFO  (zkCallback-1238-thread-1) [    ] o.a.s.c.c.ZkStateReader Updated live nodes from ZooKeeper... (1) -> (2)
   [junit4]   2> 1048572 INFO  (zkCallback-1243-thread-1) [    ] o.a.s.c.c.ZkStateReader Updated live nodes from ZooKeeper... (1) -> (2)
   [junit4]   2> 1048573 INFO  (zkCallback-1234-thread-2) [    ] o.a.s.c.c.ZkStateReader Updated live nodes from ZooKeeper... (1) -> (2)
   [junit4]   2> 1048586 INFO  (TEST-TestSolrConfigHandlerCloud.test-seed#[1F47A2C9DA27B742]) [    ] o.a.s.c.CoreContainer Security conf doesn't exist. Skipping setup for authorization module.
   [junit4]   2> 1048586 INFO  (TEST-TestSolrConfigHandlerCloud.test-seed#[1F47A2C9DA27B742]) [    ] o.a.s.c.CoreContainer No authentication plugin used.
   [junit4]   2> 1048586 INFO  (TEST-TestSolrConfigHandlerCloud.test-seed#[1F47A2C9DA27B742]) [    ] o.a.s.c.CorePropertiesLocator Looking for core definitions underneath /home/jenkins/workspace/Lucene-Solr-master-Linux/solr/build/solr-core/test/J0/temp/solr.handler.TestSolrConfigHandlerCloud_1F47A2C9DA27B742-001/shard-1-001/cores
   [junit4]   2> 1048587 INFO  (TEST-TestSolrConfigHandlerCloud.test-seed#[1F47A2C9DA27B742]) [    ] o.a.s.c.CoreDescriptor Created CoreDescriptor: {schema=schema.xml, dataDir=data/, collection=collection1, loadOnStartup=true, coreNodeName=, transient=false, name=collection1, shard=, config=solrconfig.xml, configSetProperties=configsetprops.json}
   [junit4]   2> 1048587 INFO  (TEST-TestSolrConfigHandlerCloud.test-seed#[1F47A2C9DA27B742]) [    ] o.a.s.c.CorePropertiesLocator Found core collection1 in /home/jenkins/workspace/Lucene-Solr-master-Linux/solr/build/solr-core/test/J0/temp/solr.handler.TestSolrConfigHandlerCloud_1F47A2C9DA27B742-001/shard-1-001/cores/collection1
   [junit4]   2> 1048587 INFO  (TEST-TestSolrConfigHandlerCloud.test-seed#[1F47A2C9DA27B742]) [    ] o.a.s.c.CorePropertiesLocator Found 1 core definitions
   [junit4]   2> 1048587 INFO  (TEST-TestSolrConfigHandlerCloud.test-seed#[1F47A2C9DA27B742]) [    ] o.a.s.s.SolrDispatchFilter user.dir=/home/jenkins/workspace/Lucene-Solr-master-Linux/solr/build/solr-core/test/J0
   [junit4]   2> 1048588 INFO  (coreLoadExecutor-4466-thread-1) [    ] o.a.s.c.ZkController publishing state=down
   [junit4]   2> 1048588 INFO  (coreLoadExecutor-4466-thread-1) [    ] o.a.s.c.ZkController numShards not found on descriptor - reading it from system property
   [junit4]   2> 1048588 INFO  (TEST-TestSolrConfigHandlerCloud.test-seed#[1F47A2C9DA27B742]) [    ] o.a.s.s.SolrDispatchFilter SolrDispatchFilter.init() done
   [junit4]   2> 1048588 INFO  (coreLoadExecutor-4466-thread-1) [    ] o.a.s.c.ZkController Collection collection1 not visible yet, but flagging it so a watch is registered when it becomes visible
   [junit4]   2> 1048588 INFO  (OverseerStateUpdate-96571226466353157-127.0.0.1:40230_-n_0000000000) [    ] o.a.s.c.Overseer processMessage: queueSize: 1, message = {
   [junit4]   2>   "core":"collection1",
   [junit4]   2>   "roles":null,
   [junit4]   2>   "base_url":"https://127.0.0.1:33568",
   [junit4]   2>   "node_name":"127.0.0.1:33568_",
   [junit4]   2>   "numShards":"2",
   [junit4]   2>   "state":"down",
   [junit4]   2>   "shard":null,
   [junit4]   2>   "collection":"collection1",
   [junit4]   2>   "operation":"state"} current state version: 3
   [junit4]   2> 1048588 INFO  (OverseerStateUpdate-96571226466353157-127.0.0.1:40230_-n_0000000000) [    ] o.a.s.c.o.ReplicaMutator Update state numShards=2 message={
   [junit4]   2>   "core":"collection1",
   [junit4]   2>   "roles":null,
   [junit4]   2>   "base_url":"https://127.0.0.1:33568",
   [junit4]   2>   "node_name":"127.0.0.1:33568_",
   [junit4]   2>   "numShards":"2",
   [junit4]   2>   "state":"down",
   [junit4]   2>   "shard":null,
   [junit4]   2>   "collection":"collection1",
   [junit4]   2>   "operation":"state"}
   [junit4]   2> 1048588 INFO  (coreLoadExecutor-4466-thread-1) [    ] o.a.s.c.c.ZkStateReader Deleting data for [collection1]
   [junit4]   2> 1048588 INFO  (OverseerStateUpdate-96571226466353157-127.0.0.1:40230_-n_0000000000) [    ] o.a.s.c.o.ClusterStateMutator building a new cName: collection1
   [junit4]   2> 1048589 INFO  (OverseerStateUpdate-96571226466353157-127.0.0.1:40230_-n_0000000000) [    ] o.a.s.c.o.ReplicaMutator Assigning new node to shard shard=shard2
   [junit4]   2> 1048589 INFO  (coreLoadExecutor-4466-thread-1) [    ] o.a.s.c.ZkController look for our core node name
   [junit4]   2> 1048690 INFO  (zkCallback-1234-thread-2) [    ] o.a.s.c.c.ZkStateReader A cluster state change: [WatchedEvent state:SyncConnected type:NodeDataChanged path:/clusterstate.json], has occurred - updating... (live nodes size: [2])
   [junit4]   2> 1048690 INFO  (zkCallback-1238-thread-1) [    ] o.a.s.c.c.ZkStateReader A cluster state change: [WatchedEvent state:SyncConnected type:NodeDataChanged path:/clusterstate.json], has occurred - updating... (live nodes size: [2])
   [junit4]   2> 1048690 INFO  (zkCallback-1243-thread-1) [    ] o.a.s.c.c.ZkStateReader A cluster state change: [WatchedEvent state:SyncConnected type:NodeDataChanged path:/clusterstate.json], has occurred - updating... (live nodes size: [2])
   [junit4]   2> 1049589 INFO  (coreLoadExecutor-4466-thread-1) [    ] o.a.s.c.ZkController waiting to find shard id in clusterstate for collection1
   [junit4]   2> 1049589 INFO  (coreLoadExecutor-4466-thread-1) [    ] o.a.s.c.ZkController Check for collection zkNode:collection1
   [junit4]   2> 1049589 INFO  (coreLoadExecutor-4466-thread-1) [    ] o.a.s.c.ZkController Collection zkNode exists
   [junit4]   2> 1049589 INFO  (coreLoadExecutor-4466-thread-1) [    ] o.a.s.c.c.ZkStateReader Load collection config from: [/collections/collection1]
   [junit4]   2> 1049590 INFO  (coreLoadExecutor-4466-thread-1) [    ] o.a.s.c.c.ZkStateReader path=[/collections/collection1] [configName]=[conf1] specified config exists in ZooKeeper
   [junit4]   2> 1049590 INFO  (coreLoadExecutor-4466-thread-1) [    ] o.a.s.c.SolrResourceLoader new SolrResourceLoader for directory: '/home/jenkins/workspace/Lucene-Solr-master-Linux/solr/build/solr-core/test/J0/temp/solr.handler.TestSolrConfigHandlerCloud_1F47A2C9DA27B742-001/shard-1-001/cores/collection1'
   [junit4]   2> 1049590 INFO  (coreLoadExecutor-4466-thread-1) [    ] o.a.s.c.SolrResourceLoader JNDI not configured for solr (NoInitialContextEx)
   [junit4]   2> 1049590 INFO  (coreLoadExecutor-4466-thread-1) [    ] o.a.s.c.SolrResourceLoader solr home defaulted to 'solr/' (could not find system property or JNDI)
   [junit4]   2> 1049591 INFO  (coreLoadExecutor-4466-thread-1) [    ] o.a.s.c.Config loaded config solrconfig.xml with version 0 
   [junit4]   2> 1049594 INFO  (coreLoadExecutor-4466-thread-1) [    ] o.a.s.c.SolrConfig current version of requestparams : -1
   [junit4]   2> 1049596 INFO  (coreLoadExecutor-4466-thread-1) [    ] o.a.s.c.SolrConfig Using Lucene MatchVersion: 7.0.0
   [junit4]   2> 1049602 INFO  (coreLoadExecutor-4466-thread-1) [    ] o.a.s.c.SolrConfig Loaded SolrConfig: solrconfig.xml
   [junit4]   2> 1049606 INFO  (coreLoadExecutor-4466-thread-1) [    ] o.a.s.s.IndexSchema [collection1] Schema name=test
   [junit4]   2> 1049666 INFO  (coreLoadExecutor-4466-thread-1) [    ] o.a.s.s.OpenExchangeRatesOrgProvider Initialized with rates=open-exchange-rates.json, refreshInterval=1440.
   [junit4]   2> 1049670 INFO  (coreLoadExecutor-4466-thread-1) [    ] o.a.s.s.IndexSchema default search field in schema is text
   [junit4]   2> 1049671 INFO  (coreLoadExecutor-4466-thread-1) [    ] o.a.s.s.IndexSchema unique key field: id
   [junit4]   2> 1049676 INFO  (coreLoadExecutor-4466-thread-1) [    ] o.a.s.s.FileExchangeRateProvider Reloading exchange rates from file currency.xml
   [junit4]   2> 1049677 INFO  (coreLoadExecutor-4466-thread-1) [    ] o.a.s.s.FileExchangeRateProvider Reloading exchange rates from file currency.xml
   [junit4]   2> 1049678 INFO  (coreLoadExecutor-4466-thread-1) [    ] o.a.s.s.OpenExchangeRatesOrgProvider Reloading exchange rates from open-exchange-rates.json
   [junit4]   2> 1049678 INFO  (coreLoadExecutor-4466-thread-1) [    ] o.a.s.s.OpenExchangeRatesOrgProvider Reloading exchange rates from open-exchange-rates.json
   [junit4]   2> 1049679 INFO  (coreLoadExecutor-4466-thread-1) [    ] o.a.s.c.ConfigSetProperties Did not find ConfigSet properties, assuming default properties: Can't find resource 'configsetprops.json' in classpath or '/configs/conf1', cwd=/home/jenkins/workspace/Lucene-Solr-master-Linux/solr/build/solr-core/test/J0
   [junit4]   2> 1049679 INFO  (coreLoadExecutor-4466-thread-1) [    ] o.a.s.c.CoreContainer Creating SolrCore 'collection1' using configuration from collection collection1
   [junit4]   2> 1049679 INFO  (coreLoadExecutor-4466-thread-1) [    ] o.a.s.c.SolrCore org.apache.solr.core.MockDirectoryFactory
   [junit4]   2> 1049679 INFO  (coreLoadExecutor-4466-thread-1) [    ] o.a.s.c.SolrCore [[collection1] ] Opening new SolrCore at [/home/jenkins/workspace/Lucene-Solr-master-Linux/solr/build/solr-core/test/J0/temp/solr.handler.TestSolrConfigHandlerCloud_1F47A2C9DA27B742-001/shard-1-001/cores/collection1], dataDir=[/home/jenkins/workspace/Lucene-Solr-master-Linux/solr/build/solr-core/test/J0/temp/solr.handler.TestSolrConfigHandlerCloud_1F47A2C9DA27B742-001/shard-1-001/cores/collection1/data/]
   [junit4]   2> 1049679 INFO  (coreLoadExecutor-4466-thread-1) [    ] o.a.s.c.JmxMonitoredMap JMX monitoring is enabled. Adding Solr mbeans to JMX Server: com.sun.jmx.mbeanserver.JmxMBeanServer@194bf52
   [junit4]   2> 1049680 INFO  (coreLoadExecutor-4466-thread-1) [    ] o.a.s.c.CachingDirectoryFactory return new directory for /home/jenkins/workspace/Lucene-Solr-master-Linux/solr/build/solr-core/test/J0/temp/solr.handler.TestSolrConfigHandlerCloud_1F47A2C9DA27B742-001/shard-1-001/cores/collection1/data/snapshot_metadata
   [junit4]   2> 1049680 INFO  (coreLoadExecutor-4466-thread-1) [    ] o.a.s.c.s.SolrSnapshotMetaDataManager Loading from snapshot metadata file...
   [junit4]   2> 1049680 INFO  (coreLoadExecutor-4466-thread-1) [    ] o.a.s.c.CachingDirectoryFactory return new directory for /home/jenkins/workspace/Lucene-Solr-master-Linux/solr/build/solr-core/test/J0/temp/solr.handler.TestSolrConfigHandlerCloud_1F47A2C9DA27B742-001/shard-1-001/cores/collection1/data
   [junit4]   2> 1049680 INFO  (coreLoadExecutor-4466-thread-1) [    ] o.a.s.c.SolrCore New index directory detected: old=null new=/home/jenkins/workspace/Lucene-Solr-master-Linux/solr/build/solr-core/test/J0/temp/solr.handler.TestSolrConfigHandlerCloud_1F47A2C9DA27B742-001/shard-1-001/cores/collection1/data/index/
   [junit4]   2> 1049680 WARN  (coreLoadExecutor-4466-thread-1) [    ] o.a.s.c.SolrCore [collection1] Solr index directory '/home/jenkins/workspace/Lucene-Solr-master-Linux/solr/build/solr-core/test/J0/temp/solr.handler.TestSolrConfigHandlerCloud_1F47A2C9DA27B742-001/shard-1-001/cores/collection1/data/index' doesn't exist. Creating new index...
   [junit4]   2> 1049680 INFO  (coreLoadExecutor-4466-thread-1) [    ] o.a.s.c.CachingDirectoryFactory return new directory for /home/jenkins/workspace/Lucene-Solr-master-Linux/solr/build/solr-core/test/J0/temp/solr.handler.TestSolrConfigHandlerCloud_1F47A2C9DA27B742-001/shard-1-001/cores/collection1/data/index
   [junit4]   2> 1049680 INFO  (coreLoadExecutor-4466-thread-1) [    ] o.a.s.u.RandomMergePolicy RandomMergePolicy wrapping class org.apache.lucene.index.LogByteSizeMergePolicy: [LogByteSizeMergePolicy: minMergeSize=1677721, mergeFactor=30, maxMergeSize=2147483648, maxMergeSizeForForcedMerge=9223372036854775807, calibrateSizeByDeletes=true, maxMergeDocs=2147483647, maxCFSSegmentSizeMB=8.796093022207999E12, noCFSRatio=0.8525563029375415]
   [junit4]   2> 1049681 INFO  (coreLoadExecutor-4466-thread-1) [    ] o.a.s.c.SolrDeletionPolicy SolrDeletionPolicy.onCommit: commits: num=1
   [junit4]   2> 	commit{dir=MockDirectoryWrapper(RAMDirectory@1243c59 lockFactory=org.apache.lucene.store.SingleInstanceLockFactory@11718dc),segFN=segments_1,generation=1}
   [junit4]   2> 1049681 INFO  (coreLoadExecutor-4466-thread-1) [    ] o.a.s.c.SolrDeletionPolicy newest commit generation = 1
   [junit4]   2> 1049681 INFO  (OldIndexDirectoryCleanupThreadForCore-collection1) [    ] o.a.s.c.SolrCore Looking for old index directories to cleanup for core collection1 in /home/jenkins/workspace/Lucene-Solr-master-Linux/solr/build/solr-core/test/J0/temp/solr.handler.TestSolrConfigHandlerCloud_1F47A2C9DA27B742-001/shard-1-001/cores/collection1/data/
   [junit4]   2> 1049681 WARN  (OldIndexDirectoryCleanupThreadForCore-collection1) [    ] o.a.s.c.DirectoryFactory /home/jenkins/workspace/Lucene-Solr-master-Linux/solr/build/solr-core/test/J0/temp/solr.handler.TestSolrConfigHandlerCloud_1F47A2C9DA27B742-001/shard-1-001/cores/collection1/data/ does not point to a valid data directory; skipping clean-up of old index directories.
   [junit4]   2> 1049683 INFO  (coreLoadExecutor-4466-thread-1) [    ] o.a.s.u.p.UpdateRequestProcessorChain creating updateRequestProcessorChain "nodistrib"
   [junit4]   2> 1049683 INFO  (coreLoadExecutor-4466-thread-1) [    ] o.a.s.u.p.UpdateRequestProcessorChain creating updateRequestProcessorChain "dedupe"
   [junit4]   2> 1049683 INFO  (coreLoadExecutor-4466-thread-1) [    ] o.a.s.u.p.UpdateRequestProcessorChain inserting DistributedUpdateProcessorFactory into updateRequestProcessorChain "dedupe"
   [junit4]   2> 1049683 INFO  (coreLoadExecutor-4466-thread-1) [    ] o.a.s.u.p.UpdateRequestProcessorChain creating updateRequestProcessorChain "stored_sig"
   [junit4]   2> 1049683 INFO  (coreLoadExecutor-4466-thread-1) [    ] o.a.s.u.p.UpdateRequestProcessorChain inserting DistributedUpdateProcessorFactory into updateRequestProcessorChain "stored_sig"
   [junit4]   2> 1049683 INFO  (coreLoadExecutor-4466-thread-1) [    ] o.a.s.u.p.UpdateRequestProcessorChain creating updateRequestProcessorChain "distrib-dup-test-chain-explicit"
   [junit4]   2> 1049683 INFO  (coreLoadExecutor-4466-thread-1) [    ] o.a.s.u.p.UpdateRequestProcessorChain creating updateRequestProcessorChain "distrib-dup-test-chain-implicit"
   [junit4]   2> 1049684 INFO  (coreLoadExecutor-4466-thread-1) [    ] o.a.s.u.p.UpdateRequestProcessorChain inserting DistributedUpdateProcessorFactory into updateRequestProcessorChain "distrib-dup-test-chain-implicit"
   [junit4]   2> 1049684 INFO  (coreLoadExecutor-4466-thread-1) [    ] o.a.s.c.SolrCore no updateRequestProcessorChain defined as default, creating implicit default
   [junit4]   2> 1049684 WARN  (coreLoadExecutor-4466-thread-1) [    ] o.a.s.c.RequestHandlers INVALID paramSet a in requestHandler {type = requestHandler,name = /dump,class = DumpRequestHandler,args = {defaults={a=A,b=B}}}
   [junit4]   2> 1049685 INFO  (coreLoadExecutor-4466-thread-1) [    ] o.a.s.h.l.XMLLoader xsltCacheLifetimeSeconds=60
   [junit4]   2> 1049686 INFO  (coreLoadExecutor-4466-thread-1) [    ] o.a.s.h.l.XMLLoader xsltCacheLifetimeSeconds=60
   [junit4]   2> 1049686 INFO  (coreLoadExecutor-4466-thread-1) [    ] o.a.s.h.l.XMLLoader xsltCacheLifetimeSeconds=60
   [junit4]   2> 1049687 INFO  (coreLoadExecutor-4466-thread-1) [    ] o.a.s.h.l.XMLLoader xsltCacheLifetimeSeconds=60
   [junit4]   2> 1049690 INFO  (coreLoadExecutor-4466-thread-1) [    ] o.a.s.c.RequestHandlers Registered paths: /admin/mbeans,standard,/update/json/docs,/admin/luke,/export,/get,/admin/properties,/update/json,/admin/threads,/dump,/update/csv,/sql,/graph,/admin/segments,/admin/system,/replication,/config,/stream,/schema,/admin/plugins,/admin/logging,/admin/ping,/update,/admin/file,/terms
   [junit4]   2> 1049690 INFO  (coreLoadExecutor-4466-thread-1) [    ] o.a.s.c.SolrCore Using default statsCache cache: org.apache.solr.search.stats.LocalStatsCache
   [junit4]   2> 1049690 INFO  (coreLoadExecutor-4466-thread-1) [    ] o.a.s.u.UpdateHandler Using UpdateLog implementation: org.apache.solr.update.UpdateLog
   [junit4]   2> 1049690 INFO  (coreLoadExecutor-4466-thread-1) [    ] o.a.s.u.UpdateLog Initializing UpdateLog: dataDir= defaultSyncLevel=FLUSH numRecordsToKeep=100 maxNumLogsToKeep=10 numVersionBuckets=65536
   [junit4]   2> 1049691 INFO  (coreLoadExecutor-4466-thread-1) [    ] o.a.s.u.CommitTracker Hard AutoCommit: disabled
   [junit4]   2> 1049691 INFO  (coreLoadExecutor-4466-thread-1) [    ] o.a.s.u.CommitTracker Soft AutoCommit: disabled
   [junit4]   2> 1049691 INFO  (coreLoadExecutor-4466-thread-1) [    ] o.a.s.u.RandomMergePolicy RandomMergePolicy wrapping class org.apache.lucene.index.TieredMergePolicy: [TieredMergePolicy: maxMergeAtOnce=32, maxMergeAtOnceExplicit=49, maxMergedSegmentMB=15.0244140625, floorSegmentMB=0.2666015625, forceMergeDeletesPctAllowed=1.9951762988281863, segmentsPerTier=50.0, maxCFSSegmentSizeMB=8.796093022207999E12, noCFSRatio=0.0
   [junit4]   2> 1049691 INFO  (coreLoadExecutor-4466-thread-1) [    ] o.a.s.c.SolrDeletionPolicy SolrDeletionPolicy.onInit: commits: num=1
   [junit4]   2> 	commit{dir=MockDirectoryWrapper(RAMDirectory@1243c59 lockFactory=org.apache.lucene.store.SingleInstanceLockFactory@11718dc),segFN=segments_1,generation=1}
   [junit4]   2> 1049691 INFO  (coreLoadExecutor-4466-thread-1) [    ] o.a.s.c.SolrDeletionPolicy newest commit generation = 1
   [junit4]   2> 1049691 INFO  (coreLoadExecutor-4466-thread-1) [    ] o.a.s.s.SolrIndexSearcher Opening [Searcher@f25124[collection1] main]
   [junit4]   2> 1049692 INFO  (coreLoadExecutor-4466-thread-1) [    ] o.a.s.c.c.ZkStateReader Load collection config from: [/collections/collection1]
   [junit4]   2> 1049692 INFO  (coreLoadExecutor-4466-thread-1) [    ] o.a.s.c.c.ZkStateReader path=[/collections/collection1] [configName]=[conf1] specified config exists in ZooKeeper
   [junit4]   2> 1049692 INFO  (coreLoadExecutor-4466-thread-1) [    ] o.a.s.r.ManagedResourceStorage Setting up ZooKeeper-based storage for the RestManager with znodeBase: /configs/conf1
   [junit4]   2> 1049692 INFO  (coreLoadExecutor-4466-thread-1) [    ] o.a.s.r.ManagedResourceStorage Configured ZooKeeperStorageIO with znodeBase: /configs/conf1
   [junit4]   2> 1049692 INFO  (coreLoadExecutor-4466-thread-1) [    ] o.a.s.r.RestManager Initializing RestManager with initArgs: {}
   [junit4]   2> 1049692 INFO  (coreLoadExecutor-4466-thread-1) [    ] o.a.s.r.ManagedResourceStorage Reading _rest_managed.json using ZooKeeperStorageIO:path=/configs/conf1
   [junit4]   2> 1049692 INFO  (coreLoadExecutor-4466-thread-1) [    ] o.a.s.r.ManagedResourceStorage No data found for znode /configs/conf1/_rest_managed.json
   [junit4]   2> 1049692 INFO  (coreLoadExecutor-4466-thread-1) [    ] o.a.s.r.ManagedResourceStorage Loaded null at path _rest_managed.json using ZooKeeperStorageIO:path=/configs/conf1
   [junit4]   2> 1049692 INFO  (coreLoadExecutor-4466-thread-1) [    ] o.a.s.r.RestManager Initializing 0 registered ManagedResources
   [junit4]   2> 1049692 INFO  (coreLoadExecutor-4466-thread-1) [    ] o.a.s.h.ReplicationHandler Commits will be reserved for  10000
   [junit4]   2> 1049693 INFO  (searcherExecutor-4467-thread-1) [    ] o.a.s.c.SolrCore [collection1] Registered new searcher Searcher@f25124[collection1] main{ExitableDirectoryReader(UninvertingDirectoryReader())}
   [junit4]   2> 1049693 INFO  (coreLoadExecutor-4466-thread-1) [    ] o.a.s.u.UpdateLog Looking up max value of version field to seed version buckets
   [junit4]   2> 1049693 INFO  (coreLoadExecutor-4466-thread-1) [    ] o.a.s.u.VersionInfo Refreshing highest value of _version_ for 65536 version buckets from index
   [junit4]   2> 1049693 INFO  (coreLoadExecutor-4466-thread-1) [    ] o.a.s.u.VersionInfo No terms found for _version_, cannot seed version bucket highest value from index
   [junit4]   2> 1049693 INFO  (coreLoadExecutor-4466-thread-1) [    ] o.a.s.u.UpdateLog Could not find max version in index or recent updates, using new clock 1545139626539220992
   [junit4]   2> 1049695 INFO  (coreLoadExecutor-4466-thread-1) [    ] o.a.s.u.UpdateLog Took 1.0ms to seed version buckets with highest version 1545139626539220992
   [junit4]   2> 1049695 INFO  (coreLoadExecutor-4466-thread-1) [    ] o.a.s.c.ZkController watch zkdir /configs/conf1
   [junit4]   2> 1049695 INFO  (coreLoadExecutor-4466-thread-1) [    ] o.a.s.c.CoreContainer registering core: collection1
   [junit4]   2> 1049696 INFO  (coreZkRegister-4461-thread-1) [    ] o.a.s.c.ZkController Register replica - core:collection1 address:https://127.0.0.1:33568 collection:collection1 shard:shard2
   [junit4]   2> 1049696 INFO  (coreZkRegister-4461-thread-1) [    ] o.a.s.c.c.SolrZkClient makePath: /collections/collection1/leader_elect/shard2/election
   [junit4]   2> 1049697 INFO  (coreZkRegister-4461-thread-1) [    ] o.a.s.c.LeaderElector Joined leadership election with path: /collections/collection1/leader_elect/shard2/election/96571226466353161-core_node1-n_0000000000
   [junit4]   2> 1049698 INFO  (coreZkRegister-4461-thread-1) [    ] o.a.s.c.ShardLeaderElectionContext Running the leader process for shard=shard2 and weAreReplacement=false and leaderVoteWait=10000
   [junit4]   2> 1049698 INFO  (coreZkRegister-4461-thread-1) [    ] o.a.s.c.ShardLeaderElectionContext Enough replicas found to continue.
   [junit4]   2> 1049698 INFO  (coreZkRegister-4461-thread-1) [    ] o.a.s.c.ShardLeaderElectionContext I may be the new leader - try and sync
   [junit4]   2> 1049698 INFO  (coreZkRegister-4461-thread-1) [    ] o.a.s.c.SyncStrategy Sync replicas to https://127.0.0.1:33568/collection1/
   [junit4]   2> 1049698 INFO  (coreZkRegister-4461-thread-1) [    ] o.a.s.c.SyncStrategy Sync Success - now sync replicas to me
   [junit4]   2> 1049698 INFO  (coreZkRegister-4461-thread-1) [    ] o.a.s.c.SyncStrategy https://127.0.0.1:33568/collection1/ has no replicas
   [junit4]   2> 1049698 INFO  (OverseerStateUpdate-96571226466353157-127.0.0.1:40230_-n_0000000000) [    ] o.a.s.c.Overseer processMessage: queueSize: 1, message = {
   [junit4]   2>   "operation":"leader",
   [junit4]   2>   "shard":"shard2",
   [junit4]   2>   "collection":"collection1"} current state version: 4
   [junit4]   2> 1049699 INFO  (coreZkRegister-4461-thread-1) [    ] o.a.s.c.c.SolrZkClient makePath: /collections/collection1/leaders/shard2
   [junit4]   2> 1049699 INFO  (coreZkRegister-4461-thread-1) [    ] o.a.s.c.ShardLeaderElectionContextBase Creating leader registration node /collections/collection1/leaders/shard2/leader after winning as /collections/collection1/leader_elect/shard2/election/96571226466353161-core_node1-n_0000000000
   [junit4]   2> 1049700 INFO  (coreZkRegister-4461-thread-1) [    ] o.a.s.c.ShardLeaderElectionContext I am the new leader: https://127.0.0.1:33568/collection1/ shard2
   [junit4]   2> 1049700 INFO  (OverseerStateUpdate-96571226466353157-127.0.0.1:40230_-n_0000000000) [    ] o.a.s.c.Overseer processMessage: queueSize: 1, message = {
   [junit4]   2>   "operation":"leader",
   [junit4]   2>   "shard":"shard2",
   [junit4]   2>   "collection":"collection1",
   [junit4]   2>   "base_url":"https://127.0.0.1:33568",
   [junit4]   2>   "core":"collection1",
   [junit4]   2>   "state":"active"} current state version: 4
   [junit4]   2> 1049801 INFO  (zkCallback-1234-thread-2) [    ] o.a.s.c.c.ZkStateReader A cluster state change: [WatchedEvent state:SyncConnected type:NodeDataChanged path:/clusterstate.json], has occurred - updating... (live nodes size: [2])
   [junit4]   2> 1049801 INFO  (zkCallback-1238-thread-1) [    ] o.a.s.c.c.ZkStateReader A cluster state change: [WatchedEvent state:SyncConnected type:NodeDataChanged path:/clusterstate.json], has occurred - updating... (live nodes size: [2])
   [junit4]   2> 1049801 INFO  (zkCallback-1243-thread-1) [    ] o.a.s.c.c.ZkStateReader A cluster state change: [WatchedEvent state:SyncConnected type:NodeDataChanged path:/clusterstate.json], has occurred - updating... (live nodes size: [2])
   [junit4]   2> 1049850 INFO  (coreZkRegister-4461-thread-1) [    ] o.a.s.c.ZkController We are https://127.0.0.1:33568/collection1/ and leader is https://127.0.0.1:33568/collection1/
   [junit4]   2> 1049851 INFO  (coreZkRegister-4461-thread-1) [    ] o.a.s.c.ZkController No LogReplay needed for core=collection1 baseURL=https://127.0.0.1:33568
   [junit4]   2> 1049851 INFO  (coreZkRegister-4461-thread-1) [    ] o.a.s.c.ZkController I am the leader, no recovery necessary
   [junit4]   2> 1049851 INFO  (coreZkRegister-4461-thread-1) [    ] o.a.s.c.ZkController publishing state=active
   [junit4]   2> 1049851 INFO  (coreZkRegister-4461-thread-1) [    ] o.a.s.c.ZkController numShards not found on descriptor - reading it from system property
   [junit4]   2> 1049851 INFO  (coreZkRegister-4461-thread-1) [    ] o.a.s.c.c.ZkStateReader Checking legacy cluster state for collection collection1
   [junit4]   2> 1049852 INFO  (OverseerStateUpdate-96571226466353157-127.0.0.1:40230_-n_0000000000) [    ] o.a.s.c.Overseer processMessage: queueSize: 1, message = {
   [junit4]   2>   "core":"collection1",
   [junit4]   2>   "core_node_name":"core_node1",
   [junit4]   2>   "roles":null,
   [junit4]   2>   "base_url":"https://127.0.0.1:33568",
   [junit4]   2>   "node_name":"127.0.0.1:33568_",
   [junit4]   2>   "numShards":"2",
   [junit4]   2>   "state":"active",
   [junit4]   2>   "shard":"shard2",
   [junit4]   2>   "collection":"collection1",
   [junit4]   2>   "operation":"state"} current state version: 5
   [junit4]   2> 1049852 INFO  (OverseerStateUpdate-96571226466353157-127.0.0.1:40230_-n_0000000000) [    ] o.a.s.c.o.ReplicaMutator Update state numShards=2 message={
   [junit4]   2>   "core":"collection1",
   [junit4]   2>   "core_node_name":"core_node1",
   [junit4]   2>   "roles":null,
   [junit4]   2>   "base_url":"https://127.0.0.1:33568",
   [junit4]   2>   "node_name":"127.0.0.1:33568_",
   [junit4]   2>   "numShards":"2",
   [junit4]   2>   "state":"active",
   [junit4]   2>   "shard":"shard2",
   [junit4]   2>   "collection":"collection1",
   [junit4]   2>   "operation":"state"}
   [junit4]   2> 1049953 INFO  (zkCallback-1234-thread-1) [    ] o.a.s.c.c.ZkStateReader A cluster state change: [WatchedEvent state:SyncConnected type:NodeDataChanged path:/clusterstate.json], has occurred - updating... (live nodes size: [2])
   [junit4]   2> 1049953 INFO  (zkCallback-1243-thread-1) [    ] o.a.s.c.c.ZkStateReader A cluster state change: [WatchedEvent state:SyncConnected type:NodeDataChanged path:/clusterstate.json], has occurred - updating... (live nodes size: [2])
   [junit4]   2> 1049953 INFO  (zkCallback-1238-thread-1) [    ] o.a.s.c.c.ZkStateReader A cluster state change: [WatchedEvent state:SyncConnected type:NodeDataChanged path:/clusterstate.json], has occurred - updating... (live nodes size: [2])
   [junit4]   2> 1050184 INFO  (TEST-TestSolrConfigHandlerCloud.test-seed#[1F47A2C9DA27B742]) [    ] o.a.s.SolrTestCaseJ4 Writing core.properties file to /home/jenkins/workspace/Lucene-Solr-master-Linux/solr/build/solr-core/test/J0/temp/solr.handler.TestSolrConfigHandlerCloud_1F47A2C9DA27B742-001/shard-2-001/cores/collection1
   [junit4]   2> 1050184 INFO  (TEST-TestSolrConfigHandlerCloud.test-seed#[1F47A2C9DA27B742]) [    ] o.a.s.c.AbstractFullDistribZkTestBase create jetty 2 in directory /home/jenkins/workspace/Lucene-Solr-master-Linux/solr/build/solr-core/test/J0/temp/solr.handler.TestSolrConfigHandlerCloud_1F47A2C9DA27B742-001/shard-2-001
   [junit4]   2> 1050186 INFO  (TEST-TestSolrConfigHandlerCloud.test-seed#[1F47A2C9DA27B742]) [    ] o.e.j.s.Server jetty-9.3.8.v20160314
   [junit4]   2> 1050187 INFO  (TEST-TestSolrConfigHandlerCloud.test-seed#[1F47A2C9DA27B742]) [    ] o.e.j.s.h.ContextHandler Started o.e.j.s.ServletContextHandler@84e099{/,null,AVAILABLE}
   [junit4]   2> 1050187 INFO  (TEST-TestSolrConfigHandlerCloud.test-seed#[1F47A2C9DA27B742]) [    ] o.e.j.s.ServerConnector Started ServerConnector@f09a1e{SSL,[ssl, http/1.1]}{127.0.0.1:46444}
   [junit4]   2> 1050187 INFO  (TEST-TestSolrConfigHandlerCloud.test-seed#[1F47A2C9DA27B742]) [    ] o.e.j.s.Server Started @1052564ms
   [junit4]   2> 1050187 INFO  (TEST-TestSolrConfigHandlerCloud.test-seed#[1F47A2C9DA27B742]) [    ] o.a.s.c.s.e.JettySolrRunner Jetty properties: {hostContext=/, solrconfig=solrconfig.xml, s

[...truncated too long message...]

[junit4]   2> 	at java.lang.Thread.run(java.base@9-ea/Thread.java:843)
   [junit4]   2> 8267388 INFO  (TEST-TestSolrConfigHandlerCloud.test-seed#[1F47A2C9DA27B742]) [    ] o.a.s.c.ZkController Could not publish node as down: java.lang.InterruptedException: sleep interrupted
   [junit4]   2> 8267390 INFO  (coreCloseExecutor-5175-thread-1) [    ] o.a.s.c.SolrCore [collection1]  CLOSING SolrCore org.apache.solr.core.SolrCore@3b91ab
   [junit4]   2> 8267391 INFO  (coreCloseExecutor-5175-thread-1) [    ] o.a.s.c.ZkController removed listener for config directory [/configs/conf1]
   [junit4]   2> 8267391 INFO  (coreCloseExecutor-5175-thread-1) [    ] o.a.s.c.ZkController No more listeners for config directory [/configs/conf1]
   [junit4]   2> 8267391 INFO  (coreCloseExecutor-5175-thread-1) [    ] o.a.s.u.DirectUpdateHandler2 closing DirectUpdateHandler2{commits=0,autocommits=0,soft autocommits=0,optimizes=0,rollbacks=0,expungeDeletes=0,docsPending=0,adds=0,deletesById=0,deletesByQuery=0,errors=0,cumulative_adds=0,cumulative_deletesById=0,cumulative_deletesByQuery=0,cumulative_errors=0,transaction_logs_total_size=0,transaction_logs_total_number=0}
   [junit4]   2> 8267391 INFO  (coreCloseExecutor-5175-thread-1) [    ] o.a.s.u.SolrCoreState Closing SolrCoreState
   [junit4]   2> 8267391 WARN  (coreCloseExecutor-5175-thread-1) [    ] o.a.s.c.RecoveryStrategy Stopping recovery for core=[collection1] coreNodeName=[core_node4]
   [junit4]   2> 8267391 INFO  (coreCloseExecutor-5175-thread-1) [    ] o.a.s.u.DefaultSolrCoreState SolrCoreState ref count has reached 0 - closing IndexWriter
   [junit4]   2> 8267391 INFO  (coreCloseExecutor-5175-thread-1) [    ] o.a.s.u.DefaultSolrCoreState closing IndexWriter with IndexWriterCloser
   [junit4]   2> 8267391 INFO  (coreCloseExecutor-5175-thread-1) [    ] o.a.s.c.SolrCore [collection1] Closing main searcher on request.
   [junit4]   2> 8267399 INFO  (coreCloseExecutor-5175-thread-1) [    ] o.a.s.c.CachingDirectoryFactory Closing MockDirectoryFactory - 3 directories currently being tracked
   [junit4]   2> 8267399 INFO  (coreCloseExecutor-5175-thread-1) [    ] o.a.s.c.CachingDirectoryFactory looking to close /home/jenkins/workspace/Lucene-Solr-master-Linux/solr/build/solr-core/test/J0/temp/solr.handler.TestSolrConfigHandlerCloud_1F47A2C9DA27B742-001/shard-4-001/cores/collection1/data/index [CachedDir<<refCount=0;path=/home/jenkins/workspace/Lucene-Solr-master-Linux/solr/build/solr-core/test/J0/temp/solr.handler.TestSolrConfigHandlerCloud_1F47A2C9DA27B742-001/shard-4-001/cores/collection1/data/index;done=false>>]
   [junit4]   2> 8267400 INFO  (coreCloseExecutor-5175-thread-1) [    ] o.a.s.c.CachingDirectoryFactory Closing directory, CoreContainer#isShutdown=true
   [junit4]   2> 8267400 INFO  (coreCloseExecutor-5175-thread-1) [    ] o.a.s.c.CachingDirectoryFactory Closing directory: /home/jenkins/workspace/Lucene-Solr-master-Linux/solr/build/solr-core/test/J0/temp/solr.handler.TestSolrConfigHandlerCloud_1F47A2C9DA27B742-001/shard-4-001/cores/collection1/data/index
   [junit4]   2> 8267400 INFO  (coreCloseExecutor-5175-thread-1) [    ] o.a.s.c.CachingDirectoryFactory looking to close /home/jenkins/workspace/Lucene-Solr-master-Linux/solr/build/solr-core/test/J0/temp/solr.handler.TestSolrConfigHandlerCloud_1F47A2C9DA27B742-001/shard-4-001/cores/collection1/data [CachedDir<<refCount=0;path=/home/jenkins/workspace/Lucene-Solr-master-Linux/solr/build/solr-core/test/J0/temp/solr.handler.TestSolrConfigHandlerCloud_1F47A2C9DA27B742-001/shard-4-001/cores/collection1/data;done=false>>]
   [junit4]   2> 8267400 INFO  (coreCloseExecutor-5175-thread-1) [    ] o.a.s.c.CachingDirectoryFactory Closing directory, CoreContainer#isShutdown=true
   [junit4]   2> 8267400 INFO  (coreCloseExecutor-5175-thread-1) [    ] o.a.s.c.CachingDirectoryFactory Closing directory: /home/jenkins/workspace/Lucene-Solr-master-Linux/solr/build/solr-core/test/J0/temp/solr.handler.TestSolrConfigHandlerCloud_1F47A2C9DA27B742-001/shard-4-001/cores/collection1/data
   [junit4]   2> 8267400 INFO  (coreCloseExecutor-5175-thread-1) [    ] o.a.s.c.CachingDirectoryFactory looking to close /home/jenkins/workspace/Lucene-Solr-master-Linux/solr/build/solr-core/test/J0/temp/solr.handler.TestSolrConfigHandlerCloud_1F47A2C9DA27B742-001/shard-4-001/cores/collection1/data/snapshot_metadata [CachedDir<<refCount=0;path=/home/jenkins/workspace/Lucene-Solr-master-Linux/solr/build/solr-core/test/J0/temp/solr.handler.TestSolrConfigHandlerCloud_1F47A2C9DA27B742-001/shard-4-001/cores/collection1/data/snapshot_metadata;done=false>>]
   [junit4]   2> 8267400 INFO  (coreCloseExecutor-5175-thread-1) [    ] o.a.s.c.CachingDirectoryFactory Closing directory, CoreContainer#isShutdown=true
   [junit4]   2> 8267400 INFO  (coreCloseExecutor-5175-thread-1) [    ] o.a.s.c.CachingDirectoryFactory Closing directory: /home/jenkins/workspace/Lucene-Solr-master-Linux/solr/build/solr-core/test/J0/temp/solr.handler.TestSolrConfigHandlerCloud_1F47A2C9DA27B742-001/shard-4-001/cores/collection1/data/snapshot_metadata
   [junit4]   2> 8267401 INFO  (TEST-TestSolrConfigHandlerCloud.test-seed#[1F47A2C9DA27B742]) [    ] o.e.j.s.ServerConnector Stopped ServerConnector@188036e{SSL,[ssl, http/1.1]}{127.0.0.1:0}
   [junit4]   2> 8267401 INFO  (TEST-TestSolrConfigHandlerCloud.test-seed#[1F47A2C9DA27B742]) [    ] o.e.j.s.h.ContextHandler Stopped o.e.j.s.ServletContextHandler@35f67e{/,null,UNAVAILABLE}
   [junit4]   2> 8267401 WARN  (NIOServerCxn.Factory:0.0.0.0/0.0.0.0:0) [    ] o.a.z.s.NIOServerCnxn Exception causing close of session 0x1571704d10d0006 due to java.nio.channels.ClosedByInterruptException
   [junit4]   2> 8267402 INFO  (TEST-TestSolrConfigHandlerCloud.test-seed#[1F47A2C9DA27B742]) [    ] o.a.s.c.ChaosMonkey monkey: stop shard! 40230
   [junit4]   2> 8267402 INFO  (TEST-TestSolrConfigHandlerCloud.test-seed#[1F47A2C9DA27B742]) [    ] o.a.s.c.ZkTestServer connecting to 127.0.0.1:37609 37609
   [junit4]   2> 8267507 INFO  (SUITE-TestSolrConfigHandlerCloud-seed#[1F47A2C9DA27B742]-worker) [    ] o.a.s.SolrTestCaseJ4 ###deleteCore
   [junit4]   2> 8267887 WARN  (TEST-TestSolrConfigHandlerCloud.test-seed#[1F47A2C9DA27B742]-SendThread(127.0.0.1:37609)) [    ] o.a.z.c.StaticHostProvider Unexpected exception
   [junit4]   2> java.lang.InterruptedException: sleep interrupted
   [junit4]   2> 	at java.lang.Thread.sleep(java.base@9-ea/Native Method)
   [junit4]   2> 	at org.apache.zookeeper.client.StaticHostProvider.next(StaticHostProvider.java:101)
   [junit4]   2> 	at org.apache.zookeeper.ClientCnxn$SendThread.startConnect(ClientCnxn.java:940)
   [junit4]   2> 	at org.apache.zookeeper.ClientCnxn$SendThread.run(ClientCnxn.java:1003)
   [junit4]   2> Sep 11, 2016 4:13:15 AM com.carrotsearch.randomizedtesting.ThreadLeakControl tryToInterruptAll
   [junit4]   2> INFO: All leaked threads terminated.
   [junit4]   2> NOTE: test params are: codec=CheapBastard, sim=RandomSimilarity(queryNorm=true): {}, locale=en-FJ, timezone=Europe/Tirane
   [junit4]   2> NOTE: Linux 4.4.0-36-generic i386/Oracle Corporation 9-ea (32-bit)/cpus=12,threads=1,free=359160800,total=511705088
   [junit4]   2> NOTE: All tests run in this JVM: [TestFunctionQuery, TestDocSet, PathHierarchyTokenizerFactoryTest, PreAnalyzedUpdateProcessorTest, TestBackupRepositoryFactory, TestCloudPseudoReturnFields, TestRandomFaceting, TestComponentsName, TestQuerySenderNoQuery, TestConfigSetsAPIExclusivity, CurrencyFieldOpenExchangeTest, ExitableDirectoryReaderTest, TestUniqueKeyFieldResource, TestRealTimeGet, TestRestManager, VMParamsZkACLAndCredentialsProvidersTest, RulesTest, RankQueryTest, PolyFieldTest, TestDFISimilarityFactory, TestRTimerTree, TestPKIAuthenticationPlugin, DistributedQueueTest, TestTrieFacet, DisMaxRequestHandlerTest, CloudMLTQParserTest, BufferStoreTest, QueryElevationComponentTest, QueryEqualityTest, CacheHeaderTest, TestSolrCloudWithDelegationTokens, SecurityConfHandlerTest, TestReplicationHandler, NotRequiredUniqueKeyTest, TestFieldCacheSanityChecker, TestLocalFSCloudBackupRestore, AnalysisAfterCoreReloadTest, TestDocumentBuilder, TestRangeQuery, TestJoin, TestSortByMinMaxFunction, DistributedExpandComponentTest, TestStressLucene, BlockJoinFacetRandomTest, TestNRTOpen, TestGraphTermsQParserPlugin, TestJsonFacets, BadCopyFieldTest, TestStressCloudBlindAtomicUpdates, DefaultValueUpdateProcessorTest, TestCopyFieldCollectionResource, TestImplicitCoreProperties, TestSolrDeletionPolicy2, SolrRequestParserTest, BasicDistributedZkTest, TestPHPSerializedResponseWriter, ChaosMonkeyNothingIsSafeTest, ZkStateWriterTest, DeleteInactiveReplicaTest, TestManagedSchema, TestHdfsUpdateLog, TestConfigReload, RestartWhileUpdatingTest, HdfsChaosMonkeyNothingIsSafeTest, ConnectionManagerTest, TestReplicaProperties, ScriptEngineTest, AlternateDirectoryTest, TestFaceting, TestBadConfig, ClusterStateTest, TestFieldCacheVsDocValues, RemoteQueryErrorTest, ResourceLoaderTest, TestDistributedSearch, TestReqParamsAPI, TestSolrCoreSnapshots, AnalyticsQueryTest, TestNoOpRegenerator, TestExactSharedStatsCache, LeaderElectionIntegrationTest, SpatialRPTFieldTypeTest, TestRawTransformer, BasicZkTest, ActionThrottleTest, SolrCoreTest, TestSchemaResource, TestLazyCores, PeerSyncTest, OutputWriterTest, SmileWriterTest, RequiredFieldsTest, HighlighterConfigTest, SynonymTokenizerTest, TestRecoveryHdfs, TestSolrConfigHandlerCloud]
   [junit4]   2> NOTE: reproduce with: ant test  -Dtestcase=TestSolrConfigHandlerCloud -Dtests.seed=1F47A2C9DA27B742 -Dtests.multiplier=3 -Dtests.slow=true -Dtests.locale=en-FJ -Dtests.timezone=Europe/Tirane -Dtests.asserts=true -Dtests.file.encoding=ISO-8859-1
   [junit4] ERROR   0.00s J0 | TestSolrConfigHandlerCloud (suite) <<<
   [junit4]    > Throwable #1: java.lang.Exception: Suite timeout exceeded (>= 7200000 msec).
   [junit4]    > 	at __randomizedtesting.SeedInfo.seed([1F47A2C9DA27B742]:0)
   [junit4] Completed [625/631 (1!)] on J0 in 7221.25s, 1 test, 2 errors <<< FAILURES!

[...truncated 49792 lines...]


Mime
View raw message