lucene-dev mailing list archives

Site index · List index
Message view « Date » · « Thread »
Top « Date » · « Thread »
From Policeman Jenkins Server <jenk...@thetaphi.de>
Subject [JENKINS] Lucene-Solr-master-MacOSX (64bit/jdk1.8.0) - Build # 3554 - Still Unstable!
Date Wed, 21 Sep 2016 03:43:18 GMT
Build: http://jenkins.thetaphi.de/job/Lucene-Solr-master-MacOSX/3554/
Java: 64bit/jdk1.8.0 -XX:+UseCompressedOops -XX:+UseG1GC

1 tests failed.
FAILED:  org.apache.solr.handler.TestReplicationHandler.doTestIndexAndConfigAliasReplication

Error Message:
expected:<1> but was:<0>

Stack Trace:
java.lang.AssertionError: expected:<1> but was:<0>
	at __randomizedtesting.SeedInfo.seed([4DA54ED0255A6B5:F3A9BAB5C4BD0953]:0)
	at org.junit.Assert.fail(Assert.java:93)
	at org.junit.Assert.failNotEquals(Assert.java:647)
	at org.junit.Assert.assertEquals(Assert.java:128)
	at org.junit.Assert.assertEquals(Assert.java:472)
	at org.junit.Assert.assertEquals(Assert.java:456)
	at org.apache.solr.handler.TestReplicationHandler.doTestIndexAndConfigAliasReplication(TestReplicationHandler.java:1329)
	at sun.reflect.NativeMethodAccessorImpl.invoke0(Native Method)
	at sun.reflect.NativeMethodAccessorImpl.invoke(NativeMethodAccessorImpl.java:62)
	at sun.reflect.DelegatingMethodAccessorImpl.invoke(DelegatingMethodAccessorImpl.java:43)
	at java.lang.reflect.Method.invoke(Method.java:498)
	at com.carrotsearch.randomizedtesting.RandomizedRunner.invoke(RandomizedRunner.java:1764)
	at com.carrotsearch.randomizedtesting.RandomizedRunner$8.evaluate(RandomizedRunner.java:871)
	at com.carrotsearch.randomizedtesting.RandomizedRunner$9.evaluate(RandomizedRunner.java:907)
	at com.carrotsearch.randomizedtesting.RandomizedRunner$10.evaluate(RandomizedRunner.java:921)
	at com.carrotsearch.randomizedtesting.rules.SystemPropertiesRestoreRule$1.evaluate(SystemPropertiesRestoreRule.java:57)
	at org.apache.lucene.util.TestRuleSetupTeardownChained$1.evaluate(TestRuleSetupTeardownChained.java:49)
	at org.apache.lucene.util.AbstractBeforeAfterRule$1.evaluate(AbstractBeforeAfterRule.java:45)
	at org.apache.lucene.util.TestRuleThreadAndTestName$1.evaluate(TestRuleThreadAndTestName.java:48)
	at org.apache.lucene.util.TestRuleIgnoreAfterMaxFailures$1.evaluate(TestRuleIgnoreAfterMaxFailures.java:64)
	at org.apache.lucene.util.TestRuleMarkFailure$1.evaluate(TestRuleMarkFailure.java:47)
	at com.carrotsearch.randomizedtesting.rules.StatementAdapter.evaluate(StatementAdapter.java:36)
	at com.carrotsearch.randomizedtesting.ThreadLeakControl$StatementRunner.run(ThreadLeakControl.java:367)
	at com.carrotsearch.randomizedtesting.ThreadLeakControl.forkTimeoutingTask(ThreadLeakControl.java:809)
	at com.carrotsearch.randomizedtesting.ThreadLeakControl$3.evaluate(ThreadLeakControl.java:460)
	at com.carrotsearch.randomizedtesting.RandomizedRunner.runSingleTest(RandomizedRunner.java:880)
	at com.carrotsearch.randomizedtesting.RandomizedRunner$5.evaluate(RandomizedRunner.java:781)
	at com.carrotsearch.randomizedtesting.RandomizedRunner$6.evaluate(RandomizedRunner.java:816)
	at com.carrotsearch.randomizedtesting.RandomizedRunner$7.evaluate(RandomizedRunner.java:827)
	at com.carrotsearch.randomizedtesting.rules.StatementAdapter.evaluate(StatementAdapter.java:36)
	at com.carrotsearch.randomizedtesting.rules.SystemPropertiesRestoreRule$1.evaluate(SystemPropertiesRestoreRule.java:57)
	at org.apache.lucene.util.AbstractBeforeAfterRule$1.evaluate(AbstractBeforeAfterRule.java:45)
	at com.carrotsearch.randomizedtesting.rules.StatementAdapter.evaluate(StatementAdapter.java:36)
	at org.apache.lucene.util.TestRuleStoreClassName$1.evaluate(TestRuleStoreClassName.java:41)
	at com.carrotsearch.randomizedtesting.rules.NoShadowingOrOverridesOnMethodsRule$1.evaluate(NoShadowingOrOverridesOnMethodsRule.java:40)
	at com.carrotsearch.randomizedtesting.rules.NoShadowingOrOverridesOnMethodsRule$1.evaluate(NoShadowingOrOverridesOnMethodsRule.java:40)
	at com.carrotsearch.randomizedtesting.rules.StatementAdapter.evaluate(StatementAdapter.java:36)
	at com.carrotsearch.randomizedtesting.rules.StatementAdapter.evaluate(StatementAdapter.java:36)
	at com.carrotsearch.randomizedtesting.rules.StatementAdapter.evaluate(StatementAdapter.java:36)
	at org.apache.lucene.util.TestRuleAssertionsRequired$1.evaluate(TestRuleAssertionsRequired.java:53)
	at org.apache.lucene.util.TestRuleMarkFailure$1.evaluate(TestRuleMarkFailure.java:47)
	at org.apache.lucene.util.TestRuleIgnoreAfterMaxFailures$1.evaluate(TestRuleIgnoreAfterMaxFailures.java:64)
	at org.apache.lucene.util.TestRuleIgnoreTestSuites$1.evaluate(TestRuleIgnoreTestSuites.java:54)
	at com.carrotsearch.randomizedtesting.rules.StatementAdapter.evaluate(StatementAdapter.java:36)
	at com.carrotsearch.randomizedtesting.ThreadLeakControl$StatementRunner.run(ThreadLeakControl.java:367)
	at java.lang.Thread.run(Thread.java:745)




Build Log:
[...truncated 11480 lines...]
   [junit4] Suite: org.apache.solr.handler.TestReplicationHandler
   [junit4]   2> Creating dataDir: /Users/jenkins/workspace/Lucene-Solr-master-MacOSX/solr/build/solr-core/test/J0/temp/solr.handler.TestReplicationHandler_4DA54ED0255A6B5-001/init-core-data-001
   [junit4]   2> 2351428 INFO  (SUITE-TestReplicationHandler-seed#[4DA54ED0255A6B5]-worker) [    ] o.a.s.SolrTestCaseJ4 Randomized ssl (false) and clientAuth (false) via: @org.apache.solr.SolrTestCaseJ4$SuppressSSL(bugUrl=None) w/ MAC_OS_X supressed clientAuth
   [junit4]   2> 2351429 INFO  (TEST-TestReplicationHandler.testRateLimitedReplication-seed#[4DA54ED0255A6B5]) [    ] o.a.s.SolrTestCaseJ4 ###Starting testRateLimitedReplication
   [junit4]   2> 2351430 INFO  (TEST-TestReplicationHandler.testRateLimitedReplication-seed#[4DA54ED0255A6B5]) [    ] o.a.s.SolrTestCaseJ4 Writing core.properties file to /Users/jenkins/workspace/Lucene-Solr-master-MacOSX/solr/build/solr-core/test/J0/temp/solr.handler.TestReplicationHandler_4DA54ED0255A6B5-001/solr-instance-001/collection1
   [junit4]   2> 2351461 INFO  (TEST-TestReplicationHandler.testRateLimitedReplication-seed#[4DA54ED0255A6B5]) [    ] o.e.j.s.Server jetty-9.3.8.v20160314
   [junit4]   2> 2351463 INFO  (TEST-TestReplicationHandler.testRateLimitedReplication-seed#[4DA54ED0255A6B5]) [    ] o.e.j.s.h.ContextHandler Started o.e.j.s.ServletContextHandler@201ade96{/solr,null,AVAILABLE}
   [junit4]   2> 2351464 INFO  (TEST-TestReplicationHandler.testRateLimitedReplication-seed#[4DA54ED0255A6B5]) [    ] o.e.j.s.ServerConnector Started ServerConnector@808fca{HTTP/1.1,[http/1.1]}{127.0.0.1:58955}
   [junit4]   2> 2351464 INFO  (TEST-TestReplicationHandler.testRateLimitedReplication-seed#[4DA54ED0255A6B5]) [    ] o.e.j.s.Server Started @2358357ms
   [junit4]   2> 2351464 INFO  (TEST-TestReplicationHandler.testRateLimitedReplication-seed#[4DA54ED0255A6B5]) [    ] o.a.s.c.s.e.JettySolrRunner Jetty properties: {solr.data.dir=/Users/jenkins/workspace/Lucene-Solr-master-MacOSX/solr/build/solr-core/test/J0/temp/solr.handler.TestReplicationHandler_4DA54ED0255A6B5-001/solr-instance-001/collection1/data, hostContext=/solr, hostPort=58955}
   [junit4]   2> 2351465 INFO  (TEST-TestReplicationHandler.testRateLimitedReplication-seed#[4DA54ED0255A6B5]) [    ] o.a.s.s.SolrDispatchFilter SolrDispatchFilter.init(): sun.misc.Launcher$AppClassLoader@4554617c
   [junit4]   2> 2351465 INFO  (TEST-TestReplicationHandler.testRateLimitedReplication-seed#[4DA54ED0255A6B5]) [    ] o.a.s.c.SolrResourceLoader new SolrResourceLoader for directory: '/Users/jenkins/workspace/Lucene-Solr-master-MacOSX/solr/build/solr-core/test/J0/temp/solr.handler.TestReplicationHandler_4DA54ED0255A6B5-001/solr-instance-001'
   [junit4]   2> 2351465 INFO  (TEST-TestReplicationHandler.testRateLimitedReplication-seed#[4DA54ED0255A6B5]) [    ] o.a.s.c.SolrResourceLoader JNDI not configured for solr (NoInitialContextEx)
   [junit4]   2> 2351465 INFO  (TEST-TestReplicationHandler.testRateLimitedReplication-seed#[4DA54ED0255A6B5]) [    ] o.a.s.c.SolrResourceLoader solr home defaulted to 'solr/' (could not find system property or JNDI)
   [junit4]   2> 2351465 INFO  (TEST-TestReplicationHandler.testRateLimitedReplication-seed#[4DA54ED0255A6B5]) [    ] o.a.s.c.SolrXmlConfig Loading container configuration from /Users/jenkins/workspace/Lucene-Solr-master-MacOSX/solr/build/solr-core/test/J0/temp/solr.handler.TestReplicationHandler_4DA54ED0255A6B5-001/solr-instance-001/solr.xml
   [junit4]   2> 2351475 INFO  (TEST-TestReplicationHandler.testRateLimitedReplication-seed#[4DA54ED0255A6B5]) [    ] o.a.s.c.CorePropertiesLocator Config-defined core root directory: /Users/jenkins/workspace/Lucene-Solr-master-MacOSX/solr/build/solr-core/test/J0/temp/solr.handler.TestReplicationHandler_4DA54ED0255A6B5-001/solr-instance-001/.
   [junit4]   2> 2351475 INFO  (TEST-TestReplicationHandler.testRateLimitedReplication-seed#[4DA54ED0255A6B5]) [    ] o.a.s.c.CoreContainer New CoreContainer 393766855
   [junit4]   2> 2351475 INFO  (TEST-TestReplicationHandler.testRateLimitedReplication-seed#[4DA54ED0255A6B5]) [    ] o.a.s.c.CoreContainer Loading cores into CoreContainer [instanceDir=/Users/jenkins/workspace/Lucene-Solr-master-MacOSX/solr/build/solr-core/test/J0/temp/solr.handler.TestReplicationHandler_4DA54ED0255A6B5-001/solr-instance-001]
   [junit4]   2> 2351475 WARN  (TEST-TestReplicationHandler.testRateLimitedReplication-seed#[4DA54ED0255A6B5]) [    ] o.a.s.c.CoreContainer Couldn't add files from /Users/jenkins/workspace/Lucene-Solr-master-MacOSX/solr/build/solr-core/test/J0/temp/solr.handler.TestReplicationHandler_4DA54ED0255A6B5-001/solr-instance-001/lib to classpath: /Users/jenkins/workspace/Lucene-Solr-master-MacOSX/solr/build/solr-core/test/J0/temp/solr.handler.TestReplicationHandler_4DA54ED0255A6B5-001/solr-instance-001/lib
   [junit4]   2> 2351475 INFO  (TEST-TestReplicationHandler.testRateLimitedReplication-seed#[4DA54ED0255A6B5]) [    ] o.a.s.h.c.HttpShardHandlerFactory created with socketTimeout : 90000,urlScheme : ,connTimeout : 15000,maxConnectionsPerHost : 20,maxConnections : 10000,corePoolSize : 0,maximumPoolSize : 2147483647,maxThreadIdleTime : 5,sizeOfQueue : -1,fairnessPolicy : false,
   [junit4]   2> 2351478 INFO  (TEST-TestReplicationHandler.testRateLimitedReplication-seed#[4DA54ED0255A6B5]) [    ] o.a.s.u.UpdateShardHandler Created UpdateShardHandler HTTP client with params: socketTimeout=340000&connTimeout=45000&maxConnections=100000&maxConnectionsPerHost=100000
   [junit4]   2> 2351478 INFO  (TEST-TestReplicationHandler.testRateLimitedReplication-seed#[4DA54ED0255A6B5]) [    ] o.a.s.l.LogWatcher SLF4J impl is org.slf4j.impl.Log4jLoggerFactory
   [junit4]   2> 2351479 INFO  (TEST-TestReplicationHandler.testRateLimitedReplication-seed#[4DA54ED0255A6B5]) [    ] o.a.s.l.LogWatcher Registering Log Listener [Log4j (org.slf4j.impl.Log4jLoggerFactory)]
   [junit4]   2> 2351479 INFO  (TEST-TestReplicationHandler.testRateLimitedReplication-seed#[4DA54ED0255A6B5]) [    ] o.a.s.c.CoreContainer Security conf doesn't exist. Skipping setup for authorization module.
   [junit4]   2> 2351479 INFO  (TEST-TestReplicationHandler.testRateLimitedReplication-seed#[4DA54ED0255A6B5]) [    ] o.a.s.c.CoreContainer No authentication plugin used.
   [junit4]   2> 2351484 INFO  (TEST-TestReplicationHandler.testRateLimitedReplication-seed#[4DA54ED0255A6B5]) [    ] o.a.s.c.CorePropertiesLocator Looking for core definitions underneath /Users/jenkins/workspace/Lucene-Solr-master-MacOSX/solr/build/solr-core/test/J0/temp/solr.handler.TestReplicationHandler_4DA54ED0255A6B5-001/solr-instance-001/.
   [junit4]   2> 2351486 INFO  (TEST-TestReplicationHandler.testRateLimitedReplication-seed#[4DA54ED0255A6B5]) [    ] o.a.s.c.CoreDescriptor Created CoreDescriptor: {name=collection1, config=solrconfig.xml, loadOnStartup=true, schema=schema.xml, configSetProperties=configsetprops.json, transient=false, dataDir=data/}
   [junit4]   2> 2351486 INFO  (TEST-TestReplicationHandler.testRateLimitedReplication-seed#[4DA54ED0255A6B5]) [    ] o.a.s.c.CorePropertiesLocator Found core collection1 in /Users/jenkins/workspace/Lucene-Solr-master-MacOSX/solr/build/solr-core/test/J0/temp/solr.handler.TestReplicationHandler_4DA54ED0255A6B5-001/solr-instance-001/./collection1
   [junit4]   2> 2351486 INFO  (TEST-TestReplicationHandler.testRateLimitedReplication-seed#[4DA54ED0255A6B5]) [    ] o.a.s.c.CorePropertiesLocator Found 1 core definitions
   [junit4]   2> 2351487 INFO  (coreLoadExecutor-5990-thread-1) [    ] o.a.s.c.SolrResourceLoader new SolrResourceLoader for directory: '/Users/jenkins/workspace/Lucene-Solr-master-MacOSX/solr/build/solr-core/test/J0/temp/solr.handler.TestReplicationHandler_4DA54ED0255A6B5-001/solr-instance-001/collection1'
   [junit4]   2> 2351487 INFO  (TEST-TestReplicationHandler.testRateLimitedReplication-seed#[4DA54ED0255A6B5]) [    ] o.a.s.s.SolrDispatchFilter user.dir=/Users/jenkins/workspace/Lucene-Solr-master-MacOSX/solr/build/solr-core/test/J0
   [junit4]   2> 2351487 INFO  (TEST-TestReplicationHandler.testRateLimitedReplication-seed#[4DA54ED0255A6B5]) [    ] o.a.s.s.SolrDispatchFilter SolrDispatchFilter.init() done
   [junit4]   2> 2351487 INFO  (coreLoadExecutor-5990-thread-1) [    ] o.a.s.c.SolrResourceLoader JNDI not configured for solr (NoInitialContextEx)
   [junit4]   2> 2351487 INFO  (coreLoadExecutor-5990-thread-1) [    ] o.a.s.c.SolrResourceLoader solr home defaulted to 'solr/' (could not find system property or JNDI)
   [junit4]   2> 2351497 INFO  (coreLoadExecutor-5990-thread-1) [    ] o.a.s.c.SolrConfig current version of requestparams : -1
   [junit4]   2> 2351501 INFO  (coreLoadExecutor-5990-thread-1) [    ] o.a.s.c.SolrConfig Using Lucene MatchVersion: 7.0.0
   [junit4]   2> 2351505 INFO  (coreLoadExecutor-5990-thread-1) [    ] o.a.s.c.SolrConfig Loaded SolrConfig: solrconfig.xml
   [junit4]   2> 2351507 INFO  (coreLoadExecutor-5990-thread-1) [    ] o.a.s.s.IndexSchema [collection1] Schema name=test
   [junit4]   2> 2351511 INFO  (coreLoadExecutor-5990-thread-1) [    ] o.a.s.s.IndexSchema unique key field: id
   [junit4]   2> 2351514 INFO  (coreLoadExecutor-5990-thread-1) [    ] o.a.s.c.ConfigSetProperties Did not find ConfigSet properties, assuming default properties: Can't find resource 'configsetprops.json' in classpath or '/Users/jenkins/workspace/Lucene-Solr-master-MacOSX/solr/build/solr-core/test/J0/temp/solr.handler.TestReplicationHandler_4DA54ED0255A6B5-001/solr-instance-001/collection1'
   [junit4]   2> 2351514 INFO  (coreLoadExecutor-5990-thread-1) [    ] o.a.s.c.CoreContainer Creating SolrCore 'collection1' using configuration from instancedir /Users/jenkins/workspace/Lucene-Solr-master-MacOSX/solr/build/solr-core/test/J0/temp/solr.handler.TestReplicationHandler_4DA54ED0255A6B5-001/solr-instance-001/./collection1
   [junit4]   2> 2351514 INFO  (coreLoadExecutor-5990-thread-1) [    x:collection1] o.a.s.c.SolrCore org.apache.solr.core.MockDirectoryFactory
   [junit4]   2> 2351514 INFO  (coreLoadExecutor-5990-thread-1) [    x:collection1] o.a.s.c.SolrCore [[collection1] ] Opening new SolrCore at [/Users/jenkins/workspace/Lucene-Solr-master-MacOSX/solr/build/solr-core/test/J0/temp/solr.handler.TestReplicationHandler_4DA54ED0255A6B5-001/solr-instance-001/collection1], dataDir=[/Users/jenkins/workspace/Lucene-Solr-master-MacOSX/solr/build/solr-core/test/J0/temp/solr.handler.TestReplicationHandler_4DA54ED0255A6B5-001/solr-instance-001/./collection1/data/]
   [junit4]   2> 2351514 INFO  (coreLoadExecutor-5990-thread-1) [    x:collection1] o.a.s.c.SolrCore JMX monitoring not detected for core: collection1
   [junit4]   2> 2351515 INFO  (coreLoadExecutor-5990-thread-1) [    x:collection1] o.a.s.c.CachingDirectoryFactory return new directory for /Users/jenkins/workspace/Lucene-Solr-master-MacOSX/solr/build/solr-core/test/J0/temp/solr.handler.TestReplicationHandler_4DA54ED0255A6B5-001/solr-instance-001/./collection1/data/snapshot_metadata
   [junit4]   2> 2351515 INFO  (coreLoadExecutor-5990-thread-1) [    x:collection1] o.a.s.c.s.SolrSnapshotMetaDataManager Loading from snapshot metadata file...
   [junit4]   2> 2351515 INFO  (coreLoadExecutor-5990-thread-1) [    x:collection1] o.a.s.c.CachingDirectoryFactory return new directory for /Users/jenkins/workspace/Lucene-Solr-master-MacOSX/solr/build/solr-core/test/J0/temp/solr.handler.TestReplicationHandler_4DA54ED0255A6B5-001/solr-instance-001/./collection1/data
   [junit4]   2> 2351515 INFO  (coreLoadExecutor-5990-thread-1) [    x:collection1] o.a.s.c.SolrCore New index directory detected: old=null new=/Users/jenkins/workspace/Lucene-Solr-master-MacOSX/solr/build/solr-core/test/J0/temp/solr.handler.TestReplicationHandler_4DA54ED0255A6B5-001/solr-instance-001/./collection1/data/index/
   [junit4]   2> 2351515 WARN  (coreLoadExecutor-5990-thread-1) [    x:collection1] o.a.s.c.SolrCore [collection1] Solr index directory '/Users/jenkins/workspace/Lucene-Solr-master-MacOSX/solr/build/solr-core/test/J0/temp/solr.handler.TestReplicationHandler_4DA54ED0255A6B5-001/solr-instance-001/./collection1/data/index' doesn't exist. Creating new index...
   [junit4]   2> 2351515 INFO  (coreLoadExecutor-5990-thread-1) [    x:collection1] o.a.s.c.CachingDirectoryFactory return new directory for /Users/jenkins/workspace/Lucene-Solr-master-MacOSX/solr/build/solr-core/test/J0/temp/solr.handler.TestReplicationHandler_4DA54ED0255A6B5-001/solr-instance-001/./collection1/data/index
   [junit4]   2> 2351515 INFO  (coreLoadExecutor-5990-thread-1) [    x:collection1] o.a.s.u.RandomMergePolicy RandomMergePolicy wrapping class org.apache.lucene.index.AlcoholicMergePolicy: [AlcoholicMergePolicy: minMergeSize=0, mergeFactor=10, maxMergeSize=634573683, maxMergeSizeForForcedMerge=9223372036854775807, calibrateSizeByDeletes=true, maxMergeDocs=2147483647, maxCFSSegmentSizeMB=8.796093022207999E12, noCFSRatio=0.1]
   [junit4]   2> 2351516 INFO  (coreLoadExecutor-5990-thread-1) [    x:collection1] o.a.s.c.SolrDeletionPolicy SolrDeletionPolicy.onCommit: commits: num=1
   [junit4]   2> 	commit{dir=MockDirectoryWrapper(RAMDirectory@fc8d49 lockFactory=org.apache.lucene.store.SingleInstanceLockFactory@4c9a680),segFN=segments_1,generation=1}
   [junit4]   2> 2351516 INFO  (coreLoadExecutor-5990-thread-1) [    x:collection1] o.a.s.c.SolrDeletionPolicy newest commit generation = 1
   [junit4]   2> 2351516 INFO  (OldIndexDirectoryCleanupThreadForCore-collection1) [    x:collection1] o.a.s.c.SolrCore Looking for old index directories to cleanup for core collection1 in /Users/jenkins/workspace/Lucene-Solr-master-MacOSX/solr/build/solr-core/test/J0/temp/solr.handler.TestReplicationHandler_4DA54ED0255A6B5-001/solr-instance-001/./collection1/data/
   [junit4]   2> 2351518 INFO  (coreLoadExecutor-5990-thread-1) [    x:collection1] o.a.s.c.SolrCore no updateRequestProcessorChain defined as default, creating implicit default
   [junit4]   2> 2351521 INFO  (coreLoadExecutor-5990-thread-1) [    x:collection1] o.a.s.h.l.XMLLoader xsltCacheLifetimeSeconds=60
   [junit4]   2> 2351522 INFO  (coreLoadExecutor-5990-thread-1) [    x:collection1] o.a.s.h.l.XMLLoader xsltCacheLifetimeSeconds=60
   [junit4]   2> 2351522 INFO  (coreLoadExecutor-5990-thread-1) [    x:collection1] o.a.s.h.l.XMLLoader xsltCacheLifetimeSeconds=60
   [junit4]   2> 2351523 INFO  (coreLoadExecutor-5990-thread-1) [    x:collection1] o.a.s.h.l.XMLLoader xsltCacheLifetimeSeconds=60
   [junit4]   2> 2351524 INFO  (coreLoadExecutor-5990-thread-1) [    x:collection1] o.a.s.c.PluginBag requestHandler : 'lazy' created with startup=lazy 
   [junit4]   2> 2351524 INFO  (coreLoadExecutor-5990-thread-1) [    x:collection1] o.a.s.c.RequestHandlers Registered paths: /admin/mbeans,standard,lazy,/update/json/docs,/admin/luke,/export,/get,/admin/properties,/update/json,/admin/threads,/update/csv,/sql,/graph,/admin/segments,/admin/system,/replication,defaults,/config,/stream,/schema,/admin/plugins,/admin/logging,/admin/ping,/update,/admin/file,/terms
   [junit4]   2> 2351524 INFO  (coreLoadExecutor-5990-thread-1) [    x:collection1] o.a.s.c.SolrCore Using default statsCache cache: org.apache.solr.search.stats.LocalStatsCache
   [junit4]   2> 2351525 INFO  (coreLoadExecutor-5990-thread-1) [    x:collection1] o.a.s.u.CommitTracker Hard AutoCommit: disabled
   [junit4]   2> 2351525 INFO  (coreLoadExecutor-5990-thread-1) [    x:collection1] o.a.s.u.CommitTracker Soft AutoCommit: disabled
   [junit4]   2> 2351525 INFO  (coreLoadExecutor-5990-thread-1) [    x:collection1] o.a.s.u.RandomMergePolicy RandomMergePolicy wrapping class org.apache.lucene.index.LogDocMergePolicy: [LogDocMergePolicy: minMergeSize=1000, mergeFactor=28, maxMergeSize=9223372036854775807, maxMergeSizeForForcedMerge=9223372036854775807, calibrateSizeByDeletes=true, maxMergeDocs=2147483647, maxCFSSegmentSizeMB=8.796093022207999E12, noCFSRatio=1.0]
   [junit4]   2> 2351525 INFO  (coreLoadExecutor-5990-thread-1) [    x:collection1] o.a.s.c.SolrDeletionPolicy SolrDeletionPolicy.onInit: commits: num=1
   [junit4]   2> 	commit{dir=MockDirectoryWrapper(RAMDirectory@fc8d49 lockFactory=org.apache.lucene.store.SingleInstanceLockFactory@4c9a680),segFN=segments_1,generation=1}
   [junit4]   2> 2351526 INFO  (coreLoadExecutor-5990-thread-1) [    x:collection1] o.a.s.c.SolrDeletionPolicy newest commit generation = 1
   [junit4]   2> 2351526 INFO  (coreLoadExecutor-5990-thread-1) [    x:collection1] o.a.s.s.SolrIndexSearcher Opening [Searcher@2faa659b[collection1] main]
   [junit4]   2> 2351526 INFO  (coreLoadExecutor-5990-thread-1) [    x:collection1] o.a.s.r.ManagedResourceStorage File-based storage initialized to use dir: /Users/jenkins/workspace/Lucene-Solr-master-MacOSX/solr/build/solr-core/test/J0/temp/solr.handler.TestReplicationHandler_4DA54ED0255A6B5-001/solr-instance-001/collection1/conf
   [junit4]   2> 2351526 INFO  (coreLoadExecutor-5990-thread-1) [    x:collection1] o.a.s.r.RestManager Initializing RestManager with initArgs: {storageDir=/Users/jenkins/workspace/Lucene-Solr-master-MacOSX/solr/build/solr-core/test/J0/temp/solr.handler.TestReplicationHandler_4DA54ED0255A6B5-001/solr-instance-001/collection1/conf}
   [junit4]   2> 2351526 INFO  (coreLoadExecutor-5990-thread-1) [    x:collection1] o.a.s.r.ManagedResourceStorage Reading _rest_managed.json using file:dir=/Users/jenkins/workspace/Lucene-Solr-master-MacOSX/solr/build/solr-core/test/J0/temp/solr.handler.TestReplicationHandler_4DA54ED0255A6B5-001/solr-instance-001/collection1/conf
   [junit4]   2> 2351526 INFO  (coreLoadExecutor-5990-thread-1) [    x:collection1] o.a.s.r.RestManager Initializing 0 registered ManagedResources
   [junit4]   2> 2351526 INFO  (coreLoadExecutor-5990-thread-1) [    x:collection1] o.a.s.h.ReplicationHandler Replication enabled for following config files: schema.xml,xslt/dummy.xsl
   [junit4]   2> 2351526 INFO  (coreLoadExecutor-5990-thread-1) [    x:collection1] o.a.s.h.ReplicationHandler Commits will be reserved for  10000
   [junit4]   2> 2351527 INFO  (searcherExecutor-5991-thread-1-processing-x:collection1) [    x:collection1] o.a.s.c.SolrCore [collection1] Registered new searcher Searcher@2faa659b[collection1] main{ExitableDirectoryReader(UninvertingDirectoryReader())}
   [junit4]   2> 2351527 INFO  (coreLoadExecutor-5990-thread-1) [    x:collection1] o.a.s.c.CoreContainer registering core: collection1
   [junit4]   2> 2351990 INFO  (TEST-TestReplicationHandler.testRateLimitedReplication-seed#[4DA54ED0255A6B5]) [    ] o.a.s.SolrTestCaseJ4 Writing core.properties file to /Users/jenkins/workspace/Lucene-Solr-master-MacOSX/solr/build/solr-core/test/J0/temp/solr.handler.TestReplicationHandler_4DA54ED0255A6B5-001/solr-instance-002/collection1
   [junit4]   2> 2351999 INFO  (TEST-TestReplicationHandler.testRateLimitedReplication-seed#[4DA54ED0255A6B5]) [    ] o.e.j.s.Server jetty-9.3.8.v20160314
   [junit4]   2> 2352000 INFO  (TEST-TestReplicationHandler.testRateLimitedReplication-seed#[4DA54ED0255A6B5]) [    ] o.e.j.s.h.ContextHandler Started o.e.j.s.ServletContextHandler@6453fbbf{/solr,null,AVAILABLE}
   [junit4]   2> 2352001 INFO  (TEST-TestReplicationHandler.testRateLimitedReplication-seed#[4DA54ED0255A6B5]) [    ] o.e.j.s.ServerConnector Started ServerConnector@77fb37d0{HTTP/1.1,[http/1.1]}{127.0.0.1:58956}
   [junit4]   2> 2352001 INFO  (TEST-TestReplicationHandler.testRateLimitedReplication-seed#[4DA54ED0255A6B5]) [    ] o.e.j.s.Server Started @2358894ms
   [junit4]   2> 2352001 INFO  (TEST-TestReplicationHandler.testRateLimitedReplication-seed#[4DA54ED0255A6B5]) [    ] o.a.s.c.s.e.JettySolrRunner Jetty properties: {solr.data.dir=/Users/jenkins/workspace/Lucene-Solr-master-MacOSX/solr/build/solr-core/test/J0/temp/solr.handler.TestReplicationHandler_4DA54ED0255A6B5-001/solr-instance-002/collection1/data, hostContext=/solr, hostPort=58956}
   [junit4]   2> 2352002 INFO  (TEST-TestReplicationHandler.testRateLimitedReplication-seed#[4DA54ED0255A6B5]) [    ] o.a.s.s.SolrDispatchFilter SolrDispatchFilter.init(): sun.misc.Launcher$AppClassLoader@4554617c
   [junit4]   2> 2352002 INFO  (TEST-TestReplicationHandler.testRateLimitedReplication-seed#[4DA54ED0255A6B5]) [    ] o.a.s.c.SolrResourceLoader new SolrResourceLoader for directory: '/Users/jenkins/workspace/Lucene-Solr-master-MacOSX/solr/build/solr-core/test/J0/temp/solr.handler.TestReplicationHandler_4DA54ED0255A6B5-001/solr-instance-002'
   [junit4]   2> 2352002 INFO  (TEST-TestReplicationHandler.testRateLimitedReplication-seed#[4DA54ED0255A6B5]) [    ] o.a.s.c.SolrResourceLoader JNDI not configured for solr (NoInitialContextEx)
   [junit4]   2> 2352002 INFO  (TEST-TestReplicationHandler.testRateLimitedReplication-seed#[4DA54ED0255A6B5]) [    ] o.a.s.c.SolrResourceLoader solr home defaulted to 'solr/' (could not find system property or JNDI)
   [junit4]   2> 2352003 INFO  (TEST-TestReplicationHandler.testRateLimitedReplication-seed#[4DA54ED0255A6B5]) [    ] o.a.s.c.SolrXmlConfig Loading container configuration from /Users/jenkins/workspace/Lucene-Solr-master-MacOSX/solr/build/solr-core/test/J0/temp/solr.handler.TestReplicationHandler_4DA54ED0255A6B5-001/solr-instance-002/solr.xml
   [junit4]   2> 2352006 INFO  (TEST-TestReplicationHandler.testRateLimitedReplication-seed#[4DA54ED0255A6B5]) [    ] o.a.s.c.CorePropertiesLocator Config-defined core root directory: /Users/jenkins/workspace/Lucene-Solr-master-MacOSX/solr/build/solr-core/test/J0/temp/solr.handler.TestReplicationHandler_4DA54ED0255A6B5-001/solr-instance-002/.
   [junit4]   2> 2352006 INFO  (TEST-TestReplicationHandler.testRateLimitedReplication-seed#[4DA54ED0255A6B5]) [    ] o.a.s.c.CoreContainer New CoreContainer 486580847
   [junit4]   2> 2352006 INFO  (TEST-TestReplicationHandler.testRateLimitedReplication-seed#[4DA54ED0255A6B5]) [    ] o.a.s.c.CoreContainer Loading cores into CoreContainer [instanceDir=/Users/jenkins/workspace/Lucene-Solr-master-MacOSX/solr/build/solr-core/test/J0/temp/solr.handler.TestReplicationHandler_4DA54ED0255A6B5-001/solr-instance-002]
   [junit4]   2> 2352006 WARN  (TEST-TestReplicationHandler.testRateLimitedReplication-seed#[4DA54ED0255A6B5]) [    ] o.a.s.c.CoreContainer Couldn't add files from /Users/jenkins/workspace/Lucene-Solr-master-MacOSX/solr/build/solr-core/test/J0/temp/solr.handler.TestReplicationHandler_4DA54ED0255A6B5-001/solr-instance-002/lib to classpath: /Users/jenkins/workspace/Lucene-Solr-master-MacOSX/solr/build/solr-core/test/J0/temp/solr.handler.TestReplicationHandler_4DA54ED0255A6B5-001/solr-instance-002/lib
   [junit4]   2> 2352006 INFO  (TEST-TestReplicationHandler.testRateLimitedReplication-seed#[4DA54ED0255A6B5]) [    ] o.a.s.h.c.HttpShardHandlerFactory created with socketTimeout : 90000,urlScheme : ,connTimeout : 15000,maxConnectionsPerHost : 20,maxConnections : 10000,corePoolSize : 0,maximumPoolSize : 2147483647,maxThreadIdleTime : 5,sizeOfQueue : -1,fairnessPolicy : false,
   [junit4]   2> 2352008 INFO  (TEST-TestReplicationHandler.testRateLimitedReplication-seed#[4DA54ED0255A6B5]) [    ] o.a.s.u.UpdateShardHandler Created UpdateShardHandler HTTP client with params: socketTimeout=340000&connTimeout=45000&maxConnections=100000&maxConnectionsPerHost=100000
   [junit4]   2> 2352008 INFO  (TEST-TestReplicationHandler.testRateLimitedReplication-seed#[4DA54ED0255A6B5]) [    ] o.a.s.l.LogWatcher SLF4J impl is org.slf4j.impl.Log4jLoggerFactory
   [junit4]   2> 2352008 INFO  (TEST-TestReplicationHandler.testRateLimitedReplication-seed#[4DA54ED0255A6B5]) [    ] o.a.s.l.LogWatcher Registering Log Listener [Log4j (org.slf4j.impl.Log4jLoggerFactory)]
   [junit4]   2> 2352008 INFO  (TEST-TestReplicationHandler.testRateLimitedReplication-seed#[4DA54ED0255A6B5]) [    ] o.a.s.c.CoreContainer Security conf doesn't exist. Skipping setup for authorization module.
   [junit4]   2> 2352008 INFO  (TEST-TestReplicationHandler.testRateLimitedReplication-seed#[4DA54ED0255A6B5]) [    ] o.a.s.c.CoreContainer No authentication plugin used.
   [junit4]   2> 2352009 INFO  (TEST-TestReplicationHandler.testRateLimitedReplication-seed#[4DA54ED0255A6B5]) [    ] o.a.s.c.CorePropertiesLocator Looking for core definitions underneath /Users/jenkins/workspace/Lucene-Solr-master-MacOSX/solr/build/solr-core/test/J0/temp/solr.handler.TestReplicationHandler_4DA54ED0255A6B5-001/solr-instance-002/.
   [junit4]   2> 2352010 INFO  (TEST-TestReplicationHandler.testRateLimitedReplication-seed#[4DA54ED0255A6B5]) [    ] o.a.s.c.CoreDescriptor Created CoreDescriptor: {name=collection1, config=solrconfig.xml, loadOnStartup=true, schema=schema.xml, configSetProperties=configsetprops.json, transient=false, dataDir=data/}
   [junit4]   2> 2352010 INFO  (TEST-TestReplicationHandler.testRateLimitedReplication-seed#[4DA54ED0255A6B5]) [    ] o.a.s.c.CorePropertiesLocator Found core collection1 in /Users/jenkins/workspace/Lucene-Solr-master-MacOSX/solr/build/solr-core/test/J0/temp/solr.handler.TestReplicationHandler_4DA54ED0255A6B5-001/solr-instance-002/./collection1
   [junit4]   2> 2352011 INFO  (TEST-TestReplicationHandler.testRateLimitedReplication-seed#[4DA54ED0255A6B5]) [    ] o.a.s.c.CorePropertiesLocator Found 1 core definitions
   [junit4]   2> 2352011 INFO  (coreLoadExecutor-6000-thread-1) [    ] o.a.s.c.SolrResourceLoader new SolrResourceLoader for directory: '/Users/jenkins/workspace/Lucene-Solr-master-MacOSX/solr/build/solr-core/test/J0/temp/solr.handler.TestReplicationHandler_4DA54ED0255A6B5-001/solr-instance-002/collection1'
   [junit4]   2> 2352011 INFO  (TEST-TestReplicationHandler.testRateLimitedReplication-seed#[4DA54ED0255A6B5]) [    ] o.a.s.s.SolrDispatchFilter user.dir=/Users/jenkins/workspace/Lucene-Solr-master-MacOSX/solr/build/solr-core/test/J0
   [junit4]   2> 2352011 INFO  (TEST-TestReplicationHandler.testRateLimitedReplication-seed#[4DA54ED0255A6B5]) [    ] o.a.s.s.SolrDispatchFilter SolrDispatchFilter.init() done
   [junit4]   2> 2352011 INFO  (coreLoadExecutor-6000-thread-1) [    ] o.a.s.c.SolrResourceLoader JNDI not configured for solr (NoInitialContextEx)
   [junit4]   2> 2352012 INFO  (coreLoadExecutor-6000-thread-1) [    ] o.a.s.c.SolrResourceLoader solr home defaulted to 'solr/' (could not find system property or JNDI)
   [junit4]   2> 2352016 INFO  (coreLoadExecutor-6000-thread-1) [    ] o.a.s.c.SolrConfig current version of requestparams : -1
   [junit4]   2> 2352018 INFO  (coreLoadExecutor-6000-thread-1) [    ] o.a.s.c.SolrConfig Using Lucene MatchVersion: 7.0.0
   [junit4]   2> 2352022 INFO  (coreLoadExecutor-6000-thread-1) [    ] o.a.s.c.SolrConfig Loaded SolrConfig: solrconfig.xml
   [junit4]   2> 2352024 INFO  (coreLoadExecutor-6000-thread-1) [    ] o.a.s.s.IndexSchema [collection1] Schema name=test
   [junit4]   2> 2352025 INFO  (coreLoadExecutor-6000-thread-1) [    ] o.a.s.s.IndexSchema unique key field: id
   [junit4]   2> 2352026 INFO  (coreLoadExecutor-6000-thread-1) [    ] o.a.s.c.ConfigSetProperties Did not find ConfigSet properties, assuming default properties: Can't find resource 'configsetprops.json' in classpath or '/Users/jenkins/workspace/Lucene-Solr-master-MacOSX/solr/build/solr-core/test/J0/temp/solr.handler.TestReplicationHandler_4DA54ED0255A6B5-001/solr-instance-002/collection1'
   [junit4]   2> 2352026 INFO  (coreLoadExecutor-6000-thread-1) [    ] o.a.s.c.CoreContainer Creating SolrCore 'collection1' using configuration from instancedir /Users/jenkins/workspace/Lucene-Solr-master-MacOSX/solr/build/solr-core/test/J0/temp/solr.handler.TestReplicationHandler_4DA54ED0255A6B5-001/solr-instance-002/./collection1
   [junit4]   2> 2352026 INFO  (coreLoadExecutor-6000-thread-1) [    x:collection1] o.a.s.c.SolrCore org.apache.solr.core.MockDirectoryFactory
   [junit4]   2> 2352026 INFO  (coreLoadExecutor-6000-thread-1) [    x:collection1] o.a.s.c.SolrCore [[collection1] ] Opening new SolrCore at [/Users/jenkins/workspace/Lucene-Solr-master-MacOSX/solr/build/solr-core/test/J0/temp/solr.handler.TestReplicationHandler_4DA54ED0255A6B5-001/solr-instance-002/collection1], dataDir=[/Users/jenkins/workspace/Lucene-Solr-master-MacOSX/solr/build/solr-core/test/J0/temp/solr.handler.TestReplicationHandler_4DA54ED0255A6B5-001/solr-instance-002/./collection1/data/]
   [junit4]   2> 2352027 INFO  (coreLoadExecutor-6000-thread-1) [    x:collection1] o.a.s.c.SolrCore JMX monitoring not detected for core: collection1
   [junit4]   2> 2352027 INFO  (coreLoadExecutor-6000-thread-1) [    x:collection1] o.a.s.c.CachingDirectoryFactory return new directory for /Users/jenkins/workspace/Lucene-Solr-master-MacOSX/solr/build/solr-core/test/J0/temp/solr.handler.TestReplicationHandler_4DA54ED0255A6B5-001/solr-instance-002/./collection1/data/snapshot_metadata
   [junit4]   2> 2352027 INFO  (coreLoadExecutor-6000-thread-1) [    x:collection1] o.a.s.c.s.SolrSnapshotMetaDataManager Loading from snapshot metadata file...
   [junit4]   2> 2352027 INFO  (coreLoadExecutor-6000-thread-1) [    x:collection1] o.a.s.c.CachingDirectoryFactory return new directory for /Users/jenkins/workspace/Lucene-Solr-master-MacOSX/solr/build/solr-core/test/J0/temp/solr.handler.TestReplicationHandler_4DA54ED0255A6B5-001/solr-instance-002/./collection1/data
   [junit4]   2> 2352027 INFO  (coreLoadExecutor-6000-thread-1) [    x:collection1] o.a.s.c.SolrCore New index directory detected: old=null new=/Users/jenkins/workspace/Lucene-Solr-master-MacOSX/solr/build/solr-core/test/J0/temp/solr.handler.TestReplicationHandler_4DA54ED0255A6B5-001/solr-instance-002/./collection1/data/index/
   [junit4]   2> 2352027 WARN  (coreLoadExecutor-6000-thread-1) [    x:collection1] o.a.s.c.SolrCore [collection1] Solr index directory '/Users/jenkins/workspace/Lucene-Solr-master-MacOSX/solr/build/solr-core/test/J0/temp/solr.handler.TestReplicationHandler_4DA54ED0255A6B5-001/solr-instance-002/./collection1/data/index' doesn't exist. Creating new index...
   [junit4]   2> 2352027 INFO  (coreLoadExecutor-6000-thread-1) [    x:collection1] o.a.s.c.CachingDirectoryFactory return new directory for /Users/jenkins/workspace/Lucene-Solr-master-MacOSX/solr/build/solr-core/test/J0/temp/solr.handler.TestReplicationHandler_4DA54ED0255A6B5-001/solr-instance-002/./collection1/data/index
   [junit4]   2> 2352027 INFO  (coreLoadExecutor-6000-thread-1) [    x:collection1] o.a.s.u.RandomMergePolicy RandomMergePolicy wrapping class org.apache.lucene.index.AlcoholicMergePolicy: [AlcoholicMergePolicy: minMergeSize=0, mergeFactor=10, maxMergeSize=634573683, maxMergeSizeForForcedMerge=9223372036854775807, calibrateSizeByDeletes=true, maxMergeDocs=2147483647, maxCFSSegmentSizeMB=8.796093022207999E12, noCFSRatio=0.1]
   [junit4]   2> 2352028 INFO  (coreLoadExecutor-6000-thread-1) [    x:collection1] o.a.s.c.SolrDeletionPolicy SolrDeletionPolicy.onCommit: commits: num=1
   [junit4]   2> 	commit{dir=MockDirectoryWrapper(RAMDirectory@1fdad027 lockFactory=org.apache.lucene.store.SingleInstanceLockFactory@5b850619),segFN=segments_1,generation=1}
   [junit4]   2> 2352028 INFO  (coreLoadExecutor-6000-thread-1) [    x:collection1] o.a.s.c.SolrDeletionPolicy newest commit generation = 1
   [junit4]   2> 2352028 INFO  (OldIndexDirectoryCleanupThreadForCore-collection1) [    x:collection1] o.a.s.c.SolrCore Looking for old index directories to cleanup for core collection1 in /Users/jenkins/workspace/Lucene-Solr-master-MacOSX/solr/build/solr-core/test/J0/temp/solr.handler.TestReplicationHandler_4DA54ED0255A6B5-001/solr-instance-002/./collection1/data/
   [junit4]   2> 2352029 INFO  (coreLoadExecutor-6000-thread-1) [    x:collection1] o.a.s.c.SolrCore no updateRequestProcessorChain defined as default, creating implicit default
   [junit4]   2> 2352030 INFO  (coreLoadExecutor-6000-thread-1) [    x:collection1] o.a.s.h.l.XMLLoader xsltCacheLifetimeSeconds=60
   [junit4]   2> 2352031 INFO  (coreLoadExecutor-6000-thread-1) [    x:collection1] o.a.s.h.l.XMLLoader xsltCacheLifetimeSeconds=60
   [junit4]   2> 2352031 INFO  (coreLoadExecutor-6000-thread-1) [    x:collection1] o.a.s.h.l.XMLLoader xsltCacheLifetimeSeconds=60
   [junit4]   2> 2352032 INFO  (coreLoadExecutor-6000-thread-1) [    x:collection1] o.a.s.h.l.XMLLoader xsltCacheLifetimeSeconds=60
   [junit4]   2> 2352034 INFO  (coreLoadExecutor-6000-thread-1) [    x:collection1] o.a.s.c.PluginBag requestHandler : 'lazy' created with startup=lazy 
   [junit4]   2> 2352034 INFO  (coreLoadExecutor-6000-thread-1) [    x:collection1] o.a.s.c.RequestHandlers Registered paths: /admin/mbeans,standard,lazy,/update/json/docs,/admin/luke,/export,/get,/admin/properties,/update/json,/admin/threads,/update/csv,/sql,/graph,/admin/segments,/admin/system,/replication,defaults,/config,/stream,/schema,/admin/plugins,/admin/logging,/admin/ping,/update,/admin/file,/terms
   [junit4]   2> 2352034 INFO  (coreLoadExecutor-6000-thread-1) [    x:collection1] o.a.s.c.SolrCore Using default statsCache cache: org.apache.solr.search.stats.LocalStatsCache
   [junit4]   2> 2352034 INFO  (coreLoadExecutor-6000-thread-1) [    x:collection1] o.a.s.u.CommitTracker Hard AutoCommit: disabled
   [junit4]   2> 2352034 INFO  (coreLoadExecutor-6000-thread-1) [    x:collection1] o.a.s.u.CommitTracker Soft AutoCommit: disabled
   [junit4]   2> 2352034 INFO  (coreLoadExecutor-6000-thread-1) [    x:collection1] o.a.s.u.RandomMergePolicy RandomMergePolicy wrapping class org.apache.lucene.index.LogDocMergePolicy: [LogDocMergePolicy: minMergeSize=1000, mergeFactor=28, maxMergeSize=9223372036854775807, maxMergeSizeForForcedMerge=9223372036854775807, calibrateSizeByDeletes=true, maxMergeDocs=2147483647, maxCFSSegmentSizeMB=8.796093022207999E12, noCFSRatio=1.0]
   [junit4]   2> 2352034 INFO  (coreLoadExecutor-6000-thread-1) [    x:collection1] o.a.s.c.SolrDeletionPolicy SolrDeletionPolicy.onInit: commits: num=1
   [junit4]   2> 	commit{dir=MockDirectoryWrapper(RAMDirectory@1fdad027 lockFactory=org.apache.lucene.store.SingleInstanceLockFactory@5b850619),segFN=segments_1,generation=1}
   [junit4]   2> 2352034 INFO  (coreLoadExecutor-6000-thread-1) [    x:collection1] o.a.s.c.SolrDeletionPolicy newest commit generation = 1
   [junit4]   2> 2352035 INFO  (coreLoadExecutor-6000-thread-1) [    x:collection1] o.a.s.s.SolrIndexSearcher Opening [Searcher@2926701d[collection1] main]
   [junit4]   2> 2352035 INFO  (coreLoadExecutor-6000-thread-1) [    x:collection1] o.a.s.r.ManagedResourceStorage File-based storage initialized to use dir: /Users/jenkins/workspace/Lucene-Solr-master-MacOSX/solr/build/solr-core/test/J0/temp/solr.handler.TestReplicationHandler_4DA54ED0255A6B5-001/solr-instance-002/collection1/conf
   [junit4]   2> 2352035 INFO  (coreLoadExecutor-6000-thread-1) [    x:collection1] o.a.s.r.RestManager Initializing RestManager with initArgs: {storageDir=/Users/jenkins/workspace/Lucene-Solr-master-MacOSX/solr/build/solr-core/test/J0/temp/solr.handler.TestReplicationHandler_4DA54ED0255A6B5-001/solr-instance-002/collection1/conf}
   [junit4]   2> 2352035 INFO  (coreLoadExecutor-6000-thread-1) [    x:collection1] o.a.s.r.ManagedResourceStorage Reading _rest_managed.json using file:dir=/Users/jenkins/workspace/Lucene-Solr-master-MacOSX/solr/build/solr-core/test/J0/temp/solr.handler.TestReplicationHandler_4DA54ED0255A6B5-001/solr-instance-002/collection1/conf
   [junit4]   2> 2352035 INFO  (coreLoadExecutor-6000-thread-1) [    x:collection1] o.a.s.r.RestManager Initializing 0 registered ManagedResources
   [junit4]   2> 2352037 INFO  (coreLoadExecutor-6000-thread-1) [    x:collection1] o.a.s.h.ReplicationHandler Poll scheduled at an interval of 1000ms
   [junit4]   2> 2352037 INFO  (searcherExecutor-6001-thread-1-processing-x:collection1) [    x:collection1] o.a.s.c.SolrCore [collection1] Registered new searcher Searcher@2926701d[collection1] main{ExitableDirectoryReader(UninvertingDirectoryReader())}
   [junit4]   2> 2352037 INFO  (coreLoadExecutor-6000-thread-1) [    x:collection1] o.a.s.c.CoreContainer registering core: collection1
   [junit4]   2> 2352520 INFO  (qtp609350611-13254) [    x:collection1] o.a.s.u.DirectUpdateHandler2 [collection1] REMOVING ALL DOCUMENTS FROM INDEX
   [junit4]   2> 2352520 INFO  (qtp609350611-13254) [    x:collection1] o.a.s.u.p.LogUpdateProcessorFactory [collection1]  webapp=/solr path=/update params={wt=javabin&version=2}{deleteByQuery=*:*} 0 0
   [junit4]   2> 2352523 INFO  (qtp56893921-13271) [    x:collection1] o.a.s.u.DirectUpdateHandler2 [collection1] REMOVING ALL DOCUMENTS FROM INDEX
   [junit4]   2> 2352523 INFO  (qtp56893921-13271) [    x:collection1] o.a.s.u.p.LogUpdateProcessorFactory [collection1]  webapp=/solr path=/update params={wt=javabin&version=2}{deleteByQuery=*:*} 0 0
   [junit4]   2> 2352524 INFO  (qtp609350611-13255) [    x:collection1] o.a.s.u.DirectUpdateHandler2 start commit{,optimize=false,openSearcher=true,waitSearcher=true,expungeDeletes=false,softCommit=false,prepareCommit=false}
   [junit4]   2> 2352524 INFO  (qtp609350611-13255) [    x:collection1] o.a.s.u.SolrIndexWriter Calling setCommitData with IW:org.apache.solr.update.SolrIndexWriter@36d13023
   [junit4]   2> 2352525 INFO  (qtp609350611-13255) [    x:collection1] o.a.s.c.SolrDeletionPolicy SolrDeletionPolicy.onCommit: commits: num=2
   [junit4]   2> 	commit{dir=MockDirectoryWrapper(RAMDirectory@fc8d49 lockFactory=org.apache.lucene.store.SingleInstanceLockFactory@4c9a680),segFN=segments_1,generation=1}
   [junit4]   2> 	commit{dir=MockDirectoryWrapper(RAMDirectory@fc8d49 lockFactory=org.apache.lucene.store.SingleInstanceLockFactory@4c9a680),segFN=segments_2,generation=2}
   [junit4]   2> 2352526 INFO  (qtp609350611-13255) [    x:collection1] o.a.s.c.SolrDeletionPolicy newest commit generation = 2
   [junit4]   2> 2352527 INFO  (qtp609350611-13255) [    x:collection1] o.a.s.s.SolrIndexSearcher Opening [Searcher@792bc2b2[collection1] main]
   [junit4]   2> 2352527 INFO  (qtp609350611-13255) [    x:collection1] o.a.s.u.DirectUpdateHandler2 end_commit_flush
   [junit4]   2> 2352527 INFO  (searcherExecutor-5991-thread-1-processing-x:collection1) [    x:collection1] o.a.s.c.SolrCore [collection1] Registered new searcher Searcher@792bc2b2[collection1] main{ExitableDirectoryReader(UninvertingDirectoryReader())}
   [junit4]   2> 2352527 INFO  (qtp609350611-13255) [    x:collection1] o.a.s.u.p.LogUpdateProcessorFactory [collection1]  webapp=/solr path=/update params={waitSearcher=true&commit=true&softCommit=false&wt=javabin&version=2}{commit=} 0 3
   [junit4]   2> 2352528 INFO  (qtp56893921-13272) [    x:collection1] o.a.s.u.DirectUpdateHandler2 start commit{,optimize=false,openSearcher=true,waitSearcher=true,expungeDeletes=false,softCommit=false,prepareCommit=false}
   [junit4]   2> 2352528 INFO  (qtp56893921-13272) [    x:collection1] o.a.s.u.SolrIndexWriter Calling setCommitData with IW:org.apache.solr.update.SolrIndexWriter@1ceb9a6a
   [junit4]   2> 2352529 INFO  (qtp56893921-13272) [    x:collection1] o.a.s.c.SolrDeletionPolicy SolrDeletionPolicy.onCommit: commits: num=2
   [junit4]   2> 	commit{dir=MockDirectoryWrapper(RAMDirectory@1fdad027 lockFactory=org.apache.lucene.store.SingleInstanceLockFactory@5b850619),segFN=segments_1,generation=1}
   [junit4]   2> 	commit{dir=MockDirectoryWrapper(RAMDirectory@1fdad027 lockFactory=org.apache.lucene.store.SingleInstanceLockFactory@5b850619),segFN=segments_2,generation=2}
   [junit4]   2> 2352529 INFO  (qtp56893921-13272) [    x:collection1] o.a.s.c.SolrDeletionPolicy newest commit generation = 2
   [junit4]   2> 2352529 INFO  (qtp56893921-13272) [    x:collection1] o.a.s.s.SolrIndexSearcher Opening [Searcher@53116dbc[collection1] main]
   [junit4]   2> 2352529 INFO  (qtp56893921-13272) [    x:collection1] o.a.s.u.DirectUpdateHandler2 end_commit_flush
   [junit4]   2> 2352529 INFO  (searcherExecutor-6001-thread-1-processing-x:collection1) [    x:collection1] o.a.s.c.SolrCore [collection1] Registered new searcher Searcher@53116dbc[collection1] main{ExitableDirectoryReader(UninvertingDirectoryReader())}
   [junit4]   2> 2352529 INFO  (qtp56893921-13272) [    x:collection1] o.a.s.u.p.LogUpdateProcessorFactory [collection1]  webapp=/solr path=/update params={waitSearcher=true&commit=true&softCommit=false&wt=javabin&version=2}{commit=} 0 1
   [junit4]   2> 2352531 INFO  (TEST-TestReplicationHandler.testRateLimitedReplication-seed#[4DA54ED0255A6B5]) [    ] o.e.j.s.ServerConnector Stopped ServerConnector@808fca{HTTP/1.1,[http/1.1]}{127.0.0.1:0}
   [junit4]   2> 2352531 INFO  (TEST-TestReplicationHandler.testRateLimitedReplication-seed#[4DA54ED0255A6B5]) [    ] o.a.s.c.CoreContainer Shutting down CoreContainer instance=393766855
   [junit4]   2> 2352532 INFO  (coreCloseExecutor-6006-thread-1) [    x:collection1] o.a.s.c.SolrCore [collection1]  CLOSING SolrCore org.apache.solr.core.SolrCore@7bebade9
   [junit4]   2> 2352532 INFO  (coreCloseExecutor-6006-thread-1) [    x:collection1] o.a.s.u.DirectUpdateHandler2 closing DirectUpdateHandler2{commits=1,autocommits=0,soft autocommits=0,optimizes=0,rollbacks=0,expungeDeletes=0,docsPending=0,adds=0,deletesById=0,deletesByQuery=0,errors=0,cumulative_adds=0,cumulative_deletesById=0,cumulative_deletesByQuery=1,cumulative_errors=0}
   [junit4]   2> 2352532 INFO  (coreCloseExecutor-6006-thread-1) [    x:collection1] o.a.s.u.SolrCoreState Closing SolrCoreState
   [junit4]   2> 2352532 INFO  (coreCloseExecutor-6006-thread-1) [    x:collection1] o.a.s.u.DefaultSolrCoreState SolrCoreState ref count has reached 0 - closing IndexWriter
   [junit4]   2> 2352532 INFO  (coreCloseExecutor-6006-thread-1) [    x:collection1] o.a.s.u.DefaultSolrCoreState closing IndexWriter with IndexWriterCloser
   [junit4]   2> 2352532 INFO  (coreCloseExecutor-6006-thread-1) [    x:collection1] o.a.s.c.SolrCore [collection1] Closing main searcher on request.
   [junit4]   2> 2352532 INFO  (coreCloseExecutor-6006-thread-1) [    x:collection1] o.a.s.c.CachingDirectoryFactory Closing MockDirectoryFactory - 3 directories currently being tracked
   [junit4]   2> 2352533 INFO  (coreCloseExecutor-6006-thread-1) [    x:collection1] o.a.s.c.CachingDirectoryFactory looking to close /Users/jenkins/workspace/Lucene-Solr-master-MacOSX/solr/build/solr-core/test/J0/temp/solr.handler.TestReplicationHandler_4DA54ED0255A6B5-001/solr-instance-001/./collection1/data/snapshot_metadata [CachedDir<<refCount=0;path=/Users/jenkins/workspace/Lucene-Solr-master-MacOSX/solr/build/solr-core/test/J0/temp/solr.handler.TestReplicationHandler_4DA54ED0255A6B5-001/solr-instance-001/./collection1/data/snapshot_metadata;done=false>>]
   [junit4]   2> 2352533 INFO  (coreCloseExecutor-6006-thread-1) [    x:collection1] o.a.s.c.CachingDirectoryFactory Closing directory, CoreContainer#isShutdown=true
   [junit4]   2> 2352533 INFO  (coreCloseExecutor-6006-thread-1) [    x:collection1] o.a.s.c.CachingDirectoryFactory Closing directory: /Users/jenkins/workspace/Lucene-Solr-master-MacOSX/solr/build/solr-core/test/J0/temp/solr.handler.TestReplicationHandler_4DA54ED0255A6B5-001/solr-instance-001/./collection1/data/snapshot_metadata
   [junit4]   2> 2352533 INFO  (coreCloseExecutor-6006-thread-1) [    x:collection1] o.a.s.c.CachingDirectoryFactory looking to close /Users/jenkins/workspace/Lucene-Solr-master-MacOSX/solr/build/solr-core/test/J0/temp/solr.handler.TestReplicationHandler_4DA54ED0255A6B5-001/solr-instance-001/./collection1/data/index [CachedDir<<refCount=0;path=/Users/jenkins/workspace/Lucene-Solr-master-MacOSX/solr/build/solr-core/test/J0/temp/solr.handler.TestReplicationHandler_4DA54ED0255A6B5-001/solr-instance-001/./collection1/data/index;done=false>>]
   [junit4]   2> 2352533 INFO  (coreCloseExecutor-6006-thread-1) [    x:collection1] o.a.s.c.CachingDirectoryFactory Closing directory, CoreContainer#isShutdown=true
   [junit4]   2> 2352533 INFO  (coreCloseExecutor-6006-thread-1) [    x:collection1] o.a.s.c.CachingDirectoryFactory Closing directory: /Users/jenkins/workspace/Lucene-Solr-master-MacOSX/solr/build/solr-core/test/J0/temp/solr.handler.TestReplicationHandler_4DA54ED0255A6B5-001/solr-instance-001/./collection1/data/index
   [junit4]   2> 2352533 INFO  (coreCloseExecutor-6006-thread-1) [    x:collection1] o.a.s.c.CachingDirectoryFactory looking to close /Users/jenkins/workspace/Lucene-Solr-master-MacOSX/solr/build/solr-core/test/J0/temp/solr.handler.TestReplicationHandler_4DA54ED0255A6B5-001/solr-instance-001/./collection1/data [CachedDir<<refCount=0;path=/Users/jenkins/workspace/Lucene-Solr-master-MacOSX/solr/build/solr-core/test/J0/temp/solr.handler.TestReplicationHandler_4DA54ED0255A6B5-001/solr-instance-001/./collection1/data;done=false>>]
   [junit4]   2> 2352533 INFO  (coreCloseExecutor-6006-thread-1) [    x:collection1] o.a.s.c.CachingDirectoryFactory Closing directory, CoreContainer#isShutdown=true
   [junit4]   2> 2352533 INFO  (coreCloseExecutor-6006-thread-1) [    x:collection1] o.a.s.c.CachingDirectoryFactory Closing directory: /Users/jenkins/workspace/Lucene-Solr-master-MacOSX/solr/build/solr-core/test/J0/temp/solr.handler.TestReplicationHandler_4DA54ED0255A6B5-001/solr-instance-001/./collection1/data
   [junit4]   2> 2352535 INFO  (TEST-TestReplicationHandler.testRateLimitedReplication-seed#[4DA54ED0255A6B5]) [    ] o.e.j.s.h.ContextHandler Stopped o.e.j.s.ServletContextHandler@201ade96{/solr,null,UNAVAILABLE}
   [junit4]   2> 2352536 INFO  (TEST-TestReplicationHandler.testRateLimitedReplication-seed#[4DA54ED0255A6B5]) [    ] o.e.j.s.ServerConnector Stopped ServerConnector@77fb37d0{HTTP/1.1,[http/1.1]}{127.0.0.1:0}
   [junit4]   2> 2352536 INFO  (TEST-TestReplicationHandler.testRateLimitedReplication-seed#[4DA54ED0255A6B5]) [    ] o.a.s.c.CoreContainer Shutting down CoreContainer instance=486580847
   [junit4]   2> 2352537 INFO  (coreCloseExecutor-6008-thread-1) [    x:collection1] o.a.s.c.SolrCore [collection1]  CLOSING SolrCore org.apache.solr.core.SolrCore@690cb54
   [junit4]   2> 2352538 INFO  (coreCloseExecutor-6008-thread-1) [    x:collection1] o.a.s.u.DirectUpdateHandler2 closing DirectUpdateHandler2{commits=1,autocommits=0,soft autocommits=0,optimizes=0,rollbacks=0,expungeDeletes=0,docsPending=0,adds=0,deletesById=0,deletesByQuery=0,errors=0,cumulative_adds=0,cumulative_deletesById=0,cumulative_deletesByQuery=1,cumulative_errors=0}
   [junit4]   2> 2352538 INFO  (coreCloseExecutor-6008-thread-1) [    x:collection1] o.a.s.u.SolrCoreState Closing SolrCoreState
   [junit4]   2> 2352538 INFO  (coreCloseExecutor-6008-thread-1) [    x:collection1] o.a.s.u.DefaultSolrCoreState SolrCoreState ref count has reached 0 - closing IndexWriter
   [junit4]   2> 2352538 INFO  (coreCloseExecutor-6008-thread-1) [    x:collection1] o.a.s.u.DefaultSolrCoreState closing IndexWriter with IndexWriterCloser
   [junit4]   2> 2352538 INFO  (coreCloseExecutor-6008-thread-1) [    x:collection1] o.a.s.c.SolrCore [collection1] Closing main searcher on request.
   [junit4]   2> 2352538 INFO  (coreCloseExecutor-6008-thread-1) [    x:collection1] o.a.s.c.CachingDirectoryFactory Closing MockDirectoryFactory - 3 directories currently being tracked
   [junit4]   2> 2352538 INFO  (coreCloseExecutor-6008-thread-1) [    x:collection1] o.a.s.c.CachingDirectoryFactory looking to close /Users/jenkins/workspace/Lucene-Solr-master-MacOSX/solr/build/solr-core/test/J0/temp/solr.handler.TestReplicationHandler_4DA54ED0255A6B5-001/solr-instance-002/./collection1/data [CachedDir<<refCount=0;path=/Users/jenkins/workspace/Lucene-Solr-master-MacOSX/solr/build/solr-core/test/J0/temp/solr.handler.TestReplicationHandler_4DA54ED0255A6B5-001/solr-instance-002/./collection1/data;done=false>>]
   [junit4]   2> 2352538 INFO  (coreCloseExecutor-6008-thread-1) [    x:collection1] o.a.s.c.CachingDirectoryFactory Closing directory, CoreContainer#isShutdown=true
   [junit4]   2> 2352538 INFO  (coreCloseExecutor-6008-thread-1) [    x:collection1] o.a.s.c.CachingDirectoryFactory Closing directory: /Users/jenkins/workspace/Lucene-Solr-master-MacOSX/solr/build/solr-core/test/J0/temp/solr.handler.TestReplicationHandler_4DA54ED0255A6B5-001/solr-instance-002/./collection1/data
   [junit4]   2> 2352538 INFO  (coreCloseExecutor-6008-thread-1) [    x:collection1] o.a.s.c.CachingDirectoryFactory looking to close /Users/jenkins/workspace/Lucene-Solr-master-MacOSX/solr/build/solr-core/test/J0/temp/solr.handler.TestReplicationHandler_4DA54ED0255A6B5-001/solr-instance-002/./collection1/data/snapshot_metadata [CachedDir<<refCount=0;path=/Users/jenkins/workspace/Lucene-Solr-master-MacOSX/solr/build/solr-core/test/J0/temp/solr.handler.TestReplicationHandler_4DA54ED0255A6B5-001/solr-instance-002/./collection1/data/snapshot_metadata;done=false>>]
   [junit4]   2> 2352538 INFO  (coreCloseExecutor-6008-thread-1) [    x:collection1] o.a.s.c.CachingDirectoryFactory Closing directory, CoreContainer#isShutdown=true
   [junit4]   2> 2352539 INFO  (coreCloseExecutor-6008-thread-1) [    x:collection1] o.a.s.c.CachingDirectoryFactory Closing directory: /Users/jenkins/workspace/Lucene-Solr-master-MacOSX/solr/build/solr-core/test/J0/temp/solr.handler.TestReplicationHandler_4DA54ED0255A6B5-001/solr-instance-002/./collection1/data/snapshot_metadata
   [junit4]   2> 2352539 INFO  (coreCloseExecutor-6008-thread-1) [    x:collection1] o.a.s.c.CachingDirectoryFactory looking to close /Users/jenkins/workspace/Lucene-Solr-master-MacOSX/solr/build/solr-core/test/J0/temp/solr.handler.TestReplicationHandler_4DA54ED0255A6B5-001/solr-instance-002/./collection1/data/index [CachedDir<<refCount=0;path=/Users/jenkins/workspace/Lucene-Solr-master-MacOSX/solr/build/solr-core/test/J0/temp/solr.handler.TestReplicationHandler_4DA54ED0255A6B5-001/solr-instance-002/./collection1/data/index;done=false>>]
   [junit4]   2> 2352539 INFO  (coreCloseExecutor-6008-thread-1) [    x:collection1] o.a.s.c.CachingDirectoryFactory Closing directory, CoreContainer#isShutdown=true
   [junit4]   2> 2352539 INFO  (coreCloseExecutor-6008-thread-1) [    x:collection1] o.a.s.c.CachingDirectoryFactory Closing directory: /Users/jenkins/workspace/Lucene-Solr-master-MacOSX/solr/build/solr-core/test/J0/temp/solr.handler.TestReplicationHandler_4DA54ED0255A6B5-001/solr-instance-002/./collection1/data/index
   [junit4]   2> 2352540 INFO  (TEST-TestReplicationHandler.testRateLimitedReplication-seed#[4DA54ED0255A6B5]) [    ] o.e.j.s.h.ContextHandler Stopped o.e.j.s.ServletContextHandler@6453fbbf{/solr,null,UNAVAILABLE}
   [junit4]   2> 2352545 INFO  (TEST-TestReplicationHandler.testRateLimitedReplication-seed#[4DA54ED0255A6B5]) [    ] o.e.j.s.Server jetty-9.3.8.v20160314
   [junit4]   2> 2352547 INFO  (TEST-TestReplicationHandler.testRateLimitedReplication-seed#[4DA54ED0255A6B5]) [    ] o.e.j.s.h.ContextHandler Started o.e.j.s.ServletContextHandler@527ee1f1{/solr,null,AVAILABLE}
   [junit4]   2> 2352547 INFO  (TEST-TestReplicationHandler.testRateLimitedReplication-seed#[4DA54ED0255A6B5]) [    ] o.e.j.s.ServerConnector Started ServerConnector@62948a58{HTTP/1.1,[http/1.1]}{127.0.0.1:58959}
   [junit4]   2> 2352547 INFO  (TEST-TestReplicationHandler.testRateLimitedReplication-seed#[4DA54ED0255A6B5]) [    ] o.e.j.s.Server Started @2359440ms
   [junit4]   2> 2352547 INFO  (TEST-TestReplicationHandler.testRateLimitedReplication-seed#[4DA54ED0255A6B5]) [    ] o.a.s.c.s.e.JettySolrRunner Jetty properties: {solr.data.dir=/Users/jenkins/workspace/Lucene-Solr-master-MacOSX/solr/build/solr-core/test/J0/temp/solr.handler.TestReplicationHandler_4DA54ED0255A6B5-001/solr-instance-001/collection1/data, hostContext=/solr, hostPort=58959}
   [junit4]   2> 2352548 INFO  (TEST-TestReplicationHandler.testRateLimitedReplication-seed#[4DA54ED0255A6B5]) [    ] o.a.s.s.SolrDispatchFilter SolrDispatchFilter.init(): sun.misc.Launcher$AppClassLoader@4554617c
   [junit4]   2> 2352548 INFO  (TEST-TestReplicationHandler.testRateLimitedReplication-seed#[4DA54ED0255A6B5]) [    ] o.a.s.c.SolrResourceLoader new SolrResourceLoader for directory: '/Users/jenkins/workspace/Lucene-Solr-master-MacOSX/solr/build/solr-core/test/J0/temp/solr.handler.TestReplicationHandler_4DA54ED0255A6B5-001/solr-instance-001'
   [junit4]   2> 2352548 INFO  (TEST-TestReplicationHandler.testRateLimitedReplication-seed#[4DA54ED0255A6B5]) [    ] o.a.s.c.SolrResourceLoader JNDI not configured for solr (NoInitialContextEx)
   [junit4]   2> 2352548 INFO  (TEST-TestReplicationHandler.testRateLimitedReplication-seed#[4DA54ED0255A6B5]) [    ] o.a.s.c.SolrResourceLoader solr home defaulted to 'solr/' (could not find system property or JNDI)
   [junit4]   2> 2352548 INFO  (TEST-TestReplicationHandler.testRateLimitedReplication-seed#[4DA54ED0255A6B5]) [    ] o.a.s.c.SolrXmlConfig Loading container configuration from /Users/jenkins/workspace/Lucene-Solr-master-MacOSX/solr/build/solr-core/test/J0/temp/solr.handler.TestReplicationHandler_4DA54ED0255A6B5-001/solr-instance-001/solr.xml
   [junit4]   2> 2352567 INFO  (TEST-TestReplicationHandler.testRateLimitedReplication-seed#[4DA54ED0255A6B5]) [    ] o.a.s.c.CorePropertiesLocator Config-defined core root directory: /Users/jenkins/workspace/Lucene-Solr-master-MacOSX/solr/build/solr-core/test/J0/temp/solr.handler.TestReplicationHandler_4DA54ED0255A6B5-001/solr-instance-001/.
   [junit4]   2> 2352567 INFO  (TEST-TestReplicationHandler.testRateLimitedReplication-seed#[4DA54ED0255A6B5]) [    ] o.a.s.c.CoreContainer New CoreContainer 1257879395
   [junit4]   2> 2352567 INFO  (TEST-TestReplicationHandler.testRateLimitedReplication-seed#[4DA54ED0255A6B5]) [    ] o.a.s.c.CoreContainer Loading cores into CoreContainer [instanceDir=/Users/jenkins/workspace/Lucene-Solr-master-MacOSX/solr/build/solr-core/test/J0/temp/solr.handler.TestReplicationHandler_4DA54ED0255A6B5-001/solr-instance-001]
   [junit4]   2> 2352567 WARN  (TEST-TestReplicationHandler.testRateLimitedReplication-seed#[4DA54ED0255A6B5]) [    ] o.a.s.c.CoreContainer Couldn't add files from /Users/jenkins/workspace/Lucene-Solr-master-MacOSX/solr/build/solr-core/test/J0/temp/solr.handler.TestReplicationHandler_4DA54ED0255A6B5-001/solr-instance-001/lib to classpath: /Users/jenkins/workspace/Lucene-Solr-master-MacOSX/solr/build/solr-core/test/J0/temp/solr.handler.TestReplicationHandler_4DA54ED0255A6B5-001/solr-instance-001/lib
   [junit4]   2> 2352568 INFO  (TEST-TestReplicationHandler.testRateLimitedReplication-seed#[4DA54ED0255A6B5]) [    ] o.a.s.h.c.HttpShardHandlerFactory created with socketTimeout : 90000,urlScheme : ,connTimeout : 15000,maxConnectionsPerHost : 20,maxConnections : 10000,corePoolSize : 0,maximumPoolSize : 2147483647,maxThreadIdleTime : 5,sizeOfQueue : -1,fairnessPolicy : false,
   [junit4]   2> 2352570 INFO  (TEST-TestReplicationHandler.testRateLimitedReplication-seed#[4DA54ED0255A6B5]) [    ] o.a.s.u.UpdateShardHandler Created UpdateShardHandler HTTP client with params: socketTimeout=340000&connTimeout=45000&maxConnections=100000&maxConnectionsPerHost=100000
   [junit4]   2> 2352570 INFO  (TEST-TestReplicationHandler.testRateLimitedReplication-seed#[4DA54ED0255A6B5]) [    ] o.a.s.l.LogWatcher SLF4J impl is org.slf4j.impl.Log4jLoggerFactory
   [junit4]   2> 2352570 INFO  (TEST-TestReplicationHandler.testRateLimitedReplication-seed#[4DA54ED0255A6B5]) [    ] o.a.s.l.LogWatcher Registering Log Listener [Log4j (org.slf4j.impl.Log4jLoggerFactory)]
   [junit4]   2> 2352570 INFO  (TEST-TestReplicationHandler.testRateLimitedReplication-seed#[4DA54ED0255A6B5]) [    ] o.a.s.c.CoreContainer Security conf doesn't exist. Skipping setup for authorization module.
   [junit4]   2> 2352570 INFO  (TEST-TestReplicationHandler.testRateLimitedReplication-seed#[4DA54ED0255A6B5]) [    ] o.a.s.c.CoreContainer No authentication plugin used.
   [junit4]   2> 2352571 INFO  (TEST-TestReplicationHandler.testRateLimitedReplication-seed#[4DA54ED0255A6B5]) [    ] o.a.s.c.CorePropertiesLocator Looking for core definitions underneath /Users/jenkins/workspace/Lucene-Solr-master-MacOSX/solr/build/solr-core/test/J0/temp/solr.handler.TestReplicationHandler_4DA54ED0255A6B5-001/solr-instance-001/.
   [junit4]   2> 2352572 INFO  (TEST-TestReplicationHandler.testRateLimitedReplication-seed#[4DA54ED0255A6B5]) [    ] o.a.s.c.CoreDescriptor Created CoreDescriptor: {name=collection1, config=solrconfig.xml, loadOnStartup=true, schema=schema.xml, configSetProperties=configsetprops.json, transient=false, dataDir=data/}
   [junit4]   2> 2352572 INFO  (TEST-TestReplicationHandler.testRateLimitedReplication-seed#[4DA54ED0255A6B5]) [    ] o.a.s.c.CorePropertiesLocator Found core collection1 in /Users/jenkins/workspace/Lucene-Solr-master-MacOSX/solr/build/solr-core/test/J0/temp/solr.handler.TestReplicationHandler_4DA54ED0255A6B5-001/solr-instance-001/./collection1
   [junit4]   2> 2352572 INFO  (TEST-TestReplicationHandler.testRateLimitedReplication-seed#[4DA54ED0255A6B5]) [    ] o.a.s.c.CorePropertiesLocator Found 1 core definitions
   [junit4]   2> 2352572 INFO  (coreLoadExecutor-6015-thread-1) [    ] o.a.s.c.SolrResourceLoader new SolrResourceLoader for directory: '/Users/jenkins/workspace/Lucene-Solr-master-MacOSX/solr/build/solr-core/test/J0/temp/solr.handler.TestReplicationHandler_4DA54ED0255A6B5-001/solr-instance-001/collection1'
   [junit4]   2> 2352573 INFO  (TEST-TestReplicationHandler.testRateLimitedReplication-seed#[4DA54ED0255A6B5]) [    ] o.a.s.s.SolrDispatchFilter user.dir=/Users/jenkins/workspace/Lucene-Solr-master-MacOSX/solr/build/solr-core/test/J0
   [junit4]   2> 2352573 INFO  (coreLoadExecutor-6015-thread-1) [    ] o.a.s.c.SolrResourceLoader JNDI not configured for solr (NoInitialContextEx)
   [junit4]   2> 2352573 INFO  (TEST-TestReplicationHandler.testRateLimitedReplication-seed#[4DA54ED0255A6B5]) [    ] o.a.s.s.SolrDispatchFilter SolrDispatchFilter.init() done
   [junit4]   2> 2352573 INFO  (coreLoadExecutor-6015-thread-1) [    ] o.a.s.c.SolrResourceLoader solr home defaulted to 'solr/' (could not find system property or JNDI)
   [junit4]   2> 2352577 INFO  (coreLoadExecutor-6015-thread-1) [    ] o.a.s.c.SolrConfig current version of requestparams : -1
   [junit4]   2> 2352579 INFO  (coreLoadExecutor-6015-thread-1) [    ] o.a.s.c.SolrConfig Using Lucene MatchVersion: 7.0.0
   [junit4]   2> 2352583 INFO  (coreLoadExecutor-6015-thread-1) [    ] o.a.s.c.SolrConfig Loaded SolrConfig: solrconfig.xml
   [junit4]   2> 2352585 INFO  (coreLoadExecutor-6015-thread-1) [    ] o.a.s.s.IndexSchema [collection1] Schema name=test
   [junit4]   2> 2352586 INFO  (coreLoadExecutor-6015-thread-1) [    ] o.a.s.s.IndexSchema unique key field: id
   [junit4]   2> 2352587 INFO  (coreLoadExecutor-6015-thread-1) [    ] o.a.s.c.ConfigSetProperties Did not find ConfigSet properties, assuming default properties: Can't find resource 'configsetprops.json' in classpath or '/Users/jenkins/workspace/Lucene-Solr-master-MacOSX/solr/build/solr-core/test/J0/temp/solr.handler.TestReplicationHandler_4DA54ED0255A6B5-001/solr-instance-001/collection1'
   [junit4]   2> 2352587 INFO  (coreLoadExecutor-6015-thread-1) [    ] o.a.s.c.CoreContainer Creating SolrCore 'collection1' using configuration from instancedir /Users/jenkins/workspace/Lucene-Solr-master-MacOSX/solr/build/solr-core/test/J0/temp/solr.handler.TestReplicationHandler_4DA54ED0255A6B5-001/solr-instance-001/./collection1
   [junit4]   2> 2352587 INFO  (coreLoadExecutor-6015-thread-1) [    x:collection1] o.a.s.c.SolrCore solr.NRTCachingDirectoryFactory
   [junit4]   2> 2352587 INFO  (coreLoadExecutor-6015-thread-1) [    x:collection1] o.a.s.c.SolrCore [[collection1] ] Opening new SolrCore at [/Users/jenkins/workspace/Lucene-Solr-master-MacOSX/solr/build/solr-core/test/J0/temp/solr.handler.TestReplicationHandler_4DA54ED0255A6B5-001/solr-instance-001/collection1], dataDir=[/Users/jenkins/workspace/Lucene-Solr-master-MacOSX/solr/build/solr-core/test/J0/temp/solr.handler.TestReplicationHandler_4DA54ED0255A6B5-001/solr-instance-001/./collection1/data/]
   [junit4]   2> 2352588 INFO  (coreLoadExecutor-6015-thread-1) [    x:collection1] o.a.s.c.SolrCore JMX monitoring not detected for core: collection1
   [junit4]   2> 2352588 INFO  (coreLoadExecutor-6015-thread-1) [    x:collection1] o.a.s.c.CachingDirectoryFactory return new directory for /Users/jenkins/workspace/Lucene-Solr-master-MacOSX/solr/build/solr-core/test/J0/temp/solr.handler.TestReplicationHandler_4DA54ED0255A6B5-001/solr-instance-001/collection1/data/snapshot_metadata
   [junit4]   2> 2352588 INFO  (coreLoadExecutor-6015-thread-1) [    x:collection1] o.a.s.c.s.SolrSnapshotMetaDataManager Loading from snapshot metadata file...
   [junit4]   2> 2352589 INFO  (coreLoadExecutor-6015-thread-1) [    x:collection1] o.a.s.c.CachingDirectoryFactory return new directory for /Users/jenkins/workspace/Lucene-Solr-master-MacOSX/solr/build/solr-core/test/J0/temp/solr.handler.TestReplicationHandler_4DA54ED0255A6B5-001/solr-instance-001/collection1/data
   [junit4]   2> 2352589 INFO  (coreLoadExecutor-6015-thread-1) [    x:collection1] o.a.s.c.SolrCore New index directory detected: old=null new=/Users/jenkins/workspace/Lucene-Solr-master-MacOSX/solr/build/solr-core/test/J0/temp/solr.handler.TestReplicationHandler_4DA54ED0255A6B5-001/solr-instance-001/./collection1/data/index/
   [junit4]   2> 2352589 WARN  (coreLoadExecutor-6015-thread-1) [    x:collection1] o.a.s.c.SolrCore [collection1] Solr index directory '/Users/jenkins/workspace/Lucene-Solr-master-MacOSX/solr/build/solr-core/test/J0/temp/solr.handler.TestReplicationHandler_4DA54ED0255A6B5-001/solr-instance-001/./collection1/data/index' doesn't exist. Creating new index...
   [junit4]   2> 2352590 INFO  (coreLoadExecutor-6015-thread-1) [    x:collection1] o.a.s.c.CachingDirectoryFactory return new directory for /Users/jenkins/workspace/Lucene-Solr-master-MacOSX/solr/build/solr-core/test/J0/temp/solr.handler.TestReplicationHandler_4DA54ED0255A6B5-001/solr-instance-001/collection1/data/index
   [junit4]   2> 2352590 INFO  (coreLoadExecutor-6015-thread-1) [    x:collection1] o.a.s.u.RandomMergePolicy RandomMergePolicy wrapping class org.apache.lucene.index.TieredMergePolicy: [TieredMergePolicy: maxMergeAtOnce=44, maxMergeAtOnceExplicit=22, maxMergedSegmentMB=32.921875, floorSegmentMB=1.7314453125, forceMergeDeletesPctAllowed=13.800755472442097, segmentsPerTier=22.0, maxCFSSegmentSizeMB=8.796093022207999E12, noCFSRatio=0.0
   [junit4]   2> 2352602 INFO  (coreLoadExecutor-6015-thread-1) [    x:collection1] o.a.s.c.SolrDeletionPolicy SolrDeletionPolicy.onCommit: commits: num=1
   [junit4]   2> 	commit{dir=NRTCachingDirectory(MMapDirectory@/Users/jenkins/workspace/Lucene-Solr-master-MacOSX/solr/build/solr-core/test/J0/temp/solr.handler.TestReplicationHandler_4DA54ED0255A6B5-001/solr-instance-001/collection1/data/index lockFactory=org.apache.lucene.store.SingleInstanceLockFactory@f03b1c4; maxCacheMB=48.0 maxMergeSizeMB=4.0),segFN=segments_1,generation=1}
   [junit4]   2> 2352602 INFO  (coreLoadExecutor-6015-thread-1) [    x:collection1] o.a.s.c.SolrDeletionPolicy newest commit generation = 1
   [junit4]   2> 2352603 INFO  (OldIndexDirectoryCleanupThreadForCore-collection1) [    x:collection1] o.a.s.c.SolrCore Looking for old index directories to cleanup for core collection1 in /Users/jenkins/workspace/Lucene-Solr-master-MacOSX/solr/build/solr-core/test/J0/temp/solr.handler.TestReplicationHandler_4DA54ED0255A6B5-001/solr-instance-001/./collection1/data/
   [junit4]   2> 2352604 INFO  (coreLoadExecutor-6015-thread-1) [    x:collection1] o.a.s.c.SolrCore no updateRequestProcessorChain defined as default, creating implicit default
   [junit4]   2> 2352605 INFO  (coreLoadExecutor-6015-thread-1) [    x:collection1] o.a.s.h.l.XMLLoader xsltCacheLifetimeSeconds=60
   [junit4]   2> 2352605 INFO  (coreLoadExecutor-6015-thread-1) [    x:collection1] o.a.s.h.l.XMLLoader xsltCacheLifetimeSeconds=60
   [junit4]   2> 2352606 INFO  (coreLoadExecutor-6015-thread-1) [    x:collection1] o.a.s.h.l.XMLLoader xsltCacheLifetimeSeconds=60
   [junit4]   2> 2352606 INFO  (coreLoadExecutor-6015-thread-1) [    x:collection1] o.a.s.h.l.XMLLoader xsltCacheLifetimeSeconds=60
   [junit4]   2> 2352608 INFO  (coreLoadExecutor-6015-thread-1) [    x:collection1] o.a.s.c.PluginBag requestHandler : 'lazy' created with startup=lazy 
   [junit4]   2> 2352608 INFO  (coreLoadExecutor-6015-thread-1) [    x:collection1] o.a.s.c.RequestHandlers Registered paths: /admin/mbeans,standard,lazy,/update/json/docs,/admin/luke,/export,/get,/admin/properties,/update/json,/admin/threads,/update/csv,/sql,/graph,/admin/segments,/admin/system,/replication,defaults,/config,/stream,/schema,/admin/plugins,/admin/logging,/admin/ping,/update,/admin/file,/terms
   [junit4]   2> 2352608 INFO  (coreLoadExecutor-6015-thread-1) [    x:collection1] o.a.s.c.SolrCore Using default statsCache cache: org.apache.solr.search.stats.LocalStatsCache
   [junit4]   2> 2352608 INFO  (coreLoadExecutor-6015-thread-1) [    x:collection1] o.a.s.u.CommitTracker Hard AutoCommit: disabled
   [junit4]   2> 2352608 INFO  (coreLoadExecutor-6015-thread-1) [    x:collection1] o.a.s.u.CommitTracker Soft AutoCommit: disabled
   [junit4]   2> 2352609 INFO  (coreLoadExecutor-6015-thread-1) [    x:collection1] o.a.s.u.RandomMergePolicy RandomMergePolicy wrapping class org.apache.lucene.index.TieredMergePolicy: [TieredMergePolicy: maxMergeAtOnce=34, maxMergeAtOnceExplicit=28, maxMergedSegmentMB=67.7294921875, floorSegmentMB=0.5078125, forceMergeDeletesPctAllowed=26.530993126457023, segmentsPerTier=46.0, maxCFSSegmentSizeMB=8.796093022207999E12, noCFSRatio=0.0
   [junit4]   2> 2352609 INFO  (coreLoadExecutor-6015-thread-1) [    x:collection1] o.a.s.c.SolrDeletionPolicy SolrDeletionPolicy.onInit: commits: num=1
   [junit4]   2> 	commit{dir=NRTCachingDirectory(MMapDirectory@/Users/jenkins/workspace/Lucene-Solr-master-MacOSX/solr/build/solr-core/test/J0/temp/solr.handler.TestReplicationHandler_4DA54ED0255A6B5-001/solr-instance-001/collection1/data/index lockFactory=org.apache.lucene.store.SingleInstanceLockFactory@f03b1c4; maxCacheMB=48.0 maxMergeSizeMB=4.0),segFN=segments_1,generation=1}
   [junit4]   2> 2352609 INFO  (coreLoadExecutor-6015-thread-1) [    x:collection1] o.a.s.c.SolrDeletionPolicy newest commit generation = 1
   [junit4]   2> 2352609 INFO  (coreLoadExecutor-6015-thread-1) [    x:collection1] o.a.s.s.SolrIndexSearcher Opening [Searcher@2fb74b58[collection1] main]
   [junit4]   2> 2352610 INFO  (coreLoadExecutor-6015-thread-1) [    x:collection1] o.a.s.r.ManagedResourceStorage File-based storage initialized to use dir: /Users/jenkins/workspace/Lucene-Solr-master-MacOSX/solr/build/solr-core/test/J0/temp/solr.handler.TestReplicationHandler_4DA54ED0255A6B5-001/solr-instance-001/collection1/conf
   [junit4]   2> 2352610 INFO  (coreLoadExecutor-6015-thread-1) [    x:collection1] o.a.s.r.RestManager Initializing RestManager with initArgs: {storageDir=/Users/jenkins/workspace/Lucene-Solr-master-MacOSX/solr/build/solr-core/test/J0/temp/solr.handler.TestReplicationHandler_4DA54ED0255A6B5-001/solr-instance-001/collection1/conf}
   [junit4]   2> 2352610 INFO  (coreLoadExecutor-6015-thread-1) [    x:collection1] o.a.s.r.ManagedResourceStorage Reading _rest_managed.json using file:dir=/Users/jenkins/workspace/Lucene-Solr-master-MacOSX/solr/build/solr-core/test/J0/temp/solr.handler.TestReplicationHandler_4DA54ED0255A6B5-001/solr-instance-001/collection1/conf
   [junit4]   2> 2352610 INFO  (coreLoadExecutor-6015-thread-1) [    x:collection1] o.a.s.r.RestManager Initializing 0 registered ManagedResources
   [junit4]   2> 2352610 INFO  (coreLoadExecutor-6015-thread-1) [    x:collection1] o.a.s.h.ReplicationHandler Commits will be reserved for  10000
   [junit4]   2> 2352610 INFO  (coreLoadExecutor-6015-thread-1) [    x:collection1] o.a.s.c.CoreContainer registering core: collection1
   [junit4]   2> 2352610 INFO  (searcherExecutor-6016-thread-1-processing-x:collection1) [    x:collection1] o.a.s.c.SolrCore [collection1] Registered new searcher Searcher@2fb74b58[collection1] main{ExitableDirectoryReader(UninvertingDirectoryReader())}
   [junit4]   2> 2353079 INFO  (qtp650677122-13293) [    x:collection1] o.a.s.u.p.LogUpdateProcessorFactory [collection1]  webapp=/solr path=/update params={wt=javabin&version=2}{add=[0]} 0 1
   [junit4]   2> 2353080 INFO  (qtp650677122-13294) [    x:collection1] o.a.s.u.p.LogUpdateProcessorFactory [collection1]  webapp=/solr path=/update params={wt=javabin&version=2}{add=[1]} 0 0
   [junit4]   2> 2353081 INFO  (qtp650677122-13295) [    x:collection1] o.a.s.u.p.LogUpdateProcessorFactory [collection1]  webapp=/solr path=/update params={wt=javabin&version=2}{add=[2]} 0 0
   [junit4]   2> 2353082 INFO  (qtp650677122-13296) [    x:collection1] o.a.s.u.p.LogUpdateProcessorFactory [collection1]  webapp=/solr path=/update params={wt=javabin&version=2}{add=[3]} 0 0
   [junit4]   2> 2353083 INFO  (qtp650677122-13297) [    x:collection1] o.a.s.u.p.LogUpdateProcessorFactory [collection1]  webapp=/solr path=/update params={wt=javabin&version=2}{add=[4]} 0 0
   [junit4]   2> 2353084 INFO  (qtp650677122-13298) [    x:collection1] o.a.s.u.p.LogUpdateProcessorFactory [collection1]  webapp=/solr path=/update params={wt=javabin&version=2}{add=[5]} 0 0
   [junit4]   2> 2353085 INFO  (qtp650677122-13291) [    x:collection1] o.a.s.u.p.LogUpdateProcessorFactory [collection1]  webapp=/solr path=/update params={wt=javabin&version=2}{add=[6]} 0 0
   [junit4]   2> 2353086 INFO  (qtp650677122-13293) [    x:collection1] o.a.s.u.p.LogUpdateProcessorFactory [collection1]  webapp=/solr path=/update params={wt=javabin&version=2}{add=[7]} 0 0
   [junit4]   2> 2353087 INFO  (qtp650677122-13294) [    x:collection1] o.a.s.u.p.LogUpdateProcessorFactory [collection1]  webapp=/solr path=/update params={wt=javabin&version=2}{add=[8]} 0 0
   [junit4]   2> 2353087 INFO  (qtp650677122-13295) [    x:collection1] o.a.s.u.p.LogUpdateProcessorFactory [collection1]  webapp=/solr path=/update params={wt=javabin&version=2}{add=[9]} 0 0
   [junit4]   2> 2353088 INFO  (qtp650677122-13296) [    x:collection1] o.a.s.u.p.LogUpdateProcessorFactory [collection1]  webapp=/solr path=/update params={wt=javabin&version=2}{add=[10]} 0 0
   [junit4]   2> 2353089 INFO  (qtp650677122-13297) [    x:collection1] o.a.s.u.p.LogUpdateProcessorFactory [collection1]  webapp=/solr path=/update params={wt=javabin&version=2}{add=[11]} 0 0
   [junit4]   2> 2353090 INFO  (qtp650677122-13298) [    x:collection1] o.a.s.u.p.LogUpdateProcessorFactory [collection1]  webapp=/solr path=/update params={wt=javabin&version=2}{add=[12]} 0 0
   [junit4]   2> 2353091 INFO  (qtp650677122-13291) [    x:collection1] o.a.s.u.p.LogUpdateProcessorFactory [collection1]  webapp=/solr path=/update params={wt=javabin&version=2}{add=[13]} 0 0
   [junit4]   2> 2353092 INFO  (qtp650677122-13293) [    x:collection1] o.a.s.u.p.LogUpdateProcessorFactory [collection1]  webapp=/solr path=/update params={wt=javabin&version=2}{add=[14]} 0 0
   [junit4]   2> 2353093 INFO  (qtp650677122-13294) [    x:collection1] o.a.s.u.p.LogUpdateProcessorFactory [collection1]  webapp=/solr path=/update params={wt=javabin&version=2}{add=[15]} 0 0
   [junit4]   2> 2353094 INFO  (qtp650677122-13295) [    x:collection1] o.a.s.u.p.LogUpdateProcessorFactory [collection1]  webapp=/solr path=/update params={wt=javabin&version=2}{add=[16]} 0 0
   [junit4]   2> 2353094 INFO  (qtp650677122-13296) [    x:collection1] o.a.s.u.p.LogUpdateProcessorFactory [collection1]  webapp=/solr path=/update params={wt=javabin&version=2}{add=[17]} 0 0
   [junit4]   2> 2353095 INFO  (qtp650677122-13297) [    x:collection1] o.a.s.u.p.LogUpdateProcessorFactory [collection1]  webapp=/solr path=/update params={wt=javabin&version=2}{add=[18]} 0 0
   [junit4]   2> 2353095 INFO  (qtp650677122-13298) [    x:collection1] o.a.s.u.p.LogUpdateProcessorFactory [collection1]  webapp=/solr path=/update params={wt=javabin&version=2}{add=[19]} 0 0
   [junit4]   2> 2353096 INFO  (qtp650677122-13291) [    x:collection1] o.a.s.u.p.LogUpdateProcessorFactory [collection1]  webapp=/solr path=/update params={wt=javabin&version=2}{add=[20]} 0 0
   [junit4]   2> 2353097 INFO  (qtp650677122-13293) [    x:collection1] o.a.s.u.p.LogUpdateProcessorFactory [collection1]  webapp=/solr path=/update params={wt=javabin&version=2}{add=[21]} 0 0
   [junit4]   2> 2353098 INFO  (qtp650677122-13294) [    x:collection1] o.a.s.u.p.LogUpdateProcessorFactory [collection1]  webapp=/solr path=/update params={wt=javabin&version=2}{add=[22]} 0 0
   [junit4]   2> 2353099 INFO  (qtp650677122-13295) [    x:collection1] o.a.s.u.p.LogUpdateProcessorFactory [collection1]  webapp=/solr path=/update params={wt=javabin&version=2}{add=[23]} 0 0
   [junit4]   2> 2353099 INFO  (qtp650677122-13296) [    x:collection1] o.a.s.u.p.LogUpdateProcessorFactory [collection1]  webapp=/solr path=/update params={wt=javabin&version=2}{add=[24]} 0 0
   [junit4]   2> 2353100 INFO  (qtp650677122-13297) [    x:collection1] o.a.s.u.p.LogUpdateProcessorFactory [collection1]  webapp=/solr path=/update params={wt=javabin&version=2}{add=[25]} 0 0
   [junit4]   2> 2353101 INFO  (qtp650677122-13298) [    x:collection1] o.a.s.u.p.LogUpdateProcessorFactory [collection1]  webapp=/solr path=/update params={wt=javabin&version=2}{add=[26]} 0 0
   [junit4]   2> 2353101 INFO  (qtp650677122-13291) [    x:collection1] o.a.s.u.p.LogUpdateProcessorFactory [collection1]  webapp=/solr path=/update params={wt=javabin&version=2}{add=[27]} 0 0
   [junit4]   2> 2353102 INFO  (qtp650677122-13293) [    x:collection1] o.a.s.u.p.LogUpdateProcessorFactory [collection1]  webapp=/solr path=/update params={wt=javabin&version=2}{add=[28]} 0 0
   [junit4]   2> 2353103 INFO  (qtp650677122-13294) [    x:collection1] o.a.s.u.p.LogUpdateProcessorFactory [collection1]  webapp=/solr path=/update params={wt=javabin&version=2}{add=[29]} 0 0
   [junit4]   2> 2353104 INFO  (qtp650677122-13295) [    x:collection1] o.a.s.u.p.LogUpdateProcessorFactory [collection1]  webapp=/solr path=/update params={wt=javabin&version=2}{add=[30]} 0 0
   [junit4]   2> 2353105 INFO  (qtp650677122-13296) [    x:collection1] o.a.s.u.p.LogUpdateProcessorFactory [collection1]  webapp=/solr path=/update params={wt=javabin&version=2}{add=[31]} 0 0
   [junit4]   2> 2353105 INFO  (qtp650677122-13297) [    x:collection1] o.a.s.u.p.LogUpdateProcessorFactory [collection1]  webapp=/solr path=/update params={wt=javabin&version=2}{add=[32]} 0 0
   [junit4]   2> 2353106 INFO  (qtp650677122-13298) [    x:collection1] o.a.s.u.p.LogUpdateProcessorFactory [collection1]  webapp=/solr path=/update params={wt=javabin&version=2}{add=[33]} 0 0
   [junit4]   2> 2353107 INFO  (qtp650677122-13291) [    x:collection1] o.a.s.u.p.LogUpdateProcessorFactory [collection1]  webapp=/solr path=/update params={wt=javabin&version=2}{add=[34]} 0 0
   [junit4]   2> 2353107 INFO  (qtp650677122-13293) [    x:collection1] o.a.s.u.p.LogUpdateProcessorFactory [collection1]  webapp=/solr path=/update params={wt=javabin&version=2}{add=[35]} 0 0
   [junit4]   2> 2353108 INFO  (qtp650677122-13294) [    x:collection1] o.a.s.u.p.LogUpdateProcessorFactory [collection1]  webapp=/solr path=/update params={wt=javabin&version=2}{add=[36]} 0 0
   [junit4]   2> 2353109 INFO  (qtp650677122-13295) [    x:collection1] o.a.s.u.p.LogUpdateProcessorFactory [collection1]  webapp=/solr path=/update params={wt=javabin&version=2}{add=[37]} 0 0
   [junit4]   2> 2353110 INFO  (qtp650677122-13296) [    x:collection1] o.a.s.u.p.LogUpdateProcessorFactory [collection1]  webapp=/solr path=/update params={wt=javabin&version=2}{add=[38]} 0 0
   [junit4]   2> 2353111 INFO  (qtp650677122-13297) [    x:collection1] o.a.s.u.p.LogUpdateProcessorFactory [collection1]  webapp=/solr path=/update params={wt=javabin&version=2}{add=[39]} 0 0
   [junit4]   2> 2353111 INFO  (qtp650677122-13298) [    x:collection1] o.a.s.u.p.LogUpdateProcessorFactory [collection1]  webapp=/solr path=/update params={wt=javabin&version=2}{add=[40]} 0 0
   [junit4]   2> 2353112 INFO  (qtp650677122-13291) [    x:collection1] o.a.s.u.p.LogUpdateProcessorFactory [collection1]  webapp=/solr path=/update params={wt=javabin&version=2}{add=[41]} 0 0
   [junit4]   2> 2353113 INFO  (qtp650677122-13293) [    x:collection1] o.a.s.u.p.LogUpdateProcessorFactory [collection1]  webapp=/solr path=/update params={wt=javabin&version=2}{add=[42]} 0 0
   [junit4]   2> 2353114 INFO  (qtp650677122-13294) [    x:collection1] o.a.s.u.p.LogUpdateProcessorFactory [collection1]  webapp=/solr path=/update params={wt=javabin&version=2}{add=[43]} 0 0
   [junit4]   2> 2353115 INFO  (qtp650677122-13295) [    x:collection1] o.a.s.u.p.LogUpdateProcessorFactory [collection1]  webapp=/solr path=/update params={wt=javabin&version=2}{add=[44]} 0 0
   [junit4]   2> 2353115 INFO  (qtp650677122-13296) [    x:collection1] o.a.s.u.p.LogUpdateProcessorFactory [collection1]  webapp=/solr path=/update params={wt=javabin&version=2}{add=[45]} 0 0
   [junit4]   2> 2353116 INFO  (qtp650677122-13297) [    x:collection1] o.a.s.u.p.LogUpdateProcessorFactory [collection1]  webapp=/solr path=/update params={wt=javabin&version=2}{add=[46]} 0 0
   [junit4]   2> 2353116 INFO  (qtp650677122-13298) [    x:collection1] o.a.s.u.p.LogUpdateProcessorFactory [collection1]  webapp=/solr path=/update params={wt=javabin&version=2}{add=[47]} 0 0
   [junit4]   2> 2353117 INFO  (qtp650677122-13291) [    x:collection1] o.a.s.u.p.LogUpdateProcessorFactory [collection1]  webapp=/solr path=/update params={wt=javabin&version=2}{add=[48]} 0 0
   [junit4]   2> 2353118 INFO  (qtp650677122-13293) [    x:collection1] o.a.s.u.p.LogUpdateProcessorFactory [collection1]  webapp=/solr path=/update params={wt=javabin&version=2}{add=[49]} 0 0
   [junit4]   2> 2353119 INFO  (qtp650677122-13294) [    x:collection1] o.a.s.u.p.LogUpdateProcessorFactory [collection1]  webapp=/solr path=/update params={wt=javabin&version=2}{add=[50]} 0 0
   [junit4]   2> 2353119 INFO  (qtp650677122-13295) [    x:collection1] o.a.s.u.p.LogUpdateProcessorFactory [collection1]  webapp=/solr path=/update params={wt=javabin&version=2}{add=[51]} 0 0
   [junit4]   2> 2353120 INFO  (qtp650677122-13296) [    x:collection1] o.a.s.u.p.LogUpdateProcessorFactory [collection1]  webapp=/solr path=/update params={wt=javabin&version=2}{add=[52]} 0 0
   [junit4]   2> 2353121 INFO  (qtp650677122-13297) [    x:collection1] o.a.s.u.DirectUpdateHandler2 start commit{,optimize=false,openSearcher=true,waitSearcher=true,expungeDeletes=false,softCommit=false,prepareCommit=false}
   [junit4]   2> 2353121 INFO  (qtp650677122-13297) [    x:collection1] o.a.s.u.SolrIndexWriter Calling setCommitData with IW:org.apache.solr.update.SolrIndexWriter@6f382546
   [junit4]   2> 2353144 INFO  (qtp650677122-13297) [    x:collection1] o.a.s.c.SolrDeletionPolicy SolrDeletionPolicy.onCommit: commits: num=2
   [junit4]   2> 	commit{dir=NRTCachingDirectory(MMapDirectory@/Users/jenkins/workspace/Lucene-Solr-master-MacOSX/solr/build/solr-core/test/J0/temp/solr.handler.TestReplicationHandler_4DA54ED0255A6B5-001/solr-instance-001/collection1/data/index lockFactory=org.apache.lucene.store.SingleInstanceLockFactory@f03b1c4; maxCacheMB=48.0 maxMergeSizeMB=4.0),segFN=segments_1,generation=1}
   [junit4]   2> 	commit{dir=NRTCachingDirectory(MMapDirectory@/Users/jenkins/workspace/Lucene-Solr-master-MacOSX/solr/build/solr-core/test/J0/temp/solr.handler.TestReplicationHandler_4DA54ED0255A6B5-001/solr-instance-001/collection1/data/index lockFactory=org.apache.lucene.store.SingleInstanceLockFactory@f03b1c4; maxCacheMB=48.0 maxMergeSizeMB=4.0),segFN=segments_2,generation=2}
   [junit4]   2> 2353144 INFO  (qtp650677122-13297) [    x:collection1] o.a.s.c.SolrDeletionPolicy newest commit generation = 2
   [junit4]   2> 2353146 INFO  (qtp650677122-13297) [    x:collection1] o.a.s.s.SolrIndexSearcher Opening [Searcher@6d7af9f0[collection1] main]
   [junit4]   2> 2353146 INFO  (qtp650677122-13297) [    x:collection1] o.a.s.u.DirectUpdateHandler2 end_commit_flush
   [junit4]   2> 2353147 INFO  (searcherExecutor-6016-thread-1-processing-x:collection1) [    x:collection1] o.a.s.c.SolrCore [collection1] Registered new searcher Searcher@6d7af9f0[collection1] main{ExitableDirectoryReader(UninvertingDirectoryReader(Uninverting(_0(7.0.0):c53)))}
   [junit4]   2> 2353147 INFO  (qtp650677122-13297) [    x:collection1] o.a.s.u.p.LogUpdateProcessorFactory [collection1]  webapp=/solr path=/update params={waitSearcher=true&commit=true&softCommit=false&wt=javabin&version=2}{commit=} 0 26
   [junit4]   2> 2353148 INFO  (TEST-TestReplicationHandler.testRateLimitedReplication-seed#[4DA54ED0255A6B5]) [    ] o.e.j.s.ServerConnector Stopped ServerConnector@62948a58{HTTP/1.1,[http/1.1]}{127.0.0.1:0}
   [junit4]   2> 2353148 INFO  (TEST-TestReplicationHandler.testRateLimitedReplication-seed#[4DA54ED0255A6B5]) [    ] o.a.s.c.CoreContainer Shutting down CoreContainer instance=1257879395
   [junit4]   2> 2353149 INFO  (coreCloseExecutor-6020-thread-1) [    x:collection1] o.a.s.c.SolrCore [collection1]  CLOSING SolrCore org.apache.solr.core.SolrCore@534b79e8
   [junit4]   2> 2353149 INFO  (coreCloseExecutor-6020-thread-1) [    x:collection1] o.a.s.u.DirectUpdateHandler2 closing DirectUpdateHandler2{commits=1,autocommits=0,soft autocommits=0,optimizes=0,rollbacks=0,expungeDeletes=0,docsPending=0,adds=0,deletesById=0,deletesByQuery=0,errors=0,cumulative_adds=53,cumulative_deletesById=0,cumulative_deletesByQuery=0,cumulative_errors=0}
   [junit4]   2> 2353149 INFO  (coreCloseExecutor-6020-thread-1) [    x:collection1] o.a.s.u.SolrCoreState Closing SolrCoreState
   [junit4]   2> 2353149 INFO  (coreCloseExecutor-6020-thread-1) [    x:collection1] o.a.s.u.DefaultSolrCoreState SolrCoreState ref count has reached 0 - closing IndexWriter
   [junit4]   2> 2353149 INFO  (coreCloseExecutor-6020-thread-1) [    x:collection1] o.a.s.u.DefaultSolrCoreState closing IndexWriter with IndexWriterCloser
   [junit4]   2> 2353150 INFO  (coreCloseExecutor-6020-thread-1) [    x:collection1] o.a.s.c.SolrCore [collection1] Closing main searcher on request.
   [junit4]   2> 2353150 INFO  (coreCloseExecutor-6020-thread-1) [    x:collection1] o.a.s.c.CachingDirectoryFactory Closing NRTCachingDirectoryFactory - 3 directories currently being tracked
   [junit4]   2> 2353150 INFO  (coreCloseExecutor-6020-thread-1) [    x:collection1] o.a.s.c.CachingDirectoryFactory looking to close /Users/jenkins/workspace/Lucene-Solr-master-MacOSX/solr/build/solr-core/test/J0/temp/solr.handler.TestReplicationHandler_4DA54ED0255A6B5-001/solr-instance-001/collection1/data [CachedDir<<refCount=0;path=/Users/jenkins/workspace/Lucene-Solr-master-MacOSX/solr/build/solr-core/test/J0/temp/solr.handler.TestReplicationHandler_4DA54ED0255A6B5-001/solr-instance-001/collection1/data;done=false>>]
   [junit4]   2> 2353150 INFO  (coreCloseExecutor-6020-thread-1) [    x:collection1] o.a.s.c.CachingDirectoryFactory Closing directory, CoreContainer#isShutdown=true
   [junit4]   2> 2353150 INFO  (coreCloseExecutor-6020-thread-1) [    x:collection1] o.a.s.c.CachingDirectoryFactory Closing directory: /Users/jenkins/workspace/Lucene-Solr-master-MacOSX/solr/build/solr-core/test/J0/temp/solr.handler.TestReplicationHandler_4DA54ED0255A6B5-001/solr-instance-001/collection1/data
   [junit4]   2> 2353150 INFO  (coreCloseExecutor-6020-thread-1) [    x:collection1] o.a.s.c.CachingDirectoryFactory looking to close /Users/jenkins/workspace/Lucene-Solr-master-MacOSX/solr/build/solr-core/test/J0/temp/solr.handler.TestReplicationHandler_4DA54ED0255A6B5-001/solr-instance-001/collection1/data/index [CachedDir<<refCount=0;path=/Users/jenkins/workspace/Lucene-Solr-master-MacOSX/solr/build/solr-core/test/J0/temp/solr.handler.TestReplicationHandler_4DA54ED0255A6B5-001/solr-instance-001/collection1/data/index;done=false>>]
   [junit4]   2> 2353150 INFO  (coreCloseExecutor-6020-thread-1) [    x:collection1] o.a.s.c.CachingDirectoryFactory Closing directory, CoreContainer#isShutdown=true
   [junit4]   2> 2353150 INFO  (coreCloseExecutor-6020-thread-1) [    x:collection1] o.a.s.c.CachingDirectoryFactory Closing directory: /Users/jenkins/workspace/Lucene-Solr-master-MacOSX/solr/build/solr-core/test/J0/temp/solr.handler.TestReplicationHandler_4DA54ED0255A6B5-001/solr-instance-001/collection1/data/index
   [junit4]   2> 2353150 INFO  (coreCloseExecutor-6020-thread-1) [    x:collection1] o.a.s.c.CachingDirectoryFactory looking to close /Users/jenkins/workspace/Lucene-Solr-master-MacOSX/solr/build/solr-core/test/J0/temp/solr.handler.TestReplicationHandler_4DA54ED0255A6B5-001/solr-instance-001/collection1/data/snapshot_metadata [CachedDir<<refCount=0;path=/Users/jenkins/workspace/Lucene-Solr-master-MacOSX/solr/build/solr-core/test/J0/temp/solr.handler.TestReplicationHandler_4DA54ED0255A6B5-001/solr-instance-001/collection1/data/snapshot_metadata;done=false>>]
   [junit4]   2> 2353151 INFO  (coreCloseExecutor-6020-thread-1) [    x:collection1] o.a.s.c.CachingDirectoryFactory Closing directory, CoreContainer#isShutdown=true
   [junit4]   2> 2353151 INFO  (coreCloseExecutor-6020-thread-1) [    x:collection1] o.a.s.c.CachingDirectoryFactory Closing directory: /Users/jenkins/workspace/Lucene-Solr-master-MacOSX/solr/build/solr-core/test/J0/temp/solr.handler.TestReplicationHandler_4DA54ED0255A6B5-001/solr-instance-001/collection1/data/snapshot_metadata
   [junit4]   2> 2353151 INFO  (TEST-TestReplicationHandler.testRateLimitedReplication-seed#[4DA54ED0255A6B5]) [    ] o.e.j.s.h.ContextHandler Stopped o.e.j.s.ServletContextHandler@527ee1f1{/solr,null,UNAVAILABLE}
   [junit4]   2> 2353153 INFO  (TEST-TestReplicationHandler.testRateLimitedReplication-s

[...truncated too long message...]

0255A6B5-001/solr-instance-029/./collection1/data
   [junit4]   2> 2448939 INFO  (TEST-TestReplicationHandler.doTestIndexFetchWithMasterUrl-seed#[4DA54ED0255A6B5]) [    ] o.e.j.s.h.ContextHandler Stopped o.e.j.s.ServletContextHandler@54ca82cf{/solr,null,UNAVAILABLE}
   [junit4]   2> 2448941 INFO  (TEST-TestReplicationHandler.doTestIndexFetchWithMasterUrl-seed#[4DA54ED0255A6B5]) [    ] o.e.j.s.ServerConnector Stopped ServerConnector@79c66c2d{HTTP/1.1,[http/1.1]}{127.0.0.1:0}
   [junit4]   2> 2448941 INFO  (TEST-TestReplicationHandler.doTestIndexFetchWithMasterUrl-seed#[4DA54ED0255A6B5]) [    ] o.a.s.c.CoreContainer Shutting down CoreContainer instance=1959183908
   [junit4]   2> 2448942 INFO  (coreCloseExecutor-6643-thread-1) [    x:collection1] o.a.s.c.SolrCore [collection1]  CLOSING SolrCore org.apache.solr.core.SolrCore@300ca043
   [junit4]   2> 2448942 INFO  (coreCloseExecutor-6643-thread-1) [    x:collection1] o.a.s.u.DirectUpdateHandler2 closing DirectUpdateHandler2{commits=2,autocommits=0,soft autocommits=0,optimizes=0,rollbacks=0,expungeDeletes=0,docsPending=0,adds=0,deletesById=0,deletesByQuery=0,errors=0,cumulative_adds=3,cumulative_deletesById=0,cumulative_deletesByQuery=1,cumulative_errors=0}
   [junit4]   2> 2448942 INFO  (coreCloseExecutor-6643-thread-1) [    x:collection1] o.a.s.u.SolrCoreState Closing SolrCoreState
   [junit4]   2> 2448942 INFO  (coreCloseExecutor-6643-thread-1) [    x:collection1] o.a.s.u.DefaultSolrCoreState SolrCoreState ref count has reached 0 - closing IndexWriter
   [junit4]   2> 2448942 INFO  (coreCloseExecutor-6643-thread-1) [    x:collection1] o.a.s.u.DefaultSolrCoreState closing IndexWriter with IndexWriterCloser
   [junit4]   2> 2448943 INFO  (coreCloseExecutor-6643-thread-1) [    x:collection1] o.a.s.c.SolrCore [collection1] Closing main searcher on request.
   [junit4]   2> 2448943 INFO  (coreCloseExecutor-6643-thread-1) [    x:collection1] o.a.s.c.CachingDirectoryFactory Closing MockDirectoryFactory - 3 directories currently being tracked
   [junit4]   2> 2448943 INFO  (coreCloseExecutor-6643-thread-1) [    x:collection1] o.a.s.c.CachingDirectoryFactory looking to close /Users/jenkins/workspace/Lucene-Solr-master-MacOSX/solr/build/solr-core/test/J0/temp/solr.handler.TestReplicationHandler_4DA54ED0255A6B5-001/solr-instance-030/./collection1/data/snapshot_metadata [CachedDir<<refCount=0;path=/Users/jenkins/workspace/Lucene-Solr-master-MacOSX/solr/build/solr-core/test/J0/temp/solr.handler.TestReplicationHandler_4DA54ED0255A6B5-001/solr-instance-030/./collection1/data/snapshot_metadata;done=false>>]
   [junit4]   2> 2448943 INFO  (coreCloseExecutor-6643-thread-1) [    x:collection1] o.a.s.c.CachingDirectoryFactory Closing directory, CoreContainer#isShutdown=true
   [junit4]   2> 2448943 INFO  (coreCloseExecutor-6643-thread-1) [    x:collection1] o.a.s.c.CachingDirectoryFactory Closing directory: /Users/jenkins/workspace/Lucene-Solr-master-MacOSX/solr/build/solr-core/test/J0/temp/solr.handler.TestReplicationHandler_4DA54ED0255A6B5-001/solr-instance-030/./collection1/data/snapshot_metadata
   [junit4]   2> 2448943 INFO  (coreCloseExecutor-6643-thread-1) [    x:collection1] o.a.s.c.CachingDirectoryFactory looking to close /Users/jenkins/workspace/Lucene-Solr-master-MacOSX/solr/build/solr-core/test/J0/temp/solr.handler.TestReplicationHandler_4DA54ED0255A6B5-001/solr-instance-030/./collection1/data [CachedDir<<refCount=0;path=/Users/jenkins/workspace/Lucene-Solr-master-MacOSX/solr/build/solr-core/test/J0/temp/solr.handler.TestReplicationHandler_4DA54ED0255A6B5-001/solr-instance-030/./collection1/data;done=false>>]
   [junit4]   2> 2448943 INFO  (coreCloseExecutor-6643-thread-1) [    x:collection1] o.a.s.c.CachingDirectoryFactory Closing directory, CoreContainer#isShutdown=true
   [junit4]   2> 2448943 INFO  (coreCloseExecutor-6643-thread-1) [    x:collection1] o.a.s.c.CachingDirectoryFactory Closing directory: /Users/jenkins/workspace/Lucene-Solr-master-MacOSX/solr/build/solr-core/test/J0/temp/solr.handler.TestReplicationHandler_4DA54ED0255A6B5-001/solr-instance-030/./collection1/data
   [junit4]   2> 2448943 INFO  (coreCloseExecutor-6643-thread-1) [    x:collection1] o.a.s.c.CachingDirectoryFactory looking to close /Users/jenkins/workspace/Lucene-Solr-master-MacOSX/solr/build/solr-core/test/J0/temp/solr.handler.TestReplicationHandler_4DA54ED0255A6B5-001/solr-instance-030/./collection1/data/index.20160920233610066 [CachedDir<<refCount=0;path=/Users/jenkins/workspace/Lucene-Solr-master-MacOSX/solr/build/solr-core/test/J0/temp/solr.handler.TestReplicationHandler_4DA54ED0255A6B5-001/solr-instance-030/./collection1/data/index.20160920233610066;done=false>>]
   [junit4]   2> 2448943 INFO  (coreCloseExecutor-6643-thread-1) [    x:collection1] o.a.s.c.CachingDirectoryFactory Closing directory, CoreContainer#isShutdown=true
   [junit4]   2> 2448943 INFO  (coreCloseExecutor-6643-thread-1) [    x:collection1] o.a.s.c.CachingDirectoryFactory Closing directory: /Users/jenkins/workspace/Lucene-Solr-master-MacOSX/solr/build/solr-core/test/J0/temp/solr.handler.TestReplicationHandler_4DA54ED0255A6B5-001/solr-instance-030/./collection1/data/index.20160920233610066
   [junit4]   2> 2448944 INFO  (TEST-TestReplicationHandler.doTestIndexFetchWithMasterUrl-seed#[4DA54ED0255A6B5]) [    ] o.e.j.s.h.ContextHandler Stopped o.e.j.s.ServletContextHandler@7fb2d3a7{/solr,null,UNAVAILABLE}
   [junit4]   2> 2448947 INFO  (SUITE-TestReplicationHandler-seed#[4DA54ED0255A6B5]-worker) [    ] o.a.s.SolrTestCaseJ4 ###deleteCore
   [junit4]   2> NOTE: leaving temporary files on disk at: /Users/jenkins/workspace/Lucene-Solr-master-MacOSX/solr/build/solr-core/test/J0/temp/solr.handler.TestReplicationHandler_4DA54ED0255A6B5-001
   [junit4]   2> NOTE: test params are: codec=Asserting(Lucene62): {name=PostingsFormat(name=MockRandom), id=PostingsFormat(name=MockRandom), newname=PostingsFormat(name=MockRandom)}, docValues:{}, maxPointsInLeafNode=1601, maxMBSortInHeap=5.983648678958814, sim=ClassicSimilarity, locale=sr, timezone=America/Buenos_Aires
   [junit4]   2> NOTE: Mac OS X 10.11.6 x86_64/Oracle Corporation 1.8.0_102 (64-bit)/cpus=3,threads=1,free=333866320,total=536870912
   [junit4]   2> NOTE: All tests run in this JVM: [TestDynamicFieldResource, DocValuesTest, TestComponentsName, JSONWriterTest, HLLSerializationTest, TestHdfsBackupRestoreCore, LeaderElectionTest, TestManagedSynonymFilterFactory, TestRTimerTree, TestDownShardTolerantSearch, TestXmlQParserPlugin, CursorPagingTest, TestPerFieldSimilarity, TestFieldCacheWithThreads, TestCSVLoader, TestMacros, QueryEqualityTest, TestJsonRequest, TestLegacyNumericRangeQueryBuilder, TestSolrDeletionPolicy1, TestGroupingSearch, TestDocumentBuilder, HdfsRecoverLeaseTest, TestCloudPivotFacet, TestStressVersions, CursorMarkTest, TestCollationField, DocValuesMultiTest, MoreLikeThisHandlerTest, TestConfigOverlay, TestLRUCache, TestRequestStatusCollectionAPI, EnumFieldTest, HdfsCollectionsAPIDistributedZkTest, QueryResultKeyTest, TestSortByMinMaxFunction, NumericFieldsTest, TestFieldCache, TestMissingGroups, TestPKIAuthenticationPlugin, TestBinaryResponseWriter, TestCollapseQParserPlugin, TestHashQParserPlugin, XsltUpdateRequestHandlerTest, DistributedFacetPivotLargeTest, TestDefaultStatsCache, TestManagedResource, HardAutoCommitTest, ClusterStateUpdateTest, TestExceedMaxTermLength, TestSurroundQueryParser, SuggestComponentContextFilterQueryTest, BigEndianAscendingWordSerializerTest, TestOverriddenPrefixQueryForCustomFieldType, PluginInfoTest, TestUniqueKeyFieldResource, TestReqParamsAPI, TestSolrQueryResponse, TestStressReorder, TestCollationFieldDocValues, TestRemoteStreaming, TestIntervalFaceting, OverseerCollectionConfigSetProcessorTest, CdcrBootstrapTest, TestDistributedSearch, OverseerRolesTest, QueryElevationComponentTest, TestSolrCloudWithDelegationTokens, ResponseLogComponentTest, ZkCLITest, TestCryptoKeys, BasicDistributedZkTest, AtomicUpdatesTest, TestCharFilters, TestPivotHelperCode, BlockCacheTest, TestLazyCores, OutputWriterTest, TestBinaryField, DistributedVersionInfoTest, TestRandomRequestDistribution, BlockJoinFacetDistribTest, PeerSyncTest, TriLevelCompositeIdRoutingTest, TestSimpleQParserPlugin, TestSlowCompositeReaderWrapper, TestInfoStreamLogging, TestLeaderInitiatedRecoveryThread, DocumentAnalysisRequestHandlerTest, MultiTermTest, TestSolrCoreSnapshots, ExplicitHLLTest, TestPseudoReturnFields, SolrCoreTest, SolrCLIZkUtilsTest, ShardSplitTest, ReplaceNodeTest, SegmentsInfoRequestHandlerTest, TestOnReconnectListenerSupport, TestElisionMultitermQuery, ActionThrottleTest, HdfsLockFactoryTest, TestCSVResponseWriter, AnalysisAfterCoreReloadTest, DistributedQueryElevationComponentTest, CleanupOldIndexTest, DateRangeFieldTest, VersionInfoTest, CollectionReloadTest, SchemaVersionSpecificBehaviorTest, TestPartialUpdateDeduplication, SolrPluginUtilsTest, TestRawResponseWriter, TestStressRecovery, TestTrieFacet, TestIBSimilarityFactory, TestCursorMarkWithoutUniqueKey, ExitableDirectoryReaderTest, DistributedExpandComponentTest, TestSort, TestPerFieldSimilarityWithDefaultOverride, AnalyticsMergeStrategyTest, PingRequestHandlerTest, PolyFieldTest, TestConfigSetProperties, OverseerTest, RestartWhileUpdatingTest, TestUseDocValuesAsStored, TestFastLRUCache, FastVectorHighlighterTest, TestLRUStatsCache, RequiredFieldsTest, TestFreeTextSuggestions, DirectSolrSpellCheckerTest, TestFastOutputStream, SyncSliceTest, TestNRTOpen, XmlUpdateRequestHandlerTest, RulesTest, TestEmbeddedSolrServerConstructors, TestTestInjection, TestFieldResource, SolrXmlInZkTest, ZkControllerTest, SolrTestCaseJ4Test, TestFunctionQuery, DirectSolrConnectionTest, JavabinLoaderTest, SoftAutoCommitTest, PKIAuthenticationIntegrationTest, CoreAdminRequestStatusTest, ZkNodePropsTest, TestHashPartitioner, ShardRoutingTest, BasicZkTest, RecoveryZkTest, TestReplicationHandler]
   [junit4] Completed [324/631 (1!)] on J0 in 97.54s, 15 tests, 1 failure, 1 skipped <<< FAILURES!

[...truncated 61227 lines...]


Mime
View raw message