lucene-dev mailing list archives

Site index · List index
Message view « Date » · « Thread »
Top « Date » · « Thread »
From Policeman Jenkins Server <jenk...@thetaphi.de>
Subject [JENKINS] Lucene-Solr-master-Solaris (64bit/jdk1.8.0) - Build # 840 - Still Unstable!
Date Sun, 11 Sep 2016 21:41:44 GMT
Build: http://jenkins.thetaphi.de/job/Lucene-Solr-master-Solaris/840/
Java: 64bit/jdk1.8.0 -XX:+UseCompressedOops -XX:+UseParallelGC

1 tests failed.
FAILED:  org.apache.solr.cloud.ForceLeaderTest.testReplicasInLIRNoLeader

Error Message:
org.apache.solr.client.solrj.SolrServerException: No live SolrServers available to handle this request:[http://127.0.0.1:33774/forceleader_test_collection_shard1_replica2]

Stack Trace:
org.apache.solr.client.solrj.SolrServerException: org.apache.solr.client.solrj.SolrServerException: No live SolrServers available to handle this request:[http://127.0.0.1:33774/forceleader_test_collection_shard1_replica2]
	at __randomizedtesting.SeedInfo.seed([83844D2F1CB0B8FD:651379EF2532419C]:0)
	at org.apache.solr.client.solrj.impl.CloudSolrClient.directUpdate(CloudSolrClient.java:769)
	at org.apache.solr.client.solrj.impl.CloudSolrClient.sendRequest(CloudSolrClient.java:1161)
	at org.apache.solr.client.solrj.impl.CloudSolrClient.requestWithRetryOnStaleState(CloudSolrClient.java:1050)
	at org.apache.solr.client.solrj.impl.CloudSolrClient.request(CloudSolrClient.java:992)
	at org.apache.solr.cloud.AbstractFullDistribZkTestBase.sendDocsWithRetry(AbstractFullDistribZkTestBase.java:753)
	at org.apache.solr.cloud.AbstractFullDistribZkTestBase.sendDocsWithRetry(AbstractFullDistribZkTestBase.java:741)
	at org.apache.solr.cloud.ForceLeaderTest.sendDoc(ForceLeaderTest.java:424)
	at org.apache.solr.cloud.ForceLeaderTest.assertSendDocFails(ForceLeaderTest.java:315)
	at org.apache.solr.cloud.ForceLeaderTest.testReplicasInLIRNoLeader(ForceLeaderTest.java:110)
	at sun.reflect.NativeMethodAccessorImpl.invoke0(Native Method)
	at sun.reflect.NativeMethodAccessorImpl.invoke(NativeMethodAccessorImpl.java:62)
	at sun.reflect.DelegatingMethodAccessorImpl.invoke(DelegatingMethodAccessorImpl.java:43)
	at java.lang.reflect.Method.invoke(Method.java:498)
	at com.carrotsearch.randomizedtesting.RandomizedRunner.invoke(RandomizedRunner.java:1764)
	at com.carrotsearch.randomizedtesting.RandomizedRunner$8.evaluate(RandomizedRunner.java:871)
	at com.carrotsearch.randomizedtesting.RandomizedRunner$9.evaluate(RandomizedRunner.java:907)
	at com.carrotsearch.randomizedtesting.RandomizedRunner$10.evaluate(RandomizedRunner.java:921)
	at org.apache.solr.BaseDistributedSearchTestCase$ShardsRepeatRule$ShardsFixedStatement.callStatement(BaseDistributedSearchTestCase.java:985)
	at org.apache.solr.BaseDistributedSearchTestCase$ShardsRepeatRule$ShardsStatement.evaluate(BaseDistributedSearchTestCase.java:960)
	at com.carrotsearch.randomizedtesting.rules.SystemPropertiesRestoreRule$1.evaluate(SystemPropertiesRestoreRule.java:57)
	at org.apache.lucene.util.TestRuleSetupTeardownChained$1.evaluate(TestRuleSetupTeardownChained.java:49)
	at org.apache.lucene.util.AbstractBeforeAfterRule$1.evaluate(AbstractBeforeAfterRule.java:45)
	at org.apache.lucene.util.TestRuleThreadAndTestName$1.evaluate(TestRuleThreadAndTestName.java:48)
	at org.apache.lucene.util.TestRuleIgnoreAfterMaxFailures$1.evaluate(TestRuleIgnoreAfterMaxFailures.java:64)
	at org.apache.lucene.util.TestRuleMarkFailure$1.evaluate(TestRuleMarkFailure.java:47)
	at com.carrotsearch.randomizedtesting.rules.StatementAdapter.evaluate(StatementAdapter.java:36)
	at com.carrotsearch.randomizedtesting.ThreadLeakControl$StatementRunner.run(ThreadLeakControl.java:367)
	at com.carrotsearch.randomizedtesting.ThreadLeakControl.forkTimeoutingTask(ThreadLeakControl.java:809)
	at com.carrotsearch.randomizedtesting.ThreadLeakControl$3.evaluate(ThreadLeakControl.java:460)
	at com.carrotsearch.randomizedtesting.RandomizedRunner.runSingleTest(RandomizedRunner.java:880)
	at com.carrotsearch.randomizedtesting.RandomizedRunner$5.evaluate(RandomizedRunner.java:781)
	at com.carrotsearch.randomizedtesting.RandomizedRunner$6.evaluate(RandomizedRunner.java:816)
	at com.carrotsearch.randomizedtesting.RandomizedRunner$7.evaluate(RandomizedRunner.java:827)
	at com.carrotsearch.randomizedtesting.rules.StatementAdapter.evaluate(StatementAdapter.java:36)
	at com.carrotsearch.randomizedtesting.rules.SystemPropertiesRestoreRule$1.evaluate(SystemPropertiesRestoreRule.java:57)
	at org.apache.lucene.util.AbstractBeforeAfterRule$1.evaluate(AbstractBeforeAfterRule.java:45)
	at com.carrotsearch.randomizedtesting.rules.StatementAdapter.evaluate(StatementAdapter.java:36)
	at org.apache.lucene.util.TestRuleStoreClassName$1.evaluate(TestRuleStoreClassName.java:41)
	at com.carrotsearch.randomizedtesting.rules.NoShadowingOrOverridesOnMethodsRule$1.evaluate(NoShadowingOrOverridesOnMethodsRule.java:40)
	at com.carrotsearch.randomizedtesting.rules.NoShadowingOrOverridesOnMethodsRule$1.evaluate(NoShadowingOrOverridesOnMethodsRule.java:40)
	at com.carrotsearch.randomizedtesting.rules.StatementAdapter.evaluate(StatementAdapter.java:36)
	at com.carrotsearch.randomizedtesting.rules.StatementAdapter.evaluate(StatementAdapter.java:36)
	at com.carrotsearch.randomizedtesting.rules.StatementAdapter.evaluate(StatementAdapter.java:36)
	at org.apache.lucene.util.TestRuleAssertionsRequired$1.evaluate(TestRuleAssertionsRequired.java:53)
	at org.apache.lucene.util.TestRuleMarkFailure$1.evaluate(TestRuleMarkFailure.java:47)
	at org.apache.lucene.util.TestRuleIgnoreAfterMaxFailures$1.evaluate(TestRuleIgnoreAfterMaxFailures.java:64)
	at org.apache.lucene.util.TestRuleIgnoreTestSuites$1.evaluate(TestRuleIgnoreTestSuites.java:54)
	at com.carrotsearch.randomizedtesting.rules.StatementAdapter.evaluate(StatementAdapter.java:36)
	at com.carrotsearch.randomizedtesting.ThreadLeakControl$StatementRunner.run(ThreadLeakControl.java:367)
	at java.lang.Thread.run(Thread.java:745)
Caused by: org.apache.solr.client.solrj.SolrServerException: No live SolrServers available to handle this request:[http://127.0.0.1:33774/forceleader_test_collection_shard1_replica2]
	at org.apache.solr.client.solrj.impl.LBHttpSolrClient.request(LBHttpSolrClient.java:394)
	at org.apache.solr.client.solrj.impl.CloudSolrClient.directUpdate(CloudSolrClient.java:763)
	... 49 more
Caused by: org.apache.solr.client.solrj.SolrServerException: Server refused connection at: http://127.0.0.1:33774/forceleader_test_collection_shard1_replica2
	at org.apache.solr.client.solrj.impl.HttpSolrClient.executeMethod(HttpSolrClient.java:615)
	at org.apache.solr.client.solrj.impl.HttpSolrClient.request(HttpSolrClient.java:261)
	at org.apache.solr.client.solrj.impl.HttpSolrClient.request(HttpSolrClient.java:250)
	at org.apache.solr.client.solrj.impl.LBHttpSolrClient.doRequest(LBHttpSolrClient.java:415)
	at org.apache.solr.client.solrj.impl.LBHttpSolrClient.request(LBHttpSolrClient.java:383)
	... 50 more
Caused by: org.apache.http.conn.HttpHostConnectException: Connect to 127.0.0.1:33774 [/127.0.0.1] failed: Connection refused
	at org.apache.http.impl.conn.DefaultHttpClientConnectionOperator.connect(DefaultHttpClientConnectionOperator.java:151)
	at org.apache.http.impl.conn.PoolingHttpClientConnectionManager.connect(PoolingHttpClientConnectionManager.java:353)
	at org.apache.http.impl.execchain.MainClientExec.establishRoute(MainClientExec.java:380)
	at org.apache.http.impl.execchain.MainClientExec.execute(MainClientExec.java:236)
	at org.apache.http.impl.execchain.ProtocolExec.execute(ProtocolExec.java:184)
	at org.apache.http.impl.execchain.RetryExec.execute(RetryExec.java:88)
	at org.apache.http.impl.execchain.RedirectExec.execute(RedirectExec.java:110)
	at org.apache.http.impl.client.InternalHttpClient.doExecute(InternalHttpClient.java:184)
	at org.apache.http.impl.client.CloseableHttpClient.execute(CloseableHttpClient.java:82)
	at org.apache.http.impl.client.CloseableHttpClient.execute(CloseableHttpClient.java:55)
	at org.apache.solr.client.solrj.impl.HttpSolrClient.executeMethod(HttpSolrClient.java:513)
	... 54 more
Caused by: java.net.ConnectException: Connection refused
	at java.net.PlainSocketImpl.socketConnect(Native Method)
	at java.net.AbstractPlainSocketImpl.doConnect(AbstractPlainSocketImpl.java:350)
	at java.net.AbstractPlainSocketImpl.connectToAddress(AbstractPlainSocketImpl.java:206)
	at java.net.AbstractPlainSocketImpl.connect(AbstractPlainSocketImpl.java:188)
	at java.net.SocksSocketImpl.connect(SocksSocketImpl.java:392)
	at java.net.Socket.connect(Socket.java:589)
	at org.apache.http.conn.socket.PlainConnectionSocketFactory.connectSocket(PlainConnectionSocketFactory.java:74)
	at org.apache.http.impl.conn.DefaultHttpClientConnectionOperator.connect(DefaultHttpClientConnectionOperator.java:134)
	... 64 more




Build Log:
[...truncated 11938 lines...]
   [junit4] Suite: org.apache.solr.cloud.ForceLeaderTest
   [junit4]   2> Creating dataDir: /export/home/jenkins/workspace/Lucene-Solr-master-Solaris/solr/build/solr-core/test/J0/temp/solr.cloud.ForceLeaderTest_83844D2F1CB0B8FD-001/init-core-data-001
   [junit4]   2> 1889507 INFO  (SUITE-ForceLeaderTest-seed#[83844D2F1CB0B8FD]-worker) [    ] o.a.s.SolrTestCaseJ4 Randomized ssl (false) and clientAuth (false) via: @org.apache.solr.SolrTestCaseJ4$SuppressSSL(bugUrl=https://issues.apache.org/jira/browse/SOLR-5776)
   [junit4]   2> 1889507 INFO  (SUITE-ForceLeaderTest-seed#[83844D2F1CB0B8FD]-worker) [    ] o.a.s.BaseDistributedSearchTestCase Setting hostContext system property: /
   [junit4]   2> 1889509 INFO  (TEST-ForceLeaderTest.testReplicasInLIRNoLeader-seed#[83844D2F1CB0B8FD]) [    ] o.a.s.c.ZkTestServer STARTING ZK TEST SERVER
   [junit4]   2> 1889510 INFO  (Thread-3466) [    ] o.a.s.c.ZkTestServer client port:0.0.0.0/0.0.0.0:0
   [junit4]   2> 1889510 INFO  (Thread-3466) [    ] o.a.s.c.ZkTestServer Starting server
   [junit4]   2> 1889609 INFO  (TEST-ForceLeaderTest.testReplicasInLIRNoLeader-seed#[83844D2F1CB0B8FD]) [    ] o.a.s.c.ZkTestServer start zk server on port:56635
   [junit4]   2> 1889610 INFO  (TEST-ForceLeaderTest.testReplicasInLIRNoLeader-seed#[83844D2F1CB0B8FD]) [    ] o.a.s.c.c.SolrZkClient Using default ZkCredentialsProvider
   [junit4]   2> 1889610 INFO  (TEST-ForceLeaderTest.testReplicasInLIRNoLeader-seed#[83844D2F1CB0B8FD]) [    ] o.a.s.c.c.ConnectionManager Waiting for client to connect to ZooKeeper
   [junit4]   2> 1889614 INFO  (zkCallback-2415-thread-1) [    ] o.a.s.c.c.ConnectionManager Watcher org.apache.solr.common.cloud.ConnectionManager@35e4f7bd name:ZooKeeperConnection Watcher:127.0.0.1:56635 got event WatchedEvent state:SyncConnected type:None path:null path:null type:None
   [junit4]   2> 1889614 INFO  (TEST-ForceLeaderTest.testReplicasInLIRNoLeader-seed#[83844D2F1CB0B8FD]) [    ] o.a.s.c.c.ConnectionManager Client is connected to ZooKeeper
   [junit4]   2> 1889615 INFO  (TEST-ForceLeaderTest.testReplicasInLIRNoLeader-seed#[83844D2F1CB0B8FD]) [    ] o.a.s.c.c.SolrZkClient Using default ZkACLProvider
   [junit4]   2> 1889615 INFO  (TEST-ForceLeaderTest.testReplicasInLIRNoLeader-seed#[83844D2F1CB0B8FD]) [    ] o.a.s.c.c.SolrZkClient makePath: /solr
   [junit4]   2> 1889618 INFO  (TEST-ForceLeaderTest.testReplicasInLIRNoLeader-seed#[83844D2F1CB0B8FD]) [    ] o.a.s.c.c.SolrZkClient Using default ZkCredentialsProvider
   [junit4]   2> 1889618 INFO  (TEST-ForceLeaderTest.testReplicasInLIRNoLeader-seed#[83844D2F1CB0B8FD]) [    ] o.a.s.c.c.ConnectionManager Waiting for client to connect to ZooKeeper
   [junit4]   2> 1889620 INFO  (zkCallback-2416-thread-1) [    ] o.a.s.c.c.ConnectionManager Watcher org.apache.solr.common.cloud.ConnectionManager@68295075 name:ZooKeeperConnection Watcher:127.0.0.1:56635/solr got event WatchedEvent state:SyncConnected type:None path:null path:null type:None
   [junit4]   2> 1889621 INFO  (TEST-ForceLeaderTest.testReplicasInLIRNoLeader-seed#[83844D2F1CB0B8FD]) [    ] o.a.s.c.c.ConnectionManager Client is connected to ZooKeeper
   [junit4]   2> 1889621 INFO  (TEST-ForceLeaderTest.testReplicasInLIRNoLeader-seed#[83844D2F1CB0B8FD]) [    ] o.a.s.c.c.SolrZkClient Using default ZkACLProvider
   [junit4]   2> 1889621 INFO  (TEST-ForceLeaderTest.testReplicasInLIRNoLeader-seed#[83844D2F1CB0B8FD]) [    ] o.a.s.c.c.SolrZkClient makePath: /collections/collection1
   [junit4]   2> 1889625 INFO  (TEST-ForceLeaderTest.testReplicasInLIRNoLeader-seed#[83844D2F1CB0B8FD]) [    ] o.a.s.c.c.SolrZkClient makePath: /collections/collection1/shards
   [junit4]   2> 1889627 INFO  (TEST-ForceLeaderTest.testReplicasInLIRNoLeader-seed#[83844D2F1CB0B8FD]) [    ] o.a.s.c.c.SolrZkClient makePath: /collections/control_collection
   [junit4]   2> 1889629 INFO  (TEST-ForceLeaderTest.testReplicasInLIRNoLeader-seed#[83844D2F1CB0B8FD]) [    ] o.a.s.c.c.SolrZkClient makePath: /collections/control_collection/shards
   [junit4]   2> 1889632 INFO  (TEST-ForceLeaderTest.testReplicasInLIRNoLeader-seed#[83844D2F1CB0B8FD]) [    ] o.a.s.c.AbstractZkTestCase put /export/home/jenkins/workspace/Lucene-Solr-master-Solaris/solr/core/src/test-files/solr/collection1/conf/solrconfig-tlog.xml to /configs/conf1/solrconfig.xml
   [junit4]   2> 1889632 INFO  (TEST-ForceLeaderTest.testReplicasInLIRNoLeader-seed#[83844D2F1CB0B8FD]) [    ] o.a.s.c.c.SolrZkClient makePath: /configs/conf1/solrconfig.xml
   [junit4]   2> 1889636 INFO  (TEST-ForceLeaderTest.testReplicasInLIRNoLeader-seed#[83844D2F1CB0B8FD]) [    ] o.a.s.c.AbstractZkTestCase put /export/home/jenkins/workspace/Lucene-Solr-master-Solaris/solr/core/src/test-files/solr/collection1/conf/schema.xml to /configs/conf1/schema.xml
   [junit4]   2> 1889636 INFO  (TEST-ForceLeaderTest.testReplicasInLIRNoLeader-seed#[83844D2F1CB0B8FD]) [    ] o.a.s.c.c.SolrZkClient makePath: /configs/conf1/schema.xml
   [junit4]   2> 1889641 INFO  (TEST-ForceLeaderTest.testReplicasInLIRNoLeader-seed#[83844D2F1CB0B8FD]) [    ] o.a.s.c.AbstractZkTestCase put /export/home/jenkins/workspace/Lucene-Solr-master-Solaris/solr/core/src/test-files/solr/collection1/conf/solrconfig.snippet.randomindexconfig.xml to /configs/conf1/solrconfig.snippet.randomindexconfig.xml
   [junit4]   2> 1889641 INFO  (TEST-ForceLeaderTest.testReplicasInLIRNoLeader-seed#[83844D2F1CB0B8FD]) [    ] o.a.s.c.c.SolrZkClient makePath: /configs/conf1/solrconfig.snippet.randomindexconfig.xml
   [junit4]   2> 1889646 INFO  (TEST-ForceLeaderTest.testReplicasInLIRNoLeader-seed#[83844D2F1CB0B8FD]) [    ] o.a.s.c.AbstractZkTestCase put /export/home/jenkins/workspace/Lucene-Solr-master-Solaris/solr/core/src/test-files/solr/collection1/conf/stopwords.txt to /configs/conf1/stopwords.txt
   [junit4]   2> 1889646 INFO  (TEST-ForceLeaderTest.testReplicasInLIRNoLeader-seed#[83844D2F1CB0B8FD]) [    ] o.a.s.c.c.SolrZkClient makePath: /configs/conf1/stopwords.txt
   [junit4]   2> 1889649 INFO  (TEST-ForceLeaderTest.testReplicasInLIRNoLeader-seed#[83844D2F1CB0B8FD]) [    ] o.a.s.c.AbstractZkTestCase put /export/home/jenkins/workspace/Lucene-Solr-master-Solaris/solr/core/src/test-files/solr/collection1/conf/protwords.txt to /configs/conf1/protwords.txt
   [junit4]   2> 1889650 INFO  (TEST-ForceLeaderTest.testReplicasInLIRNoLeader-seed#[83844D2F1CB0B8FD]) [    ] o.a.s.c.c.SolrZkClient makePath: /configs/conf1/protwords.txt
   [junit4]   2> 1889652 INFO  (TEST-ForceLeaderTest.testReplicasInLIRNoLeader-seed#[83844D2F1CB0B8FD]) [    ] o.a.s.c.AbstractZkTestCase put /export/home/jenkins/workspace/Lucene-Solr-master-Solaris/solr/core/src/test-files/solr/collection1/conf/currency.xml to /configs/conf1/currency.xml
   [junit4]   2> 1889652 INFO  (TEST-ForceLeaderTest.testReplicasInLIRNoLeader-seed#[83844D2F1CB0B8FD]) [    ] o.a.s.c.c.SolrZkClient makePath: /configs/conf1/currency.xml
   [junit4]   2> 1889654 INFO  (TEST-ForceLeaderTest.testReplicasInLIRNoLeader-seed#[83844D2F1CB0B8FD]) [    ] o.a.s.c.AbstractZkTestCase put /export/home/jenkins/workspace/Lucene-Solr-master-Solaris/solr/core/src/test-files/solr/collection1/conf/enumsConfig.xml to /configs/conf1/enumsConfig.xml
   [junit4]   2> 1889654 INFO  (TEST-ForceLeaderTest.testReplicasInLIRNoLeader-seed#[83844D2F1CB0B8FD]) [    ] o.a.s.c.c.SolrZkClient makePath: /configs/conf1/enumsConfig.xml
   [junit4]   2> 1889657 INFO  (TEST-ForceLeaderTest.testReplicasInLIRNoLeader-seed#[83844D2F1CB0B8FD]) [    ] o.a.s.c.AbstractZkTestCase put /export/home/jenkins/workspace/Lucene-Solr-master-Solaris/solr/core/src/test-files/solr/collection1/conf/open-exchange-rates.json to /configs/conf1/open-exchange-rates.json
   [junit4]   2> 1889657 INFO  (TEST-ForceLeaderTest.testReplicasInLIRNoLeader-seed#[83844D2F1CB0B8FD]) [    ] o.a.s.c.c.SolrZkClient makePath: /configs/conf1/open-exchange-rates.json
   [junit4]   2> 1889661 INFO  (TEST-ForceLeaderTest.testReplicasInLIRNoLeader-seed#[83844D2F1CB0B8FD]) [    ] o.a.s.c.AbstractZkTestCase put /export/home/jenkins/workspace/Lucene-Solr-master-Solaris/solr/core/src/test-files/solr/collection1/conf/mapping-ISOLatin1Accent.txt to /configs/conf1/mapping-ISOLatin1Accent.txt
   [junit4]   2> 1889661 INFO  (TEST-ForceLeaderTest.testReplicasInLIRNoLeader-seed#[83844D2F1CB0B8FD]) [    ] o.a.s.c.c.SolrZkClient makePath: /configs/conf1/mapping-ISOLatin1Accent.txt
   [junit4]   2> 1889663 INFO  (TEST-ForceLeaderTest.testReplicasInLIRNoLeader-seed#[83844D2F1CB0B8FD]) [    ] o.a.s.c.AbstractZkTestCase put /export/home/jenkins/workspace/Lucene-Solr-master-Solaris/solr/core/src/test-files/solr/collection1/conf/old_synonyms.txt to /configs/conf1/old_synonyms.txt
   [junit4]   2> 1889664 INFO  (TEST-ForceLeaderTest.testReplicasInLIRNoLeader-seed#[83844D2F1CB0B8FD]) [    ] o.a.s.c.c.SolrZkClient makePath: /configs/conf1/old_synonyms.txt
   [junit4]   2> 1889666 INFO  (TEST-ForceLeaderTest.testReplicasInLIRNoLeader-seed#[83844D2F1CB0B8FD]) [    ] o.a.s.c.AbstractZkTestCase put /export/home/jenkins/workspace/Lucene-Solr-master-Solaris/solr/core/src/test-files/solr/collection1/conf/synonyms.txt to /configs/conf1/synonyms.txt
   [junit4]   2> 1889666 INFO  (TEST-ForceLeaderTest.testReplicasInLIRNoLeader-seed#[83844D2F1CB0B8FD]) [    ] o.a.s.c.c.SolrZkClient makePath: /configs/conf1/synonyms.txt
   [junit4]   2> 1889839 INFO  (TEST-ForceLeaderTest.testReplicasInLIRNoLeader-seed#[83844D2F1CB0B8FD]) [    ] o.a.s.SolrTestCaseJ4 Writing core.properties file to /export/home/jenkins/workspace/Lucene-Solr-master-Solaris/solr/build/solr-core/test/J0/temp/solr.cloud.ForceLeaderTest_83844D2F1CB0B8FD-001/control-001/cores/collection1
   [junit4]   2> 1889841 INFO  (TEST-ForceLeaderTest.testReplicasInLIRNoLeader-seed#[83844D2F1CB0B8FD]) [    ] o.e.j.s.Server jetty-9.3.8.v20160314
   [junit4]   2> 1889842 INFO  (TEST-ForceLeaderTest.testReplicasInLIRNoLeader-seed#[83844D2F1CB0B8FD]) [    ] o.e.j.s.h.ContextHandler Started o.e.j.s.ServletContextHandler@24b0348d{/,null,AVAILABLE}
   [junit4]   2> 1889846 INFO  (TEST-ForceLeaderTest.testReplicasInLIRNoLeader-seed#[83844D2F1CB0B8FD]) [    ] o.e.j.s.ServerConnector Started ServerConnector@62b52981{HTTP/1.1,[http/1.1]}{127.0.0.1:38364}
   [junit4]   2> 1889846 INFO  (TEST-ForceLeaderTest.testReplicasInLIRNoLeader-seed#[83844D2F1CB0B8FD]) [    ] o.e.j.s.Server Started @1892942ms
   [junit4]   2> 1889846 INFO  (TEST-ForceLeaderTest.testReplicasInLIRNoLeader-seed#[83844D2F1CB0B8FD]) [    ] o.a.s.c.s.e.JettySolrRunner Jetty properties: {solr.data.dir=/export/home/jenkins/workspace/Lucene-Solr-master-Solaris/solr/build/solr-core/test/J0/temp/solr.cloud.ForceLeaderTest_83844D2F1CB0B8FD-001/tempDir-001/control/data, hostContext=/, hostPort=49063, coreRootDirectory=/export/home/jenkins/workspace/Lucene-Solr-master-Solaris/solr/build/solr-core/test/J0/temp/solr.cloud.ForceLeaderTest_83844D2F1CB0B8FD-001/control-001/cores}
   [junit4]   2> 1889846 INFO  (TEST-ForceLeaderTest.testReplicasInLIRNoLeader-seed#[83844D2F1CB0B8FD]) [    ] o.a.s.s.SolrDispatchFilter SolrDispatchFilter.init(): sun.misc.Launcher$AppClassLoader@6d06d69c
   [junit4]   2> 1889846 INFO  (TEST-ForceLeaderTest.testReplicasInLIRNoLeader-seed#[83844D2F1CB0B8FD]) [    ] o.a.s.c.SolrResourceLoader new SolrResourceLoader for directory: '/export/home/jenkins/workspace/Lucene-Solr-master-Solaris/solr/build/solr-core/test/J0/temp/solr.cloud.ForceLeaderTest_83844D2F1CB0B8FD-001/control-001'
   [junit4]   2> 1889846 INFO  (TEST-ForceLeaderTest.testReplicasInLIRNoLeader-seed#[83844D2F1CB0B8FD]) [    ] o.a.s.c.SolrResourceLoader JNDI not configured for solr (NoInitialContextEx)
   [junit4]   2> 1889846 INFO  (TEST-ForceLeaderTest.testReplicasInLIRNoLeader-seed#[83844D2F1CB0B8FD]) [    ] o.a.s.c.SolrResourceLoader solr home defaulted to 'solr/' (could not find system property or JNDI)
   [junit4]   2> 1889847 INFO  (TEST-ForceLeaderTest.testReplicasInLIRNoLeader-seed#[83844D2F1CB0B8FD]) [    ] o.a.s.c.c.SolrZkClient Using default ZkCredentialsProvider
   [junit4]   2> 1889847 INFO  (TEST-ForceLeaderTest.testReplicasInLIRNoLeader-seed#[83844D2F1CB0B8FD]) [    ] o.a.s.c.c.ConnectionManager Waiting for client to connect to ZooKeeper
   [junit4]   2> 1889857 INFO  (zkCallback-2417-thread-1) [    ] o.a.s.c.c.ConnectionManager Watcher org.apache.solr.common.cloud.ConnectionManager@2b39b808 name:ZooKeeperConnection Watcher:127.0.0.1:56635/solr got event WatchedEvent state:SyncConnected type:None path:null path:null type:None
   [junit4]   2> 1889857 INFO  (TEST-ForceLeaderTest.testReplicasInLIRNoLeader-seed#[83844D2F1CB0B8FD]) [    ] o.a.s.c.c.ConnectionManager Client is connected to ZooKeeper
   [junit4]   2> 1889857 INFO  (TEST-ForceLeaderTest.testReplicasInLIRNoLeader-seed#[83844D2F1CB0B8FD]) [    ] o.a.s.c.c.SolrZkClient Using default ZkACLProvider
   [junit4]   2> 1889858 INFO  (TEST-ForceLeaderTest.testReplicasInLIRNoLeader-seed#[83844D2F1CB0B8FD]) [    ] o.a.s.s.SolrDispatchFilter Loading solr.xml from SolrHome (not found in ZooKeeper)
   [junit4]   2> 1889858 INFO  (TEST-ForceLeaderTest.testReplicasInLIRNoLeader-seed#[83844D2F1CB0B8FD]) [    ] o.a.s.c.SolrXmlConfig Loading container configuration from /export/home/jenkins/workspace/Lucene-Solr-master-Solaris/solr/build/solr-core/test/J0/temp/solr.cloud.ForceLeaderTest_83844D2F1CB0B8FD-001/control-001/solr.xml
   [junit4]   2> 1889863 INFO  (TEST-ForceLeaderTest.testReplicasInLIRNoLeader-seed#[83844D2F1CB0B8FD]) [    ] o.a.s.c.CorePropertiesLocator Config-defined core root directory: /export/home/jenkins/workspace/Lucene-Solr-master-Solaris/solr/build/solr-core/test/J0/temp/solr.cloud.ForceLeaderTest_83844D2F1CB0B8FD-001/control-001/cores
   [junit4]   2> 1889863 INFO  (TEST-ForceLeaderTest.testReplicasInLIRNoLeader-seed#[83844D2F1CB0B8FD]) [    ] o.a.s.c.CoreContainer New CoreContainer 873277461
   [junit4]   2> 1889863 INFO  (TEST-ForceLeaderTest.testReplicasInLIRNoLeader-seed#[83844D2F1CB0B8FD]) [    ] o.a.s.c.CoreContainer Loading cores into CoreContainer [instanceDir=/export/home/jenkins/workspace/Lucene-Solr-master-Solaris/solr/build/solr-core/test/J0/temp/solr.cloud.ForceLeaderTest_83844D2F1CB0B8FD-001/control-001]
   [junit4]   2> 1889863 WARN  (TEST-ForceLeaderTest.testReplicasInLIRNoLeader-seed#[83844D2F1CB0B8FD]) [    ] o.a.s.c.CoreContainer Couldn't add files from /export/home/jenkins/workspace/Lucene-Solr-master-Solaris/solr/build/solr-core/test/J0/temp/solr.cloud.ForceLeaderTest_83844D2F1CB0B8FD-001/control-001/lib to classpath: /export/home/jenkins/workspace/Lucene-Solr-master-Solaris/solr/build/solr-core/test/J0/temp/solr.cloud.ForceLeaderTest_83844D2F1CB0B8FD-001/control-001/lib
   [junit4]   2> 1889863 INFO  (TEST-ForceLeaderTest.testReplicasInLIRNoLeader-seed#[83844D2F1CB0B8FD]) [    ] o.a.s.h.c.HttpShardHandlerFactory created with socketTimeout : 90000,urlScheme : ,connTimeout : 15000,maxConnectionsPerHost : 20,maxConnections : 10000,corePoolSize : 0,maximumPoolSize : 2147483647,maxThreadIdleTime : 5,sizeOfQueue : -1,fairnessPolicy : false,
   [junit4]   2> 1889866 INFO  (TEST-ForceLeaderTest.testReplicasInLIRNoLeader-seed#[83844D2F1CB0B8FD]) [    ] o.a.s.u.UpdateShardHandler Created UpdateShardHandler HTTP client with params: socketTimeout=340000&connTimeout=45000&maxConnections=100000&maxConnectionsPerHost=100000
   [junit4]   2> 1889866 INFO  (TEST-ForceLeaderTest.testReplicasInLIRNoLeader-seed#[83844D2F1CB0B8FD]) [    ] o.a.s.l.LogWatcher SLF4J impl is org.slf4j.impl.Log4jLoggerFactory
   [junit4]   2> 1889866 INFO  (TEST-ForceLeaderTest.testReplicasInLIRNoLeader-seed#[83844D2F1CB0B8FD]) [    ] o.a.s.l.LogWatcher Registering Log Listener [Log4j (org.slf4j.impl.Log4jLoggerFactory)]
   [junit4]   2> 1889866 INFO  (TEST-ForceLeaderTest.testReplicasInLIRNoLeader-seed#[83844D2F1CB0B8FD]) [    ] o.a.s.c.ZkContainer Zookeeper client=127.0.0.1:56635/solr
   [junit4]   2> 1889866 INFO  (TEST-ForceLeaderTest.testReplicasInLIRNoLeader-seed#[83844D2F1CB0B8FD]) [    ] o.a.s.c.ZkController zkHost includes chroot
   [junit4]   2> 1889866 INFO  (TEST-ForceLeaderTest.testReplicasInLIRNoLeader-seed#[83844D2F1CB0B8FD]) [    ] o.a.s.c.c.SolrZkClient Using default ZkCredentialsProvider
   [junit4]   2> 1889866 INFO  (TEST-ForceLeaderTest.testReplicasInLIRNoLeader-seed#[83844D2F1CB0B8FD]) [    ] o.a.s.c.c.ConnectionManager Waiting for client to connect to ZooKeeper
   [junit4]   2> 1889868 INFO  (zkCallback-2420-thread-1) [    ] o.a.s.c.c.ConnectionManager Watcher org.apache.solr.common.cloud.ConnectionManager@737bd51 name:ZooKeeperConnection Watcher:127.0.0.1:56635 got event WatchedEvent state:SyncConnected type:None path:null path:null type:None
   [junit4]   2> 1889869 INFO  (TEST-ForceLeaderTest.testReplicasInLIRNoLeader-seed#[83844D2F1CB0B8FD]) [    ] o.a.s.c.c.ConnectionManager Client is connected to ZooKeeper
   [junit4]   2> 1889869 INFO  (TEST-ForceLeaderTest.testReplicasInLIRNoLeader-seed#[83844D2F1CB0B8FD]) [    ] o.a.s.c.c.SolrZkClient Using default ZkACLProvider
   [junit4]   2> 1889870 INFO  (TEST-ForceLeaderTest.testReplicasInLIRNoLeader-seed#[83844D2F1CB0B8FD]) [n:127.0.0.1:49063_    ] o.a.s.c.ZkController Added new OnReconnect listener org.apache.solr.cloud.ZkController$$Lambda$58/1869861537@3de659d2
   [junit4]   2> 1889871 INFO  (TEST-ForceLeaderTest.testReplicasInLIRNoLeader-seed#[83844D2F1CB0B8FD]) [n:127.0.0.1:49063_    ] o.a.s.c.c.ConnectionManager Waiting for client to connect to ZooKeeper
   [junit4]   2> 1889872 INFO  (zkCallback-2421-thread-1-processing-n:127.0.0.1:49063_) [n:127.0.0.1:49063_    ] o.a.s.c.c.ConnectionManager Watcher org.apache.solr.common.cloud.ConnectionManager@363d7c10 name:ZooKeeperConnection Watcher:127.0.0.1:56635/solr got event WatchedEvent state:SyncConnected type:None path:null path:null type:None
   [junit4]   2> 1889872 INFO  (TEST-ForceLeaderTest.testReplicasInLIRNoLeader-seed#[83844D2F1CB0B8FD]) [n:127.0.0.1:49063_    ] o.a.s.c.c.ConnectionManager Client is connected to ZooKeeper
   [junit4]   2> 1889873 INFO  (TEST-ForceLeaderTest.testReplicasInLIRNoLeader-seed#[83844D2F1CB0B8FD]) [n:127.0.0.1:49063_    ] o.a.s.c.c.SolrZkClient makePath: /overseer/queue
   [junit4]   2> 1889875 INFO  (TEST-ForceLeaderTest.testReplicasInLIRNoLeader-seed#[83844D2F1CB0B8FD]) [n:127.0.0.1:49063_    ] o.a.s.c.c.SolrZkClient makePath: /overseer/collection-queue-work
   [junit4]   2> 1889877 INFO  (TEST-ForceLeaderTest.testReplicasInLIRNoLeader-seed#[83844D2F1CB0B8FD]) [n:127.0.0.1:49063_    ] o.a.s.c.c.SolrZkClient makePath: /overseer/collection-map-running
   [junit4]   2> 1889879 INFO  (TEST-ForceLeaderTest.testReplicasInLIRNoLeader-seed#[83844D2F1CB0B8FD]) [n:127.0.0.1:49063_    ] o.a.s.c.c.SolrZkClient makePath: /overseer/collection-map-completed
   [junit4]   2> 1889881 INFO  (TEST-ForceLeaderTest.testReplicasInLIRNoLeader-seed#[83844D2F1CB0B8FD]) [n:127.0.0.1:49063_    ] o.a.s.c.c.SolrZkClient makePath: /overseer/collection-map-failure
   [junit4]   2> 1889882 INFO  (TEST-ForceLeaderTest.testReplicasInLIRNoLeader-seed#[83844D2F1CB0B8FD]) [n:127.0.0.1:49063_    ] o.a.s.c.c.SolrZkClient makePath: /live_nodes
   [junit4]   2> 1889885 INFO  (TEST-ForceLeaderTest.testReplicasInLIRNoLeader-seed#[83844D2F1CB0B8FD]) [n:127.0.0.1:49063_    ] o.a.s.c.c.SolrZkClient makePath: /aliases.json
   [junit4]   2> 1889886 INFO  (TEST-ForceLeaderTest.testReplicasInLIRNoLeader-seed#[83844D2F1CB0B8FD]) [n:127.0.0.1:49063_    ] o.a.s.c.c.SolrZkClient makePath: /clusterstate.json
   [junit4]   2> 1889888 INFO  (TEST-ForceLeaderTest.testReplicasInLIRNoLeader-seed#[83844D2F1CB0B8FD]) [n:127.0.0.1:49063_    ] o.a.s.c.c.SolrZkClient makePath: /security.json
   [junit4]   2> 1889888 INFO  (TEST-ForceLeaderTest.testReplicasInLIRNoLeader-seed#[83844D2F1CB0B8FD]) [n:127.0.0.1:49063_    ] o.a.s.c.c.ZkStateReader Updating cluster state from ZooKeeper... 
   [junit4]   2> 1889889 INFO  (TEST-ForceLeaderTest.testReplicasInLIRNoLeader-seed#[83844D2F1CB0B8FD]) [n:127.0.0.1:49063_    ] o.a.s.c.c.ZkStateReader Loaded empty cluster properties
   [junit4]   2> 1889890 INFO  (TEST-ForceLeaderTest.testReplicasInLIRNoLeader-seed#[83844D2F1CB0B8FD]) [n:127.0.0.1:49063_    ] o.a.s.c.c.ZkStateReader Updated live nodes from ZooKeeper... (0) -> (0)
   [junit4]   2> 1889893 INFO  (TEST-ForceLeaderTest.testReplicasInLIRNoLeader-seed#[83844D2F1CB0B8FD]) [n:127.0.0.1:49063_    ] o.a.s.c.c.SolrZkClient makePath: /overseer_elect
   [junit4]   2> 1889895 INFO  (TEST-ForceLeaderTest.testReplicasInLIRNoLeader-seed#[83844D2F1CB0B8FD]) [n:127.0.0.1:49063_    ] o.a.s.c.c.SolrZkClient makePath: /overseer_elect/election
   [junit4]   2> 1889897 INFO  (TEST-ForceLeaderTest.testReplicasInLIRNoLeader-seed#[83844D2F1CB0B8FD]) [n:127.0.0.1:49063_    ] o.a.s.c.Overseer Overseer (id=null) closing
   [junit4]   2> 1889897 INFO  (TEST-ForceLeaderTest.testReplicasInLIRNoLeader-seed#[83844D2F1CB0B8FD]) [n:127.0.0.1:49063_    ] o.a.s.c.LeaderElector Joined leadership election with path: /overseer_elect/election/96575653958975492-127.0.0.1:49063_-n_0000000000
   [junit4]   2> 1889898 INFO  (TEST-ForceLeaderTest.testReplicasInLIRNoLeader-seed#[83844D2F1CB0B8FD]) [n:127.0.0.1:49063_    ] o.a.s.c.OverseerElectionContext I am going to be the leader 127.0.0.1:49063_
   [junit4]   2> 1889898 INFO  (TEST-ForceLeaderTest.testReplicasInLIRNoLeader-seed#[83844D2F1CB0B8FD]) [n:127.0.0.1:49063_    ] o.a.s.c.c.SolrZkClient makePath: /overseer_elect/leader
   [junit4]   2> 1889899 INFO  (TEST-ForceLeaderTest.testReplicasInLIRNoLeader-seed#[83844D2F1CB0B8FD]) [n:127.0.0.1:49063_    ] o.a.s.c.Overseer Overseer (id=96575653958975492-127.0.0.1:49063_-n_0000000000) starting
   [junit4]   2> 1889902 INFO  (TEST-ForceLeaderTest.testReplicasInLIRNoLeader-seed#[83844D2F1CB0B8FD]) [n:127.0.0.1:49063_    ] o.a.s.c.c.SolrZkClient makePath: /overseer/queue-work
   [junit4]   2> 1889911 INFO  (TEST-ForceLeaderTest.testReplicasInLIRNoLeader-seed#[83844D2F1CB0B8FD]) [n:127.0.0.1:49063_    ] o.a.s.c.OverseerAutoReplicaFailoverThread Starting OverseerAutoReplicaFailoverThread autoReplicaFailoverWorkLoopDelay=10000 autoReplicaFailoverWaitAfterExpiration=10000 autoReplicaFailoverBadNodeExpiration=60000
   [junit4]   2> 1889912 INFO  (OverseerCollectionConfigSetProcessor-96575653958975492-127.0.0.1:49063_-n_0000000000) [n:127.0.0.1:49063_    ] o.a.s.c.OverseerTaskProcessor Process current queue of overseer operations
   [junit4]   2> 1889912 INFO  (TEST-ForceLeaderTest.testReplicasInLIRNoLeader-seed#[83844D2F1CB0B8FD]) [n:127.0.0.1:49063_    ] o.a.s.c.ZkController Register node as live in ZooKeeper:/live_nodes/127.0.0.1:49063_
   [junit4]   2> 1889913 INFO  (TEST-ForceLeaderTest.testReplicasInLIRNoLeader-seed#[83844D2F1CB0B8FD]) [n:127.0.0.1:49063_    ] o.a.s.c.c.SolrZkClient makePath: /live_nodes/127.0.0.1:49063_
   [junit4]   2> 1889913 INFO  (OverseerStateUpdate-96575653958975492-127.0.0.1:49063_-n_0000000000) [n:127.0.0.1:49063_    ] o.a.s.c.Overseer Starting to work on the main queue
   [junit4]   2> 1889915 INFO  (zkCallback-2421-thread-1-processing-n:127.0.0.1:49063_) [n:127.0.0.1:49063_    ] o.a.s.c.c.ZkStateReader A live node change: [WatchedEvent state:SyncConnected type:NodeChildrenChanged path:/live_nodes], has occurred - updating... (live nodes size: [0])
   [junit4]   2> 1889915 INFO  (OverseerStateUpdate-96575653958975492-127.0.0.1:49063_-n_0000000000) [n:127.0.0.1:49063_    ] o.a.s.c.c.ZkStateReader Updated live nodes from ZooKeeper... (0) -> (1)
   [junit4]   2> 1889916 INFO  (zkCallback-2421-thread-1-processing-n:127.0.0.1:49063_) [n:127.0.0.1:49063_    ] o.a.s.c.c.ZkStateReader Updated live nodes from ZooKeeper... (1) -> (1)
   [junit4]   2> 1889940 INFO  (TEST-ForceLeaderTest.testReplicasInLIRNoLeader-seed#[83844D2F1CB0B8FD]) [n:127.0.0.1:49063_    ] o.a.s.c.CoreContainer Security conf doesn't exist. Skipping setup for authorization module.
   [junit4]   2> 1889940 INFO  (TEST-ForceLeaderTest.testReplicasInLIRNoLeader-seed#[83844D2F1CB0B8FD]) [n:127.0.0.1:49063_    ] o.a.s.c.CoreContainer No authentication plugin used.
   [junit4]   2> 1889941 INFO  (TEST-ForceLeaderTest.testReplicasInLIRNoLeader-seed#[83844D2F1CB0B8FD]) [n:127.0.0.1:49063_    ] o.a.s.c.CorePropertiesLocator Looking for core definitions underneath /export/home/jenkins/workspace/Lucene-Solr-master-Solaris/solr/build/solr-core/test/J0/temp/solr.cloud.ForceLeaderTest_83844D2F1CB0B8FD-001/control-001/cores
   [junit4]   2> 1889942 INFO  (TEST-ForceLeaderTest.testReplicasInLIRNoLeader-seed#[83844D2F1CB0B8FD]) [n:127.0.0.1:49063_    ] o.a.s.c.CoreDescriptor Created CoreDescriptor: {name=collection1, config=solrconfig.xml, transient=false, schema=schema.xml, loadOnStartup=true, configSetProperties=configsetprops.json, collection=control_collection, coreNodeName=, dataDir=data/, shard=}
   [junit4]   2> 1889942 INFO  (TEST-ForceLeaderTest.testReplicasInLIRNoLeader-seed#[83844D2F1CB0B8FD]) [n:127.0.0.1:49063_    ] o.a.s.c.CorePropertiesLocator Found core collection1 in /export/home/jenkins/workspace/Lucene-Solr-master-Solaris/solr/build/solr-core/test/J0/temp/solr.cloud.ForceLeaderTest_83844D2F1CB0B8FD-001/control-001/cores/collection1
   [junit4]   2> 1889942 INFO  (TEST-ForceLeaderTest.testReplicasInLIRNoLeader-seed#[83844D2F1CB0B8FD]) [n:127.0.0.1:49063_    ] o.a.s.c.CorePropertiesLocator Found 1 core definitions
   [junit4]   2> 1889943 INFO  (TEST-ForceLeaderTest.testReplicasInLIRNoLeader-seed#[83844D2F1CB0B8FD]) [n:127.0.0.1:49063_    ] o.a.s.s.SolrDispatchFilter user.dir=/export/home/jenkins/workspace/Lucene-Solr-master-Solaris/solr/build/solr-core/test/J0
   [junit4]   2> 1889943 INFO  (TEST-ForceLeaderTest.testReplicasInLIRNoLeader-seed#[83844D2F1CB0B8FD]) [n:127.0.0.1:49063_    ] o.a.s.s.SolrDispatchFilter SolrDispatchFilter.init() done
   [junit4]   2> 1889944 INFO  (coreLoadExecutor-6358-thread-1-processing-n:127.0.0.1:49063_) [n:127.0.0.1:49063_ c:control_collection   x:collection1] o.a.s.c.ZkController publishing state=down
   [junit4]   2> 1889944 INFO  (coreLoadExecutor-6358-thread-1-processing-n:127.0.0.1:49063_) [n:127.0.0.1:49063_ c:control_collection   x:collection1] o.a.s.c.ZkController numShards not found on descriptor - reading it from system property
   [junit4]   2> 1889946 INFO  (coreLoadExecutor-6358-thread-1-processing-n:127.0.0.1:49063_) [n:127.0.0.1:49063_ c:control_collection   x:collection1] o.a.s.c.ZkController Collection control_collection not visible yet, but flagging it so a watch is registered when it becomes visible
   [junit4]   2> 1889947 INFO  (OverseerStateUpdate-96575653958975492-127.0.0.1:49063_-n_0000000000) [n:127.0.0.1:49063_    ] o.a.s.c.Overseer processMessage: queueSize: 1, message = {
   [junit4]   2>   "core":"collection1",
   [junit4]   2>   "roles":null,
   [junit4]   2>   "base_url":"http://127.0.0.1:49063",
   [junit4]   2>   "node_name":"127.0.0.1:49063_",
   [junit4]   2>   "numShards":"1",
   [junit4]   2>   "state":"down",
   [junit4]   2>   "shard":null,
   [junit4]   2>   "collection":"control_collection",
   [junit4]   2>   "operation":"state"} current state version: 0
   [junit4]   2> 1889947 INFO  (OverseerStateUpdate-96575653958975492-127.0.0.1:49063_-n_0000000000) [n:127.0.0.1:49063_    ] o.a.s.c.o.ReplicaMutator Update state numShards=1 message={
   [junit4]   2>   "core":"collection1",
   [junit4]   2>   "roles":null,
   [junit4]   2>   "base_url":"http://127.0.0.1:49063",
   [junit4]   2>   "node_name":"127.0.0.1:49063_",
   [junit4]   2>   "numShards":"1",
   [junit4]   2>   "state":"down",
   [junit4]   2>   "shard":null,
   [junit4]   2>   "collection":"control_collection",
   [junit4]   2>   "operation":"state"}
   [junit4]   2> 1889947 INFO  (coreLoadExecutor-6358-thread-1-processing-n:127.0.0.1:49063_) [n:127.0.0.1:49063_ c:control_collection   x:collection1] o.a.s.c.c.ZkStateReader Deleting data for [control_collection]
   [junit4]   2> 1889948 INFO  (OverseerStateUpdate-96575653958975492-127.0.0.1:49063_-n_0000000000) [n:127.0.0.1:49063_    ] o.a.s.c.o.ClusterStateMutator building a new cName: control_collection
   [junit4]   2> 1889948 INFO  (OverseerStateUpdate-96575653958975492-127.0.0.1:49063_-n_0000000000) [n:127.0.0.1:49063_    ] o.a.s.c.o.ReplicaMutator Assigning new node to shard shard=shard1
   [junit4]   2> 1889949 INFO  (coreLoadExecutor-6358-thread-1-processing-n:127.0.0.1:49063_) [n:127.0.0.1:49063_ c:control_collection   x:collection1] o.a.s.c.ZkController look for our core node name
   [junit4]   2> 1889950 INFO  (zkCallback-2421-thread-1-processing-n:127.0.0.1:49063_) [n:127.0.0.1:49063_    ] o.a.s.c.c.ZkStateReader A cluster state change: [WatchedEvent state:SyncConnected type:NodeDataChanged path:/clusterstate.json], has occurred - updating... (live nodes size: [1])
   [junit4]   2> 1890951 INFO  (coreLoadExecutor-6358-thread-1-processing-n:127.0.0.1:49063_) [n:127.0.0.1:49063_ c:control_collection   x:collection1] o.a.s.c.ZkController waiting to find shard id in clusterstate for collection1
   [junit4]   2> 1890951 INFO  (coreLoadExecutor-6358-thread-1-processing-n:127.0.0.1:49063_) [n:127.0.0.1:49063_ c:control_collection   x:collection1] o.a.s.c.ZkController Check for collection zkNode:control_collection
   [junit4]   2> 1890951 INFO  (coreLoadExecutor-6358-thread-1-processing-n:127.0.0.1:49063_) [n:127.0.0.1:49063_ c:control_collection   x:collection1] o.a.s.c.ZkController Collection zkNode exists
   [junit4]   2> 1890952 INFO  (coreLoadExecutor-6358-thread-1-processing-n:127.0.0.1:49063_) [n:127.0.0.1:49063_ c:control_collection   x:collection1] o.a.s.c.c.ZkStateReader Load collection config from: [/collections/control_collection]
   [junit4]   2> 1890953 INFO  (coreLoadExecutor-6358-thread-1-processing-n:127.0.0.1:49063_) [n:127.0.0.1:49063_ c:control_collection   x:collection1] o.a.s.c.c.ZkStateReader path=[/collections/control_collection] [configName]=[conf1] specified config exists in ZooKeeper
   [junit4]   2> 1890953 INFO  (coreLoadExecutor-6358-thread-1-processing-n:127.0.0.1:49063_) [n:127.0.0.1:49063_ c:control_collection   x:collection1] o.a.s.c.SolrResourceLoader new SolrResourceLoader for directory: '/export/home/jenkins/workspace/Lucene-Solr-master-Solaris/solr/build/solr-core/test/J0/temp/solr.cloud.ForceLeaderTest_83844D2F1CB0B8FD-001/control-001/cores/collection1'
   [junit4]   2> 1890953 INFO  (coreLoadExecutor-6358-thread-1-processing-n:127.0.0.1:49063_) [n:127.0.0.1:49063_ c:control_collection   x:collection1] o.a.s.c.SolrResourceLoader JNDI not configured for solr (NoInitialContextEx)
   [junit4]   2> 1890953 INFO  (coreLoadExecutor-6358-thread-1-processing-n:127.0.0.1:49063_) [n:127.0.0.1:49063_ c:control_collection   x:collection1] o.a.s.c.SolrResourceLoader solr home defaulted to 'solr/' (could not find system property or JNDI)
   [junit4]   2> 1890956 INFO  (coreLoadExecutor-6358-thread-1-processing-n:127.0.0.1:49063_) [n:127.0.0.1:49063_ c:control_collection   x:collection1] o.a.s.c.Config loaded config solrconfig.xml with version 0 
   [junit4]   2> 1890966 INFO  (coreLoadExecutor-6358-thread-1-processing-n:127.0.0.1:49063_) [n:127.0.0.1:49063_ c:control_collection   x:collection1] o.a.s.c.SolrConfig current version of requestparams : -1
   [junit4]   2> 1890970 INFO  (coreLoadExecutor-6358-thread-1-processing-n:127.0.0.1:49063_) [n:127.0.0.1:49063_ c:control_collection   x:collection1] o.a.s.c.SolrConfig Using Lucene MatchVersion: 7.0.0
   [junit4]   2> 1890980 INFO  (coreLoadExecutor-6358-thread-1-processing-n:127.0.0.1:49063_) [n:127.0.0.1:49063_ c:control_collection   x:collection1] o.a.s.c.SolrConfig Loaded SolrConfig: solrconfig.xml
   [junit4]   2> 1890987 INFO  (coreLoadExecutor-6358-thread-1-processing-n:127.0.0.1:49063_) [n:127.0.0.1:49063_ c:control_collection   x:collection1] o.a.s.s.IndexSchema [collection1] Schema name=test
   [junit4]   2> 1891097 INFO  (coreLoadExecutor-6358-thread-1-processing-n:127.0.0.1:49063_) [n:127.0.0.1:49063_ c:control_collection   x:collection1] o.a.s.s.OpenExchangeRatesOrgProvider Initialized with rates=open-exchange-rates.json, refreshInterval=1440.
   [junit4]   2> 1891106 INFO  (coreLoadExecutor-6358-thread-1-processing-n:127.0.0.1:49063_) [n:127.0.0.1:49063_ c:control_collection   x:collection1] o.a.s.s.IndexSchema default search field in schema is text
   [junit4]   2> 1891107 INFO  (coreLoadExecutor-6358-thread-1-processing-n:127.0.0.1:49063_) [n:127.0.0.1:49063_ c:control_collection   x:collection1] o.a.s.s.IndexSchema unique key field: id
   [junit4]   2> 1891120 INFO  (coreLoadExecutor-6358-thread-1-processing-n:127.0.0.1:49063_) [n:127.0.0.1:49063_ c:control_collection   x:collection1] o.a.s.s.FileExchangeRateProvider Reloading exchange rates from file currency.xml
   [junit4]   2> 1891124 INFO  (coreLoadExecutor-6358-thread-1-processing-n:127.0.0.1:49063_) [n:127.0.0.1:49063_ c:control_collection   x:collection1] o.a.s.s.FileExchangeRateProvider Reloading exchange rates from file currency.xml
   [junit4]   2> 1891126 INFO  (coreLoadExecutor-6358-thread-1-processing-n:127.0.0.1:49063_) [n:127.0.0.1:49063_ c:control_collection   x:collection1] o.a.s.s.OpenExchangeRatesOrgProvider Reloading exchange rates from open-exchange-rates.json
   [junit4]   2> 1891127 INFO  (coreLoadExecutor-6358-thread-1-processing-n:127.0.0.1:49063_) [n:127.0.0.1:49063_ c:control_collection   x:collection1] o.a.s.s.OpenExchangeRatesOrgProvider Reloading exchange rates from open-exchange-rates.json
   [junit4]   2> 1891129 INFO  (coreLoadExecutor-6358-thread-1-processing-n:127.0.0.1:49063_) [n:127.0.0.1:49063_ c:control_collection   x:collection1] o.a.s.c.ConfigSetProperties Did not find ConfigSet properties, assuming default properties: Can't find resource 'configsetprops.json' in classpath or '/configs/conf1', cwd=/export/home/jenkins/workspace/Lucene-Solr-master-Solaris/solr/build/solr-core/test/J0
   [junit4]   2> 1891129 INFO  (coreLoadExecutor-6358-thread-1-processing-n:127.0.0.1:49063_) [n:127.0.0.1:49063_ c:control_collection   x:collection1] o.a.s.c.CoreContainer Creating SolrCore 'collection1' using configuration from collection control_collection
   [junit4]   2> 1891130 INFO  (coreLoadExecutor-6358-thread-1-processing-n:127.0.0.1:49063_) [n:127.0.0.1:49063_ c:control_collection s:shard1 r:core_node1 x:collection1] o.a.s.c.SolrCore org.apache.solr.core.MockDirectoryFactory
   [junit4]   2> 1891130 INFO  (coreLoadExecutor-6358-thread-1-processing-n:127.0.0.1:49063_) [n:127.0.0.1:49063_ c:control_collection s:shard1 r:core_node1 x:collection1] o.a.s.c.SolrCore [[collection1] ] Opening new SolrCore at [/export/home/jenkins/workspace/Lucene-Solr-master-Solaris/solr/build/solr-core/test/J0/temp/solr.cloud.ForceLeaderTest_83844D2F1CB0B8FD-001/control-001/cores/collection1], dataDir=[/export/home/jenkins/workspace/Lucene-Solr-master-Solaris/solr/build/solr-core/test/J0/temp/solr.cloud.ForceLeaderTest_83844D2F1CB0B8FD-001/control-001/cores/collection1/data/]
   [junit4]   2> 1891130 INFO  (coreLoadExecutor-6358-thread-1-processing-n:127.0.0.1:49063_) [n:127.0.0.1:49063_ c:control_collection s:shard1 r:core_node1 x:collection1] o.a.s.c.JmxMonitoredMap JMX monitoring is enabled. Adding Solr mbeans to JMX Server: com.sun.jmx.mbeanserver.JmxMBeanServer@2683d204
   [junit4]   2> 1891130 INFO  (coreLoadExecutor-6358-thread-1-processing-n:127.0.0.1:49063_) [n:127.0.0.1:49063_ c:control_collection s:shard1 r:core_node1 x:collection1] o.a.s.c.CachingDirectoryFactory return new directory for /export/home/jenkins/workspace/Lucene-Solr-master-Solaris/solr/build/solr-core/test/J0/temp/solr.cloud.ForceLeaderTest_83844D2F1CB0B8FD-001/control-001/cores/collection1/data/snapshot_metadata
   [junit4]   2> 1891130 INFO  (coreLoadExecutor-6358-thread-1-processing-n:127.0.0.1:49063_) [n:127.0.0.1:49063_ c:control_collection s:shard1 r:core_node1 x:collection1] o.a.s.c.s.SolrSnapshotMetaDataManager Loading from snapshot metadata file...
   [junit4]   2> 1891130 INFO  (coreLoadExecutor-6358-thread-1-processing-n:127.0.0.1:49063_) [n:127.0.0.1:49063_ c:control_collection s:shard1 r:core_node1 x:collection1] o.a.s.c.CachingDirectoryFactory return new directory for /export/home/jenkins/workspace/Lucene-Solr-master-Solaris/solr/build/solr-core/test/J0/temp/solr.cloud.ForceLeaderTest_83844D2F1CB0B8FD-001/control-001/cores/collection1/data
   [junit4]   2> 1891131 INFO  (coreLoadExecutor-6358-thread-1-processing-n:127.0.0.1:49063_) [n:127.0.0.1:49063_ c:control_collection s:shard1 r:core_node1 x:collection1] o.a.s.c.SolrCore New index directory detected: old=null new=/export/home/jenkins/workspace/Lucene-Solr-master-Solaris/solr/build/solr-core/test/J0/temp/solr.cloud.ForceLeaderTest_83844D2F1CB0B8FD-001/control-001/cores/collection1/data/index/
   [junit4]   2> 1891131 WARN  (coreLoadExecutor-6358-thread-1-processing-n:127.0.0.1:49063_) [n:127.0.0.1:49063_ c:control_collection s:shard1 r:core_node1 x:collection1] o.a.s.c.SolrCore [collection1] Solr index directory '/export/home/jenkins/workspace/Lucene-Solr-master-Solaris/solr/build/solr-core/test/J0/temp/solr.cloud.ForceLeaderTest_83844D2F1CB0B8FD-001/control-001/cores/collection1/data/index' doesn't exist. Creating new index...
   [junit4]   2> 1891131 INFO  (coreLoadExecutor-6358-thread-1-processing-n:127.0.0.1:49063_) [n:127.0.0.1:49063_ c:control_collection s:shard1 r:core_node1 x:collection1] o.a.s.c.CachingDirectoryFactory return new directory for /export/home/jenkins/workspace/Lucene-Solr-master-Solaris/solr/build/solr-core/test/J0/temp/solr.cloud.ForceLeaderTest_83844D2F1CB0B8FD-001/control-001/cores/collection1/data/index
   [junit4]   2> 1891131 INFO  (coreLoadExecutor-6358-thread-1-processing-n:127.0.0.1:49063_) [n:127.0.0.1:49063_ c:control_collection s:shard1 r:core_node1 x:collection1] o.a.s.u.RandomMergePolicy RandomMergePolicy wrapping class org.apache.lucene.index.AlcoholicMergePolicy: [AlcoholicMergePolicy: minMergeSize=0, mergeFactor=10, maxMergeSize=883753955, maxMergeSizeForForcedMerge=9223372036854775807, calibrateSizeByDeletes=true, maxMergeDocs=2147483647, maxCFSSegmentSizeMB=8.796093022207999E12, noCFSRatio=0.1]
   [junit4]   2> 1891131 INFO  (coreLoadExecutor-6358-thread-1-processing-n:127.0.0.1:49063_) [n:127.0.0.1:49063_ c:control_collection s:shard1 r:core_node1 x:collection1] o.a.s.c.SolrDeletionPolicy SolrDeletionPolicy.onCommit: commits: num=1
   [junit4]   2> 	commit{dir=MockDirectoryWrapper(RAMDirectory@114e6df9 lockFactory=org.apache.lucene.store.SingleInstanceLockFactory@7524ed21),segFN=segments_1,generation=1}
   [junit4]   2> 1891131 INFO  (coreLoadExecutor-6358-thread-1-processing-n:127.0.0.1:49063_) [n:127.0.0.1:49063_ c:control_collection s:shard1 r:core_node1 x:collection1] o.a.s.c.SolrDeletionPolicy newest commit generation = 1
   [junit4]   2> 1891132 INFO  (OldIndexDirectoryCleanupThreadForCore-collection1) [n:127.0.0.1:49063_ c:control_collection s:shard1 r:core_node1 x:collection1] o.a.s.c.SolrCore Looking for old index directories to cleanup for core collection1 in /export/home/jenkins/workspace/Lucene-Solr-master-Solaris/solr/build/solr-core/test/J0/temp/solr.cloud.ForceLeaderTest_83844D2F1CB0B8FD-001/control-001/cores/collection1/data/
   [junit4]   2> 1891132 WARN  (OldIndexDirectoryCleanupThreadForCore-collection1) [n:127.0.0.1:49063_ c:control_collection s:shard1 r:core_node1 x:collection1] o.a.s.c.DirectoryFactory /export/home/jenkins/workspace/Lucene-Solr-master-Solaris/solr/build/solr-core/test/J0/temp/solr.cloud.ForceLeaderTest_83844D2F1CB0B8FD-001/control-001/cores/collection1/data/ does not point to a valid data directory; skipping clean-up of old index directories.
   [junit4]   2> 1891134 INFO  (coreLoadExecutor-6358-thread-1-processing-n:127.0.0.1:49063_) [n:127.0.0.1:49063_ c:control_collection s:shard1 r:core_node1 x:collection1] o.a.s.u.p.UpdateRequestProcessorChain creating updateRequestProcessorChain "nodistrib"
   [junit4]   2> 1891134 INFO  (coreLoadExecutor-6358-thread-1-processing-n:127.0.0.1:49063_) [n:127.0.0.1:49063_ c:control_collection s:shard1 r:core_node1 x:collection1] o.a.s.u.p.UpdateRequestProcessorChain creating updateRequestProcessorChain "dedupe"
   [junit4]   2> 1891135 INFO  (coreLoadExecutor-6358-thread-1-processing-n:127.0.0.1:49063_) [n:127.0.0.1:49063_ c:control_collection s:shard1 r:core_node1 x:collection1] o.a.s.u.p.UpdateRequestProcessorChain inserting DistributedUpdateProcessorFactory into updateRequestProcessorChain "dedupe"
   [junit4]   2> 1891135 INFO  (coreLoadExecutor-6358-thread-1-processing-n:127.0.0.1:49063_) [n:127.0.0.1:49063_ c:control_collection s:shard1 r:core_node1 x:collection1] o.a.s.u.p.UpdateRequestProcessorChain creating updateRequestProcessorChain "stored_sig"
   [junit4]   2> 1891135 INFO  (coreLoadExecutor-6358-thread-1-processing-n:127.0.0.1:49063_) [n:127.0.0.1:49063_ c:control_collection s:shard1 r:core_node1 x:collection1] o.a.s.u.p.UpdateRequestProcessorChain inserting DistributedUpdateProcessorFactory into updateRequestProcessorChain "stored_sig"
   [junit4]   2> 1891135 INFO  (coreLoadExecutor-6358-thread-1-processing-n:127.0.0.1:49063_) [n:127.0.0.1:49063_ c:control_collection s:shard1 r:core_node1 x:collection1] o.a.s.u.p.UpdateRequestProcessorChain creating updateRequestProcessorChain "distrib-dup-test-chain-explicit"
   [junit4]   2> 1891135 INFO  (coreLoadExecutor-6358-thread-1-processing-n:127.0.0.1:49063_) [n:127.0.0.1:49063_ c:control_collection s:shard1 r:core_node1 x:collection1] o.a.s.u.p.UpdateRequestProcessorChain creating updateRequestProcessorChain "distrib-dup-test-chain-implicit"
   [junit4]   2> 1891135 INFO  (coreLoadExecutor-6358-thread-1-processing-n:127.0.0.1:49063_) [n:127.0.0.1:49063_ c:control_collection s:shard1 r:core_node1 x:collection1] o.a.s.u.p.UpdateRequestProcessorChain inserting DistributedUpdateProcessorFactory into updateRequestProcessorChain "distrib-dup-test-chain-implicit"
   [junit4]   2> 1891135 INFO  (coreLoadExecutor-6358-thread-1-processing-n:127.0.0.1:49063_) [n:127.0.0.1:49063_ c:control_collection s:shard1 r:core_node1 x:collection1] o.a.s.c.SolrCore no updateRequestProcessorChain defined as default, creating implicit default
   [junit4]   2> 1891135 WARN  (coreLoadExecutor-6358-thread-1-processing-n:127.0.0.1:49063_) [n:127.0.0.1:49063_ c:control_collection s:shard1 r:core_node1 x:collection1] o.a.s.c.RequestHandlers INVALID paramSet a in requestHandler {type = requestHandler,name = /dump,class = DumpRequestHandler,args = {defaults={a=A,b=B}}}
   [junit4]   2> 1891137 INFO  (coreLoadExecutor-6358-thread-1-processing-n:127.0.0.1:49063_) [n:127.0.0.1:49063_ c:control_collection s:shard1 r:core_node1 x:collection1] o.a.s.h.l.XMLLoader xsltCacheLifetimeSeconds=60
   [junit4]   2> 1891138 INFO  (coreLoadExecutor-6358-thread-1-processing-n:127.0.0.1:49063_) [n:127.0.0.1:49063_ c:control_collection s:shard1 r:core_node1 x:collection1] o.a.s.h.l.XMLLoader xsltCacheLifetimeSeconds=60
   [junit4]   2> 1891139 INFO  (coreLoadExecutor-6358-thread-1-processing-n:127.0.0.1:49063_) [n:127.0.0.1:49063_ c:control_collection s:shard1 r:core_node1 x:collection1] o.a.s.h.l.XMLLoader xsltCacheLifetimeSeconds=60
   [junit4]   2> 1891140 INFO  (coreLoadExecutor-6358-thread-1-processing-n:127.0.0.1:49063_) [n:127.0.0.1:49063_ c:control_collection s:shard1 r:core_node1 x:collection1] o.a.s.h.l.XMLLoader xsltCacheLifetimeSeconds=60
   [junit4]   2> 1891143 INFO  (coreLoadExecutor-6358-thread-1-processing-n:127.0.0.1:49063_) [n:127.0.0.1:49063_ c:control_collection s:shard1 r:core_node1 x:collection1] o.a.s.c.RequestHandlers Registered paths: /admin/mbeans,standard,/update/json/docs,/admin/luke,/export,/get,/admin/properties,/update/json,/admin/threads,/dump,/update/csv,/sql,/graph,/admin/segments,/admin/system,/replication,/config,/stream,/schema,/admin/plugins,/admin/logging,/admin/ping,/update,/admin/file,/terms
   [junit4]   2> 1891143 INFO  (coreLoadExecutor-6358-thread-1-processing-n:127.0.0.1:49063_) [n:127.0.0.1:49063_ c:control_collection s:shard1 r:core_node1 x:collection1] o.a.s.c.SolrCore Using default statsCache cache: org.apache.solr.search.stats.LocalStatsCache
   [junit4]   2> 1891144 INFO  (coreLoadExecutor-6358-thread-1-processing-n:127.0.0.1:49063_) [n:127.0.0.1:49063_ c:control_collection s:shard1 r:core_node1 x:collection1] o.a.s.u.UpdateHandler Using UpdateLog implementation: org.apache.solr.update.UpdateLog
   [junit4]   2> 1891144 INFO  (coreLoadExecutor-6358-thread-1-processing-n:127.0.0.1:49063_) [n:127.0.0.1:49063_ c:control_collection s:shard1 r:core_node1 x:collection1] o.a.s.u.UpdateLog Initializing UpdateLog: dataDir= defaultSyncLevel=FLUSH numRecordsToKeep=100 maxNumLogsToKeep=10 numVersionBuckets=65536
   [junit4]   2> 1891145 INFO  (coreLoadExecutor-6358-thread-1-processing-n:127.0.0.1:49063_) [n:127.0.0.1:49063_ c:control_collection s:shard1 r:core_node1 x:collection1] o.a.s.u.CommitTracker Hard AutoCommit: disabled
   [junit4]   2> 1891145 INFO  (coreLoadExecutor-6358-thread-1-processing-n:127.0.0.1:49063_) [n:127.0.0.1:49063_ c:control_collection s:shard1 r:core_node1 x:collection1] o.a.s.u.CommitTracker Soft AutoCommit: disabled
   [junit4]   2> 1891145 INFO  (coreLoadExecutor-6358-thread-1-processing-n:127.0.0.1:49063_) [n:127.0.0.1:49063_ c:control_collection s:shard1 r:core_node1 x:collection1] o.a.s.u.RandomMergePolicy RandomMergePolicy wrapping class org.apache.lucene.index.AlcoholicMergePolicy: [AlcoholicMergePolicy: minMergeSize=0, mergeFactor=10, maxMergeSize=1509160982, maxMergeSizeForForcedMerge=9223372036854775807, calibrateSizeByDeletes=true, maxMergeDocs=2147483647, maxCFSSegmentSizeMB=8.796093022207999E12, noCFSRatio=0.1]
   [junit4]   2> 1891145 INFO  (coreLoadExecutor-6358-thread-1-processing-n:127.0.0.1:49063_) [n:127.0.0.1:49063_ c:control_collection s:shard1 r:core_node1 x:collection1] o.a.s.c.SolrDeletionPolicy SolrDeletionPolicy.onInit: commits: num=1
   [junit4]   2> 	commit{dir=MockDirectoryWrapper(RAMDirectory@114e6df9 lockFactory=org.apache.lucene.store.SingleInstanceLockFactory@7524ed21),segFN=segments_1,generation=1}
   [junit4]   2> 1891146 INFO  (coreLoadExecutor-6358-thread-1-processing-n:127.0.0.1:49063_) [n:127.0.0.1:49063_ c:control_collection s:shard1 r:core_node1 x:collection1] o.a.s.c.SolrDeletionPolicy newest commit generation = 1
   [junit4]   2> 1891146 INFO  (coreLoadExecutor-6358-thread-1-processing-n:127.0.0.1:49063_) [n:127.0.0.1:49063_ c:control_collection s:shard1 r:core_node1 x:collection1] o.a.s.s.SolrIndexSearcher Opening [Searcher@2bb2180a[collection1] main]
   [junit4]   2> 1891146 INFO  (coreLoadExecutor-6358-thread-1-processing-n:127.0.0.1:49063_) [n:127.0.0.1:49063_ c:control_collection s:shard1 r:core_node1 x:collection1] o.a.s.c.c.ZkStateReader Load collection config from: [/collections/control_collection]
   [junit4]   2> 1891155 INFO  (coreLoadExecutor-6358-thread-1-processing-n:127.0.0.1:49063_) [n:127.0.0.1:49063_ c:control_collection s:shard1 r:core_node1 x:collection1] o.a.s.c.c.ZkStateReader path=[/collections/control_collection] [configName]=[conf1] specified config exists in ZooKeeper
   [junit4]   2> 1891155 INFO  (coreLoadExecutor-6358-thread-1-processing-n:127.0.0.1:49063_) [n:127.0.0.1:49063_ c:control_collection s:shard1 r:core_node1 x:collection1] o.a.s.r.ManagedResourceStorage Setting up ZooKeeper-based storage for the RestManager with znodeBase: /configs/conf1
   [junit4]   2> 1891155 INFO  (coreLoadExecutor-6358-thread-1-processing-n:127.0.0.1:49063_) [n:127.0.0.1:49063_ c:control_collection s:shard1 r:core_node1 x:collection1] o.a.s.r.ManagedResourceStorage Configured ZooKeeperStorageIO with znodeBase: /configs/conf1
   [junit4]   2> 1891155 INFO  (coreLoadExecutor-6358-thread-1-processing-n:127.0.0.1:49063_) [n:127.0.0.1:49063_ c:control_collection s:shard1 r:core_node1 x:collection1] o.a.s.r.RestManager Initializing RestManager with initArgs: {}
   [junit4]   2> 1891155 INFO  (coreLoadExecutor-6358-thread-1-processing-n:127.0.0.1:49063_) [n:127.0.0.1:49063_ c:control_collection s:shard1 r:core_node1 x:collection1] o.a.s.r.ManagedResourceStorage Reading _rest_managed.json using ZooKeeperStorageIO:path=/configs/conf1
   [junit4]   2> 1891156 INFO  (coreLoadExecutor-6358-thread-1-processing-n:127.0.0.1:49063_) [n:127.0.0.1:49063_ c:control_collection s:shard1 r:core_node1 x:collection1] o.a.s.r.ManagedResourceStorage No data found for znode /configs/conf1/_rest_managed.json
   [junit4]   2> 1891156 INFO  (coreLoadExecutor-6358-thread-1-processing-n:127.0.0.1:49063_) [n:127.0.0.1:49063_ c:control_collection s:shard1 r:core_node1 x:collection1] o.a.s.r.ManagedResourceStorage Loaded null at path _rest_managed.json using ZooKeeperStorageIO:path=/configs/conf1
   [junit4]   2> 1891156 INFO  (coreLoadExecutor-6358-thread-1-processing-n:127.0.0.1:49063_) [n:127.0.0.1:49063_ c:control_collection s:shard1 r:core_node1 x:collection1] o.a.s.r.RestManager Initializing 0 registered ManagedResources
   [junit4]   2> 1891156 INFO  (coreLoadExecutor-6358-thread-1-processing-n:127.0.0.1:49063_) [n:127.0.0.1:49063_ c:control_collection s:shard1 r:core_node1 x:collection1] o.a.s.h.ReplicationHandler Commits will be reserved for  10000
   [junit4]   2> 1891157 INFO  (searcherExecutor-6359-thread-1-processing-n:127.0.0.1:49063_ x:collection1 s:shard1 c:control_collection r:core_node1) [n:127.0.0.1:49063_ c:control_collection s:shard1 r:core_node1 x:collection1] o.a.s.c.SolrCore [collection1] Registered new searcher Searcher@2bb2180a[collection1] main{ExitableDirectoryReader(UninvertingDirectoryReader())}
   [junit4]   2> 1891157 INFO  (coreLoadExecutor-6358-thread-1-processing-n:127.0.0.1:49063_) [n:127.0.0.1:49063_ c:control_collection s:shard1 r:core_node1 x:collection1] o.a.s.u.UpdateLog Looking up max value of version field to seed version buckets
   [junit4]   2> 1891157 INFO  (coreLoadExecutor-6358-thread-1-processing-n:127.0.0.1:49063_) [n:127.0.0.1:49063_ c:control_collection s:shard1 r:core_node1 x:collection1] o.a.s.u.VersionInfo Refreshing highest value of _version_ for 65536 version buckets from index
   [junit4]   2> 1891157 INFO  (coreLoadExecutor-6358-thread-1-processing-n:127.0.0.1:49063_) [n:127.0.0.1:49063_ c:control_collection s:shard1 r:core_node1 x:collection1] o.a.s.u.VersionInfo No terms found for _version_, cannot seed version bucket highest value from index
   [junit4]   2> 1891157 INFO  (coreLoadExecutor-6358-thread-1-processing-n:127.0.0.1:49063_) [n:127.0.0.1:49063_ c:control_collection s:shard1 r:core_node1 x:collection1] o.a.s.u.UpdateLog Could not find max version in index or recent updates, using new clock 1545210465065369600
   [junit4]   2> 1891161 INFO  (coreLoadExecutor-6358-thread-1-processing-n:127.0.0.1:49063_) [n:127.0.0.1:49063_ c:control_collection s:shard1 r:core_node1 x:collection1] o.a.s.u.UpdateLog Took 3.0ms to seed version buckets with highest version 1545210465065369600
   [junit4]   2> 1891161 INFO  (coreLoadExecutor-6358-thread-1-processing-n:127.0.0.1:49063_) [n:127.0.0.1:49063_ c:control_collection s:shard1 r:core_node1 x:collection1] o.a.s.c.ZkController watch zkdir /configs/conf1
   [junit4]   2> 1891161 INFO  (coreLoadExecutor-6358-thread-1-processing-n:127.0.0.1:49063_) [n:127.0.0.1:49063_ c:control_collection s:shard1 r:core_node1 x:collection1] o.a.s.c.CoreContainer registering core: collection1
   [junit4]   2> 1891162 INFO  (coreZkRegister-6351-thread-1-processing-n:127.0.0.1:49063_ x:collection1 s:shard1 c:control_collection r:core_node1) [n:127.0.0.1:49063_ c:control_collection s:shard1 r:core_node1 x:collection1] o.a.s.c.ZkController Register replica - core:collection1 address:http://127.0.0.1:49063 collection:control_collection shard:shard1
   [junit4]   2> 1891164 INFO  (coreZkRegister-6351-thread-1-processing-n:127.0.0.1:49063_ x:collection1 s:shard1 c:control_collection r:core_node1) [n:127.0.0.1:49063_ c:control_collection s:shard1 r:core_node1 x:collection1] o.a.s.c.c.SolrZkClient makePath: /collections/control_collection/leader_elect/shard1/election
   [junit4]   2> 1891173 INFO  (coreZkRegister-6351-thread-1-processing-n:127.0.0.1:49063_ x:collection1 s:shard1 c:control_collection r:core_node1) [n:127.0.0.1:49063_ c:control_collection s:shard1 r:core_node1 x:collection1] o.a.s.c.LeaderElector Joined leadership election with path: /collections/control_collection/leader_elect/shard1/election/96575653958975492-core_node1-n_0000000000
   [junit4]   2> 1891173 INFO  (coreZkRegister-6351-thread-1-processing-n:127.0.0.1:49063_ x:collection1 s:shard1 c:control_collection r:core_node1) [n:127.0.0.1:49063_ c:control_collection s:shard1 r:core_node1 x:collection1] o.a.s.c.ShardLeaderElectionContext Running the leader process for shard=shard1 and weAreReplacement=false and leaderVoteWait=10000
   [junit4]   2> 1891176 INFO  (coreZkRegister-6351-thread-1-processing-n:127.0.0.1:49063_ x:collection1 s:shard1 c:control_collection r:core_node1) [n:127.0.0.1:49063_ c:control_collection s:shard1 r:core_node1 x:collection1] o.a.s.c.ShardLeaderElectionContext Enough replicas found to continue.
   [junit4]   2> 1891176 INFO  (coreZkRegister-6351-thread-1-processing-n:127.0.0.1:49063_ x:collection1 s:shard1 c:control_collection r:core_node1) [n:127.0.0.1:49063_ c:control_collection s:shard1 r:core_node1 x:collection1] o.a.s.c.ShardLeaderElectionContext I may be the new leader - try and sync
   [junit4]   2> 1891176 INFO  (OverseerStateUpdate-96575653958975492-127.0.0.1:49063_-n_0000000000) [n:127.0.0.1:49063_    ] o.a.s.c.Overseer processMessage: queueSize: 1, message = {
   [junit4]   2>   "operation":"leader",
   [junit4]   2>   "shard":"shard1",
   [junit4]   2>   "collection":"control_collection"} current state version: 1
   [junit4]   2> 1891176 INFO  (coreZkRegister-6351-thread-1-processing-n:127.0.0.1:49063_ x:collection1 s:shard1 c:control_collection r:core_node1) [n:127.0.0.1:49063_ c:control_collection s:shard1 r:core_node1 x:collection1] o.a.s.c.SyncStrategy Sync replicas to http://127.0.0.1:49063/collection1/
   [junit4]   2> 1891177 INFO  (coreZkRegister-6351-thread-1-processing-n:127.0.0.1:49063_ x:collection1 s:shard1 c:control_collection r:core_node1) [n:127.0.0.1:49063_ c:control_collection s:shard1 r:core_node1 x:collection1] o.a.s.c.SyncStrategy Sync Success - now sync replicas to me
   [junit4]   2> 1891177 INFO  (coreZkRegister-6351-thread-1-processing-n:127.0.0.1:49063_ x:collection1 s:shard1 c:control_collection r:core_node1) [n:127.0.0.1:49063_ c:control_collection s:shard1 r:core_node1 x:collection1] o.a.s.c.SyncStrategy http://127.0.0.1:49063/collection1/ has no replicas
   [junit4]   2> 1891178 INFO  (coreZkRegister-6351-thread-1-processing-n:127.0.0.1:49063_ x:collection1 s:shard1 c:control_collection r:core_node1) [n:127.0.0.1:49063_ c:control_collection s:shard1 r:core_node1 x:collection1] o.a.s.c.c.SolrZkClient makePath: /collections/control_collection/leaders/shard1
   [junit4]   2> 1891183 INFO  (coreZkRegister-6351-thread-1-processing-n:127.0.0.1:49063_ x:collection1 s:shard1 c:control_collection r:core_node1) [n:127.0.0.1:49063_ c:control_collection s:shard1 r:core_node1 x:collection1] o.a.s.c.ShardLeaderElectionContextBase Creating leader registration node /collections/control_collection/leaders/shard1/leader after winning as /collections/control_collection/leader_elect/shard1/election/96575653958975492-core_node1-n_0000000000
   [junit4]   2> 1891187 INFO  (coreZkRegister-6351-thread-1-processing-n:127.0.0.1:49063_ x:collection1 s:shard1 c:control_collection r:core_node1) [n:127.0.0.1:49063_ c:control_collection s:shard1 r:core_node1 x:collection1] o.a.s.c.ShardLeaderElectionContext I am the new leader: http://127.0.0.1:49063/collection1/ shard1
   [junit4]   2> 1891188 INFO  (OverseerStateUpdate-96575653958975492-127.0.0.1:49063_-n_0000000000) [n:127.0.0.1:49063_    ] o.a.s.c.Overseer processMessage: queueSize: 1, message = {
   [junit4]   2>   "operation":"leader",
   [junit4]   2>   "shard":"shard1",
   [junit4]   2>   "collection":"control_collection",
   [junit4]   2>   "base_url":"http://127.0.0.1:49063",
   [junit4]   2>   "core":"collection1",
   [junit4]   2>   "state":"active"} current state version: 1
   [junit4]   2> 1891292 INFO  (zkCallback-2421-thread-2-processing-n:127.0.0.1:49063_) [n:127.0.0.1:49063_    ] o.a.s.c.c.ZkStateReader A cluster state change: [WatchedEvent state:SyncConnected type:NodeDataChanged path:/clusterstate.json], has occurred - updating... (live nodes size: [1])
   [junit4]   2> 1891339 INFO  (coreZkRegister-6351-thread-1-processing-n:127.0.0.1:49063_ x:collection1 s:shard1 c:control_collection r:core_node1) [n:127.0.0.1:49063_ c:control_collection s:shard1 r:core_node1 x:collection1] o.a.s.c.ZkController We are http://127.0.0.1:49063/collection1/ and leader is http://127.0.0.1:49063/collection1/
   [junit4]   2> 1891339 INFO  (coreZkRegister-6351-thread-1-processing-n:127.0.0.1:49063_ x:collection1 s:shard1 c:control_collection r:core_node1) [n:127.0.0.1:49063_ c:control_collection s:shard1 r:core_node1 x:collection1] o.a.s.c.ZkController No LogReplay needed for core=collection1 baseURL=http://127.0.0.1:49063
   [junit4]   2> 1891339 INFO  (coreZkRegister-6351-thread-1-processing-n:127.0.0.1:49063_ x:collection1 s:shard1 c:control_collection r:core_node1) [n:127.0.0.1:49063_ c:control_collection s:shard1 r:core_node1 x:collection1] o.a.s.c.ZkController I am the leader, no recovery necessary
   [junit4]   2> 1891339 INFO  (coreZkRegister-6351-thread-1-processing-n:127.0.0.1:49063_ x:collection1 s:shard1 c:control_collection r:core_node1) [n:127.0.0.1:49063_ c:control_collection s:shard1 r:core_node1 x:collection1] o.a.s.c.ZkController publishing state=active
   [junit4]   2> 1891339 INFO  (coreZkRegister-6351-thread-1-processing-n:127.0.0.1:49063_ x:collection1 s:shard1 c:control_collection r:core_node1) [n:127.0.0.1:49063_ c:control_collection s:shard1 r:core_node1 x:collection1] o.a.s.c.ZkController numShards not found on descriptor - reading it from system property
   [junit4]   2> 1891341 INFO  (coreZkRegister-6351-thread-1-processing-n:127.0.0.1:49063_ x:collection1 s:shard1 c:control_collection r:core_node1) [n:127.0.0.1:49063_ c:control_collection s:shard1 r:core_node1 x:collection1] o.a.s.c.c.ZkStateReader Checking legacy cluster state for collection control_collection
   [junit4]   2> 1891342 INFO  (OverseerStateUpdate-96575653958975492-127.0.0.1:49063_-n_0000000000) [n:127.0.0.1:49063_    ] o.a.s.c.Overseer processMessage: queueSize: 1, message = {
   [junit4]   2>   "core":"collection1",
   [junit4]   2>   "core_node_name":"core_node1",
   [junit4]   2>   "roles":null,
   [junit4]   2>   "base_url":"http://127.0.0.1:49063",
   [junit4]   2>   "node_name":"127.0.0.1:49063_",
   [junit4]   2>   "numShards":"1",
   [junit4]   2>   "state":"active",
   [junit4]   2>   "shard":"shard1",
   [junit4]   2>   "collection":"control_collection",
   [junit4]   2>   "operation":"state"} current state version: 2
   [junit4]   2> 1891342 INFO  (OverseerStateUpdate-96575653958975492-127.0.0.1:49063_-n_0000000000) [n:127.0.0.1:49063_    ] o.a.s.c.o.ReplicaMutator Update state numShards=1 message={
   [junit4]   2>   "core":"collection1",
   [junit4]   2>   "core_node_name":"core_node1",
   [junit4]   2>   "roles":null,
   [junit4]   2>   "base_url":"http://127.0.0.1:49063",
   [junit4]   2>   "node_name":"127.0.0.1:49063_",
   [junit4]   2>   "numShards":"1",
   [junit4]   2>   "state":"active",
   [junit4]   2>   "shard":"shard1",
   [junit4]   2>   "collection":"control_collection",
   [junit4]   2>   "operation":"state"}
   [junit4]   2> 1891446 INFO  (zkCallback-2421-thread-2-processing-n:127.0.0.1:49063_) [n:127.0.0.1:49063_    ] o.a.s.c.c.ZkStateReader A cluster state change: [WatchedEvent state:SyncConnected type:NodeDataChanged path:/clusterstate.json], has occurred - updating... (live nodes size: [1])
   [junit4]   2> 1891449 INFO  (TEST-ForceLeaderTest.testReplicasInLIRNoLeader-seed#[83844D2F1CB0B8FD]) [    ] o.a.s.c.c.SolrZkClient Using default ZkCredentialsProvider
   [junit4]   2> 1891449 INFO  (TEST-ForceLeaderTest.testReplicasInLIRNoLeader-seed#[83844D2F1CB0B8FD]) [    ] o.a.s.c.c.ConnectionManager Waiting for client to connect to ZooKeeper
   [junit4]   2> 1891451 INFO  (zkCallback-2425-thread-1) [    ] o.a.s.c.c.ConnectionManager Watcher org.apache.solr.common.cloud.ConnectionManager@276f7822 name:ZooKeeperConnection Watcher:127.0.0.1:56635/solr got event WatchedEvent state:SyncConnected type:None path:null path:null type:None
   [junit4]   2> 1891451 INFO  (TEST-ForceLeaderTest.testReplicasInLIRNoLeader-seed#[83844D2F1CB0B8FD]) [    ] o.a.s.c.c.ConnectionManager Client is connected to ZooKeeper
   [junit4]   2> 1891451 INFO  (TEST-ForceLeaderTest.testReplicasInLIRNoLeader-seed#[83844D2F1CB0B8FD]) [    ] o.a.s.c.c.SolrZkClient Using default ZkACLProvider
   [junit4]   2> 1891451 INFO  (TEST-ForceLeaderTest.testReplicasInLIRNoLeader-seed#[83844D2F1CB0B8FD]) [    ] o.a.s.c.c.ZkStateReader Updating cluster state from ZooKeeper... 
   [junit4]   2> 1891453 INFO  (TEST-ForceLeaderTest.testReplicasInLIRNoLeader-seed#[83844D2F1CB0B8FD]) [    ] o.a.s.c.c.ZkStateReader Loaded empty cluster properties
   [junit4]   2> 1891454 INFO  (TEST-ForceLeaderTest.testReplicasInLIRNoLeader-seed#[83844D2F1CB0B8FD]) [    ] o.a.s.c.c.ZkStateReader Updated live nodes from ZooKeeper... (0) -> (1)
   [junit4]   2> 1891456 INFO  (TEST-ForceLeaderTest.testReplicasInLIRNoLeader-seed#[83844D2F1CB0B8FD]) [    ] o.a.s.c.ChaosMonkey monkey: init - expire sessions:false cause connection loss:false
   [junit4]   2> 1891456 INFO  (TEST-ForceLeaderTest.testReplicasInLIRNoLeader-seed#[83844D2F1CB0B8FD]) [    ] o.a.s.c.AbstractFullDistribZkTestBase Creating collection1 with stateFormat=2
   [junit4]   2> 1891456 INFO  (TEST-ForceLeaderTest.testReplicasInLIRNoLeader-seed#[83844D2F1CB0B8FD]) [    ] o.a.s.c.c.SolrZkClient Using default ZkCredentialsProvider
   [junit4]   2> 1891457 INFO  (TEST-ForceLeaderTest.testReplicasInLIRNoLeader-seed#[83844D2F1CB0B8FD]) [    ] o.a.s.c.c.ConnectionManager Waiting for client to connect to ZooKeeper
   [junit4]   2> 1891459 INFO  (zkCallback-2426-thread-1) [    ] o.a.s.c.c.ConnectionManager Watcher org.apache.solr.common.cloud.ConnectionManager@436d9d87 name:ZooKeeperConnection Watcher:127.0.0.1:56635/solr got event WatchedEvent state:SyncConnected type:None path:null path:null type:None
   [junit4]   2> 1891459 INFO  (TEST-ForceLeaderTest.testReplicasInLIRNoLeader-seed#[83844D2F1CB0B8FD]) [    ] o.a.s.c.c.ConnectionManager Client is connected to ZooKeeper
   [junit4]   2> 1891460 INFO  (TEST-ForceLeaderTest.testReplicasInLIRNoLeader-seed#[83844D2F1CB0B8FD]) [    ] o.a.s.c.c.SolrZkClient Using default ZkACLProvider
   [junit4]   2> 1891464 INFO  (OverseerStateUpdate-96575653958975492-127.0.0.1:49063_-n_0000000000) [n:127.0.0.1:49063_    ] o.a.s.c.Overseer processMessage: queueSize: 1, message = {
   [junit4]   2>   "operation":"create",
   [junit4]   2>   "name":"collection1",
   [junit4]   2>   "numShards":"2",
   [junit4]   2>   "stateFormat":"2"} current state version: 3
   [junit4]   2> 1891464 INFO  (OverseerStateUpdate-96575653958975492-127.0.0.1:49063_-n_0000000000) [n:127.0.0.1:49063_    ] o.a.s.c.o.ClusterStateMutator building a new cName: collection1
   [junit4]   2> 1891568 INFO  (OverseerStateUpdate-96575653958975492-127.0.0.1:49063_-n_0000000000) [n:127.0.0.1:49063_    ] o.a.s.c.o.ZkStateWriter going to create_collection /collections/collection1/state.json
   [junit4]   2> 1891655 INFO  (TEST-ForceLeaderTest.testReplicasInLIRNoLeader-seed#[83844D2F1CB0B8FD]) [    ] o.a.s.SolrTestCaseJ4 Writing core.properties file to /export/home/jenkins/workspace/Lucene-Solr-master-Solaris/solr/build/solr-core/test/J0/temp/solr.cloud.ForceLeaderTest_83844D2F1CB0B8FD-001/shard-1-001/cores/collection1
   [junit4]   2> 1891656 INFO  (TEST-ForceLeaderTest.testReplicasInLIRNoLeader-seed#[83844D2F1CB0B8FD]) [    ] o.a.s.c.AbstractFullDistribZkTestBase create jetty 1 in directory /export/home/jenkins/workspace/Lucene-Solr-master-Solaris/solr/build/solr-core/test/J0/temp/solr.cloud.ForceLeaderTest_83844D2F1CB0B8FD-001/shard-1-001
   [junit4]   2> 1891656 INFO  (TEST-ForceLeaderTest.testReplicasInLIRNoLeader-seed#[83844D2F1CB0B8FD]) [    ] o.e.j.s.Server jetty-9.3.8.v20160314
   [junit4]   2> 1891659 INFO  (TEST-ForceLeaderTest.testReplicasInLIRNoLeader-seed#[83844D2F1CB0B8FD]) [    ] o.e.j.s.h.ContextHandler Started o.e.j.s.ServletContextHandler@3a1604f1{/,null,AVAILABLE}
   [junit4]   2> 1891659 INFO  (TEST-ForceLeaderTest.testReplicasInLIRNoLeader-seed#[83844D2F1CB0B8FD]) [    ] o.e.j.s.ServerConnector Started ServerConnector@2d60eb4e{HTTP/1.1,[http/1.1]}{127.0.0.1:56726}
   [junit4]   2> 1891659 INFO  (TEST-ForceLeaderTest.testReplicasInLIRNoLeader-seed#[83844D2F1CB0B8FD]) [    ] o.e.j.s.Server Started @1894756ms
   [junit4]   2> 1891659 INFO  (TEST-ForceLeaderTest.testReplicasInLIRNoLeader-seed#[83844D2F1CB0B8FD]) [    ] o.a.s.c.s.e.JettySolrRunner Jetty properties: {solr.data.dir=/export/home/jenkins/workspace/Lucene-Solr-master-Solaris/solr/build/solr-core/test/J0/temp/solr.cloud.ForceLeaderTest_83844D2F1CB0B8FD-001/tempDir-001/jetty1, solrconfig=solrconfig.xml, hostContext=/, hostPort=33774, coreRootDirectory=/export/home/jenkins/workspace/Lucene-Solr-master-Solaris/solr/build/solr-core/test/J0/temp/solr.cloud.ForceLeaderTest_83844D2F1CB0B8FD-001/shard-1-001/cores}
   [junit4]   2> 1891659 INFO  (TEST-ForceLeaderTest.testReplicasInLIRNoLeader-seed#[83844D2F1CB0B8FD]) [    ] o.a.s.s.SolrDispatchFilter SolrDispatchFilter.init(): sun.misc.Launcher$AppClassLoader@6d06d69c
   [junit4]   2> 1891660 INFO  (TEST-ForceLeaderTest.testReplicasInLIRNoLeader-seed#[83844D2F1CB0B8FD]) [    ] o.a.s.c.SolrResourceLoader new SolrResourceLoader for directory: '/export/home/jenkins/workspace/Lucene-Solr-master-Solaris/solr/build/solr-core/test/J0/temp/solr.cloud.ForceLeaderTest_83844D2F1CB0B8FD-001/shard-1-001'
   [junit4]   2> 1891660 INFO  (TEST-ForceLeaderTest.testReplicasInLIRNoLeader-seed#[83844D2F1CB0B8FD]) [    ] o.a.s.c.SolrResourceLoader JNDI not configured for solr (NoInitialContextEx)
   [junit4]   2> 1891660 INFO  (TEST-ForceLeaderTest.testReplicasInLIRNoLeader-seed#[83844D2F1CB0B8FD]) [    ] o.a.s.c.SolrResourceLoader solr home defaulted to 'solr/' (could not find system property or JNDI)
   [junit4]   2> 1891660 INFO  (TEST-ForceLeaderTest.testReplicasInLIRNoLeader-seed#[83844D2F1CB0B8FD]) [    ] o.a.s.c.c.SolrZkClient Using default ZkCredentialsProvider
   [junit4]   2> 1891661 INFO  (TEST-ForceLeaderTest.testReplicasInLIRNoLeader-seed#[83844D2F1CB0B8FD]) [    ] o.a.s.c.c.ConnectionManager Waiting for client to connect to ZooKeeper
   [junit4]   2> 1891663 INFO  (zkCallback-2427-thread-1) [    ] o.a.s.c.c.ConnectionManager Watcher org.apache.solr.common.cloud.ConnectionManager@18594370 name:ZooKeeperConnection Watcher:127.0.0.1:56635/solr got event WatchedEvent state:SyncConnected type:None path:null path:null type:None
   [junit4]   2> 1891663 INFO  (TEST-ForceLeaderTest.testReplicasInLIRNoLeader-seed#[83844D2F1CB0B8FD]) [    ] o.a.s.c.c.ConnectionManager Client is connected to ZooKeeper
   [junit4]   2> 1891664 INFO  (TEST-ForceLeaderTest.testReplicasInLIRNoLeader-seed#[83844D2F1CB0B8FD]) [    ] o.a.s.c.c.SolrZkClient Using default ZkACLProvider
   [junit4]   2> 1891665 INFO  (TEST-ForceLeaderTest.testReplicasInLIRNoLeader-seed#[83844D2F1CB0B8FD]) [    ] o.a.s.s.SolrDispatchFilter Loading solr.xml from SolrHome (not found in ZooKeeper)
   [junit4]   2> 1891665 INFO  (TEST-ForceLeaderTest.testReplicasInLIRNoLeader-seed#[83844D2F1CB0B8FD]) [    ] o.a.s.c.SolrXmlConfig Loading container configuration from /export/home/jenkins/workspace/Lucene-Solr-master-Solaris/solr/build/solr-core/test/J0/temp/solr.cloud.ForceLeaderTest_83844D2F1CB0B8FD-001/shard-1-001/solr.xml
   [junit4]   2> 1891671 INFO  (TEST-ForceLeaderTest.testReplicasInLIRNoLeader-seed#[83844D2F1CB0B8FD]) [    ] o.a.s.c.CorePropertiesLocator Config-defined core root directory: /export/home/jenkins/workspace/Lucene-Solr-master-Solaris/solr/build/solr-core/test/J0/temp/solr.cloud.ForceLeaderTest_83844D2F1CB0B8FD-001/shard-1-001/cores
   [junit4]   2> 1891671 INFO  (TEST-ForceLeaderTest.testReplicasInLIRNoLeader-seed#[83844D2F1CB0B8FD]) [    ] o.a.s.c.CoreContainer New CoreContainer 1692622390
   [junit4]   2> 1891671 INFO  (TEST-ForceLeaderTest.testReplicasInLIRNoLeader-seed#[83844D2F1CB0B8FD]) [    ] o.a.s.c.CoreContainer Loading cores into CoreContainer [instanceDir=/export/home/jenkins/workspace/Lucene-Solr-master-Solaris/solr/build/solr-core/test/J0/temp/solr.cloud.ForceLeaderTest_83844D2F1CB0B8FD-001/shard-1-001]
   [junit4]   2> 1891671 WARN  (TEST-ForceLeaderTest.testReplicasInLIRNoLeader-seed#[83844D2F1CB0B8FD]) [    ] o.a.s.c.CoreContainer Couldn't add files from /export/home/jenkins/workspace/Lucene-Solr-master-Solaris/solr/build/solr-core/test/J0/temp/solr.cloud.ForceLeaderTest_83844D2F1CB0B8FD-001/shard-1-001/lib to classpath: /export/home/jenkins/workspace/Lucene-Solr-master-Solaris/solr/build/solr-core/test/J0/temp/solr.cloud.ForceLeaderTest_83844D2F1CB0B8FD-001/shard-1-001/lib
   [junit4]   2> 1891672 INFO  (TEST-ForceLeaderTest.testReplicasInLIRNoLeader-seed#[83844D2F1CB0B8FD]) [    ] o.a.s.h.c.HttpShardHandlerFactory created with socketTimeout : 90000,urlScheme : ,connTimeout : 15000,maxConnectionsPerHost : 20,maxConnections : 10000,corePoolSize : 0,maximumPoolSize : 2147483647,maxThreadIdleTime : 5,sizeOfQueue : -1,fairnessPolicy : false,
   [junit4]   2> 1891676 INFO  (TEST-ForceLeaderTest.testReplicasInLIRNoLeader-seed#[83844D2F1CB0B8FD]) [    ] o.a.s.u.UpdateShardHandler Created UpdateShardHandler HTTP client with params: socketTimeout=340000&connTimeout=45000&maxConnections=100000&maxConnectionsPerHost=100000
   [junit4]   2> 1891676 INFO  (TEST-ForceLeaderTest.testReplicasInLIRNoLeader-seed#[83844D2F1CB0B8FD]) [    ] o.a.s.l.LogWatcher SLF4J impl is org.slf4j.impl.Log4jLoggerFactory
   [junit4]   2> 1891676 INFO  (TEST-ForceLeaderTest.testReplicasInLIRNoLeader-seed#[83844D2F1CB0B8FD]) [    ] o.a.s.l.LogWatcher Registering Log Listener [Log4j (org.slf4j.impl.Log4jLoggerFactory)]
   [junit4]   2> 1891676 INFO  (TEST-ForceLeaderTest.testReplicasInLIRNoLeader-seed#[83844D2F1CB0B8FD]) [    ] o.a.s.c.ZkContainer Zookeeper client=127.0.0.1:56635/solr
   [junit4]   2> 1891676 INFO  (TEST-ForceLeaderTest.testReplicasInLIRNoLeader-seed#[83844D2F1CB0B8FD]) [    ] o.a.s.c.ZkController zkHost includes chroot
   [junit4]   2> 1891676 INFO  (TEST-ForceLeaderTest.testReplicasInLIRNoLeader-seed#[83844D2F1CB0B8FD]) [    ] o.a.s.c.c.SolrZkClient Using default ZkCredentialsProvider
   [junit4]   2> 1891678 INFO  (TEST-ForceLeaderTest.testReplicasInLIRNoLeader-seed#[83844D2F1CB0B8FD]) [    ] o.a.s.c.c.ConnectionManager Waiting for client to connect to ZooKeeper
   [junit4]   2> 1891680 INFO  (zkCallback-2430-thread-1) [    ] o.a.s.c.c.ConnectionManager Watcher org.apache.solr.common.cloud.ConnectionManager@7837330c name:ZooKeeperConnection Watcher:127.0.0.1:56635 got event WatchedEvent state:SyncConnected type:None path:null path:null type:None
   [junit4]   2> 1891680 INFO  (TEST-ForceLeaderTest.testReplicasInLIRNoLeader-seed#[83844D2F1CB0B8FD]) [    ] o.a.s.c.c.ConnectionManager Client is connected to ZooKeeper
   [junit4]   2> 1891680 INFO  (TEST-ForceLeaderTest.testReplicasInLIRNoLeader-seed#[83844D2F1CB0B8FD]) [    ] o.a.s.c.c.SolrZkClient Using default ZkACLProvider
   [junit4]   2> 1891683 INFO  (TEST-ForceLeaderTest.testReplicasInLIRNoLeader-seed#[83844D2F1CB0B8FD]) [n:127.0.0.1:33774_    ] o.a.s.c.ZkController Added new OnReconnect listener org.apache.solr.cloud.ZkController$$Lambda$58/1869861537@618054ea
   [junit4]   2> 1891683 INFO  (TEST-ForceLeaderTest.testReplicasInLIRNoLeader-seed#[83844D2F1CB0B8FD]) [n:127.0.0.1:33774_    ] o.a.s.c.c.ConnectionManager Waiting for client to connect to ZooKeeper
   [junit4]   2> 1891685 INFO  (zkCallback-2431-thread-1-processing-n:127.0.0.1:33774_) [n:127.0.0.1:33774_    ] o.a.s.c.c.ConnectionManager Watcher org.apache.solr.common.cloud.ConnectionManager@4bcb47ee name:ZooKeeperConnection Watcher:127.0.0.1:56635/solr got event WatchedEvent state:SyncConnected type:None path:null path:null type:None
   [junit4]   2> 1891686 INFO  (TEST-ForceLeaderTest.testReplicasInLIRNoLeader-seed#[83844D2F1CB0B8FD]) [n:127.0.0.1:33774_    ] o.a.s.c.c.ConnectionManager Client is connected to ZooKeeper
   [junit4]   2> 1891698 INFO  (TEST-ForceLeaderTest.testReplicasInLIRNoLeader-seed#[83844D2F1CB0B8FD]) [n:127.0.0.1:33774_    ] o.a.s.c.c.ZkStateReader Updating cluster state from ZooKeeper... 
   [junit4]   2> 1891700 INFO  (TEST-ForceLeaderTest.testReplicasInLIRNoLeader-seed#[83844D2F1CB0B8FD]) [n:127.0.0.1:33774_    ] o.a.s.c.c.ZkStateReader Loaded empty cluster properties
   [junit4]   2> 1891702 INFO  (TEST-ForceLeaderTest.testReplicasInLIRNoLeader-seed#[83844D2F1CB0B8FD]) [n:127.0.0.1:33774_    ] o.a.s.c.c.ZkStateReader Updated live nodes from ZooKeeper... (0) -> (1)
   [junit4]   2> 1891708 INFO  (TEST-ForceLeaderTest.testReplicasInLIRNoLeader-seed#[83844D2F1CB0B8FD]) [n:127.0.0.1:33774_    ] o.a.s.c.Overseer Overseer (id=null) closing
   [junit4]   2> 1891709 INFO  (TEST-ForceLeaderTest.testReplicasInLIRNoLeader-seed#[83844D2F1CB0B8FD]) [n:127.0.0.1:33774_    ] o.a.s.c.LeaderElector Joined leadership election with path: /overseer_elect/election/96575653958975497-127.0.0.1:33774_-n_0000000001
   [junit4]   2> 1891711 INFO  (TEST-ForceLeaderTest.testReplicasInLIRNoLeader-seed#[83844D2F1CB0B8FD]) [n:127.0.0.1:33774_    ] o.a.s.c.LeaderElector Watching path /overseer_elect/election/96575653958975492-127.0.0.1:49063_-n_0000000000 to know if I could be the leader
   [junit4]   2> 1891711 INFO  (TEST-ForceLeaderTest.testReplicasInLIRNoLeader-seed#[83844D2F1CB0B8FD]) [n:127.0.0.1:33774_    ] o.a.s.c.ZkController Publish node=127.0.0.1:33774_ as DOWN
   [junit4]   2> 1891713 INFO  (TEST-ForceLeaderTest.testReplicasInLIRNoLeader-seed#[83844D2F1CB0B8FD]) [n:127.0.0.1:33774_    ] o.a.s.c.ZkController Register node as live in ZooKeeper:/live_nodes/127.0.0.1:33774_
   [junit4]   2> 1891713 INFO  (TEST-ForceLeaderTest.testReplicasInLIRNoLeader-seed#[83844D2F1CB0B8FD]) [n:127.0.0.1:33774_    ] o.a.s.c.c.SolrZkClient makePath: /live_nodes/127.0.0.1:33774_
   [junit4]   2> 1891715 INFO  (OverseerStateUpdate-96575653958975492-127.0.0.1:49063_-n_0000000000) [n:127.0.0.1:49063_    ] o.a.s.c.Overseer processMessage: queueSize: 1, message = {
   [junit4]   2>   "operation":"downnode",
   [junit4]   2>   "node_name":"127.0.0.1:33774_"} current state version: 3
   [junit4]   2> 1891715 INFO  (OverseerStateUpdate-96575653958975492-127.0.0.1:49063_-n_0000000000) [n:127.0.0.1:49063_    ] o.a.s.c.o.NodeMutator DownNode state invoked for node: 127.0.0.1:33774_
   [junit4]   2> 1891716 INFO  (zkCallback-2425-thread-1) [    ] o.a.s.c.c.ZkStateReader A live node change: [WatchedEvent state:SyncConnected type:NodeChildrenChanged path:/live_nodes], has occurred - updating... (live nodes size: [1])
   [junit4]   2> 1891716 INFO  (zkCallback-2421-thread-3-processing-n:127.0.0.1:49063_) [n:127.0.0.1:49063_    ] o.a.s.c.c.ZkStateReader A live node change: [WatchedEvent state:SyncConnected type:NodeChildrenChanged path:/live_nodes], has occurred - updating... (live nodes size: [1])
   [junit4]   2> 1891716 INFO  (zkCallback-2431-thread-1-processing-n:127.0.0.1:33774_) [n:127.0.0.1:33774_    ] o.a.s.c.c.ZkStateReader A live node change: [WatchedEvent state:SyncConnected type:NodeChildrenChanged path:/live_nodes], has occurred - updating... (live nodes size: [1])
   [junit4]   2> 1891717 INFO  (zkCallback-2425-thread-1) [    ] o.a.s.c.c.ZkStateReader Updated live nodes from ZooKeeper... (1) -> (2)
   [junit4]   2> 1891717 INFO  (zkCallback-2421-thread-3-processing-n:127.0.0.1:49063_) [n:127.0.0.1:49063_    ] o.a.s.c.c.ZkStateReader Updated live nodes from ZooKeeper... (1) -> (2)
   [junit4]   2> 1891717 INFO  (zkCallback-2425-thread-1) [    ] o.a.s.c.c.ZkStateReader A cluster state change: [WatchedEvent state:SyncConnected type:NodeDataChanged path:/clusterstate.json], has occurred - updating... (live nodes size: [2])
   [junit4]   2> 1891717 INFO  (zkCallback-2421-thread-3-processing-n:127.0.0.1:49063_) [n:127.0.0.1:49063_    ] o.a.s.c.c.ZkStateReader A cluster state change: [WatchedEvent state:SyncConnected type:NodeDataChanged path:/clusterstate.json], has occurred - updating... (live nodes size: [2])
   [junit4]   2> 1891718 INFO  (zkCallback-2431-thread-1-processing-n:127.0.0.1:33774_) [n:127.0.0.1:33774_    ] o.a.s.c.c.ZkStateReader Updated live nodes from ZooKeeper... (1) -> (2)
   [junit4]   2> 1891718 INFO  (zkCallback-2431-thread-2-processing-n:127.0.0.1:33774_) [n:127.0.0.1:33774_    ] o.a.s.c.c.ZkStateReader A cluster state change: [WatchedEvent state:SyncConnected type:NodeDataChanged path:/clusterstate.json], has occurred - updating... (live nodes size: [2])
   [junit4]   2> 1891757 INFO  (TEST-ForceLeaderTest.testReplicasInLIRNoLeader-seed#[83844D2F1CB0B8FD]) [n:127.0.0.1:33774_    ] o.a.s.c.CoreContainer Security conf doesn't exist. Skipping setup for authorization module.
   [junit4]   2> 1891757 INFO  (TEST-ForceLeaderTest.testReplicasInLIRNoLeader-seed#[83844D2F1CB0B8FD]) [n:127.0.0.1:33774_    ] o.a.s.c.CoreContainer No authentication plugin used.
   [junit4]   2> 1891758 INFO  (TEST-ForceLeaderTest.testReplicasInLIRNoLeader-seed#[83844D2F1CB0B8FD]) [n:127.0.0.1:33774_    ] o.a.s.c.CorePropertiesLocator Looking for core definitions underneath /export/home/jenkins/workspace/Lucene-Solr-master-Solaris/solr/build/solr-core/test/J0/temp/solr.cloud.ForceLeaderTest_83844D2F1CB0B8FD-001/shard-1-001/cores
   [junit4]   2> 1891759 INFO  (TEST-ForceLeaderTest.testReplicasInLIRNoLeader-seed#[83844D2F1CB0B8FD]) [n:127.0.0.1:33774_    ] o.a.s.c.CoreDescriptor Created CoreDescriptor: {name=collection1, config=solrconfig.xml, transient=false, schema=schema.xml, loadOnStartup=true, configSetProperties=configsetprops.json, collection=collection1, coreNodeName=, dataDir=data/, shard=}
   [junit4]   2> 1891759 INFO  (TEST-ForceLeaderTest.testReplicasInLIRNoLeader-seed#[83844D2F1CB0B8FD]) [n:127.0.0.1:33774_    ] o.a.s.c.CorePropertiesLocator Found core collection1 in /export/home/jenkins/workspace/Lucene-Solr-master-Solaris/solr/build/solr-core/test/J0/temp/solr.cloud.ForceLeaderTest_83844D2F1CB0B8FD-001/shard-1-001/cores/collection1
   [junit4]   2> 1891760 INFO  (TEST-ForceLeaderTest.testReplicasInLIRNoLeader-seed#[83844D2F1CB0B8FD]) [n:127.0.0.1:33774_    ] o.a.s.c.CorePropertiesLocator Found 1 core definitions
   [junit4]   2> 1891761 INFO  (TEST-ForceLeaderTest.testReplicasInLIRNoLeader-seed#[83844D2F1CB0B8FD]) [n:127.0.0.1:33774_    ] o.a.s.s.SolrDispatchFilter user.dir=/export/home/jenkins/workspace/Lucene-Solr-master-Solaris/solr/build/solr-core/test/J0
   [junit4]   2> 1891761 INFO  (TEST-ForceLeaderTest.testReplicasInLIRNoLeader-seed#[83844D2F1CB0B8FD]) [n:127.0.0.1:33774_    ] o.a.s.s.SolrDispatchFilter SolrDispatchFilter.init() done
   [junit4]   2> 1891762 INFO  (coreLoadExecutor-6369-thread-1-processing-n:127.0.0.1:33774_) [n:127.0.0.1:33774_ c:collection1   x:collection1] o.a.s.c.ZkController publishing state=down
   [junit4]   2> 1891762 INFO  (coreLoadExecutor-6369-thread-1-processing-n:127.0.0.1:33774_) [n:127.0.0.1:33774_ c:collection1   x:collection1] o.a.s.c.ZkController numShards not found on descriptor - reading it from system property
   [junit4]   2> 1891764 INFO  (coreLoadExecutor-6369-thread-1-processing-n:127.0.0.1:33774_) [n:127.0.0.1:33774_ c:collection1   x:collection1] o.a.s.c.ZkController Registering watch for collection collection1
   [junit4]   2> 1891766 INFO  (OverseerStateUpdate-96575653958975492-127.0.0.1:49063_-n_0000000000) [n:127.0.0.1:49063_    ] o.a.s.c.Overseer processMessage: queueSize: 1, message = {
   [junit4]   2>   "core":"collection1",
   [junit4]   2>   "roles":null,
   [junit4]   2>   "base_url":"http://127.0.0.1:33774",
   [junit4]   2>   "node_name":"127.0.0.1:33774_",
   [junit4]   2>   "numShards":"2",
   [junit4]   2>   "state":"down",
   [junit4]   2>   "shard":null,
   [junit4]   2>   "collection":"collection1",
   [junit4]   2>   "operation":"state"} current state version: 4
   [junit4]   2> 1891766 INFO  (coreLoadExecutor-6369-thread-1-processing-n:127.0.0.1:33774_) [n:127.0.0.1:33774_ c:collection1   x:collection1] o.a.s.c.c.ZkStateReader Add data for [collection1] ver [0]
   [junit4]   2> 1891766 INFO  (OverseerStateUpdate-96575653958975492-127.0.0.1:49063_-n_0000000000) [n:127.0.0.1:49063_    ] o.a.s.c.o.ReplicaMutator Update state numShards=2 message={
   [junit4]   2>   "core":"collection1",
   [junit4]   2>   "roles":null,
   [junit4]   2>   "base_url":"http://127.0.0.1:33774",
   [junit4]   2>   "node_name":"127.0.0.1:33774_",
   [junit4]   2>   "numShards":"2",
   [junit4]   2>   "state":"down",
   [junit4]   2>   "shard":null,
   [junit4]   2>   "collection":"collection1",
   [junit4]   2>   "operation":"state"}
   [junit4]   2> 1891767 INFO  (OverseerStateUpdate-96575653958975492-127.0.0.1:49063_-n_0000000000) [n:127.0.0.1:49063_    ] o.a.s.c.o.ReplicaMutator Collection already exists with numShards=2
   [junit4]   2> 1891767 INFO  (coreLoadExecutor-6369-thread-1-processing-n:127.0.0.1:33774_) [n:127.0.0.1:33774_ c:collection1   x:collection1] o.a.s.c.ZkController look for our core node name
   [junit4]   2> 1891767 INFO  (OverseerStateUpdate-96575653958975492-127.0

[...truncated too long message...]

lExecutor.lambda$execute$0(ExecutorUtil.java:229)
   [junit4]   2> 	at java.util.concurrent.ThreadPoolExecutor.runWorker(ThreadPoolExecutor.java:1142)
   [junit4]   2> 	at java.util.concurrent.ThreadPoolExecutor$Worker.run(ThreadPoolExecutor.java:617)
   [junit4]   2> 	at java.lang.Thread.run(Thread.java:745)
   [junit4]   2> 1995036 INFO  (TEST-ForceLeaderTest.testLastPublishedStateIsActive-seed#[83844D2F1CB0B8FD]) [    ] o.e.j.s.ServerConnector Stopped ServerConnector@349a3ed4{HTTP/1.1,[http/1.1]}{127.0.0.1:0}
   [junit4]   2> 1995036 INFO  (TEST-ForceLeaderTest.testLastPublishedStateIsActive-seed#[83844D2F1CB0B8FD]) [    ] o.e.j.s.h.ContextHandler Stopped o.e.j.s.ServletContextHandler@58886947{/,null,UNAVAILABLE}
   [junit4]   2> 1995040 INFO  (TEST-ForceLeaderTest.testLastPublishedStateIsActive-seed#[83844D2F1CB0B8FD]) [    ] o.a.s.c.ChaosMonkey monkey: stop shard! 41926
   [junit4]   2> 1995041 INFO  (TEST-ForceLeaderTest.testLastPublishedStateIsActive-seed#[83844D2F1CB0B8FD]) [    ] o.a.s.c.ZkTestServer connecting to 127.0.0.1:43092 43092
   [junit4]   2> 1995071 INFO  (Thread-3513) [    ] o.a.s.c.ZkTestServer connecting to 127.0.0.1:43092 43092
   [junit4]   2> 1995072 WARN  (Thread-3513) [    ] o.a.s.c.ZkTestServer Watch limit violations: 
   [junit4]   2> Maximum concurrent create/delete watches above limit:
   [junit4]   2> 
   [junit4]   2> 	5	/solr/aliases.json
   [junit4]   2> 	5	/solr/clusterprops.json
   [junit4]   2> 	4	/solr/security.json
   [junit4]   2> 	4	/solr/configs/conf1
   [junit4]   2> 	3	/solr/collections/forceleader_last_published/state.json
   [junit4]   2> 	3	/solr/collections/collection1/state.json
   [junit4]   2> 
   [junit4]   2> Maximum concurrent data watches above limit:
   [junit4]   2> 
   [junit4]   2> 	5	/solr/clusterstate.json
   [junit4]   2> 
   [junit4]   2> Maximum concurrent children watches above limit:
   [junit4]   2> 
   [junit4]   2> 	64	/solr/overseer/collection-queue-work
   [junit4]   2> 	37	/solr/overseer/queue
   [junit4]   2> 	5	/solr/live_nodes
   [junit4]   2> 	5	/solr/collections
   [junit4]   2> 	3	/solr/overseer/queue-work
   [junit4]   2> 
   [junit4]   2> 1995072 WARN  (TEST-ForceLeaderTest.testLastPublishedStateIsActive-seed#[83844D2F1CB0B8FD]) [    ] o.a.s.c.SocketProxy Closing 6 connections to: http://127.0.0.1:45272/, target: http://127.0.0.1:58915/
   [junit4]   2> 1995073 WARN  (TEST-ForceLeaderTest.testLastPublishedStateIsActive-seed#[83844D2F1CB0B8FD]) [    ] o.a.s.c.SocketProxy Closing 0 connections to: http://127.0.0.1:56326/, target: http://127.0.0.1:61553/
   [junit4]   2> 1995073 WARN  (TEST-ForceLeaderTest.testLastPublishedStateIsActive-seed#[83844D2F1CB0B8FD]) [    ] o.a.s.c.SocketProxy Closing 4 connections to: http://127.0.0.1:41926/, target: http://127.0.0.1:46706/
   [junit4]   2> 1995073 WARN  (TEST-ForceLeaderTest.testLastPublishedStateIsActive-seed#[83844D2F1CB0B8FD]) [    ] o.a.s.c.SocketProxy Closing 8 connections to: http://127.0.0.1:35903/, target: http://127.0.0.1:57268/
   [junit4]   2> 1995074 INFO  (SUITE-ForceLeaderTest-seed#[83844D2F1CB0B8FD]-worker) [    ] o.a.s.SolrTestCaseJ4 ###deleteCore
   [junit4]   2> NOTE: leaving temporary files on disk at: /export/home/jenkins/workspace/Lucene-Solr-master-Solaris/solr/build/solr-core/test/J0/temp/solr.cloud.ForceLeaderTest_83844D2F1CB0B8FD-001
   [junit4]   2> Sep 11, 2016 9:00:37 PM com.carrotsearch.randomizedtesting.ThreadLeakControl checkThreadLeaks
   [junit4]   2> WARNING: Will linger awaiting termination of 2 leaked thread(s).
   [junit4]   2> NOTE: test params are: codec=Asserting(Lucene62): {range_facet_l_dv=Lucene50(blocksize=128), _version_=PostingsFormat(name=Memory doPackFST= false), multiDefault=FSTOrd50, a_t=PostingsFormat(name=Memory doPackFST= false), intDefault=PostingsFormat(name=Memory doPackFST= false), id=Lucene50(blocksize=128), range_facet_i_dv=PostingsFormat(name=Memory doPackFST= false), text=BlockTreeOrds(blocksize=128), range_facet_l=PostingsFormat(name=Memory doPackFST= false), timestamp=PostingsFormat(name=Memory doPackFST= false)}, docValues:{range_facet_l_dv=DocValuesFormat(name=Asserting), range_facet_i_dv=DocValuesFormat(name=Memory), timestamp=DocValuesFormat(name=Memory)}, maxPointsInLeafNode=513, maxMBSortInHeap=7.626771218858144, sim=ClassicSimilarity, locale=da-DK, timezone=Etc/GMT+8
   [junit4]   2> NOTE: SunOS 5.11 amd64/Oracle Corporation 1.8.0_102 (64-bit)/cpus=3,threads=1,free=238711304,total=476053504
   [junit4]   2> NOTE: All tests run in this JVM: [IgnoreCommitOptimizeUpdateProcessorFactoryTest, SyncSliceTest, DeleteNodeTest, VersionInfoTest, TestGroupingSearch, TestBinaryField, TestBM25SimilarityFactory, TestManagedResource, TestFilteredDocIdSet, AssignTest, LeaderElectionTest, TestScoreJoinQPNoScore, DataDrivenBlockJoinTest, RestartWhileUpdatingTest, TestFunctionQuery, SpatialFilterTest, TestXIncludeConfig, DisMaxRequestHandlerTest, TestSolrConfigHandlerConcurrent, IndexBasedSpellCheckerTest, TestDistributedStatsComponentCardinality, BlockCacheTest, TestRandomRequestDistribution, TestExactSharedStatsCache, TestSQLHandler, TestRandomDVFaceting, TestIBSimilarityFactory, JavabinLoaderTest, FastVectorHighlighterTest, TestHighlightDedupGrouping, JSONWriterTest, TestStressRecovery, TestStandardQParsers, TestRawResponseWriter, CollectionTooManyReplicasTest, TestUniqueKeyFieldResource, TestTolerantSearch, TestLazyCores, TestComponentsName, TestRandomCollapseQParserPlugin, TestStressReorder, DistributedFacetPivotWhiteBoxTest, TestMacros, TestManagedSynonymFilterFactory, TestLRUStatsCache, TestSlowCompositeReaderWrapper, OutOfBoxZkACLAndCredentialsProvidersTest, QueryResultKeyTest, PingRequestHandlerTest, CdcrReplicationHandlerTest, SchemaVersionSpecificBehaviorTest, SOLR749Test, TestUninvertingReader, SimpleFacetsTest, DistribCursorPagingTest, HdfsLockFactoryTest, TestOnReconnectListenerSupport, CollectionsAPISolrJTest, BasicDistributedZkTest, TestLockTree, PrimitiveFieldTypeTest, DocValuesMultiTest, DeleteInactiveReplicaTest, HLLSerializationTest, PrimUtilsTest, TestCollationField, TestCSVLoader, TestEmbeddedSolrServerConstructors, DistribJoinFromCollectionTest, TermsComponentTest, OutputWriterTest, TestFieldCacheSanityChecker, TestChildDocTransformer, BigEndianAscendingWordSerializerTest, TestInfoStreamLogging, PolyFieldTest, DocValuesTest, BlockJoinFacetDistribTest, TestFastOutputStream, TestShortCircuitedRequests, ZkControllerTest, TestHashQParserPlugin, StressHdfsTest, DateRangeFieldTest, HttpPartitionTest, ReplaceNodeTest, StatelessScriptUpdateProcessorFactoryTest, ZkNodePropsTest, CursorMarkTest, HdfsBasicDistributedZk2Test, TestSolrCloudWithDelegationTokens, TestPseudoReturnFields, SynonymTokenizerTest, TestSolrCoreSnapshots, CoreSorterTest, HardAutoCommitTest, AnalyticsMergeStrategyTest, TestReloadDeadlock, OverseerTest, TestOverriddenPrefixQueryForCustomFieldType, SolrXmlInZkTest, UniqFieldsUpdateProcessorFactoryTest, TestExceedMaxTermLength, StandardRequestHandlerTest, TestDynamicFieldResource, SystemInfoHandlerTest, TestDocumentBuilder, CloneFieldUpdateProcessorFactoryTest, TestSolrDynamicMBean, TestSchemaResource, DocumentAnalysisRequestHandlerTest, TestAddFieldRealTimeGet, AlternateDirectoryTest, UnloadDistributedZkTest, PeerSyncTest, TestDistributedSearch, SharedFSAutoReplicaFailoverUtilsTest, TestManagedSchemaAPI, DirectUpdateHandlerTest, BlockJoinFacetSimpleTest, SoftAutoCommitTest, DirectSolrSpellCheckerTest, TestFieldCacheSortRandom, TestElisionMultitermQuery, TestDFISimilarityFactory, HdfsChaosMonkeyNothingIsSafeTest, SuggesterFSTTest, ExitableDirectoryReaderTest, TestPartialUpdateDeduplication, CurrencyFieldXmlFileTest, AtomicUpdatesTest, HdfsUnloadDistributedZkTest, TestConfigSetsAPIExclusivity, TestNumericTerms32, QueryElevationComponentTest, TestSimpleQParserPlugin, TestSolrCloudWithSecureImpersonation, TestLFUCache, QueryEqualityTest, TolerantUpdateProcessorTest, SimpleMLTQParserTest, TestCollapseQParserPlugin, OverseerTaskQueueTest, TestSurroundQueryParser, TestFaceting, TestTrieFacet, TestJmxIntegration, TestFieldCache, TestSolrIndexConfig, XsltUpdateRequestHandlerTest, DistributedVersionInfoTest, TestCollectionAPI, MoreLikeThisHandlerTest, SampleTest, ZkCLITest, ShardRoutingCustomTest, AutoCommitTest, DistributedSpellCheckComponentTest, TestJoin, TestStressVersions, TestRangeQuery, SolrCmdDistributorTest, TestSort, TestFiltering, TestBadConfig, DistributedQueryElevationComponentTest, SignatureUpdateProcessorFactoryTest, CoreAdminHandlerTest, TestStressLucene, TestTrie, TestUpdate, TestWordDelimiterFilterFactory, DefaultValueUpdateProcessorTest, TestRemoteStreaming, SolrInfoMBeanTest, TestReversedWildcardFilterFactory, XmlUpdateRequestHandlerTest, DocumentBuilderTest, RequiredFieldsTest, TestSolrQueryParser, RegexBoostProcessorTest, SolrPluginUtilsTest, ReturnFieldsTest, TestCSVResponseWriter, TestAnalyzedSuggestions, CSVRequestHandlerTest, TestBinaryResponseWriter, HighlighterConfigTest, UpdateParamsTest, CopyFieldTest, ResponseLogComponentTest, BadComponentTest, TestMergePolicyConfig, TestSolrDeletionPolicy2, MultiTermTest, TestDocSet, TestSearchPerf, NumericFieldsTest, ExternalFileFieldSortTest, TestSolrCoreProperties, TestPostingsSolrHighlighter, DirectSolrConnectionTest, NotRequiredUniqueKeyTest, TestLuceneMatchVersion, TestPhraseSuggestions, SpellPossibilityIteratorTest, TestCharFilters, TestSweetSpotSimilarityFactory, TestPerFieldSimilarity, TestFastWriter, TestJmxMonitoredMap, TimeZoneUtilsTest, ScriptEngineTest, OpenExchangeRatesOrgProviderTest, PluginInfoTest, TestFastLRUCache, DateMathParserTest, ChaosMonkeyNothingIsSafeTest, AsyncMigrateRouteKeyTest, CdcrReplicationDistributedZkTest, CdcrRequestHandlerTest, CdcrVersionReplicationTest, CollectionReloadTest, CollectionsAPIAsyncDistributedZkTest, DeleteShardTest, DistribDocExpirationUpdateProcessorTest, ForceLeaderTest]
   [junit4] Completed [458/631 (1!)] on J0 in 105.87s, 3 tests, 1 error, 1 skipped <<< FAILURES!

[...truncated 60753 lines...]


Mime
View raw message