lucene-dev mailing list archives

Site index · List index
Message view « Date » · « Thread »
Top « Date » · « Thread »
From Policeman Jenkins Server <jenk...@thetaphi.de>
Subject [JENKINS] Lucene-Solr-master-MacOSX (64bit/jdk1.8.0) - Build # 3538 - Unstable!
Date Mon, 12 Sep 2016 06:08:46 GMT
Build: http://jenkins.thetaphi.de/job/Lucene-Solr-master-MacOSX/3538/
Java: 64bit/jdk1.8.0 -XX:-UseCompressedOops -XX:+UseSerialGC

1 tests failed.
FAILED:  org.apache.solr.cloud.ForceLeaderTest.testReplicasInLIRNoLeader

Error Message:
org.apache.solr.client.solrj.SolrServerException: No live SolrServers available to handle this request:[http://127.0.0.1:54846/w/y/forceleader_test_collection_shard1_replica2]

Stack Trace:
org.apache.solr.client.solrj.SolrServerException: org.apache.solr.client.solrj.SolrServerException: No live SolrServers available to handle this request:[http://127.0.0.1:54846/w/y/forceleader_test_collection_shard1_replica2]
	at __randomizedtesting.SeedInfo.seed([34263DDAC057F9C5:D2B1091AF9D500A4]:0)
	at org.apache.solr.client.solrj.impl.CloudSolrClient.directUpdate(CloudSolrClient.java:769)
	at org.apache.solr.client.solrj.impl.CloudSolrClient.sendRequest(CloudSolrClient.java:1161)
	at org.apache.solr.client.solrj.impl.CloudSolrClient.requestWithRetryOnStaleState(CloudSolrClient.java:1050)
	at org.apache.solr.client.solrj.impl.CloudSolrClient.request(CloudSolrClient.java:992)
	at org.apache.solr.cloud.AbstractFullDistribZkTestBase.sendDocsWithRetry(AbstractFullDistribZkTestBase.java:753)
	at org.apache.solr.cloud.AbstractFullDistribZkTestBase.sendDocsWithRetry(AbstractFullDistribZkTestBase.java:741)
	at org.apache.solr.cloud.ForceLeaderTest.sendDoc(ForceLeaderTest.java:424)
	at org.apache.solr.cloud.ForceLeaderTest.assertSendDocFails(ForceLeaderTest.java:315)
	at org.apache.solr.cloud.ForceLeaderTest.testReplicasInLIRNoLeader(ForceLeaderTest.java:110)
	at sun.reflect.NativeMethodAccessorImpl.invoke0(Native Method)
	at sun.reflect.NativeMethodAccessorImpl.invoke(NativeMethodAccessorImpl.java:62)
	at sun.reflect.DelegatingMethodAccessorImpl.invoke(DelegatingMethodAccessorImpl.java:43)
	at java.lang.reflect.Method.invoke(Method.java:498)
	at com.carrotsearch.randomizedtesting.RandomizedRunner.invoke(RandomizedRunner.java:1764)
	at com.carrotsearch.randomizedtesting.RandomizedRunner$8.evaluate(RandomizedRunner.java:871)
	at com.carrotsearch.randomizedtesting.RandomizedRunner$9.evaluate(RandomizedRunner.java:907)
	at com.carrotsearch.randomizedtesting.RandomizedRunner$10.evaluate(RandomizedRunner.java:921)
	at org.apache.solr.BaseDistributedSearchTestCase$ShardsRepeatRule$ShardsFixedStatement.callStatement(BaseDistributedSearchTestCase.java:985)
	at org.apache.solr.BaseDistributedSearchTestCase$ShardsRepeatRule$ShardsStatement.evaluate(BaseDistributedSearchTestCase.java:960)
	at com.carrotsearch.randomizedtesting.rules.SystemPropertiesRestoreRule$1.evaluate(SystemPropertiesRestoreRule.java:57)
	at org.apache.lucene.util.TestRuleSetupTeardownChained$1.evaluate(TestRuleSetupTeardownChained.java:49)
	at org.apache.lucene.util.AbstractBeforeAfterRule$1.evaluate(AbstractBeforeAfterRule.java:45)
	at org.apache.lucene.util.TestRuleThreadAndTestName$1.evaluate(TestRuleThreadAndTestName.java:48)
	at org.apache.lucene.util.TestRuleIgnoreAfterMaxFailures$1.evaluate(TestRuleIgnoreAfterMaxFailures.java:64)
	at org.apache.lucene.util.TestRuleMarkFailure$1.evaluate(TestRuleMarkFailure.java:47)
	at com.carrotsearch.randomizedtesting.rules.StatementAdapter.evaluate(StatementAdapter.java:36)
	at com.carrotsearch.randomizedtesting.ThreadLeakControl$StatementRunner.run(ThreadLeakControl.java:367)
	at com.carrotsearch.randomizedtesting.ThreadLeakControl.forkTimeoutingTask(ThreadLeakControl.java:809)
	at com.carrotsearch.randomizedtesting.ThreadLeakControl$3.evaluate(ThreadLeakControl.java:460)
	at com.carrotsearch.randomizedtesting.RandomizedRunner.runSingleTest(RandomizedRunner.java:880)
	at com.carrotsearch.randomizedtesting.RandomizedRunner$5.evaluate(RandomizedRunner.java:781)
	at com.carrotsearch.randomizedtesting.RandomizedRunner$6.evaluate(RandomizedRunner.java:816)
	at com.carrotsearch.randomizedtesting.RandomizedRunner$7.evaluate(RandomizedRunner.java:827)
	at com.carrotsearch.randomizedtesting.rules.StatementAdapter.evaluate(StatementAdapter.java:36)
	at com.carrotsearch.randomizedtesting.rules.SystemPropertiesRestoreRule$1.evaluate(SystemPropertiesRestoreRule.java:57)
	at org.apache.lucene.util.AbstractBeforeAfterRule$1.evaluate(AbstractBeforeAfterRule.java:45)
	at com.carrotsearch.randomizedtesting.rules.StatementAdapter.evaluate(StatementAdapter.java:36)
	at org.apache.lucene.util.TestRuleStoreClassName$1.evaluate(TestRuleStoreClassName.java:41)
	at com.carrotsearch.randomizedtesting.rules.NoShadowingOrOverridesOnMethodsRule$1.evaluate(NoShadowingOrOverridesOnMethodsRule.java:40)
	at com.carrotsearch.randomizedtesting.rules.NoShadowingOrOverridesOnMethodsRule$1.evaluate(NoShadowingOrOverridesOnMethodsRule.java:40)
	at com.carrotsearch.randomizedtesting.rules.StatementAdapter.evaluate(StatementAdapter.java:36)
	at com.carrotsearch.randomizedtesting.rules.StatementAdapter.evaluate(StatementAdapter.java:36)
	at com.carrotsearch.randomizedtesting.rules.StatementAdapter.evaluate(StatementAdapter.java:36)
	at org.apache.lucene.util.TestRuleAssertionsRequired$1.evaluate(TestRuleAssertionsRequired.java:53)
	at org.apache.lucene.util.TestRuleMarkFailure$1.evaluate(TestRuleMarkFailure.java:47)
	at org.apache.lucene.util.TestRuleIgnoreAfterMaxFailures$1.evaluate(TestRuleIgnoreAfterMaxFailures.java:64)
	at org.apache.lucene.util.TestRuleIgnoreTestSuites$1.evaluate(TestRuleIgnoreTestSuites.java:54)
	at com.carrotsearch.randomizedtesting.rules.StatementAdapter.evaluate(StatementAdapter.java:36)
	at com.carrotsearch.randomizedtesting.ThreadLeakControl$StatementRunner.run(ThreadLeakControl.java:367)
	at java.lang.Thread.run(Thread.java:745)
Caused by: org.apache.solr.client.solrj.SolrServerException: No live SolrServers available to handle this request:[http://127.0.0.1:54846/w/y/forceleader_test_collection_shard1_replica2]
	at org.apache.solr.client.solrj.impl.LBHttpSolrClient.request(LBHttpSolrClient.java:394)
	at org.apache.solr.client.solrj.impl.CloudSolrClient.directUpdate(CloudSolrClient.java:763)
	... 49 more
Caused by: org.apache.solr.client.solrj.SolrServerException: Server refused connection at: http://127.0.0.1:54846/w/y/forceleader_test_collection_shard1_replica2
	at org.apache.solr.client.solrj.impl.HttpSolrClient.executeMethod(HttpSolrClient.java:615)
	at org.apache.solr.client.solrj.impl.HttpSolrClient.request(HttpSolrClient.java:261)
	at org.apache.solr.client.solrj.impl.HttpSolrClient.request(HttpSolrClient.java:250)
	at org.apache.solr.client.solrj.impl.LBHttpSolrClient.doRequest(LBHttpSolrClient.java:415)
	at org.apache.solr.client.solrj.impl.LBHttpSolrClient.request(LBHttpSolrClient.java:383)
	... 50 more
Caused by: org.apache.http.conn.HttpHostConnectException: Connect to 127.0.0.1:54846 [/127.0.0.1] failed: Connection refused
	at org.apache.http.impl.conn.DefaultHttpClientConnectionOperator.connect(DefaultHttpClientConnectionOperator.java:151)
	at org.apache.http.impl.conn.PoolingHttpClientConnectionManager.connect(PoolingHttpClientConnectionManager.java:353)
	at org.apache.http.impl.execchain.MainClientExec.establishRoute(MainClientExec.java:380)
	at org.apache.http.impl.execchain.MainClientExec.execute(MainClientExec.java:236)
	at org.apache.http.impl.execchain.ProtocolExec.execute(ProtocolExec.java:184)
	at org.apache.http.impl.execchain.RetryExec.execute(RetryExec.java:88)
	at org.apache.http.impl.execchain.RedirectExec.execute(RedirectExec.java:110)
	at org.apache.http.impl.client.InternalHttpClient.doExecute(InternalHttpClient.java:184)
	at org.apache.http.impl.client.CloseableHttpClient.execute(CloseableHttpClient.java:82)
	at org.apache.http.impl.client.CloseableHttpClient.execute(CloseableHttpClient.java:55)
	at org.apache.solr.client.solrj.impl.HttpSolrClient.executeMethod(HttpSolrClient.java:513)
	... 54 more
Caused by: java.net.ConnectException: Connection refused
	at java.net.PlainSocketImpl.socketConnect(Native Method)
	at java.net.AbstractPlainSocketImpl.doConnect(AbstractPlainSocketImpl.java:350)
	at java.net.AbstractPlainSocketImpl.connectToAddress(AbstractPlainSocketImpl.java:206)
	at java.net.AbstractPlainSocketImpl.connect(AbstractPlainSocketImpl.java:188)
	at java.net.SocksSocketImpl.connect(SocksSocketImpl.java:392)
	at java.net.Socket.connect(Socket.java:589)
	at org.apache.http.conn.socket.PlainConnectionSocketFactory.connectSocket(PlainConnectionSocketFactory.java:74)
	at org.apache.http.impl.conn.DefaultHttpClientConnectionOperator.connect(DefaultHttpClientConnectionOperator.java:134)
	... 64 more




Build Log:
[...truncated 11920 lines...]
   [junit4] Suite: org.apache.solr.cloud.ForceLeaderTest
   [junit4]   2> Creating dataDir: /Users/jenkins/workspace/Lucene-Solr-master-MacOSX/solr/build/solr-core/test/J1/temp/solr.cloud.ForceLeaderTest_34263DDAC057F9C5-001/init-core-data-001
   [junit4]   2> 2407716 INFO  (SUITE-ForceLeaderTest-seed#[34263DDAC057F9C5]-worker) [    ] o.a.s.SolrTestCaseJ4 Randomized ssl (false) and clientAuth (false) via: @org.apache.solr.SolrTestCaseJ4$SuppressSSL(bugUrl=https://issues.apache.org/jira/browse/SOLR-5776) w/ MAC_OS_X supressed clientAuth
   [junit4]   2> 2407716 INFO  (SUITE-ForceLeaderTest-seed#[34263DDAC057F9C5]-worker) [    ] o.a.s.BaseDistributedSearchTestCase Setting hostContext system property: /w/y
   [junit4]   2> 2407718 INFO  (TEST-ForceLeaderTest.testReplicasInLIRNoLeader-seed#[34263DDAC057F9C5]) [    ] o.a.s.c.ZkTestServer STARTING ZK TEST SERVER
   [junit4]   2> 2407719 INFO  (Thread-3287) [    ] o.a.s.c.ZkTestServer client port:0.0.0.0/0.0.0.0:0
   [junit4]   2> 2407719 INFO  (Thread-3287) [    ] o.a.s.c.ZkTestServer Starting server
   [junit4]   2> 2407820 INFO  (TEST-ForceLeaderTest.testReplicasInLIRNoLeader-seed#[34263DDAC057F9C5]) [    ] o.a.s.c.ZkTestServer start zk server on port:54833
   [junit4]   2> 2407821 INFO  (TEST-ForceLeaderTest.testReplicasInLIRNoLeader-seed#[34263DDAC057F9C5]) [    ] o.a.s.c.c.SolrZkClient Using default ZkCredentialsProvider
   [junit4]   2> 2407821 INFO  (TEST-ForceLeaderTest.testReplicasInLIRNoLeader-seed#[34263DDAC057F9C5]) [    ] o.a.s.c.c.ConnectionManager Waiting for client to connect to ZooKeeper
   [junit4]   2> 2407860 INFO  (zkCallback-3384-thread-1) [    ] o.a.s.c.c.ConnectionManager Watcher org.apache.solr.common.cloud.ConnectionManager@5dd5e4a9 name:ZooKeeperConnection Watcher:127.0.0.1:54833 got event WatchedEvent state:SyncConnected type:None path:null path:null type:None
   [junit4]   2> 2407860 INFO  (TEST-ForceLeaderTest.testReplicasInLIRNoLeader-seed#[34263DDAC057F9C5]) [    ] o.a.s.c.c.ConnectionManager Client is connected to ZooKeeper
   [junit4]   2> 2407860 INFO  (TEST-ForceLeaderTest.testReplicasInLIRNoLeader-seed#[34263DDAC057F9C5]) [    ] o.a.s.c.c.SolrZkClient Using default ZkACLProvider
   [junit4]   2> 2407860 INFO  (TEST-ForceLeaderTest.testReplicasInLIRNoLeader-seed#[34263DDAC057F9C5]) [    ] o.a.s.c.c.SolrZkClient makePath: /solr
   [junit4]   2> 2407864 INFO  (TEST-ForceLeaderTest.testReplicasInLIRNoLeader-seed#[34263DDAC057F9C5]) [    ] o.a.s.c.c.SolrZkClient Using default ZkCredentialsProvider
   [junit4]   2> 2407864 INFO  (TEST-ForceLeaderTest.testReplicasInLIRNoLeader-seed#[34263DDAC057F9C5]) [    ] o.a.s.c.c.ConnectionManager Waiting for client to connect to ZooKeeper
   [junit4]   2> 2407865 INFO  (zkCallback-3385-thread-1) [    ] o.a.s.c.c.ConnectionManager Watcher org.apache.solr.common.cloud.ConnectionManager@60e0218e name:ZooKeeperConnection Watcher:127.0.0.1:54833/solr got event WatchedEvent state:SyncConnected type:None path:null path:null type:None
   [junit4]   2> 2407866 INFO  (TEST-ForceLeaderTest.testReplicasInLIRNoLeader-seed#[34263DDAC057F9C5]) [    ] o.a.s.c.c.ConnectionManager Client is connected to ZooKeeper
   [junit4]   2> 2407866 INFO  (TEST-ForceLeaderTest.testReplicasInLIRNoLeader-seed#[34263DDAC057F9C5]) [    ] o.a.s.c.c.SolrZkClient Using default ZkACLProvider
   [junit4]   2> 2407866 INFO  (TEST-ForceLeaderTest.testReplicasInLIRNoLeader-seed#[34263DDAC057F9C5]) [    ] o.a.s.c.c.SolrZkClient makePath: /collections/collection1
   [junit4]   2> 2407869 INFO  (TEST-ForceLeaderTest.testReplicasInLIRNoLeader-seed#[34263DDAC057F9C5]) [    ] o.a.s.c.c.SolrZkClient makePath: /collections/collection1/shards
   [junit4]   2> 2407872 INFO  (TEST-ForceLeaderTest.testReplicasInLIRNoLeader-seed#[34263DDAC057F9C5]) [    ] o.a.s.c.c.SolrZkClient makePath: /collections/control_collection
   [junit4]   2> 2407875 INFO  (TEST-ForceLeaderTest.testReplicasInLIRNoLeader-seed#[34263DDAC057F9C5]) [    ] o.a.s.c.c.SolrZkClient makePath: /collections/control_collection/shards
   [junit4]   2> 2407878 INFO  (TEST-ForceLeaderTest.testReplicasInLIRNoLeader-seed#[34263DDAC057F9C5]) [    ] o.a.s.c.AbstractZkTestCase put /Users/jenkins/workspace/Lucene-Solr-master-MacOSX/solr/core/src/test-files/solr/collection1/conf/solrconfig-tlog.xml to /configs/conf1/solrconfig.xml
   [junit4]   2> 2407879 INFO  (TEST-ForceLeaderTest.testReplicasInLIRNoLeader-seed#[34263DDAC057F9C5]) [    ] o.a.s.c.c.SolrZkClient makePath: /configs/conf1/solrconfig.xml
   [junit4]   2> 2407884 INFO  (TEST-ForceLeaderTest.testReplicasInLIRNoLeader-seed#[34263DDAC057F9C5]) [    ] o.a.s.c.AbstractZkTestCase put /Users/jenkins/workspace/Lucene-Solr-master-MacOSX/solr/core/src/test-files/solr/collection1/conf/schema.xml to /configs/conf1/schema.xml
   [junit4]   2> 2407893 INFO  (TEST-ForceLeaderTest.testReplicasInLIRNoLeader-seed#[34263DDAC057F9C5]) [    ] o.a.s.c.c.SolrZkClient makePath: /configs/conf1/schema.xml
   [junit4]   2> 2407897 INFO  (TEST-ForceLeaderTest.testReplicasInLIRNoLeader-seed#[34263DDAC057F9C5]) [    ] o.a.s.c.AbstractZkTestCase put /Users/jenkins/workspace/Lucene-Solr-master-MacOSX/solr/core/src/test-files/solr/collection1/conf/solrconfig.snippet.randomindexconfig.xml to /configs/conf1/solrconfig.snippet.randomindexconfig.xml
   [junit4]   2> 2407898 INFO  (TEST-ForceLeaderTest.testReplicasInLIRNoLeader-seed#[34263DDAC057F9C5]) [    ] o.a.s.c.c.SolrZkClient makePath: /configs/conf1/solrconfig.snippet.randomindexconfig.xml
   [junit4]   2> 2407901 INFO  (TEST-ForceLeaderTest.testReplicasInLIRNoLeader-seed#[34263DDAC057F9C5]) [    ] o.a.s.c.AbstractZkTestCase put /Users/jenkins/workspace/Lucene-Solr-master-MacOSX/solr/core/src/test-files/solr/collection1/conf/stopwords.txt to /configs/conf1/stopwords.txt
   [junit4]   2> 2407902 INFO  (TEST-ForceLeaderTest.testReplicasInLIRNoLeader-seed#[34263DDAC057F9C5]) [    ] o.a.s.c.c.SolrZkClient makePath: /configs/conf1/stopwords.txt
   [junit4]   2> 2407905 INFO  (TEST-ForceLeaderTest.testReplicasInLIRNoLeader-seed#[34263DDAC057F9C5]) [    ] o.a.s.c.AbstractZkTestCase put /Users/jenkins/workspace/Lucene-Solr-master-MacOSX/solr/core/src/test-files/solr/collection1/conf/protwords.txt to /configs/conf1/protwords.txt
   [junit4]   2> 2407907 INFO  (TEST-ForceLeaderTest.testReplicasInLIRNoLeader-seed#[34263DDAC057F9C5]) [    ] o.a.s.c.c.SolrZkClient makePath: /configs/conf1/protwords.txt
   [junit4]   2> 2407911 INFO  (TEST-ForceLeaderTest.testReplicasInLIRNoLeader-seed#[34263DDAC057F9C5]) [    ] o.a.s.c.AbstractZkTestCase put /Users/jenkins/workspace/Lucene-Solr-master-MacOSX/solr/core/src/test-files/solr/collection1/conf/currency.xml to /configs/conf1/currency.xml
   [junit4]   2> 2407928 INFO  (TEST-ForceLeaderTest.testReplicasInLIRNoLeader-seed#[34263DDAC057F9C5]) [    ] o.a.s.c.c.SolrZkClient makePath: /configs/conf1/currency.xml
   [junit4]   2> 2407931 INFO  (TEST-ForceLeaderTest.testReplicasInLIRNoLeader-seed#[34263DDAC057F9C5]) [    ] o.a.s.c.AbstractZkTestCase put /Users/jenkins/workspace/Lucene-Solr-master-MacOSX/solr/core/src/test-files/solr/collection1/conf/enumsConfig.xml to /configs/conf1/enumsConfig.xml
   [junit4]   2> 2407932 INFO  (TEST-ForceLeaderTest.testReplicasInLIRNoLeader-seed#[34263DDAC057F9C5]) [    ] o.a.s.c.c.SolrZkClient makePath: /configs/conf1/enumsConfig.xml
   [junit4]   2> 2407935 INFO  (TEST-ForceLeaderTest.testReplicasInLIRNoLeader-seed#[34263DDAC057F9C5]) [    ] o.a.s.c.AbstractZkTestCase put /Users/jenkins/workspace/Lucene-Solr-master-MacOSX/solr/core/src/test-files/solr/collection1/conf/open-exchange-rates.json to /configs/conf1/open-exchange-rates.json
   [junit4]   2> 2407950 INFO  (TEST-ForceLeaderTest.testReplicasInLIRNoLeader-seed#[34263DDAC057F9C5]) [    ] o.a.s.c.c.SolrZkClient makePath: /configs/conf1/open-exchange-rates.json
   [junit4]   2> 2407952 INFO  (TEST-ForceLeaderTest.testReplicasInLIRNoLeader-seed#[34263DDAC057F9C5]) [    ] o.a.s.c.AbstractZkTestCase put /Users/jenkins/workspace/Lucene-Solr-master-MacOSX/solr/core/src/test-files/solr/collection1/conf/mapping-ISOLatin1Accent.txt to /configs/conf1/mapping-ISOLatin1Accent.txt
   [junit4]   2> 2407957 INFO  (TEST-ForceLeaderTest.testReplicasInLIRNoLeader-seed#[34263DDAC057F9C5]) [    ] o.a.s.c.c.SolrZkClient makePath: /configs/conf1/mapping-ISOLatin1Accent.txt
   [junit4]   2> 2407960 INFO  (TEST-ForceLeaderTest.testReplicasInLIRNoLeader-seed#[34263DDAC057F9C5]) [    ] o.a.s.c.AbstractZkTestCase put /Users/jenkins/workspace/Lucene-Solr-master-MacOSX/solr/core/src/test-files/solr/collection1/conf/old_synonyms.txt to /configs/conf1/old_synonyms.txt
   [junit4]   2> 2407960 INFO  (TEST-ForceLeaderTest.testReplicasInLIRNoLeader-seed#[34263DDAC057F9C5]) [    ] o.a.s.c.c.SolrZkClient makePath: /configs/conf1/old_synonyms.txt
   [junit4]   2> 2407963 INFO  (TEST-ForceLeaderTest.testReplicasInLIRNoLeader-seed#[34263DDAC057F9C5]) [    ] o.a.s.c.AbstractZkTestCase put /Users/jenkins/workspace/Lucene-Solr-master-MacOSX/solr/core/src/test-files/solr/collection1/conf/synonyms.txt to /configs/conf1/synonyms.txt
   [junit4]   2> 2407967 INFO  (TEST-ForceLeaderTest.testReplicasInLIRNoLeader-seed#[34263DDAC057F9C5]) [    ] o.a.s.c.c.SolrZkClient makePath: /configs/conf1/synonyms.txt
   [junit4]   2> 2410336 INFO  (TEST-ForceLeaderTest.testReplicasInLIRNoLeader-seed#[34263DDAC057F9C5]) [    ] o.a.s.SolrTestCaseJ4 Writing core.properties file to /Users/jenkins/workspace/Lucene-Solr-master-MacOSX/solr/build/solr-core/test/J1/temp/solr.cloud.ForceLeaderTest_34263DDAC057F9C5-001/control-001/cores/collection1
   [junit4]   2> 2410340 INFO  (TEST-ForceLeaderTest.testReplicasInLIRNoLeader-seed#[34263DDAC057F9C5]) [    ] o.e.j.s.Server jetty-9.3.8.v20160314
   [junit4]   2> 2410342 INFO  (TEST-ForceLeaderTest.testReplicasInLIRNoLeader-seed#[34263DDAC057F9C5]) [    ] o.e.j.s.h.ContextHandler Started o.e.j.s.ServletContextHandler@44d5a7f8{/w/y,null,AVAILABLE}
   [junit4]   2> 2410342 INFO  (TEST-ForceLeaderTest.testReplicasInLIRNoLeader-seed#[34263DDAC057F9C5]) [    ] o.e.j.s.ServerConnector Started ServerConnector@23c3b79f{HTTP/1.1,[http/1.1]}{127.0.0.1:54837}
   [junit4]   2> 2410343 INFO  (TEST-ForceLeaderTest.testReplicasInLIRNoLeader-seed#[34263DDAC057F9C5]) [    ] o.e.j.s.Server Started @2416834ms
   [junit4]   2> 2410343 INFO  (TEST-ForceLeaderTest.testReplicasInLIRNoLeader-seed#[34263DDAC057F9C5]) [    ] o.a.s.c.s.e.JettySolrRunner Jetty properties: {solr.data.dir=/Users/jenkins/workspace/Lucene-Solr-master-MacOSX/solr/build/solr-core/test/J1/temp/solr.cloud.ForceLeaderTest_34263DDAC057F9C5-001/tempDir-001/control/data, hostContext=/w/y, hostPort=54836, coreRootDirectory=/Users/jenkins/workspace/Lucene-Solr-master-MacOSX/solr/build/solr-core/test/J1/temp/solr.cloud.ForceLeaderTest_34263DDAC057F9C5-001/control-001/cores}
   [junit4]   2> 2410343 INFO  (TEST-ForceLeaderTest.testReplicasInLIRNoLeader-seed#[34263DDAC057F9C5]) [    ] o.a.s.s.SolrDispatchFilter SolrDispatchFilter.init(): sun.misc.Launcher$AppClassLoader@4554617c
   [junit4]   2> 2410343 INFO  (TEST-ForceLeaderTest.testReplicasInLIRNoLeader-seed#[34263DDAC057F9C5]) [    ] o.a.s.c.SolrResourceLoader new SolrResourceLoader for directory: '/Users/jenkins/workspace/Lucene-Solr-master-MacOSX/solr/build/solr-core/test/J1/temp/solr.cloud.ForceLeaderTest_34263DDAC057F9C5-001/control-001'
   [junit4]   2> 2410343 INFO  (TEST-ForceLeaderTest.testReplicasInLIRNoLeader-seed#[34263DDAC057F9C5]) [    ] o.a.s.c.SolrResourceLoader JNDI not configured for solr (NoInitialContextEx)
   [junit4]   2> 2410344 INFO  (TEST-ForceLeaderTest.testReplicasInLIRNoLeader-seed#[34263DDAC057F9C5]) [    ] o.a.s.c.SolrResourceLoader solr home defaulted to 'solr/' (could not find system property or JNDI)
   [junit4]   2> 2410344 INFO  (TEST-ForceLeaderTest.testReplicasInLIRNoLeader-seed#[34263DDAC057F9C5]) [    ] o.a.s.c.c.SolrZkClient Using default ZkCredentialsProvider
   [junit4]   2> 2410345 INFO  (TEST-ForceLeaderTest.testReplicasInLIRNoLeader-seed#[34263DDAC057F9C5]) [    ] o.a.s.c.c.ConnectionManager Waiting for client to connect to ZooKeeper
   [junit4]   2> 2410347 INFO  (zkCallback-3386-thread-1) [    ] o.a.s.c.c.ConnectionManager Watcher org.apache.solr.common.cloud.ConnectionManager@3e7fdbba name:ZooKeeperConnection Watcher:127.0.0.1:54833/solr got event WatchedEvent state:SyncConnected type:None path:null path:null type:None
   [junit4]   2> 2410347 INFO  (TEST-ForceLeaderTest.testReplicasInLIRNoLeader-seed#[34263DDAC057F9C5]) [    ] o.a.s.c.c.ConnectionManager Client is connected to ZooKeeper
   [junit4]   2> 2410348 INFO  (TEST-ForceLeaderTest.testReplicasInLIRNoLeader-seed#[34263DDAC057F9C5]) [    ] o.a.s.c.c.SolrZkClient Using default ZkACLProvider
   [junit4]   2> 2410350 INFO  (TEST-ForceLeaderTest.testReplicasInLIRNoLeader-seed#[34263DDAC057F9C5]) [    ] o.a.s.s.SolrDispatchFilter Loading solr.xml from SolrHome (not found in ZooKeeper)
   [junit4]   2> 2410350 INFO  (TEST-ForceLeaderTest.testReplicasInLIRNoLeader-seed#[34263DDAC057F9C5]) [    ] o.a.s.c.SolrXmlConfig Loading container configuration from /Users/jenkins/workspace/Lucene-Solr-master-MacOSX/solr/build/solr-core/test/J1/temp/solr.cloud.ForceLeaderTest_34263DDAC057F9C5-001/control-001/solr.xml
   [junit4]   2> 2410359 INFO  (TEST-ForceLeaderTest.testReplicasInLIRNoLeader-seed#[34263DDAC057F9C5]) [    ] o.a.s.c.CorePropertiesLocator Config-defined core root directory: /Users/jenkins/workspace/Lucene-Solr-master-MacOSX/solr/build/solr-core/test/J1/temp/solr.cloud.ForceLeaderTest_34263DDAC057F9C5-001/control-001/cores
   [junit4]   2> 2410359 INFO  (TEST-ForceLeaderTest.testReplicasInLIRNoLeader-seed#[34263DDAC057F9C5]) [    ] o.a.s.c.CoreContainer New CoreContainer 1465625194
   [junit4]   2> 2410359 INFO  (TEST-ForceLeaderTest.testReplicasInLIRNoLeader-seed#[34263DDAC057F9C5]) [    ] o.a.s.c.CoreContainer Loading cores into CoreContainer [instanceDir=/Users/jenkins/workspace/Lucene-Solr-master-MacOSX/solr/build/solr-core/test/J1/temp/solr.cloud.ForceLeaderTest_34263DDAC057F9C5-001/control-001]
   [junit4]   2> 2410359 WARN  (TEST-ForceLeaderTest.testReplicasInLIRNoLeader-seed#[34263DDAC057F9C5]) [    ] o.a.s.c.CoreContainer Couldn't add files from /Users/jenkins/workspace/Lucene-Solr-master-MacOSX/solr/build/solr-core/test/J1/temp/solr.cloud.ForceLeaderTest_34263DDAC057F9C5-001/control-001/lib to classpath: /Users/jenkins/workspace/Lucene-Solr-master-MacOSX/solr/build/solr-core/test/J1/temp/solr.cloud.ForceLeaderTest_34263DDAC057F9C5-001/control-001/lib
   [junit4]   2> 2410360 INFO  (TEST-ForceLeaderTest.testReplicasInLIRNoLeader-seed#[34263DDAC057F9C5]) [    ] o.a.s.h.c.HttpShardHandlerFactory created with socketTimeout : 90000,urlScheme : ,connTimeout : 15000,maxConnectionsPerHost : 20,maxConnections : 10000,corePoolSize : 0,maximumPoolSize : 2147483647,maxThreadIdleTime : 5,sizeOfQueue : -1,fairnessPolicy : false,
   [junit4]   2> 2410364 INFO  (TEST-ForceLeaderTest.testReplicasInLIRNoLeader-seed#[34263DDAC057F9C5]) [    ] o.a.s.u.UpdateShardHandler Created UpdateShardHandler HTTP client with params: socketTimeout=340000&connTimeout=45000&maxConnections=100000&maxConnectionsPerHost=100000
   [junit4]   2> 2410364 INFO  (TEST-ForceLeaderTest.testReplicasInLIRNoLeader-seed#[34263DDAC057F9C5]) [    ] o.a.s.l.LogWatcher SLF4J impl is org.slf4j.impl.Log4jLoggerFactory
   [junit4]   2> 2410364 INFO  (TEST-ForceLeaderTest.testReplicasInLIRNoLeader-seed#[34263DDAC057F9C5]) [    ] o.a.s.l.LogWatcher Registering Log Listener [Log4j (org.slf4j.impl.Log4jLoggerFactory)]
   [junit4]   2> 2410364 INFO  (TEST-ForceLeaderTest.testReplicasInLIRNoLeader-seed#[34263DDAC057F9C5]) [    ] o.a.s.c.ZkContainer Zookeeper client=127.0.0.1:54833/solr
   [junit4]   2> 2410364 INFO  (TEST-ForceLeaderTest.testReplicasInLIRNoLeader-seed#[34263DDAC057F9C5]) [    ] o.a.s.c.ZkController zkHost includes chroot
   [junit4]   2> 2410364 INFO  (TEST-ForceLeaderTest.testReplicasInLIRNoLeader-seed#[34263DDAC057F9C5]) [    ] o.a.s.c.c.SolrZkClient Using default ZkCredentialsProvider
   [junit4]   2> 2410364 INFO  (TEST-ForceLeaderTest.testReplicasInLIRNoLeader-seed#[34263DDAC057F9C5]) [    ] o.a.s.c.c.ConnectionManager Waiting for client to connect to ZooKeeper
   [junit4]   2> 2410366 INFO  (zkCallback-3389-thread-1) [    ] o.a.s.c.c.ConnectionManager Watcher org.apache.solr.common.cloud.ConnectionManager@7d2f2e48 name:ZooKeeperConnection Watcher:127.0.0.1:54833 got event WatchedEvent state:SyncConnected type:None path:null path:null type:None
   [junit4]   2> 2410366 INFO  (TEST-ForceLeaderTest.testReplicasInLIRNoLeader-seed#[34263DDAC057F9C5]) [    ] o.a.s.c.c.ConnectionManager Client is connected to ZooKeeper
   [junit4]   2> 2410366 INFO  (TEST-ForceLeaderTest.testReplicasInLIRNoLeader-seed#[34263DDAC057F9C5]) [    ] o.a.s.c.c.SolrZkClient Using default ZkACLProvider
   [junit4]   2> 2410368 INFO  (TEST-ForceLeaderTest.testReplicasInLIRNoLeader-seed#[34263DDAC057F9C5]) [n:127.0.0.1:54836_w%2Fy    ] o.a.s.c.ZkController Added new OnReconnect listener org.apache.solr.cloud.ZkController$$Lambda$99/2095993381@4a77671a
   [junit4]   2> 2410369 INFO  (TEST-ForceLeaderTest.testReplicasInLIRNoLeader-seed#[34263DDAC057F9C5]) [n:127.0.0.1:54836_w%2Fy    ] o.a.s.c.c.ConnectionManager Waiting for client to connect to ZooKeeper
   [junit4]   2> 2410371 INFO  (zkCallback-3390-thread-1-processing-n:127.0.0.1:54836_w%2Fy) [n:127.0.0.1:54836_w%2Fy    ] o.a.s.c.c.ConnectionManager Watcher org.apache.solr.common.cloud.ConnectionManager@1615dce7 name:ZooKeeperConnection Watcher:127.0.0.1:54833/solr got event WatchedEvent state:SyncConnected type:None path:null path:null type:None
   [junit4]   2> 2410371 INFO  (TEST-ForceLeaderTest.testReplicasInLIRNoLeader-seed#[34263DDAC057F9C5]) [n:127.0.0.1:54836_w%2Fy    ] o.a.s.c.c.ConnectionManager Client is connected to ZooKeeper
   [junit4]   2> 2410373 INFO  (TEST-ForceLeaderTest.testReplicasInLIRNoLeader-seed#[34263DDAC057F9C5]) [n:127.0.0.1:54836_w%2Fy    ] o.a.s.c.c.SolrZkClient makePath: /overseer/queue
   [junit4]   2> 2410376 INFO  (TEST-ForceLeaderTest.testReplicasInLIRNoLeader-seed#[34263DDAC057F9C5]) [n:127.0.0.1:54836_w%2Fy    ] o.a.s.c.c.SolrZkClient makePath: /overseer/collection-queue-work
   [junit4]   2> 2410383 INFO  (TEST-ForceLeaderTest.testReplicasInLIRNoLeader-seed#[34263DDAC057F9C5]) [n:127.0.0.1:54836_w%2Fy    ] o.a.s.c.c.SolrZkClient makePath: /overseer/collection-map-running
   [junit4]   2> 2410388 INFO  (TEST-ForceLeaderTest.testReplicasInLIRNoLeader-seed#[34263DDAC057F9C5]) [n:127.0.0.1:54836_w%2Fy    ] o.a.s.c.c.SolrZkClient makePath: /overseer/collection-map-completed
   [junit4]   2> 2410391 INFO  (TEST-ForceLeaderTest.testReplicasInLIRNoLeader-seed#[34263DDAC057F9C5]) [n:127.0.0.1:54836_w%2Fy    ] o.a.s.c.c.SolrZkClient makePath: /overseer/collection-map-failure
   [junit4]   2> 2410394 INFO  (TEST-ForceLeaderTest.testReplicasInLIRNoLeader-seed#[34263DDAC057F9C5]) [n:127.0.0.1:54836_w%2Fy    ] o.a.s.c.c.SolrZkClient makePath: /live_nodes
   [junit4]   2> 2410398 INFO  (TEST-ForceLeaderTest.testReplicasInLIRNoLeader-seed#[34263DDAC057F9C5]) [n:127.0.0.1:54836_w%2Fy    ] o.a.s.c.c.SolrZkClient makePath: /aliases.json
   [junit4]   2> 2410400 INFO  (TEST-ForceLeaderTest.testReplicasInLIRNoLeader-seed#[34263DDAC057F9C5]) [n:127.0.0.1:54836_w%2Fy    ] o.a.s.c.c.SolrZkClient makePath: /clusterstate.json
   [junit4]   2> 2410402 INFO  (TEST-ForceLeaderTest.testReplicasInLIRNoLeader-seed#[34263DDAC057F9C5]) [n:127.0.0.1:54836_w%2Fy    ] o.a.s.c.c.SolrZkClient makePath: /security.json
   [junit4]   2> 2410404 INFO  (TEST-ForceLeaderTest.testReplicasInLIRNoLeader-seed#[34263DDAC057F9C5]) [n:127.0.0.1:54836_w%2Fy    ] o.a.s.c.c.ZkStateReader Updating cluster state from ZooKeeper... 
   [junit4]   2> 2410405 INFO  (TEST-ForceLeaderTest.testReplicasInLIRNoLeader-seed#[34263DDAC057F9C5]) [n:127.0.0.1:54836_w%2Fy    ] o.a.s.c.c.ZkStateReader Loaded empty cluster properties
   [junit4]   2> 2410407 INFO  (TEST-ForceLeaderTest.testReplicasInLIRNoLeader-seed#[34263DDAC057F9C5]) [n:127.0.0.1:54836_w%2Fy    ] o.a.s.c.c.ZkStateReader Updated live nodes from ZooKeeper... (0) -> (0)
   [junit4]   2> 2410412 INFO  (TEST-ForceLeaderTest.testReplicasInLIRNoLeader-seed#[34263DDAC057F9C5]) [n:127.0.0.1:54836_w%2Fy    ] o.a.s.c.c.SolrZkClient makePath: /overseer_elect
   [junit4]   2> 2410415 INFO  (TEST-ForceLeaderTest.testReplicasInLIRNoLeader-seed#[34263DDAC057F9C5]) [n:127.0.0.1:54836_w%2Fy    ] o.a.s.c.c.SolrZkClient makePath: /overseer_elect/election
   [junit4]   2> 2410418 INFO  (TEST-ForceLeaderTest.testReplicasInLIRNoLeader-seed#[34263DDAC057F9C5]) [n:127.0.0.1:54836_w%2Fy    ] o.a.s.c.Overseer Overseer (id=null) closing
   [junit4]   2> 2410419 INFO  (TEST-ForceLeaderTest.testReplicasInLIRNoLeader-seed#[34263DDAC057F9C5]) [n:127.0.0.1:54836_w%2Fy    ] o.a.s.c.LeaderElector Joined leadership election with path: /overseer_elect/election/96577627582627844-127.0.0.1:54836_w%2Fy-n_0000000000
   [junit4]   2> 2410419 INFO  (TEST-ForceLeaderTest.testReplicasInLIRNoLeader-seed#[34263DDAC057F9C5]) [n:127.0.0.1:54836_w%2Fy    ] o.a.s.c.OverseerElectionContext I am going to be the leader 127.0.0.1:54836_w%2Fy
   [junit4]   2> 2410419 INFO  (TEST-ForceLeaderTest.testReplicasInLIRNoLeader-seed#[34263DDAC057F9C5]) [n:127.0.0.1:54836_w%2Fy    ] o.a.s.c.c.SolrZkClient makePath: /overseer_elect/leader
   [junit4]   2> 2410422 INFO  (TEST-ForceLeaderTest.testReplicasInLIRNoLeader-seed#[34263DDAC057F9C5]) [n:127.0.0.1:54836_w%2Fy    ] o.a.s.c.Overseer Overseer (id=96577627582627844-127.0.0.1:54836_w%2Fy-n_0000000000) starting
   [junit4]   2> 2410424 INFO  (TEST-ForceLeaderTest.testReplicasInLIRNoLeader-seed#[34263DDAC057F9C5]) [n:127.0.0.1:54836_w%2Fy    ] o.a.s.c.c.SolrZkClient makePath: /overseer/queue-work
   [junit4]   2> 2410434 INFO  (TEST-ForceLeaderTest.testReplicasInLIRNoLeader-seed#[34263DDAC057F9C5]) [n:127.0.0.1:54836_w%2Fy    ] o.a.s.c.OverseerAutoReplicaFailoverThread Starting OverseerAutoReplicaFailoverThread autoReplicaFailoverWorkLoopDelay=10000 autoReplicaFailoverWaitAfterExpiration=10000 autoReplicaFailoverBadNodeExpiration=60000
   [junit4]   2> 2410435 INFO  (OverseerCollectionConfigSetProcessor-96577627582627844-127.0.0.1:54836_w%2Fy-n_0000000000) [n:127.0.0.1:54836_w%2Fy    ] o.a.s.c.OverseerTaskProcessor Process current queue of overseer operations
   [junit4]   2> 2410435 INFO  (OverseerStateUpdate-96577627582627844-127.0.0.1:54836_w%2Fy-n_0000000000) [n:127.0.0.1:54836_w%2Fy    ] o.a.s.c.Overseer Starting to work on the main queue
   [junit4]   2> 2410435 INFO  (TEST-ForceLeaderTest.testReplicasInLIRNoLeader-seed#[34263DDAC057F9C5]) [n:127.0.0.1:54836_w%2Fy    ] o.a.s.c.ZkController Register node as live in ZooKeeper:/live_nodes/127.0.0.1:54836_w%2Fy
   [junit4]   2> 2410446 INFO  (TEST-ForceLeaderTest.testReplicasInLIRNoLeader-seed#[34263DDAC057F9C5]) [n:127.0.0.1:54836_w%2Fy    ] o.a.s.c.c.SolrZkClient makePath: /live_nodes/127.0.0.1:54836_w%2Fy
   [junit4]   2> 2410448 INFO  (zkCallback-3390-thread-1-processing-n:127.0.0.1:54836_w%2Fy) [n:127.0.0.1:54836_w%2Fy    ] o.a.s.c.c.ZkStateReader A live node change: [WatchedEvent state:SyncConnected type:NodeChildrenChanged path:/live_nodes], has occurred - updating... (live nodes size: [0])
   [junit4]   2> 2410448 INFO  (OverseerStateUpdate-96577627582627844-127.0.0.1:54836_w%2Fy-n_0000000000) [n:127.0.0.1:54836_w%2Fy    ] o.a.s.c.c.ZkStateReader Updated live nodes from ZooKeeper... (0) -> (1)
   [junit4]   2> 2410449 INFO  (zkCallback-3390-thread-1-processing-n:127.0.0.1:54836_w%2Fy) [n:127.0.0.1:54836_w%2Fy    ] o.a.s.c.c.ZkStateReader Updated live nodes from ZooKeeper... (1) -> (1)
   [junit4]   2> 2410457 INFO  (TEST-ForceLeaderTest.testReplicasInLIRNoLeader-seed#[34263DDAC057F9C5]) [n:127.0.0.1:54836_w%2Fy    ] o.a.s.c.CoreContainer Security conf doesn't exist. Skipping setup for authorization module.
   [junit4]   2> 2410457 INFO  (TEST-ForceLeaderTest.testReplicasInLIRNoLeader-seed#[34263DDAC057F9C5]) [n:127.0.0.1:54836_w%2Fy    ] o.a.s.c.CoreContainer No authentication plugin used.
   [junit4]   2> 2410460 INFO  (TEST-ForceLeaderTest.testReplicasInLIRNoLeader-seed#[34263DDAC057F9C5]) [n:127.0.0.1:54836_w%2Fy    ] o.a.s.c.CorePropertiesLocator Looking for core definitions underneath /Users/jenkins/workspace/Lucene-Solr-master-MacOSX/solr/build/solr-core/test/J1/temp/solr.cloud.ForceLeaderTest_34263DDAC057F9C5-001/control-001/cores
   [junit4]   2> 2410461 INFO  (TEST-ForceLeaderTest.testReplicasInLIRNoLeader-seed#[34263DDAC057F9C5]) [n:127.0.0.1:54836_w%2Fy    ] o.a.s.c.CoreDescriptor Created CoreDescriptor: {name=collection1, config=solrconfig.xml, transient=false, schema=schema.xml, loadOnStartup=true, configSetProperties=configsetprops.json, collection=control_collection, coreNodeName=, dataDir=data/, shard=}
   [junit4]   2> 2410461 INFO  (TEST-ForceLeaderTest.testReplicasInLIRNoLeader-seed#[34263DDAC057F9C5]) [n:127.0.0.1:54836_w%2Fy    ] o.a.s.c.CorePropertiesLocator Found core collection1 in /Users/jenkins/workspace/Lucene-Solr-master-MacOSX/solr/build/solr-core/test/J1/temp/solr.cloud.ForceLeaderTest_34263DDAC057F9C5-001/control-001/cores/collection1
   [junit4]   2> 2410461 INFO  (TEST-ForceLeaderTest.testReplicasInLIRNoLeader-seed#[34263DDAC057F9C5]) [n:127.0.0.1:54836_w%2Fy    ] o.a.s.c.CorePropertiesLocator Found 1 core definitions
   [junit4]   2> 2410462 INFO  (TEST-ForceLeaderTest.testReplicasInLIRNoLeader-seed#[34263DDAC057F9C5]) [n:127.0.0.1:54836_w%2Fy    ] o.a.s.s.SolrDispatchFilter user.dir=/Users/jenkins/workspace/Lucene-Solr-master-MacOSX/solr/build/solr-core/test/J1
   [junit4]   2> 2410462 INFO  (coreLoadExecutor-8366-thread-1-processing-n:127.0.0.1:54836_w%2Fy) [n:127.0.0.1:54836_w%2Fy c:control_collection   x:collection1] o.a.s.c.ZkController publishing state=down
   [junit4]   2> 2410462 INFO  (TEST-ForceLeaderTest.testReplicasInLIRNoLeader-seed#[34263DDAC057F9C5]) [n:127.0.0.1:54836_w%2Fy    ] o.a.s.s.SolrDispatchFilter SolrDispatchFilter.init() done
   [junit4]   2> 2410463 INFO  (coreLoadExecutor-8366-thread-1-processing-n:127.0.0.1:54836_w%2Fy) [n:127.0.0.1:54836_w%2Fy c:control_collection   x:collection1] o.a.s.c.ZkController numShards not found on descriptor - reading it from system property
   [junit4]   2> 2410464 INFO  (coreLoadExecutor-8366-thread-1-processing-n:127.0.0.1:54836_w%2Fy) [n:127.0.0.1:54836_w%2Fy c:control_collection   x:collection1] o.a.s.c.ZkController Collection control_collection not visible yet, but flagging it so a watch is registered when it becomes visible
   [junit4]   2> 2410465 INFO  (OverseerStateUpdate-96577627582627844-127.0.0.1:54836_w%2Fy-n_0000000000) [n:127.0.0.1:54836_w%2Fy    ] o.a.s.c.Overseer processMessage: queueSize: 1, message = {
   [junit4]   2>   "core":"collection1",
   [junit4]   2>   "roles":null,
   [junit4]   2>   "base_url":"http://127.0.0.1:54836/w/y",
   [junit4]   2>   "node_name":"127.0.0.1:54836_w%2Fy",
   [junit4]   2>   "numShards":"1",
   [junit4]   2>   "state":"down",
   [junit4]   2>   "shard":null,
   [junit4]   2>   "collection":"control_collection",
   [junit4]   2>   "operation":"state"} current state version: 0
   [junit4]   2> 2410465 INFO  (OverseerStateUpdate-96577627582627844-127.0.0.1:54836_w%2Fy-n_0000000000) [n:127.0.0.1:54836_w%2Fy    ] o.a.s.c.o.ReplicaMutator Update state numShards=1 message={
   [junit4]   2>   "core":"collection1",
   [junit4]   2>   "roles":null,
   [junit4]   2>   "base_url":"http://127.0.0.1:54836/w/y",
   [junit4]   2>   "node_name":"127.0.0.1:54836_w%2Fy",
   [junit4]   2>   "numShards":"1",
   [junit4]   2>   "state":"down",
   [junit4]   2>   "shard":null,
   [junit4]   2>   "collection":"control_collection",
   [junit4]   2>   "operation":"state"}
   [junit4]   2> 2410466 INFO  (coreLoadExecutor-8366-thread-1-processing-n:127.0.0.1:54836_w%2Fy) [n:127.0.0.1:54836_w%2Fy c:control_collection   x:collection1] o.a.s.c.c.ZkStateReader Deleting data for [control_collection]
   [junit4]   2> 2410467 INFO  (OverseerStateUpdate-96577627582627844-127.0.0.1:54836_w%2Fy-n_0000000000) [n:127.0.0.1:54836_w%2Fy    ] o.a.s.c.o.ClusterStateMutator building a new cName: control_collection
   [junit4]   2> 2410468 INFO  (OverseerStateUpdate-96577627582627844-127.0.0.1:54836_w%2Fy-n_0000000000) [n:127.0.0.1:54836_w%2Fy    ] o.a.s.c.o.ReplicaMutator Assigning new node to shard shard=shard1
   [junit4]   2> 2410469 INFO  (coreLoadExecutor-8366-thread-1-processing-n:127.0.0.1:54836_w%2Fy) [n:127.0.0.1:54836_w%2Fy c:control_collection   x:collection1] o.a.s.c.ZkController look for our core node name
   [junit4]   2> 2410470 INFO  (zkCallback-3390-thread-1-processing-n:127.0.0.1:54836_w%2Fy) [n:127.0.0.1:54836_w%2Fy    ] o.a.s.c.c.ZkStateReader A cluster state change: [WatchedEvent state:SyncConnected type:NodeDataChanged path:/clusterstate.json], has occurred - updating... (live nodes size: [1])
   [junit4]   2> 2411471 INFO  (coreLoadExecutor-8366-thread-1-processing-n:127.0.0.1:54836_w%2Fy) [n:127.0.0.1:54836_w%2Fy c:control_collection   x:collection1] o.a.s.c.ZkController waiting to find shard id in clusterstate for collection1
   [junit4]   2> 2411471 INFO  (coreLoadExecutor-8366-thread-1-processing-n:127.0.0.1:54836_w%2Fy) [n:127.0.0.1:54836_w%2Fy c:control_collection   x:collection1] o.a.s.c.ZkController Check for collection zkNode:control_collection
   [junit4]   2> 2411473 INFO  (coreLoadExecutor-8366-thread-1-processing-n:127.0.0.1:54836_w%2Fy) [n:127.0.0.1:54836_w%2Fy c:control_collection   x:collection1] o.a.s.c.ZkController Collection zkNode exists
   [junit4]   2> 2411473 INFO  (coreLoadExecutor-8366-thread-1-processing-n:127.0.0.1:54836_w%2Fy) [n:127.0.0.1:54836_w%2Fy c:control_collection   x:collection1] o.a.s.c.c.ZkStateReader Load collection config from: [/collections/control_collection]
   [junit4]   2> 2411476 INFO  (coreLoadExecutor-8366-thread-1-processing-n:127.0.0.1:54836_w%2Fy) [n:127.0.0.1:54836_w%2Fy c:control_collection   x:collection1] o.a.s.c.c.ZkStateReader path=[/collections/control_collection] [configName]=[conf1] specified config exists in ZooKeeper
   [junit4]   2> 2411476 INFO  (coreLoadExecutor-8366-thread-1-processing-n:127.0.0.1:54836_w%2Fy) [n:127.0.0.1:54836_w%2Fy c:control_collection   x:collection1] o.a.s.c.SolrResourceLoader new SolrResourceLoader for directory: '/Users/jenkins/workspace/Lucene-Solr-master-MacOSX/solr/build/solr-core/test/J1/temp/solr.cloud.ForceLeaderTest_34263DDAC057F9C5-001/control-001/cores/collection1'
   [junit4]   2> 2411476 INFO  (coreLoadExecutor-8366-thread-1-processing-n:127.0.0.1:54836_w%2Fy) [n:127.0.0.1:54836_w%2Fy c:control_collection   x:collection1] o.a.s.c.SolrResourceLoader JNDI not configured for solr (NoInitialContextEx)
   [junit4]   2> 2411476 INFO  (coreLoadExecutor-8366-thread-1-processing-n:127.0.0.1:54836_w%2Fy) [n:127.0.0.1:54836_w%2Fy c:control_collection   x:collection1] o.a.s.c.SolrResourceLoader solr home defaulted to 'solr/' (could not find system property or JNDI)
   [junit4]   2> 2411479 INFO  (coreLoadExecutor-8366-thread-1-processing-n:127.0.0.1:54836_w%2Fy) [n:127.0.0.1:54836_w%2Fy c:control_collection   x:collection1] o.a.s.c.Config loaded config solrconfig.xml with version 0 
   [junit4]   2> 2411484 INFO  (coreLoadExecutor-8366-thread-1-processing-n:127.0.0.1:54836_w%2Fy) [n:127.0.0.1:54836_w%2Fy c:control_collection   x:collection1] o.a.s.c.SolrConfig current version of requestparams : -1
   [junit4]   2> 2411487 WARN  (coreLoadExecutor-8366-thread-1-processing-n:127.0.0.1:54836_w%2Fy) [n:127.0.0.1:54836_w%2Fy c:control_collection   x:collection1] o.a.s.c.Config Beginning with Solr 5.5, <mergePolicy> is deprecated, use <mergePolicyFactory> instead.
   [junit4]   2> 2411488 INFO  (coreLoadExecutor-8366-thread-1-processing-n:127.0.0.1:54836_w%2Fy) [n:127.0.0.1:54836_w%2Fy c:control_collection   x:collection1] o.a.s.c.SolrConfig Using Lucene MatchVersion: 7.0.0
   [junit4]   2> 2411495 INFO  (coreLoadExecutor-8366-thread-1-processing-n:127.0.0.1:54836_w%2Fy) [n:127.0.0.1:54836_w%2Fy c:control_collection   x:collection1] o.a.s.c.SolrConfig Loaded SolrConfig: solrconfig.xml
   [junit4]   2> 2411503 INFO  (coreLoadExecutor-8366-thread-1-processing-n:127.0.0.1:54836_w%2Fy) [n:127.0.0.1:54836_w%2Fy c:control_collection   x:collection1] o.a.s.s.IndexSchema [collection1] Schema name=test
   [junit4]   2> 2411634 INFO  (coreLoadExecutor-8366-thread-1-processing-n:127.0.0.1:54836_w%2Fy) [n:127.0.0.1:54836_w%2Fy c:control_collection   x:collection1] o.a.s.s.OpenExchangeRatesOrgProvider Initialized with rates=open-exchange-rates.json, refreshInterval=1440.
   [junit4]   2> 2411640 INFO  (coreLoadExecutor-8366-thread-1-processing-n:127.0.0.1:54836_w%2Fy) [n:127.0.0.1:54836_w%2Fy c:control_collection   x:collection1] o.a.s.s.IndexSchema default search field in schema is text
   [junit4]   2> 2411642 INFO  (coreLoadExecutor-8366-thread-1-processing-n:127.0.0.1:54836_w%2Fy) [n:127.0.0.1:54836_w%2Fy c:control_collection   x:collection1] o.a.s.s.IndexSchema unique key field: id
   [junit4]   2> 2411658 INFO  (coreLoadExecutor-8366-thread-1-processing-n:127.0.0.1:54836_w%2Fy) [n:127.0.0.1:54836_w%2Fy c:control_collection   x:collection1] o.a.s.s.FileExchangeRateProvider Reloading exchange rates from file currency.xml
   [junit4]   2> 2411661 INFO  (coreLoadExecutor-8366-thread-1-processing-n:127.0.0.1:54836_w%2Fy) [n:127.0.0.1:54836_w%2Fy c:control_collection   x:collection1] o.a.s.s.FileExchangeRateProvider Reloading exchange rates from file currency.xml
   [junit4]   2> 2411663 INFO  (coreLoadExecutor-8366-thread-1-processing-n:127.0.0.1:54836_w%2Fy) [n:127.0.0.1:54836_w%2Fy c:control_collection   x:collection1] o.a.s.s.OpenExchangeRatesOrgProvider Reloading exchange rates from open-exchange-rates.json
   [junit4]   2> 2411664 INFO  (coreLoadExecutor-8366-thread-1-processing-n:127.0.0.1:54836_w%2Fy) [n:127.0.0.1:54836_w%2Fy c:control_collection   x:collection1] o.a.s.s.OpenExchangeRatesOrgProvider Reloading exchange rates from open-exchange-rates.json
   [junit4]   2> 2411668 INFO  (coreLoadExecutor-8366-thread-1-processing-n:127.0.0.1:54836_w%2Fy) [n:127.0.0.1:54836_w%2Fy c:control_collection   x:collection1] o.a.s.c.ConfigSetProperties Did not find ConfigSet properties, assuming default properties: Can't find resource 'configsetprops.json' in classpath or '/configs/conf1', cwd=/Users/jenkins/workspace/Lucene-Solr-master-MacOSX/solr/build/solr-core/test/J1
   [junit4]   2> 2411668 INFO  (coreLoadExecutor-8366-thread-1-processing-n:127.0.0.1:54836_w%2Fy) [n:127.0.0.1:54836_w%2Fy c:control_collection   x:collection1] o.a.s.c.CoreContainer Creating SolrCore 'collection1' using configuration from collection control_collection
   [junit4]   2> 2411668 INFO  (coreLoadExecutor-8366-thread-1-processing-n:127.0.0.1:54836_w%2Fy) [n:127.0.0.1:54836_w%2Fy c:control_collection s:shard1 r:core_node1 x:collection1] o.a.s.c.SolrCore org.apache.solr.core.MockDirectoryFactory
   [junit4]   2> 2411668 INFO  (coreLoadExecutor-8366-thread-1-processing-n:127.0.0.1:54836_w%2Fy) [n:127.0.0.1:54836_w%2Fy c:control_collection s:shard1 r:core_node1 x:collection1] o.a.s.c.SolrCore [[collection1] ] Opening new SolrCore at [/Users/jenkins/workspace/Lucene-Solr-master-MacOSX/solr/build/solr-core/test/J1/temp/solr.cloud.ForceLeaderTest_34263DDAC057F9C5-001/control-001/cores/collection1], dataDir=[/Users/jenkins/workspace/Lucene-Solr-master-MacOSX/solr/build/solr-core/test/J1/temp/solr.cloud.ForceLeaderTest_34263DDAC057F9C5-001/control-001/cores/collection1/data/]
   [junit4]   2> 2411668 INFO  (coreLoadExecutor-8366-thread-1-processing-n:127.0.0.1:54836_w%2Fy) [n:127.0.0.1:54836_w%2Fy c:control_collection s:shard1 r:core_node1 x:collection1] o.a.s.c.JmxMonitoredMap JMX monitoring is enabled. Adding Solr mbeans to JMX Server: com.sun.jmx.mbeanserver.JmxMBeanServer@1046b542
   [junit4]   2> 2411669 INFO  (coreLoadExecutor-8366-thread-1-processing-n:127.0.0.1:54836_w%2Fy) [n:127.0.0.1:54836_w%2Fy c:control_collection s:shard1 r:core_node1 x:collection1] o.a.s.c.CachingDirectoryFactory return new directory for /Users/jenkins/workspace/Lucene-Solr-master-MacOSX/solr/build/solr-core/test/J1/temp/solr.cloud.ForceLeaderTest_34263DDAC057F9C5-001/control-001/cores/collection1/data/snapshot_metadata
   [junit4]   2> 2411669 INFO  (coreLoadExecutor-8366-thread-1-processing-n:127.0.0.1:54836_w%2Fy) [n:127.0.0.1:54836_w%2Fy c:control_collection s:shard1 r:core_node1 x:collection1] o.a.s.c.s.SolrSnapshotMetaDataManager Loading from snapshot metadata file...
   [junit4]   2> 2411669 INFO  (coreLoadExecutor-8366-thread-1-processing-n:127.0.0.1:54836_w%2Fy) [n:127.0.0.1:54836_w%2Fy c:control_collection s:shard1 r:core_node1 x:collection1] o.a.s.c.CachingDirectoryFactory return new directory for /Users/jenkins/workspace/Lucene-Solr-master-MacOSX/solr/build/solr-core/test/J1/temp/solr.cloud.ForceLeaderTest_34263DDAC057F9C5-001/control-001/cores/collection1/data
   [junit4]   2> 2411669 INFO  (coreLoadExecutor-8366-thread-1-processing-n:127.0.0.1:54836_w%2Fy) [n:127.0.0.1:54836_w%2Fy c:control_collection s:shard1 r:core_node1 x:collection1] o.a.s.c.SolrCore New index directory detected: old=null new=/Users/jenkins/workspace/Lucene-Solr-master-MacOSX/solr/build/solr-core/test/J1/temp/solr.cloud.ForceLeaderTest_34263DDAC057F9C5-001/control-001/cores/collection1/data/index/
   [junit4]   2> 2411670 WARN  (coreLoadExecutor-8366-thread-1-processing-n:127.0.0.1:54836_w%2Fy) [n:127.0.0.1:54836_w%2Fy c:control_collection s:shard1 r:core_node1 x:collection1] o.a.s.c.SolrCore [collection1] Solr index directory '/Users/jenkins/workspace/Lucene-Solr-master-MacOSX/solr/build/solr-core/test/J1/temp/solr.cloud.ForceLeaderTest_34263DDAC057F9C5-001/control-001/cores/collection1/data/index' doesn't exist. Creating new index...
   [junit4]   2> 2411671 INFO  (coreLoadExecutor-8366-thread-1-processing-n:127.0.0.1:54836_w%2Fy) [n:127.0.0.1:54836_w%2Fy c:control_collection s:shard1 r:core_node1 x:collection1] o.a.s.c.CachingDirectoryFactory return new directory for /Users/jenkins/workspace/Lucene-Solr-master-MacOSX/solr/build/solr-core/test/J1/temp/solr.cloud.ForceLeaderTest_34263DDAC057F9C5-001/control-001/cores/collection1/data/index
   [junit4]   2> 2411671 INFO  (coreLoadExecutor-8366-thread-1-processing-n:127.0.0.1:54836_w%2Fy) [n:127.0.0.1:54836_w%2Fy c:control_collection s:shard1 r:core_node1 x:collection1] o.a.s.u.RandomMergePolicy RandomMergePolicy wrapping class org.apache.lucene.index.TieredMergePolicy: [TieredMergePolicy: maxMergeAtOnce=26, maxMergeAtOnceExplicit=13, maxMergedSegmentMB=5.28515625, floorSegmentMB=0.875, forceMergeDeletesPctAllowed=8.934913770999959, segmentsPerTier=42.0, maxCFSSegmentSizeMB=8.796093022207999E12, noCFSRatio=0.13738807803498584
   [junit4]   2> 2411671 INFO  (coreLoadExecutor-8366-thread-1-processing-n:127.0.0.1:54836_w%2Fy) [n:127.0.0.1:54836_w%2Fy c:control_collection s:shard1 r:core_node1 x:collection1] o.a.s.c.SolrDeletionPolicy SolrDeletionPolicy.onCommit: commits: num=1
   [junit4]   2> 	commit{dir=MockDirectoryWrapper(RAMDirectory@5310e3f1 lockFactory=org.apache.lucene.store.SingleInstanceLockFactory@3bb8144d),segFN=segments_1,generation=1}
   [junit4]   2> 2411671 INFO  (coreLoadExecutor-8366-thread-1-processing-n:127.0.0.1:54836_w%2Fy) [n:127.0.0.1:54836_w%2Fy c:control_collection s:shard1 r:core_node1 x:collection1] o.a.s.c.SolrDeletionPolicy newest commit generation = 1
   [junit4]   2> 2411672 INFO  (OldIndexDirectoryCleanupThreadForCore-collection1) [n:127.0.0.1:54836_w%2Fy c:control_collection s:shard1 r:core_node1 x:collection1] o.a.s.c.SolrCore Looking for old index directories to cleanup for core collection1 in /Users/jenkins/workspace/Lucene-Solr-master-MacOSX/solr/build/solr-core/test/J1/temp/solr.cloud.ForceLeaderTest_34263DDAC057F9C5-001/control-001/cores/collection1/data/
   [junit4]   2> 2411672 WARN  (OldIndexDirectoryCleanupThreadForCore-collection1) [n:127.0.0.1:54836_w%2Fy c:control_collection s:shard1 r:core_node1 x:collection1] o.a.s.c.DirectoryFactory /Users/jenkins/workspace/Lucene-Solr-master-MacOSX/solr/build/solr-core/test/J1/temp/solr.cloud.ForceLeaderTest_34263DDAC057F9C5-001/control-001/cores/collection1/data/ does not point to a valid data directory; skipping clean-up of old index directories.
   [junit4]   2> 2411674 INFO  (coreLoadExecutor-8366-thread-1-processing-n:127.0.0.1:54836_w%2Fy) [n:127.0.0.1:54836_w%2Fy c:control_collection s:shard1 r:core_node1 x:collection1] o.a.s.u.p.UpdateRequestProcessorChain creating updateRequestProcessorChain "nodistrib"
   [junit4]   2> 2411674 INFO  (coreLoadExecutor-8366-thread-1-processing-n:127.0.0.1:54836_w%2Fy) [n:127.0.0.1:54836_w%2Fy c:control_collection s:shard1 r:core_node1 x:collection1] o.a.s.u.p.UpdateRequestProcessorChain creating updateRequestProcessorChain "dedupe"
   [junit4]   2> 2411674 INFO  (coreLoadExecutor-8366-thread-1-processing-n:127.0.0.1:54836_w%2Fy) [n:127.0.0.1:54836_w%2Fy c:control_collection s:shard1 r:core_node1 x:collection1] o.a.s.u.p.UpdateRequestProcessorChain inserting DistributedUpdateProcessorFactory into updateRequestProcessorChain "dedupe"
   [junit4]   2> 2411674 INFO  (coreLoadExecutor-8366-thread-1-processing-n:127.0.0.1:54836_w%2Fy) [n:127.0.0.1:54836_w%2Fy c:control_collection s:shard1 r:core_node1 x:collection1] o.a.s.u.p.UpdateRequestProcessorChain creating updateRequestProcessorChain "stored_sig"
   [junit4]   2> 2411675 INFO  (coreLoadExecutor-8366-thread-1-processing-n:127.0.0.1:54836_w%2Fy) [n:127.0.0.1:54836_w%2Fy c:control_collection s:shard1 r:core_node1 x:collection1] o.a.s.u.p.UpdateRequestProcessorChain inserting DistributedUpdateProcessorFactory into updateRequestProcessorChain "stored_sig"
   [junit4]   2> 2411675 INFO  (coreLoadExecutor-8366-thread-1-processing-n:127.0.0.1:54836_w%2Fy) [n:127.0.0.1:54836_w%2Fy c:control_collection s:shard1 r:core_node1 x:collection1] o.a.s.u.p.UpdateRequestProcessorChain creating updateRequestProcessorChain "distrib-dup-test-chain-explicit"
   [junit4]   2> 2411675 INFO  (coreLoadExecutor-8366-thread-1-processing-n:127.0.0.1:54836_w%2Fy) [n:127.0.0.1:54836_w%2Fy c:control_collection s:shard1 r:core_node1 x:collection1] o.a.s.u.p.UpdateRequestProcessorChain creating updateRequestProcessorChain "distrib-dup-test-chain-implicit"
   [junit4]   2> 2411675 INFO  (coreLoadExecutor-8366-thread-1-processing-n:127.0.0.1:54836_w%2Fy) [n:127.0.0.1:54836_w%2Fy c:control_collection s:shard1 r:core_node1 x:collection1] o.a.s.u.p.UpdateRequestProcessorChain inserting DistributedUpdateProcessorFactory into updateRequestProcessorChain "distrib-dup-test-chain-implicit"
   [junit4]   2> 2411675 INFO  (coreLoadExecutor-8366-thread-1-processing-n:127.0.0.1:54836_w%2Fy) [n:127.0.0.1:54836_w%2Fy c:control_collection s:shard1 r:core_node1 x:collection1] o.a.s.c.SolrCore no updateRequestProcessorChain defined as default, creating implicit default
   [junit4]   2> 2411675 WARN  (coreLoadExecutor-8366-thread-1-processing-n:127.0.0.1:54836_w%2Fy) [n:127.0.0.1:54836_w%2Fy c:control_collection s:shard1 r:core_node1 x:collection1] o.a.s.c.RequestHandlers INVALID paramSet a in requestHandler {type = requestHandler,name = /dump,class = DumpRequestHandler,args = {defaults={a=A,b=B}}}
   [junit4]   2> 2411681 INFO  (coreLoadExecutor-8366-thread-1-processing-n:127.0.0.1:54836_w%2Fy) [n:127.0.0.1:54836_w%2Fy c:control_collection s:shard1 r:core_node1 x:collection1] o.a.s.h.l.XMLLoader xsltCacheLifetimeSeconds=60
   [junit4]   2> 2411681 INFO  (coreLoadExecutor-8366-thread-1-processing-n:127.0.0.1:54836_w%2Fy) [n:127.0.0.1:54836_w%2Fy c:control_collection s:shard1 r:core_node1 x:collection1] o.a.s.h.l.XMLLoader xsltCacheLifetimeSeconds=60
   [junit4]   2> 2411682 INFO  (coreLoadExecutor-8366-thread-1-processing-n:127.0.0.1:54836_w%2Fy) [n:127.0.0.1:54836_w%2Fy c:control_collection s:shard1 r:core_node1 x:collection1] o.a.s.h.l.XMLLoader xsltCacheLifetimeSeconds=60
   [junit4]   2> 2411683 INFO  (coreLoadExecutor-8366-thread-1-processing-n:127.0.0.1:54836_w%2Fy) [n:127.0.0.1:54836_w%2Fy c:control_collection s:shard1 r:core_node1 x:collection1] o.a.s.h.l.XMLLoader xsltCacheLifetimeSeconds=60
   [junit4]   2> 2411687 INFO  (coreLoadExecutor-8366-thread-1-processing-n:127.0.0.1:54836_w%2Fy) [n:127.0.0.1:54836_w%2Fy c:control_collection s:shard1 r:core_node1 x:collection1] o.a.s.c.RequestHandlers Registered paths: /admin/mbeans,standard,/update/json/docs,/admin/luke,/export,/get,/admin/properties,/update/json,/admin/threads,/dump,/update/csv,/sql,/graph,/admin/segments,/admin/system,/replication,/config,/stream,/schema,/admin/plugins,/admin/logging,/admin/ping,/update,/admin/file,/terms
   [junit4]   2> 2411687 INFO  (coreLoadExecutor-8366-thread-1-processing-n:127.0.0.1:54836_w%2Fy) [n:127.0.0.1:54836_w%2Fy c:control_collection s:shard1 r:core_node1 x:collection1] o.a.s.c.SolrCore Using default statsCache cache: org.apache.solr.search.stats.LocalStatsCache
   [junit4]   2> 2411688 INFO  (coreLoadExecutor-8366-thread-1-processing-n:127.0.0.1:54836_w%2Fy) [n:127.0.0.1:54836_w%2Fy c:control_collection s:shard1 r:core_node1 x:collection1] o.a.s.u.UpdateHandler Using UpdateLog implementation: org.apache.solr.update.UpdateLog
   [junit4]   2> 2411688 INFO  (coreLoadExecutor-8366-thread-1-processing-n:127.0.0.1:54836_w%2Fy) [n:127.0.0.1:54836_w%2Fy c:control_collection s:shard1 r:core_node1 x:collection1] o.a.s.u.UpdateLog Initializing UpdateLog: dataDir= defaultSyncLevel=FLUSH numRecordsToKeep=100 maxNumLogsToKeep=10 numVersionBuckets=65536
   [junit4]   2> 2411689 INFO  (coreLoadExecutor-8366-thread-1-processing-n:127.0.0.1:54836_w%2Fy) [n:127.0.0.1:54836_w%2Fy c:control_collection s:shard1 r:core_node1 x:collection1] o.a.s.u.CommitTracker Hard AutoCommit: disabled
   [junit4]   2> 2411689 INFO  (coreLoadExecutor-8366-thread-1-processing-n:127.0.0.1:54836_w%2Fy) [n:127.0.0.1:54836_w%2Fy c:control_collection s:shard1 r:core_node1 x:collection1] o.a.s.u.CommitTracker Soft AutoCommit: disabled
   [junit4]   2> 2411689 INFO  (coreLoadExecutor-8366-thread-1-processing-n:127.0.0.1:54836_w%2Fy) [n:127.0.0.1:54836_w%2Fy c:control_collection s:shard1 r:core_node1 x:collection1] o.a.s.u.RandomMergePolicy RandomMergePolicy wrapping class org.apache.lucene.index.LogDocMergePolicy: [LogDocMergePolicy: minMergeSize=1000, mergeFactor=12, maxMergeSize=9223372036854775807, maxMergeSizeForForcedMerge=9223372036854775807, calibrateSizeByDeletes=true, maxMergeDocs=2147483647, maxCFSSegmentSizeMB=8.796093022207999E12, noCFSRatio=0.40752785006859626]
   [junit4]   2> 2411689 INFO  (coreLoadExecutor-8366-thread-1-processing-n:127.0.0.1:54836_w%2Fy) [n:127.0.0.1:54836_w%2Fy c:control_collection s:shard1 r:core_node1 x:collection1] o.a.s.c.SolrDeletionPolicy SolrDeletionPolicy.onInit: commits: num=1
   [junit4]   2> 	commit{dir=MockDirectoryWrapper(RAMDirectory@5310e3f1 lockFactory=org.apache.lucene.store.SingleInstanceLockFactory@3bb8144d),segFN=segments_1,generation=1}
   [junit4]   2> 2411689 INFO  (coreLoadExecutor-8366-thread-1-processing-n:127.0.0.1:54836_w%2Fy) [n:127.0.0.1:54836_w%2Fy c:control_collection s:shard1 r:core_node1 x:collection1] o.a.s.c.SolrDeletionPolicy newest commit generation = 1
   [junit4]   2> 2411690 INFO  (coreLoadExecutor-8366-thread-1-processing-n:127.0.0.1:54836_w%2Fy) [n:127.0.0.1:54836_w%2Fy c:control_collection s:shard1 r:core_node1 x:collection1] o.a.s.s.SolrIndexSearcher Opening [Searcher@7ab5b108[collection1] main]
   [junit4]   2> 2411690 INFO  (coreLoadExecutor-8366-thread-1-processing-n:127.0.0.1:54836_w%2Fy) [n:127.0.0.1:54836_w%2Fy c:control_collection s:shard1 r:core_node1 x:collection1] o.a.s.c.c.ZkStateReader Load collection config from: [/collections/control_collection]
   [junit4]   2> 2411691 INFO  (coreLoadExecutor-8366-thread-1-processing-n:127.0.0.1:54836_w%2Fy) [n:127.0.0.1:54836_w%2Fy c:control_collection s:shard1 r:core_node1 x:collection1] o.a.s.c.c.ZkStateReader path=[/collections/control_collection] [configName]=[conf1] specified config exists in ZooKeeper
   [junit4]   2> 2411691 INFO  (coreLoadExecutor-8366-thread-1-processing-n:127.0.0.1:54836_w%2Fy) [n:127.0.0.1:54836_w%2Fy c:control_collection s:shard1 r:core_node1 x:collection1] o.a.s.r.ManagedResourceStorage Setting up ZooKeeper-based storage for the RestManager with znodeBase: /configs/conf1
   [junit4]   2> 2411691 INFO  (coreLoadExecutor-8366-thread-1-processing-n:127.0.0.1:54836_w%2Fy) [n:127.0.0.1:54836_w%2Fy c:control_collection s:shard1 r:core_node1 x:collection1] o.a.s.r.ManagedResourceStorage Configured ZooKeeperStorageIO with znodeBase: /configs/conf1
   [junit4]   2> 2411691 INFO  (coreLoadExecutor-8366-thread-1-processing-n:127.0.0.1:54836_w%2Fy) [n:127.0.0.1:54836_w%2Fy c:control_collection s:shard1 r:core_node1 x:collection1] o.a.s.r.RestManager Initializing RestManager with initArgs: {}
   [junit4]   2> 2411691 INFO  (coreLoadExecutor-8366-thread-1-processing-n:127.0.0.1:54836_w%2Fy) [n:127.0.0.1:54836_w%2Fy c:control_collection s:shard1 r:core_node1 x:collection1] o.a.s.r.ManagedResourceStorage Reading _rest_managed.json using ZooKeeperStorageIO:path=/configs/conf1
   [junit4]   2> 2411692 INFO  (coreLoadExecutor-8366-thread-1-processing-n:127.0.0.1:54836_w%2Fy) [n:127.0.0.1:54836_w%2Fy c:control_collection s:shard1 r:core_node1 x:collection1] o.a.s.r.ManagedResourceStorage No data found for znode /configs/conf1/_rest_managed.json
   [junit4]   2> 2411692 INFO  (coreLoadExecutor-8366-thread-1-processing-n:127.0.0.1:54836_w%2Fy) [n:127.0.0.1:54836_w%2Fy c:control_collection s:shard1 r:core_node1 x:collection1] o.a.s.r.ManagedResourceStorage Loaded null at path _rest_managed.json using ZooKeeperStorageIO:path=/configs/conf1
   [junit4]   2> 2411692 INFO  (coreLoadExecutor-8366-thread-1-processing-n:127.0.0.1:54836_w%2Fy) [n:127.0.0.1:54836_w%2Fy c:control_collection s:shard1 r:core_node1 x:collection1] o.a.s.r.RestManager Initializing 0 registered ManagedResources
   [junit4]   2> 2411692 INFO  (coreLoadExecutor-8366-thread-1-processing-n:127.0.0.1:54836_w%2Fy) [n:127.0.0.1:54836_w%2Fy c:control_collection s:shard1 r:core_node1 x:collection1] o.a.s.h.ReplicationHandler Commits will be reserved for  10000
   [junit4]   2> 2411693 INFO  (searcherExecutor-8367-thread-1-processing-n:127.0.0.1:54836_w%2Fy x:collection1 s:shard1 c:control_collection r:core_node1) [n:127.0.0.1:54836_w%2Fy c:control_collection s:shard1 r:core_node1 x:collection1] o.a.s.c.SolrCore [collection1] Registered new searcher Searcher@7ab5b108[collection1] main{ExitableDirectoryReader(UninvertingDirectoryReader())}
   [junit4]   2> 2411693 INFO  (coreLoadExecutor-8366-thread-1-processing-n:127.0.0.1:54836_w%2Fy) [n:127.0.0.1:54836_w%2Fy c:control_collection s:shard1 r:core_node1 x:collection1] o.a.s.u.UpdateLog Looking up max value of version field to seed version buckets
   [junit4]   2> 2411693 INFO  (coreLoadExecutor-8366-thread-1-processing-n:127.0.0.1:54836_w%2Fy) [n:127.0.0.1:54836_w%2Fy c:control_collection s:shard1 r:core_node1 x:collection1] o.a.s.u.VersionInfo Refreshing highest value of _version_ for 65536 version buckets from index
   [junit4]   2> 2411693 INFO  (coreLoadExecutor-8366-thread-1-processing-n:127.0.0.1:54836_w%2Fy) [n:127.0.0.1:54836_w%2Fy c:control_collection s:shard1 r:core_node1 x:collection1] o.a.s.u.VersionInfo No terms found for _version_, cannot seed version bucket highest value from index
   [junit4]   2> 2411693 INFO  (coreLoadExecutor-8366-thread-1-processing-n:127.0.0.1:54836_w%2Fy) [n:127.0.0.1:54836_w%2Fy c:control_collection s:shard1 r:core_node1 x:collection1] o.a.s.u.UpdateLog Could not find max version in index or recent updates, using new clock 1545242045485940736
   [junit4]   2> 2411695 INFO  (coreLoadExecutor-8366-thread-1-processing-n:127.0.0.1:54836_w%2Fy) [n:127.0.0.1:54836_w%2Fy c:control_collection s:shard1 r:core_node1 x:collection1] o.a.s.u.UpdateLog Took 2.0ms to seed version buckets with highest version 1545242045485940736
   [junit4]   2> 2411695 INFO  (coreLoadExecutor-8366-thread-1-processing-n:127.0.0.1:54836_w%2Fy) [n:127.0.0.1:54836_w%2Fy c:control_collection s:shard1 r:core_node1 x:collection1] o.a.s.c.ZkController watch zkdir /configs/conf1
   [junit4]   2> 2411696 INFO  (coreLoadExecutor-8366-thread-1-processing-n:127.0.0.1:54836_w%2Fy) [n:127.0.0.1:54836_w%2Fy c:control_collection s:shard1 r:core_node1 x:collection1] o.a.s.c.CoreContainer registering core: collection1
   [junit4]   2> 2411697 INFO  (coreZkRegister-8359-thread-1-processing-n:127.0.0.1:54836_w%2Fy x:collection1 s:shard1 c:control_collection r:core_node1) [n:127.0.0.1:54836_w%2Fy c:control_collection s:shard1 r:core_node1 x:collection1] o.a.s.c.ZkController Register replica - core:collection1 address:http://127.0.0.1:54836/w/y collection:control_collection shard:shard1
   [junit4]   2> 2411698 INFO  (coreZkRegister-8359-thread-1-processing-n:127.0.0.1:54836_w%2Fy x:collection1 s:shard1 c:control_collection r:core_node1) [n:127.0.0.1:54836_w%2Fy c:control_collection s:shard1 r:core_node1 x:collection1] o.a.s.c.c.SolrZkClient makePath: /collections/control_collection/leader_elect/shard1/election
   [junit4]   2> 2411705 INFO  (coreZkRegister-8359-thread-1-processing-n:127.0.0.1:54836_w%2Fy x:collection1 s:shard1 c:control_collection r:core_node1) [n:127.0.0.1:54836_w%2Fy c:control_collection s:shard1 r:core_node1 x:collection1] o.a.s.c.LeaderElector Joined leadership election with path: /collections/control_collection/leader_elect/shard1/election/96577627582627844-core_node1-n_0000000000
   [junit4]   2> 2411705 INFO  (coreZkRegister-8359-thread-1-processing-n:127.0.0.1:54836_w%2Fy x:collection1 s:shard1 c:control_collection r:core_node1) [n:127.0.0.1:54836_w%2Fy c:control_collection s:shard1 r:core_node1 x:collection1] o.a.s.c.ShardLeaderElectionContext Running the leader process for shard=shard1 and weAreReplacement=false and leaderVoteWait=10000
   [junit4]   2> 2411709 INFO  (coreZkRegister-8359-thread-1-processing-n:127.0.0.1:54836_w%2Fy x:collection1 s:shard1 c:control_collection r:core_node1) [n:127.0.0.1:54836_w%2Fy c:control_collection s:shard1 r:core_node1 x:collection1] o.a.s.c.ShardLeaderElectionContext Enough replicas found to continue.
   [junit4]   2> 2411709 INFO  (coreZkRegister-8359-thread-1-processing-n:127.0.0.1:54836_w%2Fy x:collection1 s:shard1 c:control_collection r:core_node1) [n:127.0.0.1:54836_w%2Fy c:control_collection s:shard1 r:core_node1 x:collection1] o.a.s.c.ShardLeaderElectionContext I may be the new leader - try and sync
   [junit4]   2> 2411709 INFO  (coreZkRegister-8359-thread-1-processing-n:127.0.0.1:54836_w%2Fy x:collection1 s:shard1 c:control_collection r:core_node1) [n:127.0.0.1:54836_w%2Fy c:control_collection s:shard1 r:core_node1 x:collection1] o.a.s.c.SyncStrategy Sync replicas to http://127.0.0.1:54836/w/y/collection1/
   [junit4]   2> 2411709 INFO  (coreZkRegister-8359-thread-1-processing-n:127.0.0.1:54836_w%2Fy x:collection1 s:shard1 c:control_collection r:core_node1) [n:127.0.0.1:54836_w%2Fy c:control_collection s:shard1 r:core_node1 x:collection1] o.a.s.c.SyncStrategy Sync Success - now sync replicas to me
   [junit4]   2> 2411709 INFO  (coreZkRegister-8359-thread-1-processing-n:127.0.0.1:54836_w%2Fy x:collection1 s:shard1 c:control_collection r:core_node1) [n:127.0.0.1:54836_w%2Fy c:control_collection s:shard1 r:core_node1 x:collection1] o.a.s.c.SyncStrategy http://127.0.0.1:54836/w/y/collection1/ has no replicas
   [junit4]   2> 2411710 INFO  (OverseerStateUpdate-96577627582627844-127.0.0.1:54836_w%2Fy-n_0000000000) [n:127.0.0.1:54836_w%2Fy    ] o.a.s.c.Overseer processMessage: queueSize: 1, message = {
   [junit4]   2>   "operation":"leader",
   [junit4]   2>   "shard":"shard1",
   [junit4]   2>   "collection":"control_collection"} current state version: 1
   [junit4]   2> 2411710 INFO  (coreZkRegister-8359-thread-1-processing-n:127.0.0.1:54836_w%2Fy x:collection1 s:shard1 c:control_collection r:core_node1) [n:127.0.0.1:54836_w%2Fy c:control_collection s:shard1 r:core_node1 x:collection1] o.a.s.c.c.SolrZkClient makePath: /collections/control_collection/leaders/shard1
   [junit4]   2> 2411715 INFO  (coreZkRegister-8359-thread-1-processing-n:127.0.0.1:54836_w%2Fy x:collection1 s:shard1 c:control_collection r:core_node1) [n:127.0.0.1:54836_w%2Fy c:control_collection s:shard1 r:core_node1 x:collection1] o.a.s.c.ShardLeaderElectionContextBase Creating leader registration node /collections/control_collection/leaders/shard1/leader after winning as /collections/control_collection/leader_elect/shard1/election/96577627582627844-core_node1-n_0000000000
   [junit4]   2> 2411717 INFO  (coreZkRegister-8359-thread-1-processing-n:127.0.0.1:54836_w%2Fy x:collection1 s:shard1 c:control_collection r:core_node1) [n:127.0.0.1:54836_w%2Fy c:control_collection s:shard1 r:core_node1 x:collection1] o.a.s.c.ShardLeaderElectionContext I am the new leader: http://127.0.0.1:54836/w/y/collection1/ shard1
   [junit4]   2> 2411718 INFO  (OverseerStateUpdate-96577627582627844-127.0.0.1:54836_w%2Fy-n_0000000000) [n:127.0.0.1:54836_w%2Fy    ] o.a.s.c.Overseer processMessage: queueSize: 1, message = {
   [junit4]   2>   "operation":"leader",
   [junit4]   2>   "shard":"shard1",
   [junit4]   2>   "collection":"control_collection",
   [junit4]   2>   "base_url":"http://127.0.0.1:54836/w/y",
   [junit4]   2>   "core":"collection1",
   [junit4]   2>   "state":"active"} current state version: 1
   [junit4]   2> 2411825 INFO  (zkCallback-3390-thread-1-processing-n:127.0.0.1:54836_w%2Fy) [n:127.0.0.1:54836_w%2Fy    ] o.a.s.c.c.ZkStateReader A cluster state change: [WatchedEvent state:SyncConnected type:NodeDataChanged path:/clusterstate.json], has occurred - updating... (live nodes size: [1])
   [junit4]   2> 2411830 INFO  (coreZkRegister-8359-thread-1-processing-n:127.0.0.1:54836_w%2Fy x:collection1 s:shard1 c:control_collection r:core_node1) [n:127.0.0.1:54836_w%2Fy c:control_collection s:shard1 r:core_node1 x:collection1] o.a.s.c.ZkController We are http://127.0.0.1:54836/w/y/collection1/ and leader is http://127.0.0.1:54836/w/y/collection1/
   [junit4]   2> 2411830 INFO  (coreZkRegister-8359-thread-1-processing-n:127.0.0.1:54836_w%2Fy x:collection1 s:shard1 c:control_collection r:core_node1) [n:127.0.0.1:54836_w%2Fy c:control_collection s:shard1 r:core_node1 x:collection1] o.a.s.c.ZkController No LogReplay needed for core=collection1 baseURL=http://127.0.0.1:54836/w/y
   [junit4]   2> 2411830 INFO  (coreZkRegister-8359-thread-1-processing-n:127.0.0.1:54836_w%2Fy x:collection1 s:shard1 c:control_collection r:core_node1) [n:127.0.0.1:54836_w%2Fy c:control_collection s:shard1 r:core_node1 x:collection1] o.a.s.c.ZkController I am the leader, no recovery necessary
   [junit4]   2> 2411830 INFO  (coreZkRegister-8359-thread-1-processing-n:127.0.0.1:54836_w%2Fy x:collection1 s:shard1 c:control_collection r:core_node1) [n:127.0.0.1:54836_w%2Fy c:control_collection s:shard1 r:core_node1 x:collection1] o.a.s.c.ZkController publishing state=active
   [junit4]   2> 2411830 INFO  (coreZkRegister-8359-thread-1-processing-n:127.0.0.1:54836_w%2Fy x:collection1 s:shard1 c:control_collection r:core_node1) [n:127.0.0.1:54836_w%2Fy c:control_collection s:shard1 r:core_node1 x:collection1] o.a.s.c.ZkController numShards not found on descriptor - reading it from system property
   [junit4]   2> 2411832 INFO  (coreZkRegister-8359-thread-1-processing-n:127.0.0.1:54836_w%2Fy x:collection1 s:shard1 c:control_collection r:core_node1) [n:127.0.0.1:54836_w%2Fy c:control_collection s:shard1 r:core_node1 x:collection1] o.a.s.c.c.ZkStateReader Checking legacy cluster state for collection control_collection
   [junit4]   2> 2411834 INFO  (OverseerStateUpdate-96577627582627844-127.0.0.1:54836_w%2Fy-n_0000000000) [n:127.0.0.1:54836_w%2Fy    ] o.a.s.c.Overseer processMessage: queueSize: 1, message = {
   [junit4]   2>   "core":"collection1",
   [junit4]   2>   "core_node_name":"core_node1",
   [junit4]   2>   "roles":null,
   [junit4]   2>   "base_url":"http://127.0.0.1:54836/w/y",
   [junit4]   2>   "node_name":"127.0.0.1:54836_w%2Fy",
   [junit4]   2>   "numShards":"1",
   [junit4]   2>   "state":"active",
   [junit4]   2>   "shard":"shard1",
   [junit4]   2>   "collection":"control_collection",
   [junit4]   2>   "operation":"state"} current state version: 2
   [junit4]   2> 2411835 INFO  (OverseerStateUpdate-96577627582627844-127.0.0.1:54836_w%2Fy-n_0000000000) [n:127.0.0.1:54836_w%2Fy    ] o.a.s.c.o.ReplicaMutator Update state numShards=1 message={
   [junit4]   2>   "core":"collection1",
   [junit4]   2>   "core_node_name":"core_node1",
   [junit4]   2>   "roles":null,
   [junit4]   2>   "base_url":"http://127.0.0.1:54836/w/y",
   [junit4]   2>   "node_name":"127.0.0.1:54836_w%2Fy",
   [junit4]   2>   "numShards":"1",
   [junit4]   2>   "state":"active",
   [junit4]   2>   "shard":"shard1",
   [junit4]   2>   "collection":"control_collection",
   [junit4]   2>   "operation":"state"}
   [junit4]   2> 2411949 INFO  (zkCallback-3390-thread-3-processing-n:127.0.0.1:54836_w%2Fy) [n:127.0.0.1:54836_w%2Fy    ] o.a.s.c.c.ZkStateReader A cluster state change: [WatchedEvent state:SyncConnected type:NodeDataChanged path:/clusterstate.json], has occurred - updating... (live nodes size: [1])
   [junit4]   2> 2411985 INFO  (TEST-ForceLeaderTest.testReplicasInLIRNoLeader-seed#[34263DDAC057F9C5]) [    ] o.a.s.c.c.SolrZkClient Using default ZkCredentialsProvider
   [junit4]   2> 2411986 INFO  (TEST-ForceLeaderTest.testReplicasInLIRNoLeader-seed#[34263DDAC057F9C5]) [    ] o.a.s.c.c.ConnectionManager Waiting for client to connect to ZooKeeper
   [junit4]   2> 2411987 INFO  (zkCallback-3394-thread-1) [    ] o.a.s.c.c.ConnectionManager Watcher org.apache.solr.common.cloud.ConnectionManager@783ff6da name:ZooKeeperConnection Watcher:127.0.0.1:54833/solr got event WatchedEvent state:SyncConnected type:None path:null path:null type:None
   [junit4]   2> 2411987 INFO  (TEST-ForceLeaderTest.testReplicasInLIRNoLeader-seed#[34263DDAC057F9C5]) [    ] o.a.s.c.c.ConnectionManager Client is connected to ZooKeeper
   [junit4]   2> 2411988 INFO  (TEST-ForceLeaderTest.testReplicasInLIRNoLeader-seed#[34263DDAC057F9C5]) [    ] o.a.s.c.c.SolrZkClient Using default ZkACLProvider
   [junit4]   2> 2411988 INFO  (TEST-ForceLeaderTest.testReplicasInLIRNoLeader-seed#[34263DDAC057F9C5]) [    ] o.a.s.c.c.ZkStateReader Updating cluster state from ZooKeeper... 
   [junit4]   2> 2411989 INFO  (TEST-ForceLeaderTest.testReplicasInLIRNoLeader-seed#[34263DDAC057F9C5]) [    ] o.a.s.c.c.ZkStateReader Loaded empty cluster properties
   [junit4]   2> 2411992 INFO  (TEST-ForceLeaderTest.testReplicasInLIRNoLeader-seed#[34263DDAC057F9C5]) [    ] o.a.s.c.c.ZkStateReader Updated live nodes from ZooKeeper... (0) -> (1)
   [junit4]   2> 2411994 INFO  (TEST-ForceLeaderTest.testReplicasInLIRNoLeader-seed#[34263DDAC057F9C5]) [    ] o.a.s.c.ChaosMonkey monkey: init - expire sessions:false cause connection loss:false
   [junit4]   2> 2411994 INFO  (TEST-ForceLeaderTest.testReplicasInLIRNoLeader-seed#[34263DDAC057F9C5]) [    ] o.a.s.c.AbstractFullDistribZkTestBase Creating collection1 with stateFormat=2
   [junit4]   2> 2411994 INFO  (TEST-ForceLeaderTest.testReplicasInLIRNoLeader-seed#[34263DDAC057F9C5]) [    ] o.a.s.c.c.SolrZkClient Using default ZkCredentialsProvider
   [junit4]   2> 2411995 INFO  (TEST-ForceLeaderTest.testReplicasInLIRNoLeader-seed#[34263DDAC057F9C5]) [    ] o.a.s.c.c.ConnectionManager Waiting for client to connect to ZooKeeper
   [junit4]   2> 2411996 INFO  (zkCallback-3395-thread-1) [    ] o.a.s.c.c.ConnectionManager Watcher org.apache.solr.common.cloud.ConnectionManager@5047d1c8 name:ZooKeeperConnection Watcher:127.0.0.1:54833/solr got event WatchedEvent state:SyncConnected type:None path:null path:null type:None
   [junit4]   2> 2411996 INFO  (TEST-ForceLeaderTest.testReplicasInLIRNoLeader-seed#[34263DDAC057F9C5]) [    ] o.a.s.c.c.ConnectionManager Client is connected to ZooKeeper
   [junit4]   2> 2411996 INFO  (TEST-ForceLeaderTest.testReplicasInLIRNoLeader-seed#[34263DDAC057F9C5]) [    ] o.a.s.c.c.SolrZkClient Using default ZkACLProvider
   [junit4]   2> 2412000 INFO  (OverseerStateUpdate-96577627582627844-127.0.0.1:54836_w%2Fy-n_0000000000) [n:127.0.0.1:54836_w%2Fy    ] o.a.s.c.Overseer processMessage: queueSize: 1, message = {
   [junit4]   2>   "operation":"create",
   [junit4]   2>   "name":"collection1",
   [junit4]   2>   "numShards":"2",
   [junit4]   2>   "stateFormat":"2"} current state version: 3
   [junit4]   2> 2412000 INFO  (OverseerStateUpdate-96577627582627844-127.0.0.1:54836_w%2Fy-n_0000000000) [n:127.0.0.1:54836_w%2Fy    ] o.a.s.c.o.ClusterStateMutator building a new cName: collection1
   [junit4]   2> 2412111 INFO  (OverseerStateUpdate-96577627582627844-127.0.0.1:54836_w%2Fy-n_0000000000) [n:127.0.0.1:54836_w%2Fy    ] o.a.s.c.o.ZkStateWriter going to create_collection /collections/collection1/state.json
   [junit4]   2> 2412319 INFO  (TEST-ForceLeaderTest.testReplicasInLIRNoLeader-seed#[34263DDAC057F9C5]) [    ] o.a.s.SolrTestCaseJ4 Writing core.properties file to /Users/jenkins/workspace/Lucene-Solr-master-MacOSX/solr/build/solr-core/test/J1/temp/solr.cloud.ForceLeaderTest_34263DDAC057F9C5-001/shard-1-001/cores/collection1
   [junit4]   2> 2412320 INFO  (TEST-ForceLeaderTest.testReplicasInLIRNoLeader-seed#[34263DDAC057F9C5]) [    ] o.a.s.c.AbstractFullDistribZkTestBase create jetty 1 in directory /Users/jenkins/workspace/Lucene-Solr-master-MacOSX/solr/build/solr-core/test/J1/temp/solr.cloud.ForceLeaderTest_34263DDAC057F9C5-001/shard-1-001
   [junit4]   2> 2412320 INFO  (TEST-ForceLeaderTest.testReplicasInLIRNoLeader-seed#[34263DDAC057F9C5]) [    ] o.e.j.s.Server jetty-9.3.8.v20160314
   [junit4]   2> 2412322 INFO  (TEST-ForceLeaderTest.testReplicasInLIRNoLeader-seed#[34263DDAC057F9C5]) [    ] o.e.j.s.h.ContextHandler Started o.e.j.s.ServletContextHandler@473afaaf{/w/y,null,AVAILABLE}
   [junit4]   2> 2412322 INFO  (TEST-ForceLeaderTest.testReplicasInLIRNoLeader-seed#[34263DDAC057F9C5]) [    ] o.e.j.s.ServerConnector Started ServerConnector@737db656{HTTP/1.1,[http/1.1]}{127.0.0.1:54847}
   [junit4]   2> 2412322 INFO  (TEST-ForceLeaderTest.testReplicasInLIRNoLeader-seed#[34263DDAC057F9C5]) [    ] o.e.j.s.Server Started @2418813ms
   [junit4]   2> 2412322 INFO  (TEST-ForceLeaderTest.testReplicasInLIRNoLeader-seed#[34263DDAC057F9C5]) [    ] o.a.s.c.s.e.JettySolrRunner Jetty properties: {solr.data.dir=/Users/jenkins/workspace/Lucene-Solr-master-MacOSX/solr/build/solr-core/test/J1/temp/solr.cloud.ForceLeaderTest_34263DDAC057F9C5-001/tempDir-001/jetty1, solrconfig=solrconfig.xml, hostContext=/w/y, hostPort=54846, coreRootDirectory=/Users/jenkins/workspace/Lucene-Solr-master-MacOSX/solr/build/solr-core/test/J1/temp/solr.cloud.ForceLeaderTest_34263DDAC057F9C5-001/shard-1-001/cores}
   [junit4]   2> 2412323 INFO  (TEST-ForceLeaderTest.testReplicasInLIRNoLeader-seed#[34263DDAC057F9C5]) [    ] o.a.s.s.SolrDispatchFilter SolrDispatchFilter.init(): sun.misc.Launcher$AppClassLoader@4554617c
   [junit4]   2> 2412323 INFO  (TEST-ForceLeaderTest.testReplicasInLIRNoLeader-seed#[34263DDAC057F9C5]) [    ] o.a.s.c.SolrResourceLoader new SolrResourceLoader for directory: '/Users/jenkins/workspace/Lucene-Solr-master-MacOSX/solr/build/solr-core/test/J1/temp/solr.cloud.ForceLeaderTest_34263DDAC057F9C5-001/shard-1-001'
   [junit4]   2> 2412323 INFO  (TEST-ForceLeaderTest.testReplicasInLIRNoLeader-seed#[34263DDAC057F9C5]) [    ] o.a.s.c.SolrResourceLoader JNDI not configured for solr (NoInitialContextEx)
   [junit4]   2> 2412324 INFO  (TEST-ForceLeaderTest.testReplicasInLIRNoLeader-seed#[34263DDAC057F9C5]) [    ] o.a.s.c.SolrResourceLoader solr home defaulted to 'solr/' (could not find system property or JNDI)
   [junit4]   2> 2412324 INFO  (TEST-ForceLeaderTest.testReplicasInLIRNoLeader-seed#[34263DDAC057F9C5]) [    ] o.a.s.c.c.SolrZkClient Using default ZkCredentialsProvider
   [junit4]   2> 2412324 INFO  (TEST-ForceLeaderTest.testReplicasInLIRNoLeader-seed#[34263DDAC057F9C5]) [    ] o.a.s.c.c.ConnectionManager Waiting for client to connect to ZooKeeper
   [junit4]   2> 2412327 INFO  (zkCallback-3396-thread-1) [    ] o.a.s.c.c.ConnectionManager Watcher org.apache.solr.common.cloud.ConnectionManager@415032cd name:ZooKeeperConnection Watcher:127.0.0.1:54833/solr got event WatchedEvent state:SyncConnected type:None path:null path:null type:None
   [junit4]   2> 2412327 INFO  (TEST-ForceLeaderTest.testReplicasInLIRNoLeader-seed#[34263DDAC057F9C5]) [    ] o.a.s.c.c.ConnectionManager Client is connected to ZooKeeper
   [junit4]   2> 2412328 INFO  (TEST-ForceLeaderTest.testReplicasInLIRNoLeader-seed#[34263DDAC057F9C5]) [    ] o.a.s.c.c.SolrZkClient Using default ZkACLProvider
   [junit4]   2> 2412330 INFO  (TEST-ForceLeaderTest.testReplicasInLIRNoLeader-seed#[34263DDAC057F9C5]) [    ] o.a.s.s.SolrDispatchFilter Loading solr.xml from SolrHome (not found in ZooKeeper)
   [junit4]   2> 2412330 INFO  (TEST-ForceLeaderTest.testReplicasInLIRNoLeader-seed#[34263DDAC057F9C5]) [    ] o.a.s.c.SolrXmlConfig Loading container configuration from /Users/jenkins/workspace/Lucene-Solr-master-MacOSX/solr/build/solr-core/test/J1/temp/solr.cloud.ForceLeaderTest_34263DDAC057F9C5-001/shard-1-001/solr.xml
   [junit4]   2> 2412347 INFO  (TEST-ForceLeaderTest.testReplicasInLIRNoLeader-seed#[34263DDAC057F9C5]) [    ] o.a.s.c.CorePropertiesLocator Config-defined core root directory: /Users/jenkins/workspace/Lucene-Solr-master-MacOSX/solr/build/solr-core/test/J1/temp/solr.cloud.ForceLeaderTest_34263DDAC057F9C5-001/shard-1-001/cores
   [junit4]   2> 2412347 INFO  (TEST-ForceLeaderTest.testReplicasInLIRNoLeader-seed#[34263DDAC057F9C5]) [    ] o.a.s.c.CoreContainer New CoreContainer 1183239159
   [junit4]   2> 2412347 INFO  (TEST-ForceLeaderTest.testReplicasInLIRNoLeader-seed#[34263DDAC057F9C5]) [    ] o.a.s.c.CoreContainer Loading cores into CoreContainer [instanceDir=/Users/jenkins/workspace/Lucene-Solr-master-MacOSX/solr/build/solr-core/test/J1/temp/solr.cloud.ForceLeaderTest_34263DDAC057F9C5-001/shard-1-001]
   [junit4]   2> 2412347 WARN  (TEST-ForceLeaderTest.testReplicasInLIRNoLeader-seed#[34263DDAC057F9C5]) [    ] o.a.s.c.CoreContainer Couldn't add files from /Users/jenkins/workspace/Lucene-Solr-master-MacOSX/solr/build/solr-core/test/J1/temp/solr.cloud.ForceLeaderTest_34263DDAC057F9C5-001/shard-1-001/lib to classpath: /Users/jenkins/workspace/Lucene-Solr-master-MacOSX/solr/build/solr-core/test/J1/temp/solr.cloud.ForceLeaderTest_34263DDAC057F9C5-001/shard-1-001/lib
   [junit4]   2> 2412347 INFO  (TEST-ForceLeaderTest.testReplicasInLIRNoLeader-seed#[34263DDAC057F9C5]) [    ] o.a.s.h.c.HttpShardHandlerFactory created with socketTimeout : 90000,urlScheme : ,connTimeout : 15000,maxConnectionsPerHost : 20,maxConnections : 10000,corePoolSize : 0,maximumPoolSize : 2147483647,maxThreadIdleTime : 5,sizeOfQueue : -1,fairnessPolicy : false,
   [junit4]   2> 2412351 INFO  (TEST-ForceLeaderTest.testReplicasInLIRNoLeader-seed#[34263DDAC057F9C5]) [    ] o.a.s.u.UpdateShardHandler Created UpdateShardHandler HTTP client with params: socketTimeout=340000&connTimeout=45000&maxConnections=100000&maxConnectionsPerHost=100000
   [junit4]   2> 2412351 INFO  (TEST-ForceLeaderTest.testReplicasInLIRNoLeader-seed#[34263DDAC057F9C5]) [    ] o.a.s.l.LogWatcher SLF4J impl is org.slf4j.impl.Log4jLoggerFactory
   [junit4]   2> 2412351 INFO  (TEST-ForceLeaderTest.testReplicasInLIRNoLeader-seed#[34263DDAC057F9C5]) [    ] o.a.s.l.LogWatcher Registering Log Listener [Log4j (org.slf4j.impl.Log4jLoggerFactory)]
   [junit4]   2> 2412351 INFO  (TEST-ForceLeaderTest.testReplicasInLIRNoLeader-seed#[34263DDAC057F9C5]) [    ] o.a.s.c.ZkContainer Zookeeper client=127.0.0.1:54833/solr
   [junit4]   2> 2412352 INFO  (TEST-ForceLeaderTest.testReplicasInLIRNoLeader-seed#[34263DDAC057F9C5]) [    ] o.a.s.c.ZkController zkHost includes chroot
   [junit4]   2> 2412352 INFO  (TEST-ForceLeaderTest.testReplicasInLIRNoLeader-seed#[34263DDAC057F9C5]) [    ] o.a.s.c.c.SolrZkClient Using default ZkCredentialsProvider
   [junit4]   2> 2412352 INFO  (TEST-ForceLeaderTest.testReplicasInLIRNoLeader-seed#[34263DDAC057F9C5]) [    ] o.a.s.c.c.ConnectionManager Waiting for client to connect to ZooKeeper
   [junit4]   2> 2412354 INFO  (zkCallback-3399-thread-1) [    ] o.a.s.c.c.ConnectionManager Watcher org.apache.solr.common.cloud.ConnectionManager@149f96c1 name:ZooKeeperConnection Watcher:127.0.0.1:54833 got event WatchedEvent state:SyncConnected type:None path:null path:null type:None
   [junit4]   2> 2412354 INFO  (TEST-ForceLeaderTest.testReplicasInLIRNoLeader-seed#[34263DDAC057F9C5]) [    ] o.a.s.c.c.ConnectionManager Client is connected to ZooKeeper
   [junit4]   2> 2412354 INFO  (TEST-ForceLeaderTest.testReplicasInLIRNoLeader-seed#[34263DDAC057F9C5]) [    ] o.a.s.c.c.SolrZkClient Using default ZkACLProvider
   [junit4]   2> 2412357 INFO  (TEST-ForceLeaderTest.testReplicasInLIRNoLeader-seed#[34263DDAC057F9C5]) [n:127.0.0.1:54846_w%2Fy    ] o.a.s.c.ZkController Added new OnReconnect listener org.apache.solr.cloud.ZkController$$Lambda$99/2095993381@128496bb
   [junit4]   2> 2412358 INFO  (TEST-ForceLeaderTest.testReplicasInLIRNoLeader-seed#[34263DDAC057F9C5]) [n:127.0.0.1:54846_w%2Fy    ] o.a.s.c.c.ConnectionManager Waiting for client to connect to ZooKeeper
   [junit4]   2> 2412359 INFO  (zkCallback-3400-thread-1-processing-n:127.0.0.1:54846_w%2Fy) [n:127.0.0.1:54846_w%2Fy    ] o.a.s.c.c.ConnectionManager Watcher org.apache.solr.common.cloud.ConnectionManager@39089e1c name:ZooKeeperConnection Watcher:127.0.0.1:54833/solr got event WatchedEvent state:SyncConnected type:None path:null path:null type:None
   [junit4]   2> 2412359 INFO  (TEST-ForceLeaderTest.testReplicasInLIRNoLeader-seed#[34263DDAC057F9C5]) [n:127.0.0.1:54846_w%2Fy    ] o.a.s.c.c.ConnectionManager Client is connected to ZooKeeper
   [junit4]   2> 2412370 INFO  (TEST-ForceLeaderTest.testReplicasInLIRNoLeader-seed#[34263DDAC057F9C5]) [n:127.0.0.1:54846_w%2Fy    ] o.a.s.c.c.ZkStateReader Updating cluster state from ZooKeeper... 
   [junit4]   2> 2412371 INFO  (TEST-ForceLeaderTest.testReplicasInLIRNoLeader-seed#[34263DDAC057F9C5]) [n:127.0.0.1:54846_w%2Fy    ] o.a.s.c.c.ZkStateReader Loaded empty cluster properties
   [junit4]   2> 2412372 INFO  (TEST-ForceLeaderTest.testReplicasInLIRNoLeader-seed#[34263DDAC057F9C5]) [n:127.0.0.1:54846_w%2Fy    ] o.a.s.c.c.ZkStateReader Updated live nodes from ZooKeeper... (0) -> (1)
   [junit4]   2> 2412377 INFO  (TEST-ForceLeaderTest.testReplicasInLIRNoLeader-seed#[34263DDAC057F9C5]) [n:127.0.0.1:54846_w%2Fy    ] o.a.s.c.Overseer Overseer (id=null) closing
   [junit4]   2> 2412378 INFO  (TEST-ForceLeaderTest.testReplicasInLIRNoLeader-seed#[34263DDAC057F9C5]) [n:127.0.0.1:54846_w%2Fy    ] o.a.s.c.LeaderElector Joined leadership election with path: /overseer_elect/election/96577627582627849-127.0.0.1:54846_w%2Fy-n_0000000001
   [junit4]   2> 2412380 INFO  (TEST-ForceLeaderTest.testReplicasInLIRNoLeader-seed#[34263DDAC057F9C5]) [n:127.0.0.1:54846_w%2Fy    ] o.a.s.c.LeaderElector Watching path /overseer_elect/election/96577627582627844-127.0.0.1:54836_w%2Fy-n_0000000000 to know if I could be the leader
   [junit4]   2> 2412380 INFO  (TEST-ForceLeaderTest.testReplicasInLIRNoLeader-seed#[34263DDAC057F9C5]) [n:127.0.0.1:54846_w%2Fy    ] o.a.s.c.ZkController Publish node=127.0.0.1:54846_w%2Fy as DOWN
   [junit4]   2> 2412383 INFO  (TEST-ForceLeaderTest.testReplicasInLIRNoLeader-seed#[34263DDAC057F9C5]) [n:127.0.0.1:54846_w%2Fy    ] o.a.s.c.ZkController Register node as live in ZooKeeper:/live_nodes/127.0.0.1:54846_w%2Fy
   [junit4]   2> 2412383 INFO  (TEST-ForceLeaderTest.testReplicasInLIRNoLeader-seed#[34263DDAC057F9C5]) [n:127.0.0.1:54846_w%2Fy    ] o.a.s.c.c.SolrZkClient makePath: /live_nodes/127.0.0.1:54846_w%2Fy
   [junit4]   2> 2412384 INFO  (OverseerStateUpdate-96577627582627844-127.0.0.1:54836_w%2Fy-n_0000000000) [n:127.0.0.1:54836_w%2Fy    ] o.a.s.c.Overseer processMessage: queueSize: 1, message = {
   [junit4]   2>   "operation":"downnode",
   [junit4]   2>   "node_name":"127.0.0.1:54846_w%2Fy"} current state version: 3
   [junit4]   2> 2412384 INFO  (OverseerStateUpdate-96577627582627844-127.0.0.1:54836_w%2Fy-n_0000000000) [n:127.0.0.1:54836_w%2Fy    ] o.a.s.c.o.NodeMutator DownNode state invoked for node: 127.0.0.1:54846_w%2Fy
   [junit4]   2> 2412385 INFO  (zkCallback-3394-thread-1) [    ] o.a.s.c.c.ZkStateReader A live node change: [WatchedEvent state:SyncConnected type:NodeChildrenChanged path:/live_nodes], has occurred - updating... (live nodes size: [1])
   [junit4]   2> 2412385 INFO  (zkCallback-3390-thread-3-processing-n:127.0.0.1:54836_w%2Fy) [n:127.0.0.1:54836_w%2Fy    ] o.a.s.c.c.ZkStateReader A live node change: [WatchedEvent state:SyncConnected type:NodeChildrenChanged path:/live_nodes], has occurred - updating... (live nodes size: [1])
   [junit4]   2> 2412385 INFO  (zkCallback-3400-thread-1-processing-n:127.0.0.1:54846_w%2Fy) [n:127.0.0.1:54846_w%2Fy    ] o.a.s.c.c.ZkStateReader A live node change: [WatchedEvent state:SyncConnected type:NodeChildrenChanged path:/live_nodes], has occurred - updating... (live nodes size: [1])
   [junit4]   2> 2412386 INFO  (zkCallback-3394-thread-1) [    ] o.a.s.c.c.ZkStateReader Updated live nodes from ZooKeeper... (1) -> (2)
   [junit4]   2> 2412386 INFO  (zkCallback-3390-thread-3-processing-n:127.0.0.1:54836_w%2Fy) [n:127.0.0.1:54836_w%2Fy    ] o.a.s.c.c.ZkStateReader Updated live nodes from ZooKeeper... (1) -> (2)
   [junit4]   2> 2412387 INFO  (zkCallback-3400-thread-1-processing-n:127.0.0.1:54846_w%2Fy) [n:127.0.0.1:54846_w%2Fy    ] o.a.s.c.c.ZkStateReader Updated live nodes from ZooKeeper... (1) -> (2)
   [junit4]   2> 2412388 INFO  (zkCallback-3390-thread-1-processing-n:127.0.0.1:54836_w%2Fy) [n:127.0.0.1:54836_w%2Fy    ] o.a.s.c.c.ZkStateReader A cluster state change: [WatchedEvent state:SyncConnected type:NodeDataChanged path:/clusterstate.json], has occurred - updating... (live nodes size: [2])
   [junit4]   2> 2412388 INFO  (zkCallback-3394-thread-1) [    ] o.a.s.c.c.ZkStateReader A cluster state change: [WatchedEvent state:SyncConnected type:NodeDataChanged path:/clusterstate.json], has occurred - updating... (live nodes size: [2])
   [junit4]   2> 2412388 INFO  (zkCallback-3400-thread-1-processing-n:127.0.0.1:54846_w%2Fy) [n:127.0.0.1:54846_w%2Fy    ] o.a.s.c.c.ZkStateReader A cluster state change: [WatchedEvent state:SyncConnected type:NodeDataChanged path:/clusterstate.json], has occurred - updating... (live nodes size: [2])
   [junit4]   2> 2412399 INFO  (TEST-ForceLeaderTest.testReplicasInLIRNoLeader-seed#[34263DDAC057F9C5]) [n:127.0.0.1:54846_w%2Fy    ] o.a.s.c.CoreContainer Security conf doesn't exist. Skipping setup for authorization module.
   [junit4]   2> 2412399 INFO  (TEST-ForceLeaderTest.testReplicasInLIRNoLeader-seed#[34263DDAC057F9C5]) [n:127.0.0.1:54846_w%2Fy    ] o.a.s.c.CoreContainer No authentication plugin used.
   [junit4]   2> 2412400 INFO  (TEST-ForceLeaderTest.testReplicasInLIRNoLeader-seed#[34263DDAC057F9C5]) [n:127.0.0.1:54846_w%2Fy    ] o.a.s.c.CorePropertiesLocator Looking for core definitions underneath /Users/jenkins/workspace/Lucene-Solr-master-MacOSX/solr/build/solr-core/test/J1/temp/solr.cloud.ForceLeaderTest_34263DDAC057F9C5-001/shard-1-001/cores
   [junit4]   2> 2412402 INFO  (TEST-ForceLeaderTest.testReplicasInLIRNoLeader-seed#[34263DDAC057F9C5]) [n:127.0.0.1:54846_w%2Fy    ] o.a.s.c.CoreDescriptor Created CoreDescriptor: {name=collection1, config=solrconfig.xml, transient=false, schema=schema.xml, loadOnStartup=true, configSetProperties=configsetprops.json, collection=collection1, coreNodeName=, dataDir=data/, shard=}
   [junit4]   2> 2412402 INFO  (TEST-ForceLeaderTest.testReplicasInLIRNoLeader-seed#[34263DDAC057F9C5]) [n:127.0.0.1:54846_w%2Fy    ] o.a.s.c.CorePropertiesLocator Found core collection1 in /Users/jenkins/workspace/Lucene-Solr-master-MacOSX/solr/build/solr-core/test/J1/temp/solr.cloud.ForceLeaderTest_34263DDAC057F9C5-001/shard-1-001/cores/collection1
   [junit4]   2> 2412402 INFO  (TEST-ForceLeaderTest.testReplicasInLIRNoLeader-seed#[34263DDAC057F9C5]) [n:127.0.0.1:54846_w%2Fy    ] o.a.s.c.CorePropertiesLocator Found 1 core definitions
   [junit4]   2> 2412404 INFO  (TEST-ForceLeaderTest.testReplicasInLIRNoLeader-seed#[34263DDAC057F9C5]) [n:127.0.0.1:54846_w%2Fy    ] o.a.s.s.SolrDispatchFilter user.dir=/Users/jenkins/workspace/Lucene-Solr-master-MacOSX/solr/build/solr-core/test/J1
   [junit4]   2> 2412404 INFO  (TEST-ForceLeaderTest.testReplicasInLIRNoLeader-seed#[34263DDAC057F9C5]) [n:127.0.0.1:54846_w%2Fy    ] o.a.s.s.SolrDispatchFilter SolrDispatchFilter.init() done
   [junit4]   2> 2412404 INFO  (coreLoadExecutor-8377-thread-1-processing-n:127.0.0.1:54846_w%2Fy) [n:127.0.0.1:54846_w%2Fy c:collection1   x:collection1] o.a.s.c.ZkController publishing state=down
   [junit4]   2> 2412404 INFO  (coreLoadExecutor-8377-thread-1-processing-n:127.0.0.1:54846_w%2Fy) [n:127.0.0.1:54846_w%2Fy c:collection1   x:collection1] o.a.s.c.ZkController numShards not found on descriptor - reading it from system property
   [junit4]   2> 2412406 INFO  (coreLoadExecutor-8377-thread-1-processing-n:127.0.0.1:54846_w%2Fy) [n:127.0.0.1:54846_w%2Fy c:collection1   x:collection1] o.a.s.c.ZkController Registering watch for collection collection1
   [junit4]   2> 2412406 INFO  (coreLoadExecutor-8377-t

[...truncated too long message...]

ontext.runLeaderProcess(ElectionContext.java:450)
   [junit4]   2> 	at org.apache.solr.cloud.LeaderElector.runIamLeaderProcess(LeaderElector.java:170)
   [junit4]   2> 	at org.apache.solr.cloud.LeaderElector.checkIfIamLeader(LeaderElector.java:135)
   [junit4]   2> 	at org.apache.solr.cloud.LeaderElector.access$200(LeaderElector.java:56)
   [junit4]   2> 	at org.apache.solr.cloud.LeaderElector$ElectionWatcher.process(LeaderElector.java:348)
   [junit4]   2> 	at org.apache.solr.common.cloud.SolrZkClient$3.lambda$process$0(SolrZkClient.java:266)
   [junit4]   2> 	at java.util.concurrent.Executors$RunnableAdapter.call(Executors.java:511)
   [junit4]   2> 	at java.util.concurrent.FutureTask.run(FutureTask.java:266)
   [junit4]   2> 	at org.apache.solr.common.util.ExecutorUtil$MDCAwareThreadPoolExecutor.lambda$execute$0(ExecutorUtil.java:229)
   [junit4]   2> 	at java.util.concurrent.ThreadPoolExecutor.runWorker(ThreadPoolExecutor.java:1142)
   [junit4]   2> 	at java.util.concurrent.ThreadPoolExecutor$Worker.run(ThreadPoolExecutor.java:617)
   [junit4]   2> 	at java.lang.Thread.run(Thread.java:745)
   [junit4]   2> 2520541 INFO  (TEST-ForceLeaderTest.testLastPublishedStateIsActive-seed#[34263DDAC057F9C5]) [    ] o.e.j.s.ServerConnector Stopped ServerConnector@7529278d{HTTP/1.1,[http/1.1]}{127.0.0.1:0}
   [junit4]   2> 2520542 INFO  (TEST-ForceLeaderTest.testLastPublishedStateIsActive-seed#[34263DDAC057F9C5]) [    ] o.e.j.s.h.ContextHandler Stopped o.e.j.s.ServletContextHandler@1018c857{/w/y,null,UNAVAILABLE}
   [junit4]   2> 2520544 INFO  (TEST-ForceLeaderTest.testLastPublishedStateIsActive-seed#[34263DDAC057F9C5]) [    ] o.a.s.c.ChaosMonkey monkey: stop shard! 54979
   [junit4]   2> 2520545 INFO  (TEST-ForceLeaderTest.testLastPublishedStateIsActive-seed#[34263DDAC057F9C5]) [    ] o.a.s.c.ZkTestServer connecting to 127.0.0.1:54976 54976
   [junit4]   2> 2520558 INFO  (Thread-3334) [    ] o.a.s.c.ZkTestServer connecting to 127.0.0.1:54976 54976
   [junit4]   2> 2526436 WARN  (Thread-3334) [    ] o.a.s.c.ZkTestServer Watch limit violations: 
   [junit4]   2> Maximum concurrent create/delete watches above limit:
   [junit4]   2> 
   [junit4]   2> 	5	/solr/aliases.json
   [junit4]   2> 	5	/solr/clusterprops.json
   [junit4]   2> 	4	/solr/security.json
   [junit4]   2> 	4	/solr/configs/conf1
   [junit4]   2> 
   [junit4]   2> Maximum concurrent data watches above limit:
   [junit4]   2> 
   [junit4]   2> 	5	/solr/clusterstate.json
   [junit4]   2> 	3	/solr/collections/forceleader_last_published/state.json
   [junit4]   2> 	3	/solr/collections/collection1/state.json
   [junit4]   2> 
   [junit4]   2> Maximum concurrent children watches above limit:
   [junit4]   2> 
   [junit4]   2> 	63	/solr/overseer/collection-queue-work
   [junit4]   2> 	45	/solr/overseer/queue
   [junit4]   2> 	11	/solr/overseer/queue-work
   [junit4]   2> 	5	/solr/live_nodes
   [junit4]   2> 	5	/solr/collections
   [junit4]   2> 
   [junit4]   2> 2526437 WARN  (TEST-ForceLeaderTest.testLastPublishedStateIsActive-seed#[34263DDAC057F9C5]) [    ] o.a.s.c.SocketProxy Closing 6 connections to: http://127.0.0.1:54990/w/y, target: http://127.0.0.1:54991/w/y
   [junit4]   2> 2526437 WARN  (TEST-ForceLeaderTest.testLastPublishedStateIsActive-seed#[34263DDAC057F9C5]) [    ] o.a.s.c.SocketProxy Closing 4 connections to: http://127.0.0.1:54979/w/y, target: http://127.0.0.1:54980/w/y
   [junit4]   2> 2526438 WARN  (TEST-ForceLeaderTest.testLastPublishedStateIsActive-seed#[34263DDAC057F9C5]) [    ] o.a.s.c.SocketProxy Closing 1 connections to: http://127.0.0.1:55003/w/y, target: http://127.0.0.1:55004/w/y
   [junit4]   2> 2526438 WARN  (TEST-ForceLeaderTest.testLastPublishedStateIsActive-seed#[34263DDAC057F9C5]) [    ] o.a.s.c.SocketProxy Closing 9 connections to: http://127.0.0.1:55012/w/y, target: http://127.0.0.1:55013/w/y
   [junit4]   2> 2526439 INFO  (SUITE-ForceLeaderTest-seed#[34263DDAC057F9C5]-worker) [    ] o.a.s.SolrTestCaseJ4 ###deleteCore
   [junit4]   2> NOTE: leaving temporary files on disk at: /Users/jenkins/workspace/Lucene-Solr-master-MacOSX/solr/build/solr-core/test/J1/temp/solr.cloud.ForceLeaderTest_34263DDAC057F9C5-001
   [junit4]   2> NOTE: test params are: codec=CheapBastard, sim=ClassicSimilarity, locale=sk, timezone=Atlantic/Bermuda
   [junit4]   2> NOTE: Mac OS X 10.11.6 x86_64/Oracle Corporation 1.8.0_102 (64-bit)/cpus=3,threads=1,free=52263896,total=518979584
   [junit4]   2> NOTE: All tests run in this JVM: [TestPHPSerializedResponseWriter, DebugComponentTest, TestInitParams, TestJmxMonitoredMap, HLLUtilTest, TestFieldTypeCollectionResource, HdfsBasicDistributedZkTest, TestIndexingPerformance, TestSchemaSimilarityResource, TestSolrQueryParser, TestCloudSchemaless, SpellPossibilityIteratorTest, TestClassicSimilarityFactory, CloudMLTQParserTest, BaseCdcrDistributedZkTest, TestRecoveryHdfs, TestFieldCacheReopen, DeleteLastCustomShardedReplicaTest, DocExpirationUpdateProcessorFactoryTest, TestRangeQuery, SignatureUpdateProcessorFactoryTest, TestGraphTermsQParserPlugin, TestObjectReleaseTracker, TestLeaderElectionZkExpiry, RequestLoggingTest, TestZkChroot, TestJoin, HdfsNNFailoverTest, TestBulkSchemaAPI, TestReversedWildcardFilterFactory, TestCrossCoreJoin, TestMacroExpander, BinaryUpdateRequestHandlerTest, TestSerializedLuceneMatchVersion, TestDocBasedVersionConstraints, TermVectorComponentDistributedTest, TestRebalanceLeaders, FileBasedSpellCheckerTest, LeaderElectionIntegrationTest, IndexSchemaTest, SolrCloudExampleTest, CdcrRequestHandlerTest, TestQuerySenderListener, TestRealTimeGet, SuggesterWFSTTest, TestQueryTypes, TestCoreDiscovery, TestManagedSchema, DistribDocExpirationUpdateProcessorTest, RegexBoostProcessorTest, OverseerStatusTest, ConnectionReuseTest, UpdateRequestProcessorFactoryTest, AliasIntegrationTest, CdcrUpdateLogTest, BasicAuthIntegrationTest, AddSchemaFieldsUpdateProcessorFactoryTest, TestReloadAndDeleteDocs, CollectionStateFormat2Test, SortByFunctionTest, TestSubQueryTransformerDistrib, ReturnFieldsTest, TestTolerantUpdateProcessorCloud, TestFastWriter, TestSortingResponseWriter, AutoCommitTest, CachingDirectoryFactoryTest, TestOmitPositions, DistributedQueryComponentCustomSortTest, ExternalFileFieldSortTest, TestRecovery, BasicZkTest, AddBlockUpdateTest, RequestHandlersTest, HdfsDirectoryFactoryTest, TestSolrQueryParserResource, QueryParsingTest, SolrCoreCheckLockOnStartupTest, TestStressCloudBlindAtomicUpdates, BJQParserTest, BlobRepositoryCloudTest, CacheHeaderTest, TestHighFrequencyDictionaryFactory, TestValueSourceCache, SolrInfoMBeanTest, TestSolrConfigHandlerCloud, SuggesterTest, TestLegacyFieldCache, TestFiltering, SliceStateTest, WordBreakSolrSpellCheckerTest, CdcrReplicationDistributedZkTest, GraphQueryTest, TestSuggestSpellingConverter, BlockJoinFacetRandomTest, UpdateParamsTest, TestRandomFaceting, TestConfigSetsAPIZkFailure, DistributedIntervalFacetingTest, TestInitQParser, ClassificationUpdateProcessorFactoryTest, TestCopyFieldCollectionResource, FieldMutatingUpdateProcessorTest, TestStressUserVersions, TestFoldingMultitermQuery, TestManagedStopFilterFactory, TestCloudPseudoReturnFields, TestQueryWrapperFilter, TlogReplayBufferedWhileIndexingTest, DistributedFacetPivotLongTailTest, DistributedTermsComponentTest, TestQueryUtils, ShowFileRequestHandlerTest, DistributedDebugComponentTest, TestDynamicFieldCollectionResource, TestNumericTerms64, EchoParamsTest, TestComplexPhraseQParserPlugin, SolrIndexSplitterTest, TestUtils, NotRequiredUniqueKeyTest, RAMDirectoryFactoryTest, DistributedFacetExistsSmallTest, TestMaxScoreQueryParser, TestConfigSetImmutable, ChaosMonkeySafeLeaderTest, TestSolr4Spatial, TestCustomDocTransformer, TestSolrDeletionPolicy2, HdfsTlogReplayBufferedWhileIndexingTest, TestExclusionRuleCollectionAccess, TestLocalFSCloudBackupRestore, CoreMergeIndexesAdminHandlerTest, DocValuesMissingTest, TestFieldCacheVsDocValues, TestDistributedGrouping, SuggesterTSTTest, TestFieldSortValues, CloudExitableDirectoryReaderTest, SpellCheckCollatorTest, TestSolrCLIRunExample, ResourceLoaderTest, TestDistributedMissingSort, LeaderInitiatedRecoveryOnShardRestartTest, RollingRestartTest, ZkStateWriterTest, ScriptEngineTest, TestSSLRandomization, TestClusterStateMutator, TestDFRSimilarityFactory, TestConfig, BasicDistributedZk2Test, CollectionsAPIDistributedZkTest, OpenCloseCoreStressTest, OverseerTest, ShardRoutingTest, RecoveryZkTest, FullSolrCloudDistribCmdsTest, ZkSolrClientTest, ShardRoutingCustomTest, TestDistributedSearch, TestFaceting, ZkControllerTest, HardAutoCommitTest, SpellCheckComponentTest, SolrCmdDistributorTest, BadIndexSchemaTest, ConvertedLegacyTest, TestBadConfig, HighlighterTest, CurrencyFieldXmlFileTest, TestExtendedDismaxParser, TestTrie, SpatialFilterTest, TestCSVLoader, TestAtomicUpdateErrorCases, TestWordDelimiterFilterFactory, DirectUpdateHandlerOptimizeTest, StatelessScriptUpdateProcessorFactoryTest, DisMaxRequestHandlerTest, StandardRequestHandlerTest, TestWriterPerf, TermVectorComponentTest, RequiredFieldsTest, SolrPluginUtilsTest, MBeansHandlerTest, JsonLoaderTest, TestComponentsName, TestLFUCache, CopyFieldTest, SolrIndexConfigTest, SampleTest, TestDocSet, TestSearchPerf, OutputWriterTest, TestSolrCoreProperties, DirectSolrConnectionTest, TestPhraseSuggestions, SynonymTokenizerTest, TestXIncludeConfig, TestLMDirichletSimilarityFactory, TestBM25SimilarityFactory, PluginInfoTest, PreAnalyzedFieldTest, DOMUtilTest, TestSolrJ, SystemInfoHandlerTest, UUIDFieldTest, DistributedMLTComponentTest, SolrTestCaseJ4Test, TestCursorMarkWithoutUniqueKey, TestSimpleTrackingShardHandler, AsyncCallRequestStatusResponseTest, CdcrReplicationHandlerTest, CollectionTooManyReplicasTest, ConcurrentDeleteAndCreateCollectionTest, ConnectionManagerTest, CreateCollectionCleanupTest, CustomCollectionTest, DeleteShardTest, DeleteStatusTest, DistributedQueueTest, ForceLeaderTest]
   [junit4] Completed [452/631 (1!)] on J1 in 118.75s, 3 tests, 1 error, 1 skipped <<< FAILURES!

[...truncated 60762 lines...]


Mime
View raw message