lucene-dev mailing list archives

Site index · List index
Message view « Date » · « Thread »
Top « Date » · « Thread »
From Policeman Jenkins Server <jenk...@thetaphi.de>
Subject [JENKINS] Lucene-Solr-6.x-Windows (64bit/jdk1.8.0_102) - Build # 447 - Still Unstable!
Date Sun, 11 Sep 2016 14:24:08 GMT
Build: http://jenkins.thetaphi.de/job/Lucene-Solr-6.x-Windows/447/
Java: 64bit/jdk1.8.0_102 -XX:+UseCompressedOops -XX:+UseG1GC

1 tests failed.
FAILED:  org.apache.solr.cloud.LeaderFailoverAfterPartitionTest.test

Error Message:
No live SolrServers available to handle this request:[http://127.0.0.1:61269/c8n_1x3_lf_shard1_replica1]

Stack Trace:
org.apache.solr.client.solrj.impl.CloudSolrClient$RouteException: No live SolrServers available to handle this request:[http://127.0.0.1:61269/c8n_1x3_lf_shard1_replica1]
	at __randomizedtesting.SeedInfo.seed([F5C71D2FBE28162B:7D9322F510D47BD3]:0)
	at org.apache.solr.client.solrj.impl.CloudSolrClient.directUpdate(CloudSolrClient.java:755)
	at org.apache.solr.client.solrj.impl.CloudSolrClient.sendRequest(CloudSolrClient.java:1161)
	at org.apache.solr.client.solrj.impl.CloudSolrClient.requestWithRetryOnStaleState(CloudSolrClient.java:1050)
	at org.apache.solr.client.solrj.impl.CloudSolrClient.request(CloudSolrClient.java:992)
	at org.apache.solr.client.solrj.SolrClient.request(SolrClient.java:1219)
	at org.apache.solr.cloud.HttpPartitionTest.sendDoc(HttpPartitionTest.java:592)
	at org.apache.solr.cloud.HttpPartitionTest.sendDoc(HttpPartitionTest.java:578)
	at org.apache.solr.cloud.LeaderFailoverAfterPartitionTest.testRf3WithLeaderFailover(LeaderFailoverAfterPartitionTest.java:174)
	at org.apache.solr.cloud.LeaderFailoverAfterPartitionTest.test(LeaderFailoverAfterPartitionTest.java:55)
	at sun.reflect.NativeMethodAccessorImpl.invoke0(Native Method)
	at sun.reflect.NativeMethodAccessorImpl.invoke(NativeMethodAccessorImpl.java:62)
	at sun.reflect.DelegatingMethodAccessorImpl.invoke(DelegatingMethodAccessorImpl.java:43)
	at java.lang.reflect.Method.invoke(Method.java:498)
	at com.carrotsearch.randomizedtesting.RandomizedRunner.invoke(RandomizedRunner.java:1764)
	at com.carrotsearch.randomizedtesting.RandomizedRunner$8.evaluate(RandomizedRunner.java:871)
	at com.carrotsearch.randomizedtesting.RandomizedRunner$9.evaluate(RandomizedRunner.java:907)
	at com.carrotsearch.randomizedtesting.RandomizedRunner$10.evaluate(RandomizedRunner.java:921)
	at org.apache.solr.BaseDistributedSearchTestCase$ShardsRepeatRule$ShardsFixedStatement.callStatement(BaseDistributedSearchTestCase.java:992)
	at org.apache.solr.BaseDistributedSearchTestCase$ShardsRepeatRule$ShardsStatement.evaluate(BaseDistributedSearchTestCase.java:967)
	at com.carrotsearch.randomizedtesting.rules.SystemPropertiesRestoreRule$1.evaluate(SystemPropertiesRestoreRule.java:57)
	at org.apache.lucene.util.TestRuleSetupTeardownChained$1.evaluate(TestRuleSetupTeardownChained.java:49)
	at org.apache.lucene.util.AbstractBeforeAfterRule$1.evaluate(AbstractBeforeAfterRule.java:45)
	at org.apache.lucene.util.TestRuleThreadAndTestName$1.evaluate(TestRuleThreadAndTestName.java:48)
	at org.apache.lucene.util.TestRuleIgnoreAfterMaxFailures$1.evaluate(TestRuleIgnoreAfterMaxFailures.java:64)
	at org.apache.lucene.util.TestRuleMarkFailure$1.evaluate(TestRuleMarkFailure.java:47)
	at com.carrotsearch.randomizedtesting.rules.StatementAdapter.evaluate(StatementAdapter.java:36)
	at com.carrotsearch.randomizedtesting.ThreadLeakControl$StatementRunner.run(ThreadLeakControl.java:367)
	at com.carrotsearch.randomizedtesting.ThreadLeakControl.forkTimeoutingTask(ThreadLeakControl.java:809)
	at com.carrotsearch.randomizedtesting.ThreadLeakControl$3.evaluate(ThreadLeakControl.java:460)
	at com.carrotsearch.randomizedtesting.RandomizedRunner.runSingleTest(RandomizedRunner.java:880)
	at com.carrotsearch.randomizedtesting.RandomizedRunner$5.evaluate(RandomizedRunner.java:781)
	at com.carrotsearch.randomizedtesting.RandomizedRunner$6.evaluate(RandomizedRunner.java:816)
	at com.carrotsearch.randomizedtesting.RandomizedRunner$7.evaluate(RandomizedRunner.java:827)
	at com.carrotsearch.randomizedtesting.rules.StatementAdapter.evaluate(StatementAdapter.java:36)
	at com.carrotsearch.randomizedtesting.rules.SystemPropertiesRestoreRule$1.evaluate(SystemPropertiesRestoreRule.java:57)
	at org.apache.lucene.util.AbstractBeforeAfterRule$1.evaluate(AbstractBeforeAfterRule.java:45)
	at com.carrotsearch.randomizedtesting.rules.StatementAdapter.evaluate(StatementAdapter.java:36)
	at org.apache.lucene.util.TestRuleStoreClassName$1.evaluate(TestRuleStoreClassName.java:41)
	at com.carrotsearch.randomizedtesting.rules.NoShadowingOrOverridesOnMethodsRule$1.evaluate(NoShadowingOrOverridesOnMethodsRule.java:40)
	at com.carrotsearch.randomizedtesting.rules.NoShadowingOrOverridesOnMethodsRule$1.evaluate(NoShadowingOrOverridesOnMethodsRule.java:40)
	at com.carrotsearch.randomizedtesting.rules.StatementAdapter.evaluate(StatementAdapter.java:36)
	at com.carrotsearch.randomizedtesting.rules.StatementAdapter.evaluate(StatementAdapter.java:36)
	at com.carrotsearch.randomizedtesting.rules.StatementAdapter.evaluate(StatementAdapter.java:36)
	at org.apache.lucene.util.TestRuleAssertionsRequired$1.evaluate(TestRuleAssertionsRequired.java:53)
	at org.apache.lucene.util.TestRuleMarkFailure$1.evaluate(TestRuleMarkFailure.java:47)
	at org.apache.lucene.util.TestRuleIgnoreAfterMaxFailures$1.evaluate(TestRuleIgnoreAfterMaxFailures.java:64)
	at org.apache.lucene.util.TestRuleIgnoreTestSuites$1.evaluate(TestRuleIgnoreTestSuites.java:54)
	at com.carrotsearch.randomizedtesting.rules.StatementAdapter.evaluate(StatementAdapter.java:36)
	at com.carrotsearch.randomizedtesting.ThreadLeakControl$StatementRunner.run(ThreadLeakControl.java:367)
	at java.lang.Thread.run(Thread.java:745)
Caused by: org.apache.solr.client.solrj.SolrServerException: No live SolrServers available to handle this request:[http://127.0.0.1:61269/c8n_1x3_lf_shard1_replica1]
	at org.apache.solr.client.solrj.impl.LBHttpSolrClient.request(LBHttpSolrClient.java:384)
	at org.apache.solr.client.solrj.impl.CloudSolrClient.lambda$directUpdate$0(CloudSolrClient.java:730)
	at java.util.concurrent.FutureTask.run(FutureTask.java:266)
	at org.apache.solr.common.util.ExecutorUtil$MDCAwareThreadPoolExecutor.lambda$execute$0(ExecutorUtil.java:229)
	at java.util.concurrent.ThreadPoolExecutor.runWorker(ThreadPoolExecutor.java:1142)
	at java.util.concurrent.ThreadPoolExecutor$Worker.run(ThreadPoolExecutor.java:617)
	... 1 more
Caused by: org.apache.solr.client.solrj.SolrServerException: Server refused connection at: http://127.0.0.1:61269/c8n_1x3_lf_shard1_replica1
	at org.apache.solr.client.solrj.impl.HttpSolrClient.executeMethod(HttpSolrClient.java:599)
	at org.apache.solr.client.solrj.impl.HttpSolrClient.request(HttpSolrClient.java:261)
	at org.apache.solr.client.solrj.impl.HttpSolrClient.request(HttpSolrClient.java:250)
	at org.apache.solr.client.solrj.impl.LBHttpSolrClient.doRequest(LBHttpSolrClient.java:405)
	at org.apache.solr.client.solrj.impl.LBHttpSolrClient.request(LBHttpSolrClient.java:357)
	... 6 more
Caused by: java.net.ConnectException: Connection refused: connect
	at java.net.DualStackPlainSocketImpl.waitForConnect(Native Method)
	at java.net.DualStackPlainSocketImpl.socketConnect(DualStackPlainSocketImpl.java:85)
	at java.net.AbstractPlainSocketImpl.doConnect(AbstractPlainSocketImpl.java:350)
	at java.net.AbstractPlainSocketImpl.connectToAddress(AbstractPlainSocketImpl.java:206)
	at java.net.AbstractPlainSocketImpl.connect(AbstractPlainSocketImpl.java:188)
	at java.net.PlainSocketImpl.connect(PlainSocketImpl.java:172)
	at java.net.SocksSocketImpl.connect(SocksSocketImpl.java:392)
	at java.net.Socket.connect(Socket.java:589)
	at org.apache.http.conn.scheme.PlainSocketFactory.connectSocket(PlainSocketFactory.java:117)
	at org.apache.http.impl.conn.DefaultClientConnectionOperator.openConnection(DefaultClientConnectionOperator.java:177)
	at org.apache.http.impl.conn.ManagedClientConnectionImpl.open(ManagedClientConnectionImpl.java:304)
	at org.apache.http.impl.client.DefaultRequestDirector.tryConnect(DefaultRequestDirector.java:611)
	at org.apache.http.impl.client.DefaultRequestDirector.execute(DefaultRequestDirector.java:446)
	at org.apache.http.impl.client.AbstractHttpClient.doExecute(AbstractHttpClient.java:882)
	at org.apache.http.impl.client.CloseableHttpClient.execute(CloseableHttpClient.java:82)
	at org.apache.http.impl.client.CloseableHttpClient.execute(CloseableHttpClient.java:107)
	at org.apache.http.impl.client.CloseableHttpClient.execute(CloseableHttpClient.java:55)
	at org.apache.solr.client.solrj.impl.HttpSolrClient.executeMethod(HttpSolrClient.java:497)
	... 10 more




Build Log:
[...truncated 12130 lines...]
   [junit4] Suite: org.apache.solr.cloud.LeaderFailoverAfterPartitionTest
   [junit4]   2> Creating dataDir: C:\Users\jenkins\workspace\Lucene-Solr-6.x-Windows\solr\build\solr-core\test\J1\temp\solr.cloud.LeaderFailoverAfterPartitionTest_F5C71D2FBE28162B-001\init-core-data-001
   [junit4]   2> 2383186 INFO  (SUITE-LeaderFailoverAfterPartitionTest-seed#[F5C71D2FBE28162B]-worker) [    ] o.a.s.SolrTestCaseJ4 Randomized ssl (false) and clientAuth (false) via: @org.apache.solr.SolrTestCaseJ4$SuppressSSL(bugUrl=https://issues.apache.org/jira/browse/SOLR-5776)
   [junit4]   2> 2383186 INFO  (SUITE-LeaderFailoverAfterPartitionTest-seed#[F5C71D2FBE28162B]-worker) [    ] o.a.s.BaseDistributedSearchTestCase Setting hostContext system property: /
   [junit4]   2> 2383190 INFO  (TEST-LeaderFailoverAfterPartitionTest.test-seed#[F5C71D2FBE28162B]) [    ] o.a.s.c.ZkTestServer STARTING ZK TEST SERVER
   [junit4]   2> 2383190 INFO  (Thread-3662) [    ] o.a.s.c.ZkTestServer client port:0.0.0.0/0.0.0.0:0
   [junit4]   2> 2383190 INFO  (Thread-3662) [    ] o.a.s.c.ZkTestServer Starting server
   [junit4]   2> 2383292 INFO  (TEST-LeaderFailoverAfterPartitionTest.test-seed#[F5C71D2FBE28162B]) [    ] o.a.s.c.ZkTestServer start zk server on port:61226
   [junit4]   2> 2383292 INFO  (TEST-LeaderFailoverAfterPartitionTest.test-seed#[F5C71D2FBE28162B]) [    ] o.a.s.c.c.SolrZkClient Using default ZkCredentialsProvider
   [junit4]   2> 2383293 INFO  (TEST-LeaderFailoverAfterPartitionTest.test-seed#[F5C71D2FBE28162B]) [    ] o.a.s.c.c.ConnectionManager Waiting for client to connect to ZooKeeper
   [junit4]   2> 2383340 INFO  (zkCallback-2877-thread-1) [    ] o.a.s.c.c.ConnectionManager Watcher org.apache.solr.common.cloud.ConnectionManager@de0ca83 name:ZooKeeperConnection Watcher:127.0.0.1:61226 got event WatchedEvent state:SyncConnected type:None path:null path:null type:None
   [junit4]   2> 2383340 INFO  (TEST-LeaderFailoverAfterPartitionTest.test-seed#[F5C71D2FBE28162B]) [    ] o.a.s.c.c.ConnectionManager Client is connected to ZooKeeper
   [junit4]   2> 2383341 INFO  (TEST-LeaderFailoverAfterPartitionTest.test-seed#[F5C71D2FBE28162B]) [    ] o.a.s.c.c.SolrZkClient Using default ZkACLProvider
   [junit4]   2> 2383341 INFO  (TEST-LeaderFailoverAfterPartitionTest.test-seed#[F5C71D2FBE28162B]) [    ] o.a.s.c.c.SolrZkClient makePath: /solr
   [junit4]   2> 2383344 INFO  (TEST-LeaderFailoverAfterPartitionTest.test-seed#[F5C71D2FBE28162B]) [    ] o.a.s.c.c.SolrZkClient Using default ZkCredentialsProvider
   [junit4]   2> 2383345 INFO  (TEST-LeaderFailoverAfterPartitionTest.test-seed#[F5C71D2FBE28162B]) [    ] o.a.s.c.c.ConnectionManager Waiting for client to connect to ZooKeeper
   [junit4]   2> 2383347 INFO  (zkCallback-2878-thread-1) [    ] o.a.s.c.c.ConnectionManager Watcher org.apache.solr.common.cloud.ConnectionManager@1b698c02 name:ZooKeeperConnection Watcher:127.0.0.1:61226/solr got event WatchedEvent state:SyncConnected type:None path:null path:null type:None
   [junit4]   2> 2383347 INFO  (TEST-LeaderFailoverAfterPartitionTest.test-seed#[F5C71D2FBE28162B]) [    ] o.a.s.c.c.ConnectionManager Client is connected to ZooKeeper
   [junit4]   2> 2383347 INFO  (TEST-LeaderFailoverAfterPartitionTest.test-seed#[F5C71D2FBE28162B]) [    ] o.a.s.c.c.SolrZkClient Using default ZkACLProvider
   [junit4]   2> 2383347 INFO  (TEST-LeaderFailoverAfterPartitionTest.test-seed#[F5C71D2FBE28162B]) [    ] o.a.s.c.c.SolrZkClient makePath: /collections/collection1
   [junit4]   2> 2383350 INFO  (TEST-LeaderFailoverAfterPartitionTest.test-seed#[F5C71D2FBE28162B]) [    ] o.a.s.c.c.SolrZkClient makePath: /collections/collection1/shards
   [junit4]   2> 2383353 INFO  (TEST-LeaderFailoverAfterPartitionTest.test-seed#[F5C71D2FBE28162B]) [    ] o.a.s.c.c.SolrZkClient makePath: /collections/control_collection
   [junit4]   2> 2383354 INFO  (TEST-LeaderFailoverAfterPartitionTest.test-seed#[F5C71D2FBE28162B]) [    ] o.a.s.c.c.SolrZkClient makePath: /collections/control_collection/shards
   [junit4]   2> 2383357 INFO  (TEST-LeaderFailoverAfterPartitionTest.test-seed#[F5C71D2FBE28162B]) [    ] o.a.s.c.AbstractZkTestCase put C:\Users\jenkins\workspace\Lucene-Solr-6.x-Windows\solr\core\src\test-files\solr\collection1\conf\solrconfig-tlog.xml to /configs/conf1/solrconfig.xml
   [junit4]   2> 2383358 INFO  (TEST-LeaderFailoverAfterPartitionTest.test-seed#[F5C71D2FBE28162B]) [    ] o.a.s.c.c.SolrZkClient makePath: /configs/conf1/solrconfig.xml
   [junit4]   2> 2383361 INFO  (TEST-LeaderFailoverAfterPartitionTest.test-seed#[F5C71D2FBE28162B]) [    ] o.a.s.c.AbstractZkTestCase put C:\Users\jenkins\workspace\Lucene-Solr-6.x-Windows\solr\core\src\test-files\solr\collection1\conf\schema.xml to /configs/conf1/schema.xml
   [junit4]   2> 2383361 INFO  (TEST-LeaderFailoverAfterPartitionTest.test-seed#[F5C71D2FBE28162B]) [    ] o.a.s.c.c.SolrZkClient makePath: /configs/conf1/schema.xml
   [junit4]   2> 2383364 INFO  (TEST-LeaderFailoverAfterPartitionTest.test-seed#[F5C71D2FBE28162B]) [    ] o.a.s.c.AbstractZkTestCase put C:\Users\jenkins\workspace\Lucene-Solr-6.x-Windows\solr\core\src\test-files\solr\collection1\conf\solrconfig.snippet.randomindexconfig.xml to /configs/conf1/solrconfig.snippet.randomindexconfig.xml
   [junit4]   2> 2383364 INFO  (TEST-LeaderFailoverAfterPartitionTest.test-seed#[F5C71D2FBE28162B]) [    ] o.a.s.c.c.SolrZkClient makePath: /configs/conf1/solrconfig.snippet.randomindexconfig.xml
   [junit4]   2> 2383366 INFO  (TEST-LeaderFailoverAfterPartitionTest.test-seed#[F5C71D2FBE28162B]) [    ] o.a.s.c.AbstractZkTestCase put C:\Users\jenkins\workspace\Lucene-Solr-6.x-Windows\solr\core\src\test-files\solr\collection1\conf\stopwords.txt to /configs/conf1/stopwords.txt
   [junit4]   2> 2383366 INFO  (TEST-LeaderFailoverAfterPartitionTest.test-seed#[F5C71D2FBE28162B]) [    ] o.a.s.c.c.SolrZkClient makePath: /configs/conf1/stopwords.txt
   [junit4]   2> 2383368 INFO  (TEST-LeaderFailoverAfterPartitionTest.test-seed#[F5C71D2FBE28162B]) [    ] o.a.s.c.AbstractZkTestCase put C:\Users\jenkins\workspace\Lucene-Solr-6.x-Windows\solr\core\src\test-files\solr\collection1\conf\protwords.txt to /configs/conf1/protwords.txt
   [junit4]   2> 2383369 INFO  (TEST-LeaderFailoverAfterPartitionTest.test-seed#[F5C71D2FBE28162B]) [    ] o.a.s.c.c.SolrZkClient makePath: /configs/conf1/protwords.txt
   [junit4]   2> 2383371 INFO  (TEST-LeaderFailoverAfterPartitionTest.test-seed#[F5C71D2FBE28162B]) [    ] o.a.s.c.AbstractZkTestCase put C:\Users\jenkins\workspace\Lucene-Solr-6.x-Windows\solr\core\src\test-files\solr\collection1\conf\currency.xml to /configs/conf1/currency.xml
   [junit4]   2> 2383371 INFO  (TEST-LeaderFailoverAfterPartitionTest.test-seed#[F5C71D2FBE28162B]) [    ] o.a.s.c.c.SolrZkClient makePath: /configs/conf1/currency.xml
   [junit4]   2> 2383373 INFO  (TEST-LeaderFailoverAfterPartitionTest.test-seed#[F5C71D2FBE28162B]) [    ] o.a.s.c.AbstractZkTestCase put C:\Users\jenkins\workspace\Lucene-Solr-6.x-Windows\solr\core\src\test-files\solr\collection1\conf\enumsConfig.xml to /configs/conf1/enumsConfig.xml
   [junit4]   2> 2383373 INFO  (TEST-LeaderFailoverAfterPartitionTest.test-seed#[F5C71D2FBE28162B]) [    ] o.a.s.c.c.SolrZkClient makePath: /configs/conf1/enumsConfig.xml
   [junit4]   2> 2383374 INFO  (TEST-LeaderFailoverAfterPartitionTest.test-seed#[F5C71D2FBE28162B]) [    ] o.a.s.c.AbstractZkTestCase put C:\Users\jenkins\workspace\Lucene-Solr-6.x-Windows\solr\core\src\test-files\solr\collection1\conf\open-exchange-rates.json to /configs/conf1/open-exchange-rates.json
   [junit4]   2> 2383376 INFO  (TEST-LeaderFailoverAfterPartitionTest.test-seed#[F5C71D2FBE28162B]) [    ] o.a.s.c.c.SolrZkClient makePath: /configs/conf1/open-exchange-rates.json
   [junit4]   2> 2383378 INFO  (TEST-LeaderFailoverAfterPartitionTest.test-seed#[F5C71D2FBE28162B]) [    ] o.a.s.c.AbstractZkTestCase put C:\Users\jenkins\workspace\Lucene-Solr-6.x-Windows\solr\core\src\test-files\solr\collection1\conf\mapping-ISOLatin1Accent.txt to /configs/conf1/mapping-ISOLatin1Accent.txt
   [junit4]   2> 2383378 INFO  (TEST-LeaderFailoverAfterPartitionTest.test-seed#[F5C71D2FBE28162B]) [    ] o.a.s.c.c.SolrZkClient makePath: /configs/conf1/mapping-ISOLatin1Accent.txt
   [junit4]   2> 2383380 INFO  (TEST-LeaderFailoverAfterPartitionTest.test-seed#[F5C71D2FBE28162B]) [    ] o.a.s.c.AbstractZkTestCase put C:\Users\jenkins\workspace\Lucene-Solr-6.x-Windows\solr\core\src\test-files\solr\collection1\conf\old_synonyms.txt to /configs/conf1/old_synonyms.txt
   [junit4]   2> 2383380 INFO  (TEST-LeaderFailoverAfterPartitionTest.test-seed#[F5C71D2FBE28162B]) [    ] o.a.s.c.c.SolrZkClient makePath: /configs/conf1/old_synonyms.txt
   [junit4]   2> 2383381 INFO  (TEST-LeaderFailoverAfterPartitionTest.test-seed#[F5C71D2FBE28162B]) [    ] o.a.s.c.AbstractZkTestCase put C:\Users\jenkins\workspace\Lucene-Solr-6.x-Windows\solr\core\src\test-files\solr\collection1\conf\synonyms.txt to /configs/conf1/synonyms.txt
   [junit4]   2> 2383382 INFO  (TEST-LeaderFailoverAfterPartitionTest.test-seed#[F5C71D2FBE28162B]) [    ] o.a.s.c.c.SolrZkClient makePath: /configs/conf1/synonyms.txt
   [junit4]   2> 2383878 INFO  (TEST-LeaderFailoverAfterPartitionTest.test-seed#[F5C71D2FBE28162B]) [    ] o.a.s.SolrTestCaseJ4 Writing core.properties file to C:\Users\jenkins\workspace\Lucene-Solr-6.x-Windows\solr\build\solr-core\test\J1\temp\solr.cloud.LeaderFailoverAfterPartitionTest_F5C71D2FBE28162B-001\control-001\cores\collection1
   [junit4]   2> 2383883 INFO  (TEST-LeaderFailoverAfterPartitionTest.test-seed#[F5C71D2FBE28162B]) [    ] o.e.j.s.Server jetty-9.3.8.v20160314
   [junit4]   2> 2383885 INFO  (TEST-LeaderFailoverAfterPartitionTest.test-seed#[F5C71D2FBE28162B]) [    ] o.e.j.s.h.ContextHandler Started o.e.j.s.ServletContextHandler@34058e2b{/,null,AVAILABLE}
   [junit4]   2> 2383888 INFO  (TEST-LeaderFailoverAfterPartitionTest.test-seed#[F5C71D2FBE28162B]) [    ] o.e.j.s.ServerConnector Started ServerConnector@45e88d3d{HTTP/1.1,[http/1.1]}{127.0.0.1:61234}
   [junit4]   2> 2383888 INFO  (TEST-LeaderFailoverAfterPartitionTest.test-seed#[F5C71D2FBE28162B]) [    ] o.e.j.s.Server Started @2389803ms
   [junit4]   2> 2383888 INFO  (TEST-LeaderFailoverAfterPartitionTest.test-seed#[F5C71D2FBE28162B]) [    ] o.a.s.c.s.e.JettySolrRunner Jetty properties: {solr.data.dir=C:\Users\jenkins\workspace\Lucene-Solr-6.x-Windows\solr\build\solr-core\test\J1\temp\solr.cloud.LeaderFailoverAfterPartitionTest_F5C71D2FBE28162B-001\tempDir-001/control/data, hostContext=/, hostPort=61233, coreRootDirectory=C:\Users\jenkins\workspace\Lucene-Solr-6.x-Windows\solr\build\solr-core\test\J1\temp\solr.cloud.LeaderFailoverAfterPartitionTest_F5C71D2FBE28162B-001\control-001\cores}
   [junit4]   2> 2383888 INFO  (TEST-LeaderFailoverAfterPartitionTest.test-seed#[F5C71D2FBE28162B]) [    ] o.a.s.s.SolrDispatchFilter SolrDispatchFilter.init(): sun.misc.Launcher$AppClassLoader@73d16e93
   [junit4]   2> 2383888 INFO  (TEST-LeaderFailoverAfterPartitionTest.test-seed#[F5C71D2FBE28162B]) [    ] o.a.s.c.SolrResourceLoader new SolrResourceLoader for directory: 'C:\Users\jenkins\workspace\Lucene-Solr-6.x-Windows\solr\build\solr-core\test\J1\temp\solr.cloud.LeaderFailoverAfterPartitionTest_F5C71D2FBE28162B-001\control-001'
   [junit4]   2> 2383889 INFO  (TEST-LeaderFailoverAfterPartitionTest.test-seed#[F5C71D2FBE28162B]) [    ] o.a.s.c.SolrResourceLoader JNDI not configured for solr (NoInitialContextEx)
   [junit4]   2> 2383889 INFO  (TEST-LeaderFailoverAfterPartitionTest.test-seed#[F5C71D2FBE28162B]) [    ] o.a.s.c.SolrResourceLoader solr home defaulted to 'solr/' (could not find system property or JNDI)
   [junit4]   2> 2383889 INFO  (TEST-LeaderFailoverAfterPartitionTest.test-seed#[F5C71D2FBE28162B]) [    ] o.a.s.c.c.SolrZkClient Using default ZkCredentialsProvider
   [junit4]   2> 2383890 INFO  (TEST-LeaderFailoverAfterPartitionTest.test-seed#[F5C71D2FBE28162B]) [    ] o.a.s.c.c.ConnectionManager Waiting for client to connect to ZooKeeper
   [junit4]   2> 2383893 INFO  (zkCallback-2879-thread-1) [    ] o.a.s.c.c.ConnectionManager Watcher org.apache.solr.common.cloud.ConnectionManager@3b2127e2 name:ZooKeeperConnection Watcher:127.0.0.1:61226/solr got event WatchedEvent state:SyncConnected type:None path:null path:null type:None
   [junit4]   2> 2383894 INFO  (TEST-LeaderFailoverAfterPartitionTest.test-seed#[F5C71D2FBE28162B]) [    ] o.a.s.c.c.ConnectionManager Client is connected to ZooKeeper
   [junit4]   2> 2383894 INFO  (TEST-LeaderFailoverAfterPartitionTest.test-seed#[F5C71D2FBE28162B]) [    ] o.a.s.c.c.SolrZkClient Using default ZkACLProvider
   [junit4]   2> 2383894 INFO  (TEST-LeaderFailoverAfterPartitionTest.test-seed#[F5C71D2FBE28162B]) [    ] o.a.s.s.SolrDispatchFilter Loading solr.xml from SolrHome (not found in ZooKeeper)
   [junit4]   2> 2383894 INFO  (TEST-LeaderFailoverAfterPartitionTest.test-seed#[F5C71D2FBE28162B]) [    ] o.a.s.c.SolrXmlConfig Loading container configuration from C:\Users\jenkins\workspace\Lucene-Solr-6.x-Windows\solr\build\solr-core\test\J1\temp\solr.cloud.LeaderFailoverAfterPartitionTest_F5C71D2FBE28162B-001\control-001\solr.xml
   [junit4]   2> 2383906 INFO  (TEST-LeaderFailoverAfterPartitionTest.test-seed#[F5C71D2FBE28162B]) [    ] o.a.s.c.CorePropertiesLocator Config-defined core root directory: C:\Users\jenkins\workspace\Lucene-Solr-6.x-Windows\solr\build\solr-core\test\J1\temp\solr.cloud.LeaderFailoverAfterPartitionTest_F5C71D2FBE28162B-001\control-001\cores
   [junit4]   2> 2383906 INFO  (TEST-LeaderFailoverAfterPartitionTest.test-seed#[F5C71D2FBE28162B]) [    ] o.a.s.c.CoreContainer New CoreContainer 29179968
   [junit4]   2> 2383906 INFO  (TEST-LeaderFailoverAfterPartitionTest.test-seed#[F5C71D2FBE28162B]) [    ] o.a.s.c.CoreContainer Loading cores into CoreContainer [instanceDir=C:\Users\jenkins\workspace\Lucene-Solr-6.x-Windows\solr\build\solr-core\test\J1\temp\solr.cloud.LeaderFailoverAfterPartitionTest_F5C71D2FBE28162B-001\control-001]
   [junit4]   2> 2383906 WARN  (TEST-LeaderFailoverAfterPartitionTest.test-seed#[F5C71D2FBE28162B]) [    ] o.a.s.c.CoreContainer Couldn't add files from C:\Users\jenkins\workspace\Lucene-Solr-6.x-Windows\solr\build\solr-core\test\J1\temp\solr.cloud.LeaderFailoverAfterPartitionTest_F5C71D2FBE28162B-001\control-001\lib to classpath: C:\Users\jenkins\workspace\Lucene-Solr-6.x-Windows\solr\build\solr-core\test\J1\temp\solr.cloud.LeaderFailoverAfterPartitionTest_F5C71D2FBE28162B-001\control-001\lib
   [junit4]   2> 2383907 INFO  (TEST-LeaderFailoverAfterPartitionTest.test-seed#[F5C71D2FBE28162B]) [    ] o.a.s.h.c.HttpShardHandlerFactory created with socketTimeout : 90000,urlScheme : ,connTimeout : 15000,maxConnectionsPerHost : 20,maxConnections : 10000,corePoolSize : 0,maximumPoolSize : 2147483647,maxThreadIdleTime : 5,sizeOfQueue : -1,fairnessPolicy : false,useRetries : false,connectionsEvictorSleepDelay : 5000,maxConnectionIdleTime : 40000,
   [junit4]   2> 2383910 INFO  (TEST-LeaderFailoverAfterPartitionTest.test-seed#[F5C71D2FBE28162B]) [    ] o.a.s.u.UpdateShardHandler Creating UpdateShardHandler HTTP client with params: socketTimeout=340000&connTimeout=45000&retry=true
   [junit4]   2> 2383911 INFO  (TEST-LeaderFailoverAfterPartitionTest.test-seed#[F5C71D2FBE28162B]) [    ] o.a.s.l.LogWatcher SLF4J impl is org.slf4j.impl.Log4jLoggerFactory
   [junit4]   2> 2383911 INFO  (TEST-LeaderFailoverAfterPartitionTest.test-seed#[F5C71D2FBE28162B]) [    ] o.a.s.l.LogWatcher Registering Log Listener [Log4j (org.slf4j.impl.Log4jLoggerFactory)]
   [junit4]   2> 2383911 INFO  (TEST-LeaderFailoverAfterPartitionTest.test-seed#[F5C71D2FBE28162B]) [    ] o.a.s.c.ZkContainer Zookeeper client=127.0.0.1:61226/solr
   [junit4]   2> 2383911 INFO  (TEST-LeaderFailoverAfterPartitionTest.test-seed#[F5C71D2FBE28162B]) [    ] o.a.s.c.ZkController zkHost includes chroot
   [junit4]   2> 2383911 INFO  (TEST-LeaderFailoverAfterPartitionTest.test-seed#[F5C71D2FBE28162B]) [    ] o.a.s.c.c.SolrZkClient Using default ZkCredentialsProvider
   [junit4]   2> 2383912 INFO  (TEST-LeaderFailoverAfterPartitionTest.test-seed#[F5C71D2FBE28162B]) [    ] o.a.s.c.c.ConnectionManager Waiting for client to connect to ZooKeeper
   [junit4]   2> 2383952 INFO  (zkCallback-2882-thread-1) [    ] o.a.s.c.c.ConnectionManager Watcher org.apache.solr.common.cloud.ConnectionManager@615cea8f name:ZooKeeperConnection Watcher:127.0.0.1:61226 got event WatchedEvent state:SyncConnected type:None path:null path:null type:None
   [junit4]   2> 2383952 INFO  (TEST-LeaderFailoverAfterPartitionTest.test-seed#[F5C71D2FBE28162B]) [    ] o.a.s.c.c.ConnectionManager Client is connected to ZooKeeper
   [junit4]   2> 2383953 INFO  (TEST-LeaderFailoverAfterPartitionTest.test-seed#[F5C71D2FBE28162B]) [    ] o.a.s.c.c.SolrZkClient Using default ZkACLProvider
   [junit4]   2> 2383954 WARN  (NIOServerCxn.Factory:0.0.0.0/0.0.0.0:0) [    ] o.a.z.s.NIOServerCnxn caught end of stream exception
   [junit4]   2> EndOfStreamException: Unable to read additional data from client sessionid 0x157197b118a0003, likely client has closed socket
   [junit4]   2> 	at org.apache.zookeeper.server.NIOServerCnxn.doIO(NIOServerCnxn.java:228)
   [junit4]   2> 	at org.apache.zookeeper.server.NIOServerCnxnFactory.run(NIOServerCnxnFactory.java:208)
   [junit4]   2> 	at java.lang.Thread.run(Thread.java:745)
   [junit4]   2> 2383954 INFO  (TEST-LeaderFailoverAfterPartitionTest.test-seed#[F5C71D2FBE28162B]) [n:127.0.0.1:61233_    ] o.a.s.c.ZkController Added new OnReconnect listener org.apache.solr.cloud.ZkController$$Lambda$74/1395342677@6a337099
   [junit4]   2> 2383955 INFO  (TEST-LeaderFailoverAfterPartitionTest.test-seed#[F5C71D2FBE28162B]) [n:127.0.0.1:61233_    ] o.a.s.c.c.ConnectionManager Waiting for client to connect to ZooKeeper
   [junit4]   2> 2383956 INFO  (zkCallback-2883-thread-1-processing-n:127.0.0.1:61233_) [n:127.0.0.1:61233_    ] o.a.s.c.c.ConnectionManager Watcher org.apache.solr.common.cloud.ConnectionManager@6f0a6c8e name:ZooKeeperConnection Watcher:127.0.0.1:61226/solr got event WatchedEvent state:SyncConnected type:None path:null path:null type:None
   [junit4]   2> 2383956 INFO  (TEST-LeaderFailoverAfterPartitionTest.test-seed#[F5C71D2FBE28162B]) [n:127.0.0.1:61233_    ] o.a.s.c.c.ConnectionManager Client is connected to ZooKeeper
   [junit4]   2> 2383958 INFO  (TEST-LeaderFailoverAfterPartitionTest.test-seed#[F5C71D2FBE28162B]) [n:127.0.0.1:61233_    ] o.a.s.c.c.SolrZkClient makePath: /overseer/queue
   [junit4]   2> 2383961 INFO  (TEST-LeaderFailoverAfterPartitionTest.test-seed#[F5C71D2FBE28162B]) [n:127.0.0.1:61233_    ] o.a.s.c.c.SolrZkClient makePath: /overseer/collection-queue-work
   [junit4]   2> 2383964 INFO  (TEST-LeaderFailoverAfterPartitionTest.test-seed#[F5C71D2FBE28162B]) [n:127.0.0.1:61233_    ] o.a.s.c.c.SolrZkClient makePath: /overseer/collection-map-running
   [junit4]   2> 2383967 INFO  (TEST-LeaderFailoverAfterPartitionTest.test-seed#[F5C71D2FBE28162B]) [n:127.0.0.1:61233_    ] o.a.s.c.c.SolrZkClient makePath: /overseer/collection-map-completed
   [junit4]   2> 2383969 INFO  (TEST-LeaderFailoverAfterPartitionTest.test-seed#[F5C71D2FBE28162B]) [n:127.0.0.1:61233_    ] o.a.s.c.c.SolrZkClient makePath: /overseer/collection-map-failure
   [junit4]   2> 2383971 INFO  (TEST-LeaderFailoverAfterPartitionTest.test-seed#[F5C71D2FBE28162B]) [n:127.0.0.1:61233_    ] o.a.s.c.c.SolrZkClient makePath: /live_nodes
   [junit4]   2> 2383973 INFO  (TEST-LeaderFailoverAfterPartitionTest.test-seed#[F5C71D2FBE28162B]) [n:127.0.0.1:61233_    ] o.a.s.c.c.SolrZkClient makePath: /aliases.json
   [junit4]   2> 2383974 INFO  (TEST-LeaderFailoverAfterPartitionTest.test-seed#[F5C71D2FBE28162B]) [n:127.0.0.1:61233_    ] o.a.s.c.c.SolrZkClient makePath: /clusterstate.json
   [junit4]   2> 2383976 INFO  (TEST-LeaderFailoverAfterPartitionTest.test-seed#[F5C71D2FBE28162B]) [n:127.0.0.1:61233_    ] o.a.s.c.c.SolrZkClient makePath: /security.json
   [junit4]   2> 2383978 INFO  (TEST-LeaderFailoverAfterPartitionTest.test-seed#[F5C71D2FBE28162B]) [n:127.0.0.1:61233_    ] o.a.s.c.c.ZkStateReader Updating cluster state from ZooKeeper... 
   [junit4]   2> 2383979 INFO  (TEST-LeaderFailoverAfterPartitionTest.test-seed#[F5C71D2FBE28162B]) [n:127.0.0.1:61233_    ] o.a.s.c.c.ZkStateReader Loaded empty cluster properties
   [junit4]   2> 2383980 INFO  (TEST-LeaderFailoverAfterPartitionTest.test-seed#[F5C71D2FBE28162B]) [n:127.0.0.1:61233_    ] o.a.s.c.c.ZkStateReader Updated live nodes from ZooKeeper... (0) -> (0)
   [junit4]   2> 2383983 INFO  (TEST-LeaderFailoverAfterPartitionTest.test-seed#[F5C71D2FBE28162B]) [n:127.0.0.1:61233_    ] o.a.s.c.c.SolrZkClient makePath: /overseer_elect
   [junit4]   2> 2383984 INFO  (TEST-LeaderFailoverAfterPartitionTest.test-seed#[F5C71D2FBE28162B]) [n:127.0.0.1:61233_    ] o.a.s.c.c.SolrZkClient makePath: /overseer_elect/election
   [junit4]   2> 2383986 INFO  (TEST-LeaderFailoverAfterPartitionTest.test-seed#[F5C71D2FBE28162B]) [n:127.0.0.1:61233_    ] o.a.s.c.Overseer Overseer (id=null) closing
   [junit4]   2> 2383986 INFO  (TEST-LeaderFailoverAfterPartitionTest.test-seed#[F5C71D2FBE28162B]) [n:127.0.0.1:61233_    ] o.a.s.c.LeaderElector Joined leadership election with path: /overseer_elect/election/96573933377683460-127.0.0.1:61233_-n_0000000000
   [junit4]   2> 2383986 INFO  (TEST-LeaderFailoverAfterPartitionTest.test-seed#[F5C71D2FBE28162B]) [n:127.0.0.1:61233_    ] o.a.s.c.OverseerElectionContext I am going to be the leader 127.0.0.1:61233_
   [junit4]   2> 2383987 INFO  (TEST-LeaderFailoverAfterPartitionTest.test-seed#[F5C71D2FBE28162B]) [n:127.0.0.1:61233_    ] o.a.s.c.c.SolrZkClient makePath: /overseer_elect/leader
   [junit4]   2> 2383988 INFO  (TEST-LeaderFailoverAfterPartitionTest.test-seed#[F5C71D2FBE28162B]) [n:127.0.0.1:61233_    ] o.a.s.c.Overseer Overseer (id=96573933377683460-127.0.0.1:61233_-n_0000000000) starting
   [junit4]   2> 2383990 INFO  (TEST-LeaderFailoverAfterPartitionTest.test-seed#[F5C71D2FBE28162B]) [n:127.0.0.1:61233_    ] o.a.s.c.c.SolrZkClient makePath: /overseer/queue-work
   [junit4]   2> 2383996 INFO  (TEST-LeaderFailoverAfterPartitionTest.test-seed#[F5C71D2FBE28162B]) [n:127.0.0.1:61233_    ] o.a.s.c.OverseerAutoReplicaFailoverThread Starting OverseerAutoReplicaFailoverThread autoReplicaFailoverWorkLoopDelay=10000 autoReplicaFailoverWaitAfterExpiration=10000 autoReplicaFailoverBadNodeExpiration=60000
   [junit4]   2> 2383997 INFO  (OverseerCollectionConfigSetProcessor-96573933377683460-127.0.0.1:61233_-n_0000000000) [n:127.0.0.1:61233_    ] o.a.s.c.OverseerTaskProcessor Process current queue of overseer operations
   [junit4]   2> 2383997 INFO  (TEST-LeaderFailoverAfterPartitionTest.test-seed#[F5C71D2FBE28162B]) [n:127.0.0.1:61233_    ] o.a.s.c.ZkController Register node as live in ZooKeeper:/live_nodes/127.0.0.1:61233_
   [junit4]   2> 2383997 INFO  (TEST-LeaderFailoverAfterPartitionTest.test-seed#[F5C71D2FBE28162B]) [n:127.0.0.1:61233_    ] o.a.s.c.c.SolrZkClient makePath: /live_nodes/127.0.0.1:61233_
   [junit4]   2> 2383997 INFO  (OverseerStateUpdate-96573933377683460-127.0.0.1:61233_-n_0000000000) [n:127.0.0.1:61233_    ] o.a.s.c.Overseer Starting to work on the main queue
   [junit4]   2> 2384000 INFO  (zkCallback-2883-thread-1-processing-n:127.0.0.1:61233_) [n:127.0.0.1:61233_    ] o.a.s.c.c.ZkStateReader A live node change: [WatchedEvent state:SyncConnected type:NodeChildrenChanged path:/live_nodes], has occurred - updating... (live nodes size: [0])
   [junit4]   2> 2384000 INFO  (OverseerStateUpdate-96573933377683460-127.0.0.1:61233_-n_0000000000) [n:127.0.0.1:61233_    ] o.a.s.c.c.ZkStateReader Updated live nodes from ZooKeeper... (0) -> (1)
   [junit4]   2> 2384000 INFO  (zkCallback-2883-thread-1-processing-n:127.0.0.1:61233_) [n:127.0.0.1:61233_    ] o.a.s.c.c.ZkStateReader Updated live nodes from ZooKeeper... (1) -> (1)
   [junit4]   2> 2384008 INFO  (TEST-LeaderFailoverAfterPartitionTest.test-seed#[F5C71D2FBE28162B]) [n:127.0.0.1:61233_    ] o.a.s.c.CoreContainer Security conf doesn't exist. Skipping setup for authorization module.
   [junit4]   2> 2384008 INFO  (TEST-LeaderFailoverAfterPartitionTest.test-seed#[F5C71D2FBE28162B]) [n:127.0.0.1:61233_    ] o.a.s.c.CoreContainer No authentication plugin used.
   [junit4]   2> 2384010 INFO  (TEST-LeaderFailoverAfterPartitionTest.test-seed#[F5C71D2FBE28162B]) [n:127.0.0.1:61233_    ] o.a.s.c.CorePropertiesLocator Looking for core definitions underneath C:\Users\jenkins\workspace\Lucene-Solr-6.x-Windows\solr\build\solr-core\test\J1\temp\solr.cloud.LeaderFailoverAfterPartitionTest_F5C71D2FBE28162B-001\control-001\cores
   [junit4]   2> 2384012 INFO  (TEST-LeaderFailoverAfterPartitionTest.test-seed#[F5C71D2FBE28162B]) [n:127.0.0.1:61233_    ] o.a.s.c.CoreDescriptor Created CoreDescriptor: {name=collection1, config=solrconfig.xml, transient=false, schema=schema.xml, loadOnStartup=true, configSetProperties=configsetprops.json, collection=control_collection, coreNodeName=, dataDir=data\, shard=}
   [junit4]   2> 2384012 INFO  (TEST-LeaderFailoverAfterPartitionTest.test-seed#[F5C71D2FBE28162B]) [n:127.0.0.1:61233_    ] o.a.s.c.CorePropertiesLocator Found core collection1 in C:\Users\jenkins\workspace\Lucene-Solr-6.x-Windows\solr\build\solr-core\test\J1\temp\solr.cloud.LeaderFailoverAfterPartitionTest_F5C71D2FBE28162B-001\control-001\cores\collection1
   [junit4]   2> 2384012 INFO  (TEST-LeaderFailoverAfterPartitionTest.test-seed#[F5C71D2FBE28162B]) [n:127.0.0.1:61233_    ] o.a.s.c.CorePropertiesLocator Found 1 core definitions
   [junit4]   2> 2384014 INFO  (TEST-LeaderFailoverAfterPartitionTest.test-seed#[F5C71D2FBE28162B]) [n:127.0.0.1:61233_    ] o.a.s.s.SolrDispatchFilter user.dir=C:\Users\jenkins\workspace\Lucene-Solr-6.x-Windows\solr\build\solr-core\test\J1
   [junit4]   2> 2384014 INFO  (coreLoadExecutor-8305-thread-1-processing-n:127.0.0.1:61233_) [n:127.0.0.1:61233_ c:control_collection   x:collection1] o.a.s.c.ZkController publishing state=down
   [junit4]   2> 2384014 INFO  (coreLoadExecutor-8305-thread-1-processing-n:127.0.0.1:61233_) [n:127.0.0.1:61233_ c:control_collection   x:collection1] o.a.s.c.ZkController numShards not found on descriptor - reading it from system property
   [junit4]   2> 2384014 INFO  (TEST-LeaderFailoverAfterPartitionTest.test-seed#[F5C71D2FBE28162B]) [n:127.0.0.1:61233_    ] o.a.s.s.SolrDispatchFilter SolrDispatchFilter.init() done
   [junit4]   2> 2384015 INFO  (coreLoadExecutor-8305-thread-1-processing-n:127.0.0.1:61233_) [n:127.0.0.1:61233_ c:control_collection   x:collection1] o.a.s.c.ZkController Collection control_collection not visible yet, but flagging it so a watch is registered when it becomes visible
   [junit4]   2> 2384016 INFO  (OverseerStateUpdate-96573933377683460-127.0.0.1:61233_-n_0000000000) [n:127.0.0.1:61233_    ] o.a.s.c.Overseer processMessage: queueSize: 1, message = {
   [junit4]   2>   "core":"collection1",
   [junit4]   2>   "roles":null,
   [junit4]   2>   "base_url":"http://127.0.0.1:61233",
   [junit4]   2>   "node_name":"127.0.0.1:61233_",
   [junit4]   2>   "numShards":"1",
   [junit4]   2>   "state":"down",
   [junit4]   2>   "shard":null,
   [junit4]   2>   "collection":"control_collection",
   [junit4]   2>   "operation":"state"} current state version: 0
   [junit4]   2> 2384016 INFO  (OverseerStateUpdate-96573933377683460-127.0.0.1:61233_-n_0000000000) [n:127.0.0.1:61233_    ] o.a.s.c.o.ReplicaMutator Update state numShards=1 message={
   [junit4]   2>   "core":"collection1",
   [junit4]   2>   "roles":null,
   [junit4]   2>   "base_url":"http://127.0.0.1:61233",
   [junit4]   2>   "node_name":"127.0.0.1:61233_",
   [junit4]   2>   "numShards":"1",
   [junit4]   2>   "state":"down",
   [junit4]   2>   "shard":null,
   [junit4]   2>   "collection":"control_collection",
   [junit4]   2>   "operation":"state"}
   [junit4]   2> 2384016 INFO  (coreLoadExecutor-8305-thread-1-processing-n:127.0.0.1:61233_) [n:127.0.0.1:61233_ c:control_collection   x:collection1] o.a.s.c.c.ZkStateReader Deleting data for [control_collection]
   [junit4]   2> 2384016 INFO  (OverseerStateUpdate-96573933377683460-127.0.0.1:61233_-n_0000000000) [n:127.0.0.1:61233_    ] o.a.s.c.o.ClusterStateMutator building a new cName: control_collection
   [junit4]   2> 2384017 INFO  (OverseerStateUpdate-96573933377683460-127.0.0.1:61233_-n_0000000000) [n:127.0.0.1:61233_    ] o.a.s.c.o.ReplicaMutator Assigning new node to shard shard=shard1
   [junit4]   2> 2384018 INFO  (coreLoadExecutor-8305-thread-1-processing-n:127.0.0.1:61233_) [n:127.0.0.1:61233_ c:control_collection   x:collection1] o.a.s.c.ZkController look for our core node name
   [junit4]   2> 2384019 INFO  (zkCallback-2883-thread-1-processing-n:127.0.0.1:61233_) [n:127.0.0.1:61233_    ] o.a.s.c.c.ZkStateReader A cluster state change: [WatchedEvent state:SyncConnected type:NodeDataChanged path:/clusterstate.json], has occurred - updating... (live nodes size: [1])
   [junit4]   2> 2385018 INFO  (coreLoadExecutor-8305-thread-1-processing-n:127.0.0.1:61233_) [n:127.0.0.1:61233_ c:control_collection   x:collection1] o.a.s.c.ZkController waiting to find shard id in clusterstate for collection1
   [junit4]   2> 2385018 INFO  (coreLoadExecutor-8305-thread-1-processing-n:127.0.0.1:61233_) [n:127.0.0.1:61233_ c:control_collection   x:collection1] o.a.s.c.ZkController Check for collection zkNode:control_collection
   [junit4]   2> 2385020 INFO  (coreLoadExecutor-8305-thread-1-processing-n:127.0.0.1:61233_) [n:127.0.0.1:61233_ c:control_collection   x:collection1] o.a.s.c.ZkController Collection zkNode exists
   [junit4]   2> 2385020 INFO  (coreLoadExecutor-8305-thread-1-processing-n:127.0.0.1:61233_) [n:127.0.0.1:61233_ c:control_collection   x:collection1] o.a.s.c.c.ZkStateReader Load collection config from: [/collections/control_collection]
   [junit4]   2> 2385020 INFO  (coreLoadExecutor-8305-thread-1-processing-n:127.0.0.1:61233_) [n:127.0.0.1:61233_ c:control_collection   x:collection1] o.a.s.c.c.ZkStateReader path=[/collections/control_collection] [configName]=[conf1] specified config exists in ZooKeeper
   [junit4]   2> 2385020 INFO  (coreLoadExecutor-8305-thread-1-processing-n:127.0.0.1:61233_) [n:127.0.0.1:61233_ c:control_collection   x:collection1] o.a.s.c.SolrResourceLoader new SolrResourceLoader for directory: 'C:\Users\jenkins\workspace\Lucene-Solr-6.x-Windows\solr\build\solr-core\test\J1\temp\solr.cloud.LeaderFailoverAfterPartitionTest_F5C71D2FBE28162B-001\control-001\cores\collection1'
   [junit4]   2> 2385021 INFO  (coreLoadExecutor-8305-thread-1-processing-n:127.0.0.1:61233_) [n:127.0.0.1:61233_ c:control_collection   x:collection1] o.a.s.c.SolrResourceLoader JNDI not configured for solr (NoInitialContextEx)
   [junit4]   2> 2385021 INFO  (coreLoadExecutor-8305-thread-1-processing-n:127.0.0.1:61233_) [n:127.0.0.1:61233_ c:control_collection   x:collection1] o.a.s.c.SolrResourceLoader solr home defaulted to 'solr/' (could not find system property or JNDI)
   [junit4]   2> 2385023 INFO  (coreLoadExecutor-8305-thread-1-processing-n:127.0.0.1:61233_) [n:127.0.0.1:61233_ c:control_collection   x:collection1] o.a.s.c.Config loaded config solrconfig.xml with version 0 
   [junit4]   2> 2385033 INFO  (coreLoadExecutor-8305-thread-1-processing-n:127.0.0.1:61233_) [n:127.0.0.1:61233_ c:control_collection   x:collection1] o.a.s.c.SolrConfig current version of requestparams : -1
   [junit4]   2> 2385035 INFO  (coreLoadExecutor-8305-thread-1-processing-n:127.0.0.1:61233_) [n:127.0.0.1:61233_ c:control_collection   x:collection1] o.a.s.c.SolrConfig Using Lucene MatchVersion: 6.3.0
   [junit4]   2> 2385044 INFO  (coreLoadExecutor-8305-thread-1-processing-n:127.0.0.1:61233_) [n:127.0.0.1:61233_ c:control_collection   x:collection1] o.a.s.c.SolrConfig Loaded SolrConfig: solrconfig.xml
   [junit4]   2> 2385051 INFO  (coreLoadExecutor-8305-thread-1-processing-n:127.0.0.1:61233_) [n:127.0.0.1:61233_ c:control_collection   x:collection1] o.a.s.s.IndexSchema [collection1] Schema name=test
   [junit4]   2> 2385134 INFO  (coreLoadExecutor-8305-thread-1-processing-n:127.0.0.1:61233_) [n:127.0.0.1:61233_ c:control_collection   x:collection1] o.a.s.s.OpenExchangeRatesOrgProvider Initialized with rates=open-exchange-rates.json, refreshInterval=1440.
   [junit4]   2> 2385143 INFO  (coreLoadExecutor-8305-thread-1-processing-n:127.0.0.1:61233_) [n:127.0.0.1:61233_ c:control_collection   x:collection1] o.a.s.s.IndexSchema default search field in schema is text
   [junit4]   2> 2385144 INFO  (coreLoadExecutor-8305-thread-1-processing-n:127.0.0.1:61233_) [n:127.0.0.1:61233_ c:control_collection   x:collection1] o.a.s.s.IndexSchema unique key field: id
   [junit4]   2> 2385154 INFO  (coreLoadExecutor-8305-thread-1-processing-n:127.0.0.1:61233_) [n:127.0.0.1:61233_ c:control_collection   x:collection1] o.a.s.s.FileExchangeRateProvider Reloading exchange rates from file currency.xml
   [junit4]   2> 2385157 INFO  (coreLoadExecutor-8305-thread-1-processing-n:127.0.0.1:61233_) [n:127.0.0.1:61233_ c:control_collection   x:collection1] o.a.s.s.FileExchangeRateProvider Reloading exchange rates from file currency.xml
   [junit4]   2> 2385159 INFO  (coreLoadExecutor-8305-thread-1-processing-n:127.0.0.1:61233_) [n:127.0.0.1:61233_ c:control_collection   x:collection1] o.a.s.s.OpenExchangeRatesOrgProvider Reloading exchange rates from open-exchange-rates.json
   [junit4]   2> 2385159 INFO  (coreLoadExecutor-8305-thread-1-processing-n:127.0.0.1:61233_) [n:127.0.0.1:61233_ c:control_collection   x:collection1] o.a.s.s.OpenExchangeRatesOrgProvider Reloading exchange rates from open-exchange-rates.json
   [junit4]   2> 2385165 INFO  (coreLoadExecutor-8305-thread-1-processing-n:127.0.0.1:61233_) [n:127.0.0.1:61233_ c:control_collection   x:collection1] o.a.s.c.ConfigSetProperties Did not find ConfigSet properties, assuming default properties: Can't find resource 'configsetprops.json' in classpath or '/configs/conf1', cwd=C:\Users\jenkins\workspace\Lucene-Solr-6.x-Windows\solr\build\solr-core\test\J1
   [junit4]   2> 2385165 INFO  (coreLoadExecutor-8305-thread-1-processing-n:127.0.0.1:61233_) [n:127.0.0.1:61233_ c:control_collection   x:collection1] o.a.s.c.CoreContainer Creating SolrCore 'collection1' using configuration from collection control_collection
   [junit4]   2> 2385165 INFO  (coreLoadExecutor-8305-thread-1-processing-n:127.0.0.1:61233_) [n:127.0.0.1:61233_ c:control_collection s:shard1 r:core_node1 x:collection1] o.a.s.c.SolrCore org.apache.solr.core.MockDirectoryFactory
   [junit4]   2> 2385165 INFO  (coreLoadExecutor-8305-thread-1-processing-n:127.0.0.1:61233_) [n:127.0.0.1:61233_ c:control_collection s:shard1 r:core_node1 x:collection1] o.a.s.c.SolrCore [[collection1] ] Opening new SolrCore at [C:\Users\jenkins\workspace\Lucene-Solr-6.x-Windows\solr\build\solr-core\test\J1\temp\solr.cloud.LeaderFailoverAfterPartitionTest_F5C71D2FBE28162B-001\control-001\cores\collection1], dataDir=[C:\Users\jenkins\workspace\Lucene-Solr-6.x-Windows\solr\build\solr-core\test\J1\temp\solr.cloud.LeaderFailoverAfterPartitionTest_F5C71D2FBE28162B-001\control-001\cores\collection1\data\]
   [junit4]   2> 2385165 INFO  (coreLoadExecutor-8305-thread-1-processing-n:127.0.0.1:61233_) [n:127.0.0.1:61233_ c:control_collection s:shard1 r:core_node1 x:collection1] o.a.s.c.JmxMonitoredMap JMX monitoring is enabled. Adding Solr mbeans to JMX Server: com.sun.jmx.mbeanserver.JmxMBeanServer@d2a0659
   [junit4]   2> 2385166 INFO  (coreLoadExecutor-8305-thread-1-processing-n:127.0.0.1:61233_) [n:127.0.0.1:61233_ c:control_collection s:shard1 r:core_node1 x:collection1] o.a.s.c.CachingDirectoryFactory return new directory for C:\Users\jenkins\workspace\Lucene-Solr-6.x-Windows\solr\build\solr-core\test\J1\temp\solr.cloud.LeaderFailoverAfterPartitionTest_F5C71D2FBE28162B-001\control-001\cores\collection1\data\snapshot_metadata
   [junit4]   2> 2385166 INFO  (coreLoadExecutor-8305-thread-1-processing-n:127.0.0.1:61233_) [n:127.0.0.1:61233_ c:control_collection s:shard1 r:core_node1 x:collection1] o.a.s.c.s.SolrSnapshotMetaDataManager Loading from snapshot metadata file...
   [junit4]   2> 2385166 INFO  (coreLoadExecutor-8305-thread-1-processing-n:127.0.0.1:61233_) [n:127.0.0.1:61233_ c:control_collection s:shard1 r:core_node1 x:collection1] o.a.s.c.CachingDirectoryFactory return new directory for C:\Users\jenkins\workspace\Lucene-Solr-6.x-Windows\solr\build\solr-core\test\J1\temp\solr.cloud.LeaderFailoverAfterPartitionTest_F5C71D2FBE28162B-001\control-001\cores\collection1\data\
   [junit4]   2> 2385166 INFO  (coreLoadExecutor-8305-thread-1-processing-n:127.0.0.1:61233_) [n:127.0.0.1:61233_ c:control_collection s:shard1 r:core_node1 x:collection1] o.a.s.c.SolrCore New index directory detected: old=null new=C:\Users\jenkins\workspace\Lucene-Solr-6.x-Windows\solr\build\solr-core\test\J1\temp\solr.cloud.LeaderFailoverAfterPartitionTest_F5C71D2FBE28162B-001\control-001\cores\collection1\data\index/
   [junit4]   2> 2385167 WARN  (coreLoadExecutor-8305-thread-1-processing-n:127.0.0.1:61233_) [n:127.0.0.1:61233_ c:control_collection s:shard1 r:core_node1 x:collection1] o.a.s.c.SolrCore [collection1] Solr index directory 'C:\Users\jenkins\workspace\Lucene-Solr-6.x-Windows\solr\build\solr-core\test\J1\temp\solr.cloud.LeaderFailoverAfterPartitionTest_F5C71D2FBE28162B-001\control-001\cores\collection1\data\index' doesn't exist. Creating new index...
   [junit4]   2> 2385167 INFO  (coreLoadExecutor-8305-thread-1-processing-n:127.0.0.1:61233_) [n:127.0.0.1:61233_ c:control_collection s:shard1 r:core_node1 x:collection1] o.a.s.c.CachingDirectoryFactory return new directory for C:\Users\jenkins\workspace\Lucene-Solr-6.x-Windows\solr\build\solr-core\test\J1\temp\solr.cloud.LeaderFailoverAfterPartitionTest_F5C71D2FBE28162B-001\control-001\cores\collection1\data\index
   [junit4]   2> 2385167 INFO  (coreLoadExecutor-8305-thread-1-processing-n:127.0.0.1:61233_) [n:127.0.0.1:61233_ c:control_collection s:shard1 r:core_node1 x:collection1] o.a.s.u.RandomMergePolicy RandomMergePolicy wrapping class org.apache.lucene.index.LogDocMergePolicy: [LogDocMergePolicy: minMergeSize=1000, mergeFactor=27, maxMergeSize=9223372036854775807, maxMergeSizeForForcedMerge=9223372036854775807, calibrateSizeByDeletes=true, maxMergeDocs=2147483647, maxCFSSegmentSizeMB=8.796093022207999E12, noCFSRatio=0.2859045438297233]
   [junit4]   2> 2385167 INFO  (coreLoadExecutor-8305-thread-1-processing-n:127.0.0.1:61233_) [n:127.0.0.1:61233_ c:control_collection s:shard1 r:core_node1 x:collection1] o.a.s.c.SolrDeletionPolicy SolrDeletionPolicy.onCommit: commits: num=1
   [junit4]   2> 	commit{dir=MockDirectoryWrapper(RAMDirectory@74da539e lockFactory=org.apache.lucene.store.SingleInstanceLockFactory@61ef5c1f),segFN=segments_1,generation=1}
   [junit4]   2> 2385167 INFO  (coreLoadExecutor-8305-thread-1-processing-n:127.0.0.1:61233_) [n:127.0.0.1:61233_ c:control_collection s:shard1 r:core_node1 x:collection1] o.a.s.c.SolrDeletionPolicy newest commit generation = 1
   [junit4]   2> 2385167 INFO  (OldIndexDirectoryCleanupThreadForCore-collection1) [n:127.0.0.1:61233_ c:control_collection s:shard1 r:core_node1 x:collection1] o.a.s.c.SolrCore Looking for old index directories to cleanup for core collection1 in C:\Users\jenkins\workspace\Lucene-Solr-6.x-Windows\solr\build\solr-core\test\J1\temp\solr.cloud.LeaderFailoverAfterPartitionTest_F5C71D2FBE28162B-001\control-001\cores\collection1\data\
   [junit4]   2> 2385169 WARN  (OldIndexDirectoryCleanupThreadForCore-collection1) [n:127.0.0.1:61233_ c:control_collection s:shard1 r:core_node1 x:collection1] o.a.s.c.DirectoryFactory C:\Users\jenkins\workspace\Lucene-Solr-6.x-Windows\solr\build\solr-core\test\J1\temp\solr.cloud.LeaderFailoverAfterPartitionTest_F5C71D2FBE28162B-001\control-001\cores\collection1\data\ does not point to a valid data directory; skipping clean-up of old index directories.
   [junit4]   2> 2385170 INFO  (coreLoadExecutor-8305-thread-1-processing-n:127.0.0.1:61233_) [n:127.0.0.1:61233_ c:control_collection s:shard1 r:core_node1 x:collection1] o.a.s.u.p.UpdateRequestProcessorChain creating updateRequestProcessorChain "nodistrib"
   [junit4]   2> 2385170 INFO  (coreLoadExecutor-8305-thread-1-processing-n:127.0.0.1:61233_) [n:127.0.0.1:61233_ c:control_collection s:shard1 r:core_node1 x:collection1] o.a.s.u.p.UpdateRequestProcessorChain creating updateRequestProcessorChain "dedupe"
   [junit4]   2> 2385170 INFO  (coreLoadExecutor-8305-thread-1-processing-n:127.0.0.1:61233_) [n:127.0.0.1:61233_ c:control_collection s:shard1 r:core_node1 x:collection1] o.a.s.u.p.UpdateRequestProcessorChain inserting DistributedUpdateProcessorFactory into updateRequestProcessorChain "dedupe"
   [junit4]   2> 2385170 INFO  (coreLoadExecutor-8305-thread-1-processing-n:127.0.0.1:61233_) [n:127.0.0.1:61233_ c:control_collection s:shard1 r:core_node1 x:collection1] o.a.s.u.p.UpdateRequestProcessorChain creating updateRequestProcessorChain "stored_sig"
   [junit4]   2> 2385170 INFO  (coreLoadExecutor-8305-thread-1-processing-n:127.0.0.1:61233_) [n:127.0.0.1:61233_ c:control_collection s:shard1 r:core_node1 x:collection1] o.a.s.u.p.UpdateRequestProcessorChain inserting DistributedUpdateProcessorFactory into updateRequestProcessorChain "stored_sig"
   [junit4]   2> 2385170 INFO  (coreLoadExecutor-8305-thread-1-processing-n:127.0.0.1:61233_) [n:127.0.0.1:61233_ c:control_collection s:shard1 r:core_node1 x:collection1] o.a.s.u.p.UpdateRequestProcessorChain creating updateRequestProcessorChain "distrib-dup-test-chain-explicit"
   [junit4]   2> 2385171 INFO  (coreLoadExecutor-8305-thread-1-processing-n:127.0.0.1:61233_) [n:127.0.0.1:61233_ c:control_collection s:shard1 r:core_node1 x:collection1] o.a.s.u.p.UpdateRequestProcessorChain creating updateRequestProcessorChain "distrib-dup-test-chain-implicit"
   [junit4]   2> 2385171 INFO  (coreLoadExecutor-8305-thread-1-processing-n:127.0.0.1:61233_) [n:127.0.0.1:61233_ c:control_collection s:shard1 r:core_node1 x:collection1] o.a.s.u.p.UpdateRequestProcessorChain inserting DistributedUpdateProcessorFactory into updateRequestProcessorChain "distrib-dup-test-chain-implicit"
   [junit4]   2> 2385171 INFO  (coreLoadExecutor-8305-thread-1-processing-n:127.0.0.1:61233_) [n:127.0.0.1:61233_ c:control_collection s:shard1 r:core_node1 x:collection1] o.a.s.c.SolrCore no updateRequestProcessorChain defined as default, creating implicit default
   [junit4]   2> 2385171 WARN  (coreLoadExecutor-8305-thread-1-processing-n:127.0.0.1:61233_) [n:127.0.0.1:61233_ c:control_collection s:shard1 r:core_node1 x:collection1] o.a.s.c.RequestHandlers INVALID paramSet a in requestHandler {type = requestHandler,name = /dump,class = DumpRequestHandler,args = {defaults={a=A,b=B}}}
   [junit4]   2> 2385177 INFO  (coreLoadExecutor-8305-thread-1-processing-n:127.0.0.1:61233_) [n:127.0.0.1:61233_ c:control_collection s:shard1 r:core_node1 x:collection1] o.a.s.h.l.XMLLoader xsltCacheLifetimeSeconds=60
   [junit4]   2> 2385179 INFO  (coreLoadExecutor-8305-thread-1-processing-n:127.0.0.1:61233_) [n:127.0.0.1:61233_ c:control_collection s:shard1 r:core_node1 x:collection1] o.a.s.h.l.XMLLoader xsltCacheLifetimeSeconds=60
   [junit4]   2> 2385180 INFO  (coreLoadExecutor-8305-thread-1-processing-n:127.0.0.1:61233_) [n:127.0.0.1:61233_ c:control_collection s:shard1 r:core_node1 x:collection1] o.a.s.h.l.XMLLoader xsltCacheLifetimeSeconds=60
   [junit4]   2> 2385181 INFO  (coreLoadExecutor-8305-thread-1-processing-n:127.0.0.1:61233_) [n:127.0.0.1:61233_ c:control_collection s:shard1 r:core_node1 x:collection1] o.a.s.h.l.XMLLoader xsltCacheLifetimeSeconds=60
   [junit4]   2> 2385186 INFO  (coreLoadExecutor-8305-thread-1-processing-n:127.0.0.1:61233_) [n:127.0.0.1:61233_ c:control_collection s:shard1 r:core_node1 x:collection1] o.a.s.c.RequestHandlers Registered paths: /admin/mbeans,standard,/update/json/docs,/admin/luke,/export,/get,/admin/properties,/update/json,/admin/threads,/dump,/update/csv,/sql,/graph,/admin/segments,/admin/system,/replication,/config,/stream,/schema,/admin/plugins,/admin/logging,/admin/ping,/update,/admin/file,/terms
   [junit4]   2> 2385186 INFO  (coreLoadExecutor-8305-thread-1-processing-n:127.0.0.1:61233_) [n:127.0.0.1:61233_ c:control_collection s:shard1 r:core_node1 x:collection1] o.a.s.c.SolrCore Using default statsCache cache: org.apache.solr.search.stats.LocalStatsCache
   [junit4]   2> 2385186 INFO  (coreLoadExecutor-8305-thread-1-processing-n:127.0.0.1:61233_) [n:127.0.0.1:61233_ c:control_collection s:shard1 r:core_node1 x:collection1] o.a.s.u.UpdateHandler Using UpdateLog implementation: org.apache.solr.update.UpdateLog
   [junit4]   2> 2385186 INFO  (coreLoadExecutor-8305-thread-1-processing-n:127.0.0.1:61233_) [n:127.0.0.1:61233_ c:control_collection s:shard1 r:core_node1 x:collection1] o.a.s.u.UpdateLog Initializing UpdateLog: dataDir= defaultSyncLevel=FLUSH numRecordsToKeep=100 maxNumLogsToKeep=10 numVersionBuckets=65536
   [junit4]   2> 2385189 INFO  (coreLoadExecutor-8305-thread-1-processing-n:127.0.0.1:61233_) [n:127.0.0.1:61233_ c:control_collection s:shard1 r:core_node1 x:collection1] o.a.s.u.CommitTracker Hard AutoCommit: disabled
   [junit4]   2> 2385189 INFO  (coreLoadExecutor-8305-thread-1-processing-n:127.0.0.1:61233_) [n:127.0.0.1:61233_ c:control_collection s:shard1 r:core_node1 x:collection1] o.a.s.u.CommitTracker Soft AutoCommit: disabled
   [junit4]   2> 2385189 INFO  (coreLoadExecutor-8305-thread-1-processing-n:127.0.0.1:61233_) [n:127.0.0.1:61233_ c:control_collection s:shard1 r:core_node1 x:collection1] o.a.s.u.RandomMergePolicy RandomMergePolicy wrapping class org.apache.lucene.index.LogByteSizeMergePolicy: [LogByteSizeMergePolicy: minMergeSize=1677721, mergeFactor=29, maxMergeSize=2147483648, maxMergeSizeForForcedMerge=9223372036854775807, calibrateSizeByDeletes=false, maxMergeDocs=2147483647, maxCFSSegmentSizeMB=2.1533203125, noCFSRatio=0.676795971691136]
   [junit4]   2> 2385189 INFO  (coreLoadExecutor-8305-thread-1-processing-n:127.0.0.1:61233_) [n:127.0.0.1:61233_ c:control_collection s:shard1 r:core_node1 x:collection1] o.a.s.c.SolrDeletionPolicy SolrDeletionPolicy.onInit: commits: num=1
   [junit4]   2> 	commit{dir=MockDirectoryWrapper(RAMDirectory@74da539e lockFactory=org.apache.lucene.store.SingleInstanceLockFactory@61ef5c1f),segFN=segments_1,generation=1}
   [junit4]   2> 2385189 INFO  (coreLoadExecutor-8305-thread-1-processing-n:127.0.0.1:61233_) [n:127.0.0.1:61233_ c:control_collection s:shard1 r:core_node1 x:collection1] o.a.s.c.SolrDeletionPolicy newest commit generation = 1
   [junit4]   2> 2385189 INFO  (coreLoadExecutor-8305-thread-1-processing-n:127.0.0.1:61233_) [n:127.0.0.1:61233_ c:control_collection s:shard1 r:core_node1 x:collection1] o.a.s.s.SolrIndexSearcher Opening [Searcher@fc80148[collection1] main]
   [junit4]   2> 2385189 INFO  (coreLoadExecutor-8305-thread-1-processing-n:127.0.0.1:61233_) [n:127.0.0.1:61233_ c:control_collection s:shard1 r:core_node1 x:collection1] o.a.s.c.c.ZkStateReader Load collection config from: [/collections/control_collection]
   [junit4]   2> 2385191 INFO  (coreLoadExecutor-8305-thread-1-processing-n:127.0.0.1:61233_) [n:127.0.0.1:61233_ c:control_collection s:shard1 r:core_node1 x:collection1] o.a.s.c.c.ZkStateReader path=[/collections/control_collection] [configName]=[conf1] specified config exists in ZooKeeper
   [junit4]   2> 2385191 INFO  (coreLoadExecutor-8305-thread-1-processing-n:127.0.0.1:61233_) [n:127.0.0.1:61233_ c:control_collection s:shard1 r:core_node1 x:collection1] o.a.s.r.ManagedResourceStorage Setting up ZooKeeper-based storage for the RestManager with znodeBase: /configs/conf1
   [junit4]   2> 2385191 INFO  (coreLoadExecutor-8305-thread-1-processing-n:127.0.0.1:61233_) [n:127.0.0.1:61233_ c:control_collection s:shard1 r:core_node1 x:collection1] o.a.s.r.ManagedResourceStorage Configured ZooKeeperStorageIO with znodeBase: /configs/conf1
   [junit4]   2> 2385191 INFO  (coreLoadExecutor-8305-thread-1-processing-n:127.0.0.1:61233_) [n:127.0.0.1:61233_ c:control_collection s:shard1 r:core_node1 x:collection1] o.a.s.r.RestManager Initializing RestManager with initArgs: {}
   [junit4]   2> 2385191 INFO  (coreLoadExecutor-8305-thread-1-processing-n:127.0.0.1:61233_) [n:127.0.0.1:61233_ c:control_collection s:shard1 r:core_node1 x:collection1] o.a.s.r.ManagedResourceStorage Reading _rest_managed.json using ZooKeeperStorageIO:path=/configs/conf1
   [junit4]   2> 2385191 INFO  (coreLoadExecutor-8305-thread-1-processing-n:127.0.0.1:61233_) [n:127.0.0.1:61233_ c:control_collection s:shard1 r:core_node1 x:collection1] o.a.s.r.ManagedResourceStorage No data found for znode /configs/conf1/_rest_managed.json
   [junit4]   2> 2385192 INFO  (coreLoadExecutor-8305-thread-1-processing-n:127.0.0.1:61233_) [n:127.0.0.1:61233_ c:control_collection s:shard1 r:core_node1 x:collection1] o.a.s.r.ManagedResourceStorage Loaded null at path _rest_managed.json using ZooKeeperStorageIO:path=/configs/conf1
   [junit4]   2> 2385192 INFO  (coreLoadExecutor-8305-thread-1-processing-n:127.0.0.1:61233_) [n:127.0.0.1:61233_ c:control_collection s:shard1 r:core_node1 x:collection1] o.a.s.r.RestManager Initializing 0 registered ManagedResources
   [junit4]   2> 2385192 INFO  (coreLoadExecutor-8305-thread-1-processing-n:127.0.0.1:61233_) [n:127.0.0.1:61233_ c:control_collection s:shard1 r:core_node1 x:collection1] o.a.s.h.ReplicationHandler Commits will be reserved for  10000
   [junit4]   2> 2385193 INFO  (searcherExecutor-8306-thread-1-processing-n:127.0.0.1:61233_ x:collection1 s:shard1 c:control_collection r:core_node1) [n:127.0.0.1:61233_ c:control_collection s:shard1 r:core_node1 x:collection1] o.a.s.c.SolrCore [collection1] Registered new searcher Searcher@fc80148[collection1] main{ExitableDirectoryReader(UninvertingDirectoryReader())}
   [junit4]   2> 2385193 INFO  (coreLoadExecutor-8305-thread-1-processing-n:127.0.0.1:61233_) [n:127.0.0.1:61233_ c:control_collection s:shard1 r:core_node1 x:collection1] o.a.s.u.UpdateLog Looking up max value of version field to seed version buckets
   [junit4]   2> 2385193 INFO  (coreLoadExecutor-8305-thread-1-processing-n:127.0.0.1:61233_) [n:127.0.0.1:61233_ c:control_collection s:shard1 r:core_node1 x:collection1] o.a.s.u.VersionInfo Refreshing highest value of _version_ for 65536 version buckets from index
   [junit4]   2> 2385193 INFO  (coreLoadExecutor-8305-thread-1-processing-n:127.0.0.1:61233_) [n:127.0.0.1:61233_ c:control_collection s:shard1 r:core_node1 x:collection1] o.a.s.u.VersionInfo No terms found for _version_, cannot seed version bucket highest value from index
   [junit4]   2> 2385193 INFO  (coreLoadExecutor-8305-thread-1-processing-n:127.0.0.1:61233_) [n:127.0.0.1:61233_ c:control_collection s:shard1 r:core_node1 x:collection1] o.a.s.u.UpdateLog Could not find max version in index or recent updates, using new clock 1545182936142184448
   [junit4]   2> 2385194 INFO  (coreLoadExecutor-8305-thread-1-processing-n:127.0.0.1:61233_) [n:127.0.0.1:61233_ c:control_collection s:shard1 r:core_node1 x:collection1] o.a.s.u.UpdateLog Took 1.0ms to seed version buckets with highest version 1545182936142184448
   [junit4]   2> 2385194 INFO  (coreLoadExecutor-8305-thread-1-processing-n:127.0.0.1:61233_) [n:127.0.0.1:61233_ c:control_collection s:shard1 r:core_node1 x:collection1] o.a.s.c.ZkController watch zkdir /configs/conf1
   [junit4]   2> 2385195 INFO  (coreLoadExecutor-8305-thread-1-processing-n:127.0.0.1:61233_) [n:127.0.0.1:61233_ c:control_collection s:shard1 r:core_node1 x:collection1] o.a.s.c.CoreContainer registering core: collection1
   [junit4]   2> 2385195 INFO  (coreZkRegister-8298-thread-1-processing-n:127.0.0.1:61233_ x:collection1 s:shard1 c:control_collection r:core_node1) [n:127.0.0.1:61233_ c:control_collection s:shard1 r:core_node1 x:collection1] o.a.s.c.ZkController Register replica - core:collection1 address:http://127.0.0.1:61233 collection:control_collection shard:shard1
   [junit4]   2> 2385196 INFO  (coreZkRegister-8298-thread-1-processing-n:127.0.0.1:61233_ x:collection1 s:shard1 c:control_collection r:core_node1) [n:127.0.0.1:61233_ c:control_collection s:shard1 r:core_node1 x:collection1] o.a.s.c.c.SolrZkClient makePath: /collections/control_collection/leader_elect/shard1/election
   [junit4]   2> 2385201 INFO  (coreZkRegister-8298-thread-1-processing-n:127.0.0.1:61233_ x:collection1 s:shard1 c:control_collection r:core_node1) [n:127.0.0.1:61233_ c:control_collection s:shard1 r:core_node1 x:collection1] o.a.s.c.LeaderElector Joined leadership election with path: /collections/control_collection/leader_elect/shard1/election/96573933377683460-core_node1-n_0000000000
   [junit4]   2> 2385201 INFO  (coreZkRegister-8298-thread-1-processing-n:127.0.0.1:61233_ x:collection1 s:shard1 c:control_collection r:core_node1) [n:127.0.0.1:61233_ c:control_collection s:shard1 r:core_node1 x:collection1] o.a.s.c.ShardLeaderElectionContext Running the leader process for shard=shard1 and weAreReplacement=false and leaderVoteWait=10000
   [junit4]   2> 2385202 INFO  (coreZkRegister-8298-thread-1-processing-n:127.0.0.1:61233_ x:collection1 s:shard1 c:control_collection r:core_node1) [n:127.0.0.1:61233_ c:control_collection s:shard1 r:core_node1 x:collection1] o.a.s.c.ShardLeaderElectionContext Enough replicas found to continue.
   [junit4]   2> 2385202 INFO  (coreZkRegister-8298-thread-1-processing-n:127.0.0.1:61233_ x:collection1 s:shard1 c:control_collection r:core_node1) [n:127.0.0.1:61233_ c:control_collection s:shard1 r:core_node1 x:collection1] o.a.s.c.ShardLeaderElectionContext I may be the new leader - try and sync
   [junit4]   2> 2385202 INFO  (coreZkRegister-8298-thread-1-processing-n:127.0.0.1:61233_ x:collection1 s:shard1 c:control_collection r:core_node1) [n:127.0.0.1:61233_ c:control_collection s:shard1 r:core_node1 x:collection1] o.a.s.c.SyncStrategy Sync replicas to http://127.0.0.1:61233/collection1/
   [junit4]   2> 2385202 INFO  (coreZkRegister-8298-thread-1-processing-n:127.0.0.1:61233_ x:collection1 s:shard1 c:control_collection r:core_node1) [n:127.0.0.1:61233_ c:control_collection s:shard1 r:core_node1 x:collection1] o.a.s.c.SyncStrategy Sync Success - now sync replicas to me
   [junit4]   2> 2385203 INFO  (coreZkRegister-8298-thread-1-processing-n:127.0.0.1:61233_ x:collection1 s:shard1 c:control_collection r:core_node1) [n:127.0.0.1:61233_ c:control_collection s:shard1 r:core_node1 x:collection1] o.a.s.c.SyncStrategy http://127.0.0.1:61233/collection1/ has no replicas
   [junit4]   2> 2385203 INFO  (OverseerStateUpdate-96573933377683460-127.0.0.1:61233_-n_0000000000) [n:127.0.0.1:61233_    ] o.a.s.c.Overseer processMessage: queueSize: 1, message = {
   [junit4]   2>   "operation":"leader",
   [junit4]   2>   "shard":"shard1",
   [junit4]   2>   "collection":"control_collection"} current state version: 1
   [junit4]   2> 2385203 INFO  (coreZkRegister-8298-thread-1-processing-n:127.0.0.1:61233_ x:collection1 s:shard1 c:control_collection r:core_node1) [n:127.0.0.1:61233_ c:control_collection s:shard1 r:core_node1 x:collection1] o.a.s.c.c.SolrZkClient makePath: /collections/control_collection/leaders/shard1
   [junit4]   2> 2385206 INFO  (coreZkRegister-8298-thread-1-processing-n:127.0.0.1:61233_ x:collection1 s:shard1 c:control_collection r:core_node1) [n:127.0.0.1:61233_ c:control_collection s:shard1 r:core_node1 x:collection1] o.a.s.c.ShardLeaderElectionContextBase Creating leader registration node /collections/control_collection/leaders/shard1/leader after winning as /collections/control_collection/leader_elect/shard1/election/96573933377683460-core_node1-n_0000000000
   [junit4]   2> 2385207 INFO  (coreZkRegister-8298-thread-1-processing-n:127.0.0.1:61233_ x:collection1 s:shard1 c:control_collection r:core_node1) [n:127.0.0.1:61233_ c:control_collection s:shard1 r:core_node1 x:collection1] o.a.s.c.ShardLeaderElectionContext I am the new leader: http://127.0.0.1:61233/collection1/ shard1
   [junit4]   2> 2385207 INFO  (OverseerStateUpdate-96573933377683460-127.0.0.1:61233_-n_0000000000) [n:127.0.0.1:61233_    ] o.a.s.c.Overseer processMessage: queueSize: 1, message = {
   [junit4]   2>   "operation":"leader",
   [junit4]   2>   "shard":"shard1",
   [junit4]   2>   "collection":"control_collection",
   [junit4]   2>   "base_url":"http://127.0.0.1:61233",
   [junit4]   2>   "core":"collection1",
   [junit4]   2>   "state":"active"} current state version: 1
   [junit4]   2> 2385315 INFO  (zkCallback-2883-thread-1-processing-n:127.0.0.1:61233_) [n:127.0.0.1:61233_    ] o.a.s.c.c.ZkStateReader A cluster state change: [WatchedEvent state:SyncConnected type:NodeDataChanged path:/clusterstate.json], has occurred - updating... (live nodes size: [1])
   [junit4]   2> 2385359 INFO  (coreZkRegister-8298-thread-1-processing-n:127.0.0.1:61233_ x:collection1 s:shard1 c:control_collection r:core_node1) [n:127.0.0.1:61233_ c:control_collection s:shard1 r:core_node1 x:collection1] o.a.s.c.ZkController We are http://127.0.0.1:61233/collection1/ and leader is http://127.0.0.1:61233/collection1/
   [junit4]   2> 2385359 INFO  (coreZkRegister-8298-thread-1-processing-n:127.0.0.1:61233_ x:collection1 s:shard1 c:control_collection r:core_node1) [n:127.0.0.1:61233_ c:control_collection s:shard1 r:core_node1 x:collection1] o.a.s.c.ZkController No LogReplay needed for core=collection1 baseURL=http://127.0.0.1:61233
   [junit4]   2> 2385359 INFO  (coreZkRegister-8298-thread-1-processing-n:127.0.0.1:61233_ x:collection1 s:shard1 c:control_collection r:core_node1) [n:127.0.0.1:61233_ c:control_collection s:shard1 r:core_node1 x:collection1] o.a.s.c.ZkController I am the leader, no recovery necessary
   [junit4]   2> 2385359 INFO  (coreZkRegister-8298-thread-1-processing-n:127.0.0.1:61233_ x:collection1 s:shard1 c:control_collection r:core_node1) [n:127.0.0.1:61233_ c:control_collection s:shard1 r:core_node1 x:collection1] o.a.s.c.ZkController publishing state=active
   [junit4]   2> 2385359 INFO  (coreZkRegister-8298-thread-1-processing-n:127.0.0.1:61233_ x:collection1 s:shard1 c:control_collection r:core_node1) [n:127.0.0.1:61233_ c:control_collection s:shard1 r:core_node1 x:collection1] o.a.s.c.ZkController numShards not found on descriptor - reading it from system property
   [junit4]   2> 2385360 INFO  (coreZkRegister-8298-thread-1-processing-n:127.0.0.1:61233_ x:collection1 s:shard1 c:control_collection r:core_node1) [n:127.0.0.1:61233_ c:control_collection s:shard1 r:core_node1 x:collection1] o.a.s.c.c.ZkStateReader Checking legacy cluster state for collection control_collection
   [junit4]   2> 2385361 INFO  (OverseerStateUpdate-96573933377683460-127.0.0.1:61233_-n_0000000000) [n:127.0.0.1:61233_    ] o.a.s.c.Overseer processMessage: queueSize: 1, message = {
   [junit4]   2>   "core":"collection1",
   [junit4]   2>   "core_node_name":"core_node1",
   [junit4]   2>   "roles":null,
   [junit4]   2>   "base_url":"http://127.0.0.1:61233",
   [junit4]   2>   "node_name":"127.0.0.1:61233_",
   [junit4]   2>   "numShards":"1",
   [junit4]   2>   "state":"active",
   [junit4]   2>   "shard":"shard1",
   [junit4]   2>   "collection":"control_collection",
   [junit4]   2>   "operation":"state"} current state version: 2
   [junit4]   2> 2385361 INFO  (OverseerStateUpdate-96573933377683460-127.0.0.1:61233_-n_0000000000) [n:127.0.0.1:61233_    ] o.a.s.c.o.ReplicaMutator Update state numShards=1 message={
   [junit4]   2>   "core":"collection1",
   [junit4]   2>   "core_node_name":"core_node1",
   [junit4]   2>   "roles":null,
   [junit4]   2>   "base_url":"http://127.0.0.1:61233",
   [junit4]   2>   "node_name":"127.0.0.1:61233_",
   [junit4]   2>   "numShards":"1",
   [junit4]   2>   "state":"active",
   [junit4]   2>   "shard":"shard1",
   [junit4]   2>   "collection":"control_collection",
   [junit4]   2>   "operation":"state"}
   [junit4]   2> 2385464 INFO  (zkCallback-2883-thread-3-processing-n:127.0.0.1:61233_) [n:127.0.0.1:61233_    ] o.a.s.c.c.ZkStateReader A cluster state change: [WatchedEvent state:SyncConnected type:NodeDataChanged path:/clusterstate.json], has occurred - updating... (live nodes size: [1])
   [junit4]   2> 2385519 INFO  (TEST-LeaderFailoverAfterPartitionTest.test-seed#[F5C71D2FBE28162B]) [    ] o.a.s.c.c.SolrZkClient Using default ZkCredentialsProvider
   [junit4]   2> 2385519 INFO  (TEST-LeaderFailoverAfterPartitionTest.test-seed#[F5C71D2FBE28162B]) [    ] o.a.s.c.c.ConnectionManager Waiting for client to connect to ZooKeeper
   [junit4]   2> 2385519 INFO  (zkCallback-2887-thread-1) [    ] o.a.s.c.c.ConnectionManager Watcher org.apache.solr.common.cloud.ConnectionManager@4fd7953d name:ZooKeeperConnection Watcher:127.0.0.1:61226/solr got event WatchedEvent state:SyncConnected type:None path:null path:null type:None
   [junit4]   2> 2385519 INFO  (TEST-LeaderFailoverAfterPartitionTest.test-seed#[F5C71D2FBE28162B]) [    ] o.a.s.c.c.ConnectionManager Client is connected to ZooKeeper
   [junit4]   2> 2385519 INFO  (TEST-LeaderFailoverAfterPartitionTest.test-seed#[F5C71D2FBE28162B]) [    ] o.a.s.c.c.SolrZkClient Using default ZkACLProvider
   [junit4]   2> 2385519 INFO  (TEST-LeaderFailoverAfterPartitionTest.test-seed#[F5C71D2FBE28162B]) [    ] o.a.s.c.c.ZkStateReader Updating cluster state from ZooKeeper... 
   [junit4]   2> 2385524 INFO  (TEST-LeaderFailoverAfterPartitionTest.test-seed#[F5C71D2FBE28162B]) [    ] o.a.s.c.c.ZkStateReader Loaded empty cluster properties
   [junit4]   2> 2385525 INFO  (TEST-LeaderFailoverAfterPartitionTest.test-seed#[F5C71D2FBE28162B]) [    ] o.a.s.c.c.ZkStateReader Updated live nodes from ZooKeeper... (0) -> (1)
   [junit4]   2> 2385526 INFO  (TEST-LeaderFailoverAfterPartitionTest.test-seed#[F5C71D2FBE28162B]) [    ] o.a.s.c.ChaosMonkey monkey: init - expire sessions:false cause connection loss:false
   [junit4]   2> 2385526 INFO  (TEST-LeaderFailoverAfterPartitionTest.test-seed#[F5C71D2FBE28162B]) [    ] o.a.s.c.AbstractFullDistribZkTestBase Creating collection1 with stateFormat=2
   [junit4]   2> 2385526 INFO  (TEST-LeaderFailoverAfterPartitionTest.test-seed#[F5C71D2FBE28162B]) [    ] o.a.s.c.c.SolrZkClient Using default ZkCredentialsProvider
   [junit4]   2> 2385527 INFO  (TEST-LeaderFailoverAfterPartitionTest.test-seed#[F5C71D2FBE28162B]) [    ] o.a.s.c.c.ConnectionManager Waiting for client to connect to ZooKeeper
   [junit4]   2> 2385528 INFO  (zkCallback-2888-thread-1) [    ] o.a.s.c.c.ConnectionManager Watcher org.apache.solr.common.cloud.ConnectionManager@7f5735c6 name:ZooKeeperConnection Watcher:127.0.0.1:61226/solr got event WatchedEvent state:SyncConnected type:None path:null path:null type:None
   [junit4]   2> 2385528 INFO  (TEST-LeaderFailoverAfterPartitionTest.test-seed#[F5C71D2FBE28162B]) [    ] o.a.s.c.c.ConnectionManager Client is connected to ZooKeeper
   [junit4]   2> 2385528 INFO  (TEST-LeaderFailoverAfterPartitionTest.test-seed#[F5C71D2FBE28162B]) [    ] o.a.s.c.c.SolrZkClient Using default ZkACLProvider
   [junit4]   2> 2385532 INFO  (OverseerStateUpdate-96573933377683460-127.0.0.1:61233_-n_0000000000) [n:127.0.0.1:61233_    ] o.a.s.c.Overseer processMessage: queueSize: 1, message = {
   [junit4]   2>   "operation":"create",
   [junit4]   2>   "name":"collection1",
   [junit4]   2>   "numShards":"2",
   [junit4]   2>   "stateFormat":"2"} current state version: 3
   [junit4]   2> 2385532 INFO  (OverseerStateUpdate-96573933377683460-127.0.0.1:61233_-n_0000000000) [n:127.0.0.1:61233_    ] o.a.s.c.o.ClusterStateMutator building a new cName: collection1
   [junit4]   2> 2385647 INFO  (OverseerStateUpdate-96573933377683460-127.0.0.1:61233_-n_0000000000) [n:127.0.0.1:61233_    ] o.a.s.c.o.ZkStateWriter going to create_collection /collections/collection1/state.json
   [junit4]   2> 2386015 INFO  (TEST-LeaderFailoverAfterPartitionTest.test-seed#[F5C71D2FBE28162B]) [    ] o.a.s.SolrTestCaseJ4 Writing core.properties file to C:\Users\jenkins\workspace\Lucene-Solr-6.x-Windows\solr\build\solr-core\test\J1\temp\solr.cloud.LeaderFailoverAfterPartitionTest_F5C71D2FBE28162B-001\shard-1-001\cores\collection1
   [junit4]   2> 2386017 INFO  (TEST-LeaderFailoverAfterPartitionTest.test-seed#[F5C71D2FBE28162B]) [    ] o.a.s.c.AbstractFullDistribZkTestBase create jetty 1 in directory C:\Users\jenkins\workspace\Lucene-Solr-6.x-Windows\solr\build\solr-core\test\J1\temp\solr.cloud.LeaderFailoverAfterPartitionTest_F5C71D2FBE28162B-001\shard-1-001
   [junit4]   2> 2386019 INFO  (TEST-LeaderFailoverAfterPartitionTest.test-seed#[F5C71D2FBE28162B]) [    ] o.e.j.s.Server jetty-9.3.8.v20160314
   [junit4]   2> 2386020 INFO  (TEST-LeaderFailoverAfterPartitionTest.test-seed#[F5C71D2FBE28162B]) [    ] o.e.j.s.h.ContextHandler Started o.e.j.s.ServletContextHandler@1cd99cdb{/,null,AVAILABLE}
   [junit4]   2> 2386021 INFO  (TEST-LeaderFailoverAfterPartitionTest.test-seed#[F5C71D2FBE28162B]) [    ] o.e.j.s.ServerConnector Started ServerConnector@461b622f{HTTP/1.1,[http/1.1]}{127.0.0.1:61257}
   [junit4]   2> 2386022 INFO  (TEST-LeaderFailoverAfterPartitionTest.test-seed#[F5C71D2FBE28162B]) [    ] o.e.j.s.Server Started @2391937ms
   [junit4]   2> 2386022 INFO  (TEST-LeaderFailoverAfterPartitionTest.test-seed#[F5C71D2FBE28162B]) [    ] o.a.s.c.s.e.JettySolrRunner Jetty properties: {solr.data.dir=C:\Users\jenkins\workspace\Lucene-Solr-6.x-Windows\solr\build\solr-core\test\J1\temp\solr.cloud.LeaderFailoverAfterPartitionTest_F5C71D2FBE28162B-001\tempDir-001/jetty1, solrconfig=solrconfig.xml, hostContext=/, hostPort=61256, coreRootDirectory=C:\Users\jenkins\workspace\Lucene-Solr-6.x-Windows\solr\build\solr-core\test\J1\temp\solr.cloud.LeaderFailoverAfterPartitionTest_F5C71D2FBE28162B-001\shard-1-001\cores}
   [junit4]   2> 2386022 INFO  (TEST-LeaderFailoverAfterPartitionTest.test-seed#[F5C71D2FBE28162B]) [    ] o.a.s.s.SolrDispatchFilter SolrDispatchFilter.init(): sun.misc.Launcher$AppClassLoader@73d16e93
   [junit4]   2> 2386022 INFO  (TEST-LeaderFailoverAfterPartitionTest.test-seed#[F5C71D2FBE28162B]) [    ] o.a.s.c.SolrResourceLoader new SolrResourceLoader for directory: 'C:\Users\jenkins\workspace\Lucene-Solr-6.x-Windows\solr\build\solr-core\test\J1\temp\solr.cloud.LeaderFailoverAfterPartitionTest_F5C71D2FBE28162B-001\shard-1-001'
   [junit4]   2> 2386022 INFO  (TEST-LeaderFailoverAfterPartitionTest.test-seed#[F5C71D2FBE28162B]) [    ] o.a.s.c.SolrResourceLoader JNDI not configured for solr (NoInitialContextEx)
   [junit4]   2> 2386022 INFO  (TEST-LeaderFailoverAfterPartitionTest.test-seed#[F5C71D2FBE28162B]) [    ] o.a.s.c.SolrResourceLoader solr home defaulted to 'solr/' (could not find system property or JNDI)
   [junit4]   2> 2386023 INFO  (TEST-LeaderFailoverAfterPartitionTest.test-seed#[F5C71D2FBE28162B]) [    ] o.a.s.c.c.SolrZkClient Using default ZkCredentialsProvider
   [junit4]   2> 2386024 INFO  (TEST-LeaderFailoverAfterPartitionTest.test-seed#[F5C71D2FBE28162B]) [    ] o.a.s.c.c.ConnectionManager Waiting for client to connect to ZooKeeper
   [junit4]   2> 2386025 INFO  (zkCallback-2889-thread-1) [    ] o.a.s.c.c.ConnectionManager Watcher org.apache.solr.common.cloud.ConnectionManager@e93d8b3 name:ZooKeeperConnection Watcher:127.0.0.1:61226/solr got event WatchedEvent state:SyncConnected type:None path:null path:null type:None
   [junit4]   2> 2386025 INFO  (TEST-LeaderFailoverAfterPartitionTest.test-seed#[F5C71D2FBE28162B]) [    ] o.a.s.c.c.ConnectionManager Client is connected to ZooKeeper
   [junit4]   2> 2386026 INFO  (TEST-LeaderFailoverAfterPartitionTest.test-seed#[F5C71D2FBE28162B]) [    ] o.a.s.c.c.SolrZkClient Using default ZkACLProvider
   [junit4]   2> 2386027 INFO  (TEST-LeaderFailoverAfterPartitionTest.test-seed#[F5C71D2FBE28162B]) [    ] o.a.s.s.SolrDispatchFilter Loading solr.xml from SolrHome (not found in ZooKeeper)
   [junit4]   2> 2386028 INFO  (TEST-LeaderFailoverAfterPartitionTest.test-seed#[F5C71D2FBE28162B]) [    ] o.a.s.c.SolrXmlConfig Loading container configuration from C:\Users\jenkins\workspace\Lucene-Solr-6.x-Windows\solr\build\solr-core\test\J1\temp\solr.cloud.LeaderFailoverAfterPartitionTest_F5C71D2FBE28162B-001\shard-1-001\solr.xml
   [junit4]   2> 2386038 INFO  (TEST-LeaderFailoverAfterPartitionTest.test-seed#[F5C71D2FBE28162B]) [    ] o.a.s.c.CorePropertiesLocator Config-defined core root directory: C:\Users\jenkins\workspace\Lucene-Solr-6.x-Windows\solr\build\solr-core\test\J1\temp\solr.cloud.LeaderFailoverAfterPartitionTest_F5C71D2FBE28162B-001\shard-1-001\cores
   [junit4]   2> 2386038 INFO  (TEST-LeaderFailoverAfterPartitionTest.test-seed#[F5C71D2FBE28162B]) [    ] o.a.s.c.CoreContainer New CoreContainer 842241240
   [junit4]   2> 2386038 INFO  (TEST-LeaderFailoverAfterPartitionTest.test-seed#[F5C71D2FBE28162B]) [    ] o.a.s.c.CoreContainer Loading cores into CoreContainer [instanceDir=C:\Users\jenkins\workspace\Lucene-Solr-6.x-Windows\solr\build\solr-core\test\J1\temp\solr.cloud.LeaderFailoverAfterPartitionTest_F5C71D2FBE28162B-001\shard-1-001]
   [junit4]   2> 2386038 WARN  (TEST-LeaderFailoverAfterPartitionTest.test-seed#[F5C71D2FBE28162B]) [    ] o.a.s.c.CoreContainer Couldn't add files from C:\Users\jenkins\workspace\Lucene-Solr-6.x-Windows\solr\build\solr-core\test\J1\temp\solr.cloud.LeaderFailoverAfterPartitionTest_F5C71D2FBE28162B-001\shard-1-001\lib to classpath: C:\Users\jenkins\workspace\Lucene-Solr-6.x-Windows\solr\build\solr-core\test\J1\temp\solr.cloud.LeaderFailoverAfterPartitionTest_F5C71D2FBE28162B-001\shard-1-001\lib
   [junit4]   2> 2386038 INFO  (TEST-LeaderFailoverAfterPartitionTest.test-seed#[F5C71D2FBE28162B]) [    ] o.a.s.h.c.HttpShardHandlerFactory created with socketTimeout : 90000,urlScheme : ,connTimeout : 15000,maxConnectionsPerHost : 20,maxConnections : 10000,corePoolSize : 0,maximumPoolSize : 2147483647,maxThreadIdleTime : 5,sizeOfQueue : -1,fairnessPolicy : false,useRetries : false,connectionsEvictorSleepDelay : 5000,maxConnectionIdleTime : 40000,
   [junit4]   2> 2386042 INFO  (TEST-LeaderFailoverAfterPartitionTest.test-seed#[F5C71D2FBE28162B]) [    ] o.a.s.u.UpdateShardHandler Creating UpdateShardHandler HTTP client with params: socketTimeout=340000&connTimeout=45000&retry=true
   [junit4]   2> 2386044 INFO  (TEST-LeaderFailoverAfterPartitionTest.test-seed#[F5C71D2FBE28162B]) [    ] o.a.s.l.LogWatcher SLF4J impl is org.slf4j.impl.Log4jLoggerFactory
   [junit4]   2> 2386044 INFO  (TEST-LeaderFailoverAfterPartitionTest.test-seed#[F5C71D2FBE28162B]) [    ] o.a.s.l.LogWatcher Registering Log Listener [Log4j (org.slf4j.impl.Log4jLoggerFactory)]
   [junit4]   2> 2386044 INFO  (TEST-LeaderFailoverAfterPartitionTest.test-seed#[F5C71D2FBE28162B]) [    ] o.a.s.c.ZkContainer Zookeeper client=127.0.0.1:61226/solr
   [junit4]   2> 2386044 INFO  (TEST-LeaderFailoverAfterPartitionTest.test-seed#[F5C71D2FBE28162B]) [    ] o.a.s.c.ZkController zkHost includes chroot
   [junit4]   2> 2386044 INFO  (TEST-LeaderFailoverAfterPartitionTest.test-seed#[F5C71D2FBE28162B]) [    ] o.a.s.c.c.SolrZkClient Using default ZkCredentialsProvider
   [junit4]   2> 2386045 INFO  (TEST-LeaderFailoverAfterPartitionTest.test-seed#[F5C71D2FBE28162B]) [    ] o.a.s.c.c.ConnectionManager Waiting for client to connect to ZooKeeper
   [junit4]   2> 2386046 INFO  (zkCallback-2892-thread-1) [    ] o.a.s.c.c.ConnectionManager Watcher org.apache.solr.common.cloud.ConnectionManager@11049080 name:ZooKeeperConnection Watcher:127.0.0.1:61226 got event WatchedEvent state:SyncConnected type:None path:null path:null type:None
   [junit4]   2> 2386046 INFO  (TEST-LeaderFailoverAfterPartitionTest.test-seed#[F5C71D2FBE28162B]) [    ] o.a.s.c.c.ConnectionManager Client is connected to ZooKeeper
   [junit4]   2> 2386047 INFO  (TEST-LeaderFailoverAfterPartitionTest.test-seed#[F5C71D2FBE28162B]) [    ] o.a.s.c.c.SolrZkClient Using default ZkACLProvider
   [junit4]   2> 2386048 INFO  (TEST-LeaderFailoverAfterPartitionTest.test-seed#[F5C71D2FBE28162B]) [n:127.0.0.1:61256_    ] o.a.s.c.ZkController Added new OnReconnect listener org.apache.solr.cloud.ZkController$$Lambda$74/1395342677@3b56df39
   [junit4]   2> 2386049 INFO  (TEST-LeaderFailoverAfterPartitionTest.test-seed#[F5C71D2FBE28162B]) [n:127.0.0.1:61256_    ] o.a.s.c.c.ConnectionManager Waiting for client to connect to ZooKeeper
   [junit4]   2> 2386050 INFO  (zkCallback-2893-thread-1-processing-n:127.0.0.1:61256_) [n:127.0.0.1:61256_    ] o.a.s.c.c.ConnectionManager Watcher org.apache.solr.common.cloud.ConnectionManager@6e55bca5 name:ZooKeeperConnection Watcher:127.0.0.1:61226/solr got event WatchedEvent state:SyncConnected type:None path:null path:null type:None
   [junit4]   2> 2386050 INFO  (TEST-LeaderFailoverAfterPartitionTest.test-seed#[F5C71D2FBE28162B]) [n:127.0.0.1:61256_    ] o.a.s.c.c.ConnectionManager Client is connected to ZooKeeper
   [junit4]   2> 2386059 INFO  (TEST-LeaderFailoverAfterPartitionTest.test-seed#[F5C71D2FBE28162B]) [n:127.0.0.1:61256_    ] o.a.s.c.c.ZkStateReader Updating cluster state from ZooKeeper... 
   [junit4]   2> 2386060 INFO  (TEST-LeaderFailoverAfterPartitionTest.test-seed#[F5C71D2FBE28162B]) [n:127.0.0.1:61256_    ] o.a.s.c.c.ZkStateReader Loaded empty cluster properties
   [junit4]   2> 2386061 INFO  (TEST-LeaderFailoverAfterPartitionTest.test-seed#[F5C71D2FBE28162B]) [n:127.0.0.1:61256_    ] o.a.s.c.c.ZkStateReader Updated live nodes from ZooKeeper... (0) -> (1)
   [junit4]   2> 2386065 INFO  (TEST-LeaderFailoverAfterPartitionTest.test-seed#[F5C71D2FBE28162B]) [n:127.0.0.1:61256_    ] o.a.s.c.Overseer Overseer (id=null) closing
   [junit4]   2> 2386066 INFO  (TEST-LeaderFailoverAfterPartitionTest.test-seed#[F5C71D2FBE28162B]) [n:127.0.0.1:61256_    ] o.a.s.c.LeaderElector Joined leadership election with path: /overseer_elect/election/96573933377683465-127.0.0.1:61256_-n_0000000001
   [junit4]   2> 2386067 INFO  (TEST-LeaderFailoverAfterPartitionTest.test-seed#[F5C71D2FBE28162B]) [n:127.0.0.1:61256_    ] o.a.s.c.LeaderElector Watching path /overseer_elect/election/96573933377683460-127.0.0.1:61233_-n_0000000000 to know if I could be the leader
   [junit4]   2> 2386067 INFO  (TEST-LeaderFailoverAfterPartitionTest.test-seed#[F5C71D2FBE28162B]) [n:127.0.0.1:61256_    ] o.a.s.c.ZkController Publish node=127.0.0.1:61256_ as DOWN
   [junit4]   2> 2386068 INFO  (TEST-LeaderFailoverAfterPartitionTest.test-seed#[F5C71D2FBE28162B]) [n:127.0.0.1:61256_    ] o.a.s.c.ZkController Register node as live in ZooKeeper:/live_nodes/127.0.0.1:61256_
   [junit4]   2> 2386068 INFO  (TEST-LeaderFailoverAfterPartitionTest.test-seed#[F5C71D2FBE28162B]) [n:127.0.0.1:61256_    ] o.a.s.c.c.SolrZkClient makePath: /live_nodes/127.0.0.1:61256_
   [junit4]   2> 2386069 INFO  (OverseerStateUpdate-96573933377683460-127.0.0.1:61233_-n_0000000000) [n:127.0.0.1:61233_    ] o.a.s.c.Overseer processMessage: queueSize: 1, message = {
   [junit4]   2>   "operation":"downnode",
   [junit4]   2>   "node_name":"127.0.0.1:61256_"} current state version: 3
   [junit4]   2> 2386069 INFO  (OverseerStateUpdate-96573933377683460-127.0.0.1:61233_-n_0000000000) [n:127.0.0.1:61233_    ] o.a.s.c.o.NodeMutator DownNode state invoked for node: 127.0.0.1:61256_
   [junit4]   2> 2386070 INFO  (zkCallback-2883-thread-3-processing-n:127.0.0.1:61233_) [n:127.0.0.1:61233_    ] o.a.s.c.c.ZkStateReader A live node change: [WatchedEvent state:SyncConnected type:NodeChildrenChanged path:/live_nodes], has occurred - updating... (live nodes size: [1])
   [junit4]   2> 2386070 INFO  (zkCallback-2887-thread-1) [    ] o.a.s.c.c.ZkStateReader A live node change: [WatchedEvent state:SyncConnected type:NodeChildrenChanged path:/live_nodes], has occurred - updating... (live nodes size: [1])
   [junit4]   2> 2386070 INFO  (zkCallback-2893-thread-1-processing-n:127.0.0.1:61256_) [n:127.0.0.1:61256_    ] o.a.s.c.c.ZkStateReader A live node change: [WatchedEvent state:SyncConnected type:NodeChildrenChanged path:/live_nodes], has occurred - updating... (live nodes size: [1])
   [junit4]   2> 2386070 INFO  (zkCallback-2883-thread-3-processing-n:127.0.0.1:61233_) [n:127.0.0.1:61233_    ] o.a.s.c.c.ZkStateReader Updated live nodes from ZooKeeper... (1) -> (2)
   [junit4]   2> 2386070 INFO  (zkCallback-2887-thread-1) [    ] o.a.s.c.c.ZkStateReader Updated live nodes from ZooKeeper... (1) -> (2)
   [junit4]   2> 2386071 INFO  (zkCallback-2893-thread-1-processing-n:127.0.0.1:61256_) [n:127.0.0.1:61256_    ] o.a.s.c.c.ZkStateReader Updated live nodes from ZooKeeper... (1) -> (2)
   [junit4]   2> 2386071 INFO  (zkCallback-2883-thread-1-processing-n:127.0.0.1:61233_) [n:127.0.0.1:61233_    ] o.a.s.c.c.ZkStateReader A cluster state change: [WatchedEvent state:SyncConnected type:NodeDataChanged path:/clusterstate.json], has occurred - updating... (live nodes size: [2])
   [junit4]   2> 2386071 INFO  (zkCallback-2887-thread-1) [    ] o.a.s.c.c.ZkStateReader A cluster state change: [WatchedEvent state:SyncConnected type:NodeDataChanged path:/clusterstate.json], has occurred - updating... (live nodes size: [2])
   [junit4]   2> 2386071 INFO  (zkCallback-2893-thread-1-processing-n:127.0.0.1:61256_) [n:127.0.0.1:61256_    ] o.a.s.c.c.ZkStateReader A cluster state change: [WatchedEvent state:SyncConnected type:NodeDataChanged path:/clusterstate.json], has occurred - updating... (live nodes size: [2])
   [junit4]   2> 2386077 INFO  (TEST-LeaderFailoverAfterPartitionTest.test-seed#[F5C71D2FBE28162B]) [n:127.0.0.1:61256_    ] o.a.s.c.CoreContainer Security conf doesn't exist. Skipping setup for authorization module.
   [junit4]   2> 2386077 INFO  (TEST-LeaderFailoverAfterPartitionTest.test-seed#[F5C71D2FBE28162B]) [n:127.0.0.1:61256_    ] o.a.s.c.CoreContainer No authentication plugin used.
   [junit4]   2> 2386079 INFO  (TEST-LeaderFailoverAfterPartitionTest.test-seed#[F5C71D2FBE28162B]) [n:127.0.0.1:61256_    ] o.a.s.c.CorePropertiesLocator Looking for core definitions underneath C:\Users\jenkins\workspace\Lucene-Solr-6.x-Windows\solr\build\solr-core\test\J1\temp\solr.cloud.LeaderFailoverAfterPartitionTest_F5C71D2FBE28162B-001\shard-1-001\cores
   [junit4]   2> 2386080 INFO  (TEST-LeaderFailoverAfterPartitionTest.test-seed#[F5C71D2FBE28162B]) [n:127.0.0.1:61256_    ] o.a.s.c.CoreDescriptor Created CoreDescriptor: {name=collection1, config=solrconfig.xml, transient=false, schema=schema.xml, loadOnStartup=true, configSetProperties=configsetprops.json, collection=collection1, coreNodeName=, dataDir=data\, shard=}
   [junit4]   2> 2386080 INFO  (TEST-LeaderFailoverAfterPartitionTest.test-seed#[F5C71D2FBE28162B]) [n:127.0.0.1:61256_    ] o.a.s.c.CorePropertiesLocator Found core collection1 in C:\Users\jenkins\workspace\Lucene-Solr-6.x-Windows\solr\build\solr-core\test\J1\temp\solr.cloud.LeaderFailoverAfterPartitionTest_F5C71D2FBE28162B-001\shard-1-001\cores\collection1
   [junit4]   2> 2386080 INFO  (TEST-LeaderFailoverAfterPartitionTest.test-seed#[F5C71D2FBE28162B]) [n:127.0.0.1:61256_    ] o.a.s.c.CorePropertiesLocator Found 1 core definitions
   [junit4]   2> 2386081 INFO  (TEST-LeaderFailoverAfterPartitionTest.test-seed#[F5C71D2FBE28162B]) [n:127.0.0.1:61256_    ] o.a.s.s.SolrDispatchFilter user.dir=C:\Users\jenkins\workspace\Lucene-Solr-6.x-Windows\solr\build\solr-core\test\J1
   [junit4]   2> 2386081 INFO  (TEST-LeaderFailoverAfterPartitionTest.test-seed#[F5C71D2FBE28162B]) [n:127.0.0.1:61256_    ] o.a.s.s.SolrDispatchFilter SolrDispatchFilter.init() done
   [junit4]   2> 2386082 INFO  (coreLoadExecutor-8316-thread-1-processing-n:127.0.0.1:61256_) [n:127.0.0.1:61256_ c:collection1   x:collection1] o.a.s.c.ZkController publishing state=down
   [junit4]   2> 2386082 INFO  (coreLoadExecutor-8316-thread-1-processing-n:127.0.0.1:61256_) [n:127.0.0.1:61256_ c:collection1   x:collection1] o.a.s.c.ZkController numShards not found on descriptor - reading it from system property
   [junit4]   2> 2386083 INFO  (coreLoadExecutor-8316-thread-1-processing-n:127.0.0.1:61256_) [n:127.0.0.1:61256_ c:collection1   x:collection1] o.a.s.c.ZkController Registering watch for collection collection1
   [junit4]   2> 2386083 INFO  (OverseerStateUpdate-96573933377683460-127.0.0.1:61233_-n_0000000000) [n:127.0.0.1:61233_    ] o.a.s.c.Overseer processMessage: queueSize: 1, message = {
   [junit4]   2>   "core":"collection1",
   [junit4]   2>   "roles":null,
   [junit4]   2>   "base_url":"http://127.0.0.1:61256",
   [junit4]   2>   "node_name":"127.0.0.1:61256_",
   [junit4]   2>   "numShards":"2",
   [junit4]   2>   "state":"down",
   [junit4]   2>   "shard":null,
   [junit4]   2>   "collection":"collection1",
   [junit4]   2>   "operation":"state"} current state version: 4
   [junit4]   2> 2386083 INFO  (OverseerStateUpdate-96573933377683460-127.0.0.1:61233_-n_0000000000) [n:127.0.0.1:61233_    ] o.a.s.c.o.ReplicaMutator Update state numShards=2 message={
   [junit4]   2>   "core":"collection1",
   [junit4]   2>   "roles":null,
   [junit4]   2>   "base_url":"http://127.0.0.1:61256",
   [junit4]   2>   "node_name":"127.0.0.1:61256_",
   [junit4]   2>   "numShards":"2",
   [junit4]   2>   "state":"down",
   [junit4]   2>   "shard":null,
   [junit4]   2>   "collection":"collection1",
   [junit4]   2>   "operation":"state"}
   [junit4]   2> 2386083 INFO  (coreLoadExecutor-8316-thr

[...truncated too long message...]

er refused connection at: http://127.0.0.1:61269/c8n_1x3_lf_shard1_replica1
   [junit4]    > 	at org.apache.solr.client.solrj.impl.HttpSolrClient.executeMethod(HttpSolrClient.java:599)
   [junit4]    > 	at org.apache.solr.client.solrj.impl.HttpSolrClient.request(HttpSolrClient.java:261)
   [junit4]    > 	at org.apache.solr.client.solrj.impl.HttpSolrClient.request(HttpSolrClient.java:250)
   [junit4]    > 	at org.apache.solr.client.solrj.impl.LBHttpSolrClient.doRequest(LBHttpSolrClient.java:405)
   [junit4]    > 	at org.apache.solr.client.solrj.impl.LBHttpSolrClient.request(LBHttpSolrClient.java:357)
   [junit4]    > 	... 6 more
   [junit4]    > Caused by: java.net.ConnectException: Connection refused: connect
   [junit4]    > 	at java.net.DualStackPlainSocketImpl.waitForConnect(Native Method)
   [junit4]    > 	at java.net.DualStackPlainSocketImpl.socketConnect(DualStackPlainSocketImpl.java:85)
   [junit4]    > 	at java.net.AbstractPlainSocketImpl.doConnect(AbstractPlainSocketImpl.java:350)
   [junit4]    > 	at java.net.AbstractPlainSocketImpl.connectToAddress(AbstractPlainSocketImpl.java:206)
   [junit4]    > 	at java.net.AbstractPlainSocketImpl.connect(AbstractPlainSocketImpl.java:188)
   [junit4]    > 	at java.net.PlainSocketImpl.connect(PlainSocketImpl.java:172)
   [junit4]    > 	at java.net.SocksSocketImpl.connect(SocksSocketImpl.java:392)
   [junit4]    > 	at java.net.Socket.connect(Socket.java:589)
   [junit4]    > 	at org.apache.http.conn.scheme.PlainSocketFactory.connectSocket(PlainSocketFactory.java:117)
   [junit4]    > 	at org.apache.http.impl.conn.DefaultClientConnectionOperator.openConnection(DefaultClientConnectionOperator.java:177)
   [junit4]    > 	at org.apache.http.impl.conn.ManagedClientConnectionImpl.open(ManagedClientConnectionImpl.java:304)
   [junit4]    > 	at org.apache.http.impl.client.DefaultRequestDirector.tryConnect(DefaultRequestDirector.java:611)
   [junit4]    > 	at org.apache.http.impl.client.DefaultRequestDirector.execute(DefaultRequestDirector.java:446)
   [junit4]    > 	at org.apache.http.impl.client.AbstractHttpClient.doExecute(AbstractHttpClient.java:882)
   [junit4]    > 	at org.apache.http.impl.client.CloseableHttpClient.execute(CloseableHttpClient.java:82)
   [junit4]    > 	at org.apache.http.impl.client.CloseableHttpClient.execute(CloseableHttpClient.java:107)
   [junit4]    > 	at org.apache.http.impl.client.CloseableHttpClient.execute(CloseableHttpClient.java:55)
   [junit4]    > 	at org.apache.solr.client.solrj.impl.HttpSolrClient.executeMethod(HttpSolrClient.java:497)
   [junit4]    > 	... 10 more
   [junit4]   2> 2456409 INFO  (SUITE-LeaderFailoverAfterPartitionTest-seed#[F5C71D2FBE28162B]-worker) [    ] o.a.s.SolrTestCaseJ4 ###deleteCore
   [junit4]   2> NOTE: leaving temporary files on disk at: C:\Users\jenkins\workspace\Lucene-Solr-6.x-Windows\solr\build\solr-core\test\J1\temp\solr.cloud.LeaderFailoverAfterPartitionTest_F5C71D2FBE28162B-001
   [junit4]   2> Sep 11, 2016 1:42:31 PM com.carrotsearch.randomizedtesting.ThreadLeakControl checkThreadLeaks
   [junit4]   2> WARNING: Will linger awaiting termination of 1 leaked thread(s).
   [junit4]   2> NOTE: test params are: codec=Asserting(Lucene62): {range_facet_l_dv=PostingsFormat(name=Memory doPackFST= true), _version_=Lucene50(blocksize=128), multiDefault=FST50, a_t=Lucene50(blocksize=128), intDefault=Lucene50(blocksize=128), id=PostingsFormat(name=Memory doPackFST= true), range_facet_i_dv=Lucene50(blocksize=128), text=TestBloomFilteredLucenePostings(BloomFilteringPostingsFormat(Lucene50(blocksize=128))), range_facet_l=Lucene50(blocksize=128), timestamp=Lucene50(blocksize=128)}, docValues:{range_facet_l_dv=DocValuesFormat(name=Lucene54), range_facet_i_dv=DocValuesFormat(name=Asserting), timestamp=DocValuesFormat(name=Asserting)}, maxPointsInLeafNode=388, maxMBSortInHeap=6.40953721123017, sim=ClassicSimilarity, locale=es-GT, timezone=America/Hermosillo
   [junit4]   2> NOTE: Windows 10 10.0 amd64/Oracle Corporation 1.8.0_102 (64-bit)/cpus=3,threads=1,free=185762264,total=433061888
   [junit4]   2> NOTE: All tests run in this JVM: [JsonLoaderTest, DistribDocExpirationUpdateProcessorTest, TestSolrDynamicMBean, TestRandomFaceting, TestPKIAuthenticationPlugin, TestTestInjection, OverseerModifyCollectionTest, SolrIndexConfigTest, TestJoin, BooleanFieldTest, TestCloudInspectUtil, DefaultValueUpdateProcessorTest, AtomicUpdatesTest, TestAddFieldRealTimeGet, SpellCheckComponentTest, TestFiltering, RemoteQueryErrorTest, ReturnFieldsTest, TestLMDirichletSimilarityFactory, HdfsLockFactoryTest, CircularListTest, TestConfig, TestZkChroot, TestFieldResource, JavabinLoaderTest, TriLevelCompositeIdRoutingTest, TestPerFieldSimilarityWithDefaultOverride, DateRangeFieldTest, MinimalSchemaTest, TestQueryWrapperFilter, TestShardHandlerFactory, CSVRequestHandlerTest, TestBulkSchemaConcurrent, DeleteLastCustomShardedReplicaTest, TestRecovery, StressHdfsTest, TestUninvertingReader, TestFieldCacheSortRandom, TestSmileRequest, BadIndexSchemaTest, BasicFunctionalityTest, TestAuthenticationFramework, TestUseDocValuesAsStored, TestRandomFlRTGCloud, QueryParsingTest, TestRecoveryHdfs, TestCoreDiscovery, TestSolrConfigHandlerConcurrent, TestBadConfig, TestSolrQueryParserDefaultOperatorResource, CoreSorterTest, TestFieldTypeResource, ZkSolrClientTest, CursorMarkTest, TestFieldCache, SmileWriterTest, RegexBoostProcessorTest, TestSolrFieldCacheMBean, TestDistributedMissingSort, TestSQLHandler, FullSolrCloudDistribCmdsTest, DistributedFacetPivotWhiteBoxTest, TestSSLRandomization, AsyncCallRequestStatusResponseTest, TestQuerySenderNoQuery, ExplicitHLLTest, ChaosMonkeySafeLeaderTest, TestFuzzyAnalyzedSuggestions, TestSolrQueryParser, TestRebalanceLeaders, URLClassifyProcessorTest, RollingRestartTest, TestChildDocTransformer, CustomCollectionTest, WordBreakSolrSpellCheckerTest, SignatureUpdateProcessorFactoryTest, TestManagedSynonymFilterFactory, DateMathParserTest, TestNonDefinedSimilarityFactory, LukeRequestHandlerTest, DistributedExpandComponentTest, GraphQueryTest, SegmentsInfoRequestHandlerTest, TestDistributedStatsComponentCardinality, ScriptEngineTest, CdcrRequestHandlerTest, PreAnalyzedFieldTest, TestBlobHandler, TestSha256AuthenticationProvider, OpenCloseCoreStressTest, TestSolrCoreProperties, EchoParamsTest, ConnectionManagerTest, HdfsChaosMonkeyNothingIsSafeTest, DeleteReplicaTest, InfoHandlerTest, AnalyticsMergeStrategyTest, RulesTest, TestGeoJSONResponseWriter, TestQueryTypes, TolerantUpdateProcessorTest, BasicZkTest, TestWriterPerf, TestCloudPseudoReturnFields, TestXmlQParser, TestNRTOpen, TestMaxScoreQueryParser, TestIntervalFaceting, VersionInfoTest, TestManagedSchemaAPI, TestConfigSetsAPI, TermVectorComponentDistributedTest, FacetPivotSmallTest, TestSlowCompositeReaderWrapper, SuggesterTSTTest, TestExactSharedStatsCache, BigEndianAscendingWordSerializerTest, HdfsRestartWhileUpdatingTest, BlockCacheTest, TestSearcherReuse, PKIAuthenticationIntegrationTest, TestStressUserVersions, TestScoreJoinQPScore, RAMDirectoryFactoryTest, TestCodecSupport, DistributedQueueTest, DistanceFunctionTest, MBeansHandlerTest, TestQuerySenderListener, UUIDFieldTest, SuggestComponentContextFilterQueryTest, TestPHPSerializedResponseWriter, EnumFieldTest, TestMacros, CloneFieldUpdateProcessorFactoryTest, TestConfigSetProperties, TestReversedWildcardFilterFactory, TestNoOpRegenerator, SolrCmdDistributorTest, TestDistribDocBasedVersion, TestPivotHelperCode, HLLSerializationTest, NoCacheHeaderTest, TestExceedMaxTermLength, DirectUpdateHandlerOptimizeTest, TestValueSourceCache, TestSolrDeletionPolicy2, TestLMJelinekMercerSimilarityFactory, TestJmxMonitoredMap, TestReqParamsAPI, AliasIntegrationTest, TestFilteredDocIdSet, StatsComponentTest, OverseerTest, LeaderElectionIntegrationTest, ShardRoutingTest, ZkCLITest, ShardRoutingCustomTest, AutoCommitTest, TestDistributedGrouping, DistributedSpellCheckComponentTest, TestRealTimeGet, DistributedTermsComponentTest, TestSolr4Spatial, ConvertedLegacyTest, TestLazyCores, SoftAutoCommitTest, CurrencyFieldOpenExchangeTest, SolrIndexSplitterTest, SpellCheckCollatorTest, CoreAdminHandlerTest, TestStressLucene, TestTrie, SuggesterWFSTTest, SchemaVersionSpecificBehaviorTest, TestPseudoReturnFields, TestAtomicUpdateErrorCases, SortByFunctionTest, DocValuesMultiTest, XsltUpdateRequestHandlerTest, DebugComponentTest, DisMaxRequestHandlerTest, TestOmitPositions, TermsComponentTest, RequestHandlersTest, DocumentBuilderTest, TestIndexingPerformance, RequiredFieldsTest, FastVectorHighlighterTest, LoggingHandlerTest, IndexSchemaTest, TestCollationField, UniqFieldsUpdateProcessorFactoryTest, TestComponentsName, TestBinaryResponseWriter, HighlighterConfigTest, UpdateParamsTest, AlternateDirectoryTest, CopyFieldTest, ResponseLogComponentTest, BadComponentTest, TestMergePolicyConfig, MultiTermTest, SampleTest, TestDocSet, TestBinaryField, TestSearchPerf, ExternalFileFieldSortTest, DirectSolrConnectionTest, NotRequiredUniqueKeyTest, TestLuceneMatchVersion, TestPhraseSuggestions, SpellPossibilityIteratorTest, TestCharFilters, SynonymTokenizerTest, TestXIncludeConfig, TestSweetSpotSimilarityFactory, TestDFRSimilarityFactory, TestPerFieldSimilarity, TestBM25SimilarityFactory, TestFastWriter, TimeZoneUtilsTest, ResourceLoaderTest, TestFastOutputStream, OpenExchangeRatesOrgProviderTest, TestFastLRUCache, TestSystemIdResolver, TestSuggestSpellingConverter, SpellingQueryConverterTest, ClusterStateTest, TestSolrJ, TestLRUCache, TestDocumentBuilder, SliceStateTest, FileUtilsTest, DistributedIntervalFacetingTest, TestEmbeddedSolrServerConstructors, TestJettySolrRunner, ActionThrottleTest, CloudExitableDirectoryReaderTest, CollectionTooManyReplicasTest, ConcurrentDeleteAndCreateCollectionTest, ConfigSetsAPITest, DeleteNodeTest, DeleteShardTest, DistributedVersionInfoTest, LeaderFailoverAfterPartitionTest]
   [junit4] Completed [465/630 (1!)] on J1 in 73.75s, 1 test, 1 error <<< FAILURES!

[...truncated 60796 lines...]


Mime
View raw message