lucene-dev mailing list archives

Site index · List index
Message view « Date » · « Thread »
Top « Date » · « Thread »
From Apache Jenkins Server <jenk...@builds.apache.org>
Subject [JENKINS] Lucene-Solr-Tests-master - Build # 1396 - Still Unstable
Date Mon, 19 Sep 2016 20:02:32 GMT
Build: https://builds.apache.org/job/Lucene-Solr-Tests-master/1396/

2 tests failed.
FAILED:  org.apache.solr.cloud.TestSolrCloudWithKerberosAlt.testBasics

Error Message:
Address already in use

Stack Trace:
java.net.BindException: Address already in use
	at __randomizedtesting.SeedInfo.seed([BAE64CA36CFAE2E:3676CAE60E21F05E]:0)
	at sun.nio.ch.Net.bind0(Native Method)
	at sun.nio.ch.Net.bind(Net.java:433)
	at sun.nio.ch.Net.bind(Net.java:425)
	at sun.nio.ch.ServerSocketChannelImpl.bind(ServerSocketChannelImpl.java:223)
	at sun.nio.ch.ServerSocketAdaptor.bind(ServerSocketAdaptor.java:74)
	at org.apache.mina.transport.socket.nio.NioSocketAcceptor.open(NioSocketAcceptor.java:252)
	at org.apache.mina.transport.socket.nio.NioSocketAcceptor.open(NioSocketAcceptor.java:49)
	at org.apache.mina.core.polling.AbstractPollingIoAcceptor.registerHandles(AbstractPollingIoAcceptor.java:525)
	at org.apache.mina.core.polling.AbstractPollingIoAcceptor.access$200(AbstractPollingIoAcceptor.java:67)
	at org.apache.mina.core.polling.AbstractPollingIoAcceptor$Acceptor.run(AbstractPollingIoAcceptor.java:409)
	at org.apache.mina.util.NamePreservingRunnable.run(NamePreservingRunnable.java:65)
	at java.util.concurrent.ThreadPoolExecutor.runWorker(ThreadPoolExecutor.java:1142)
	at java.util.concurrent.ThreadPoolExecutor$Worker.run(ThreadPoolExecutor.java:617)
	at java.lang.Thread.run(Thread.java:745)


FAILED:  org.apache.solr.update.SoftAutoCommitTest.testSoftAndHardCommitMaxTimeMixedAdds

Error Message:
soft529 wasn't fast enough

Stack Trace:
java.lang.AssertionError: soft529 wasn't fast enough
	at __randomizedtesting.SeedInfo.seed([BAE64CA36CFAE2E:5A7A9D4A87BC9E89]:0)
	at org.junit.Assert.fail(Assert.java:93)
	at org.junit.Assert.assertTrue(Assert.java:43)
	at org.junit.Assert.assertNotNull(Assert.java:526)
	at org.apache.solr.update.SoftAutoCommitTest.testSoftAndHardCommitMaxTimeMixedAdds(SoftAutoCommitTest.java:111)
	at sun.reflect.NativeMethodAccessorImpl.invoke0(Native Method)
	at sun.reflect.NativeMethodAccessorImpl.invoke(NativeMethodAccessorImpl.java:62)
	at sun.reflect.DelegatingMethodAccessorImpl.invoke(DelegatingMethodAccessorImpl.java:43)
	at java.lang.reflect.Method.invoke(Method.java:498)
	at com.carrotsearch.randomizedtesting.RandomizedRunner.invoke(RandomizedRunner.java:1764)
	at com.carrotsearch.randomizedtesting.RandomizedRunner$8.evaluate(RandomizedRunner.java:871)
	at com.carrotsearch.randomizedtesting.RandomizedRunner$9.evaluate(RandomizedRunner.java:907)
	at com.carrotsearch.randomizedtesting.RandomizedRunner$10.evaluate(RandomizedRunner.java:921)
	at com.carrotsearch.randomizedtesting.rules.SystemPropertiesRestoreRule$1.evaluate(SystemPropertiesRestoreRule.java:57)
	at org.apache.lucene.util.TestRuleSetupTeardownChained$1.evaluate(TestRuleSetupTeardownChained.java:49)
	at org.apache.lucene.util.AbstractBeforeAfterRule$1.evaluate(AbstractBeforeAfterRule.java:45)
	at org.apache.lucene.util.TestRuleThreadAndTestName$1.evaluate(TestRuleThreadAndTestName.java:48)
	at org.apache.lucene.util.TestRuleIgnoreAfterMaxFailures$1.evaluate(TestRuleIgnoreAfterMaxFailures.java:64)
	at org.apache.lucene.util.TestRuleMarkFailure$1.evaluate(TestRuleMarkFailure.java:47)
	at com.carrotsearch.randomizedtesting.rules.StatementAdapter.evaluate(StatementAdapter.java:36)
	at com.carrotsearch.randomizedtesting.ThreadLeakControl$StatementRunner.run(ThreadLeakControl.java:367)
	at com.carrotsearch.randomizedtesting.ThreadLeakControl.forkTimeoutingTask(ThreadLeakControl.java:809)
	at com.carrotsearch.randomizedtesting.ThreadLeakControl$3.evaluate(ThreadLeakControl.java:460)
	at com.carrotsearch.randomizedtesting.RandomizedRunner.runSingleTest(RandomizedRunner.java:880)
	at com.carrotsearch.randomizedtesting.RandomizedRunner$5.evaluate(RandomizedRunner.java:781)
	at com.carrotsearch.randomizedtesting.RandomizedRunner$6.evaluate(RandomizedRunner.java:816)
	at com.carrotsearch.randomizedtesting.RandomizedRunner$7.evaluate(RandomizedRunner.java:827)
	at com.carrotsearch.randomizedtesting.rules.StatementAdapter.evaluate(StatementAdapter.java:36)
	at com.carrotsearch.randomizedtesting.rules.SystemPropertiesRestoreRule$1.evaluate(SystemPropertiesRestoreRule.java:57)
	at org.apache.lucene.util.AbstractBeforeAfterRule$1.evaluate(AbstractBeforeAfterRule.java:45)
	at com.carrotsearch.randomizedtesting.rules.StatementAdapter.evaluate(StatementAdapter.java:36)
	at org.apache.lucene.util.TestRuleStoreClassName$1.evaluate(TestRuleStoreClassName.java:41)
	at com.carrotsearch.randomizedtesting.rules.NoShadowingOrOverridesOnMethodsRule$1.evaluate(NoShadowingOrOverridesOnMethodsRule.java:40)
	at com.carrotsearch.randomizedtesting.rules.NoShadowingOrOverridesOnMethodsRule$1.evaluate(NoShadowingOrOverridesOnMethodsRule.java:40)
	at com.carrotsearch.randomizedtesting.rules.StatementAdapter.evaluate(StatementAdapter.java:36)
	at com.carrotsearch.randomizedtesting.rules.StatementAdapter.evaluate(StatementAdapter.java:36)
	at com.carrotsearch.randomizedtesting.rules.StatementAdapter.evaluate(StatementAdapter.java:36)
	at org.apache.lucene.util.TestRuleAssertionsRequired$1.evaluate(TestRuleAssertionsRequired.java:53)
	at org.apache.lucene.util.TestRuleMarkFailure$1.evaluate(TestRuleMarkFailure.java:47)
	at org.apache.lucene.util.TestRuleIgnoreAfterMaxFailures$1.evaluate(TestRuleIgnoreAfterMaxFailures.java:64)
	at org.apache.lucene.util.TestRuleIgnoreTestSuites$1.evaluate(TestRuleIgnoreTestSuites.java:54)
	at com.carrotsearch.randomizedtesting.rules.StatementAdapter.evaluate(StatementAdapter.java:36)
	at com.carrotsearch.randomizedtesting.ThreadLeakControl$StatementRunner.run(ThreadLeakControl.java:367)
	at java.lang.Thread.run(Thread.java:745)




Build Log:
[...truncated 10524 lines...]
   [junit4] Suite: org.apache.solr.update.SoftAutoCommitTest
   [junit4]   2> Creating dataDir: /x1/jenkins/jenkins-slave/workspace/Lucene-Solr-Tests-master/solr/build/solr-core/test/J1/temp/solr.update.SoftAutoCommitTest_BAE64CA36CFAE2E-001/init-core-data-001
   [junit4]   2> 0    INFO  (SUITE-SoftAutoCommitTest-seed#[BAE64CA36CFAE2E]-worker) [    ] o.e.j.u.log Logging initialized @9197ms
   [junit4]   2> 42   INFO  (SUITE-SoftAutoCommitTest-seed#[BAE64CA36CFAE2E]-worker) [    ] o.a.s.SolrTestCaseJ4 Randomized ssl (true) and clientAuth (true) via: @org.apache.solr.util.RandomizeSSL(reason=, ssl=NaN, value=NaN, clientAuth=NaN)
   [junit4]   2> 488  INFO  (SUITE-SoftAutoCommitTest-seed#[BAE64CA36CFAE2E]-worker) [    ] o.a.s.SolrTestCaseJ4 ####initCore
   [junit4]   2> 562  INFO  (SUITE-SoftAutoCommitTest-seed#[BAE64CA36CFAE2E]-worker) [    ] o.a.s.c.SolrResourceLoader new SolrResourceLoader for directory: '/x1/jenkins/jenkins-slave/workspace/Lucene-Solr-Tests-master/solr/core/src/test-files/solr/collection1'
   [junit4]   2> 575  INFO  (SUITE-SoftAutoCommitTest-seed#[BAE64CA36CFAE2E]-worker) [    ] o.a.s.c.SolrResourceLoader JNDI not configured for solr (NoInitialContextEx)
   [junit4]   2> 575  INFO  (SUITE-SoftAutoCommitTest-seed#[BAE64CA36CFAE2E]-worker) [    ] o.a.s.c.SolrResourceLoader using system property solr.solr.home: /x1/jenkins/jenkins-slave/workspace/Lucene-Solr-Tests-master/solr/core/src/test-files/solr
   [junit4]   2> 579  INFO  (SUITE-SoftAutoCommitTest-seed#[BAE64CA36CFAE2E]-worker) [    ] o.a.s.c.SolrResourceLoader Adding 'file:/x1/jenkins/jenkins-slave/workspace/Lucene-Solr-Tests-master/solr/core/src/test-files/solr/collection1/lib/classes/' to classloader
   [junit4]   2> 579  INFO  (SUITE-SoftAutoCommitTest-seed#[BAE64CA36CFAE2E]-worker) [    ] o.a.s.c.SolrResourceLoader Adding 'file:/x1/jenkins/jenkins-slave/workspace/Lucene-Solr-Tests-master/solr/core/src/test-files/solr/collection1/lib/README' to classloader
   [junit4]   2> 1737 INFO  (SUITE-SoftAutoCommitTest-seed#[BAE64CA36CFAE2E]-worker) [    ] o.a.s.c.SolrConfig current version of requestparams : -1
   [junit4]   2> 1976 INFO  (SUITE-SoftAutoCommitTest-seed#[BAE64CA36CFAE2E]-worker) [    ] o.a.s.c.SolrConfig Using Lucene MatchVersion: 7.0.0
   [junit4]   2> 2290 INFO  (SUITE-SoftAutoCommitTest-seed#[BAE64CA36CFAE2E]-worker) [    ] o.a.s.c.SolrConfig Loaded SolrConfig: solrconfig.xml
   [junit4]   2> 2660 INFO  (SUITE-SoftAutoCommitTest-seed#[BAE64CA36CFAE2E]-worker) [    ] o.a.s.s.IndexSchema [null] Schema name=test
   [junit4]   2> 5074 INFO  (SUITE-SoftAutoCommitTest-seed#[BAE64CA36CFAE2E]-worker) [    ] o.a.s.s.OpenExchangeRatesOrgProvider Initialized with rates=open-exchange-rates.json, refreshInterval=1440.
   [junit4]   2> 5246 INFO  (SUITE-SoftAutoCommitTest-seed#[BAE64CA36CFAE2E]-worker) [    ] o.a.s.s.IndexSchema default search field in schema is text
   [junit4]   2> 5271 INFO  (SUITE-SoftAutoCommitTest-seed#[BAE64CA36CFAE2E]-worker) [    ] o.a.s.s.IndexSchema unique key field: id
   [junit4]   2> 5952 INFO  (SUITE-SoftAutoCommitTest-seed#[BAE64CA36CFAE2E]-worker) [    ] o.a.s.s.FileExchangeRateProvider Reloading exchange rates from file currency.xml
   [junit4]   2> 5960 INFO  (SUITE-SoftAutoCommitTest-seed#[BAE64CA36CFAE2E]-worker) [    ] o.a.s.s.FileExchangeRateProvider Reloading exchange rates from file currency.xml
   [junit4]   2> 5967 INFO  (SUITE-SoftAutoCommitTest-seed#[BAE64CA36CFAE2E]-worker) [    ] o.a.s.s.OpenExchangeRatesOrgProvider Reloading exchange rates from open-exchange-rates.json
   [junit4]   2> 5969 INFO  (SUITE-SoftAutoCommitTest-seed#[BAE64CA36CFAE2E]-worker) [    ] o.a.s.s.OpenExchangeRatesOrgProvider Reloading exchange rates from open-exchange-rates.json
   [junit4]   2> 5977 INFO  (SUITE-SoftAutoCommitTest-seed#[BAE64CA36CFAE2E]-worker) [    ] o.a.s.c.SolrResourceLoader JNDI not configured for solr (NoInitialContextEx)
   [junit4]   2> 5977 INFO  (SUITE-SoftAutoCommitTest-seed#[BAE64CA36CFAE2E]-worker) [    ] o.a.s.c.SolrResourceLoader using system property solr.solr.home: /x1/jenkins/jenkins-slave/workspace/Lucene-Solr-Tests-master/solr/core/src/test-files/solr
   [junit4]   2> 5977 INFO  (SUITE-SoftAutoCommitTest-seed#[BAE64CA36CFAE2E]-worker) [    ] o.a.s.c.SolrResourceLoader new SolrResourceLoader for directory: '/x1/jenkins/jenkins-slave/workspace/Lucene-Solr-Tests-master/solr/core/src/test-files/solr'
   [junit4]   2> 5977 INFO  (SUITE-SoftAutoCommitTest-seed#[BAE64CA36CFAE2E]-worker) [    ] o.a.s.c.SolrResourceLoader JNDI not configured for solr (NoInitialContextEx)
   [junit4]   2> 5978 INFO  (SUITE-SoftAutoCommitTest-seed#[BAE64CA36CFAE2E]-worker) [    ] o.a.s.c.SolrResourceLoader using system property solr.solr.home: /x1/jenkins/jenkins-slave/workspace/Lucene-Solr-Tests-master/solr/core/src/test-files/solr
   [junit4]   2> 6038 INFO  (SUITE-SoftAutoCommitTest-seed#[BAE64CA36CFAE2E]-worker) [    ] o.a.s.c.CoreContainer New CoreContainer 171438984
   [junit4]   2> 6039 INFO  (SUITE-SoftAutoCommitTest-seed#[BAE64CA36CFAE2E]-worker) [    ] o.a.s.c.CoreContainer Loading cores into CoreContainer [instanceDir=/x1/jenkins/jenkins-slave/workspace/Lucene-Solr-Tests-master/solr/core/src/test-files/solr]
   [junit4]   2> 6039 WARN  (SUITE-SoftAutoCommitTest-seed#[BAE64CA36CFAE2E]-worker) [    ] o.a.s.c.CoreContainer Couldn't add files from /x1/jenkins/jenkins-slave/workspace/Lucene-Solr-Tests-master/solr/core/src/test-files/solr/lib to classpath: /x1/jenkins/jenkins-slave/workspace/Lucene-Solr-Tests-master/solr/core/src/test-files/solr/lib
   [junit4]   2> 6054 INFO  (SUITE-SoftAutoCommitTest-seed#[BAE64CA36CFAE2E]-worker) [    ] o.a.s.h.c.HttpShardHandlerFactory created with socketTimeout : 600000,connTimeout : 60000,maxConnectionsPerHost : 20,maxConnections : 10000,corePoolSize : 0,maximumPoolSize : 2147483647,maxThreadIdleTime : 5,sizeOfQueue : -1,fairnessPolicy : false,
   [junit4]   2> 6625 INFO  (SUITE-SoftAutoCommitTest-seed#[BAE64CA36CFAE2E]-worker) [    ] o.a.s.u.UpdateShardHandler Created UpdateShardHandler HTTP client with params: socketTimeout=30000&connTimeout=30000&maxConnections=100000&maxConnectionsPerHost=100000
   [junit4]   2> 6647 INFO  (SUITE-SoftAutoCommitTest-seed#[BAE64CA36CFAE2E]-worker) [    ] o.a.s.l.LogWatcher SLF4J impl is org.slf4j.impl.Log4jLoggerFactory
   [junit4]   2> 6648 INFO  (SUITE-SoftAutoCommitTest-seed#[BAE64CA36CFAE2E]-worker) [    ] o.a.s.l.LogWatcher Registering Log Listener [Log4j (org.slf4j.impl.Log4jLoggerFactory)]
   [junit4]   2> 6660 INFO  (SUITE-SoftAutoCommitTest-seed#[BAE64CA36CFAE2E]-worker) [    ] o.a.s.c.CoreContainer Security conf doesn't exist. Skipping setup for authorization module.
   [junit4]   2> 6661 INFO  (SUITE-SoftAutoCommitTest-seed#[BAE64CA36CFAE2E]-worker) [    ] o.a.s.c.CoreContainer No authentication plugin used.
   [junit4]   2> 6959 INFO  (SUITE-SoftAutoCommitTest-seed#[BAE64CA36CFAE2E]-worker) [    ] o.a.s.c.CoreDescriptor Created CoreDescriptor: {name=collection1, config=solrconfig.xml, transient=false, schema=schema.xml, loadOnStartup=true, configSetProperties=configsetprops.json, collection=collection1, dataDir=/x1/jenkins/jenkins-slave/workspace/Lucene-Solr-Tests-master/solr/build/solr-core/test/J1/temp/solr.update.SoftAutoCommitTest_BAE64CA36CFAE2E-001/init-core-data-001, shard=shard1}
   [junit4]   2> 7052 INFO  (coreLoadExecutor-6-thread-1) [    ] o.a.s.c.SolrResourceLoader new SolrResourceLoader for directory: '/x1/jenkins/jenkins-slave/workspace/Lucene-Solr-Tests-master/solr/core/src/test-files/solr/collection1'
   [junit4]   2> 7053 INFO  (coreLoadExecutor-6-thread-1) [    ] o.a.s.c.SolrResourceLoader JNDI not configured for solr (NoInitialContextEx)
   [junit4]   2> 7054 INFO  (coreLoadExecutor-6-thread-1) [    ] o.a.s.c.SolrResourceLoader using system property solr.solr.home: /x1/jenkins/jenkins-slave/workspace/Lucene-Solr-Tests-master/solr/core/src/test-files/solr
   [junit4]   2> 7057 INFO  (coreLoadExecutor-6-thread-1) [    ] o.a.s.c.SolrResourceLoader Adding 'file:/x1/jenkins/jenkins-slave/workspace/Lucene-Solr-Tests-master/solr/core/src/test-files/solr/collection1/lib/classes/' to classloader
   [junit4]   2> 7057 INFO  (coreLoadExecutor-6-thread-1) [    ] o.a.s.c.SolrResourceLoader Adding 'file:/x1/jenkins/jenkins-slave/workspace/Lucene-Solr-Tests-master/solr/core/src/test-files/solr/collection1/lib/README' to classloader
   [junit4]   2> 7308 INFO  (coreLoadExecutor-6-thread-1) [    ] o.a.s.c.SolrConfig current version of requestparams : -1
   [junit4]   2> 7360 INFO  (coreLoadExecutor-6-thread-1) [    ] o.a.s.c.SolrConfig Using Lucene MatchVersion: 7.0.0
   [junit4]   2> 7588 INFO  (coreLoadExecutor-6-thread-1) [    ] o.a.s.c.SolrConfig Loaded SolrConfig: solrconfig.xml
   [junit4]   2> 7684 INFO  (coreLoadExecutor-6-thread-1) [    ] o.a.s.s.IndexSchema [collection1] Schema name=test
   [junit4]   2> 8298 INFO  (coreLoadExecutor-6-thread-1) [    ] o.a.s.s.OpenExchangeRatesOrgProvider Initialized with rates=open-exchange-rates.json, refreshInterval=1440.
   [junit4]   2> 8479 INFO  (coreLoadExecutor-6-thread-1) [    ] o.a.s.s.IndexSchema default search field in schema is text
   [junit4]   2> 8480 INFO  (coreLoadExecutor-6-thread-1) [    ] o.a.s.s.IndexSchema unique key field: id
   [junit4]   2> 8544 INFO  (coreLoadExecutor-6-thread-1) [    ] o.a.s.s.FileExchangeRateProvider Reloading exchange rates from file currency.xml
   [junit4]   2> 8553 INFO  (coreLoadExecutor-6-thread-1) [    ] o.a.s.s.FileExchangeRateProvider Reloading exchange rates from file currency.xml
   [junit4]   2> 8557 INFO  (coreLoadExecutor-6-thread-1) [    ] o.a.s.s.OpenExchangeRatesOrgProvider Reloading exchange rates from open-exchange-rates.json
   [junit4]   2> 8558 INFO  (coreLoadExecutor-6-thread-1) [    ] o.a.s.s.OpenExchangeRatesOrgProvider Reloading exchange rates from open-exchange-rates.json
   [junit4]   2> 8573 INFO  (coreLoadExecutor-6-thread-1) [    ] o.a.s.c.ConfigSetProperties Did not find ConfigSet properties, assuming default properties: Can't find resource 'configsetprops.json' in classpath or '/x1/jenkins/jenkins-slave/workspace/Lucene-Solr-Tests-master/solr/core/src/test-files/solr/collection1'
   [junit4]   2> 8573 INFO  (coreLoadExecutor-6-thread-1) [    ] o.a.s.c.CoreContainer Creating SolrCore 'collection1' using configuration from instancedir /x1/jenkins/jenkins-slave/workspace/Lucene-Solr-Tests-master/solr/core/src/test-files/solr/collection1
   [junit4]   2> 8713 INFO  (coreLoadExecutor-6-thread-1) [    x:collection1] o.a.s.c.SolrCore org.apache.solr.core.MockDirectoryFactory
   [junit4]   2> 8744 INFO  (coreLoadExecutor-6-thread-1) [    x:collection1] o.a.s.c.SolrCore [[collection1] ] Opening new SolrCore at [/x1/jenkins/jenkins-slave/workspace/Lucene-Solr-Tests-master/solr/core/src/test-files/solr/collection1], dataDir=[/x1/jenkins/jenkins-slave/workspace/Lucene-Solr-Tests-master/solr/build/solr-core/test/J1/temp/solr.update.SoftAutoCommitTest_BAE64CA36CFAE2E-001/init-core-data-001/]
   [junit4]   2> 8774 INFO  (coreLoadExecutor-6-thread-1) [    x:collection1] o.a.s.c.JmxMonitoredMap No JMX servers found, not exposing Solr information with JMX.
   [junit4]   2> 8827 INFO  (coreLoadExecutor-6-thread-1) [    x:collection1] o.a.s.c.CachingDirectoryFactory return new directory for /x1/jenkins/jenkins-slave/workspace/Lucene-Solr-Tests-master/solr/build/solr-core/test/J1/temp/solr.update.SoftAutoCommitTest_BAE64CA36CFAE2E-001/init-core-data-001/snapshot_metadata
   [junit4]   2> 8828 INFO  (coreLoadExecutor-6-thread-1) [    x:collection1] o.a.s.c.s.SolrSnapshotMetaDataManager Loading from snapshot metadata file...
   [junit4]   2> 8831 INFO  (coreLoadExecutor-6-thread-1) [    x:collection1] o.a.s.c.CachingDirectoryFactory return new directory for /x1/jenkins/jenkins-slave/workspace/Lucene-Solr-Tests-master/solr/build/solr-core/test/J1/temp/solr.update.SoftAutoCommitTest_BAE64CA36CFAE2E-001/init-core-data-001
   [junit4]   2> 8832 INFO  (coreLoadExecutor-6-thread-1) [    x:collection1] o.a.s.c.SolrCore New index directory detected: old=null new=/x1/jenkins/jenkins-slave/workspace/Lucene-Solr-Tests-master/solr/build/solr-core/test/J1/temp/solr.update.SoftAutoCommitTest_BAE64CA36CFAE2E-001/init-core-data-001/index/
   [junit4]   2> 8832 WARN  (coreLoadExecutor-6-thread-1) [    x:collection1] o.a.s.c.SolrCore [collection1] Solr index directory '/x1/jenkins/jenkins-slave/workspace/Lucene-Solr-Tests-master/solr/build/solr-core/test/J1/temp/solr.update.SoftAutoCommitTest_BAE64CA36CFAE2E-001/init-core-data-001/index' doesn't exist. Creating new index...
   [junit4]   2> 8849 INFO  (coreLoadExecutor-6-thread-1) [    x:collection1] o.a.s.c.CachingDirectoryFactory return new directory for /x1/jenkins/jenkins-slave/workspace/Lucene-Solr-Tests-master/solr/build/solr-core/test/J1/temp/solr.update.SoftAutoCommitTest_BAE64CA36CFAE2E-001/init-core-data-001/index
   [junit4]   2> 8853 INFO  (coreLoadExecutor-6-thread-1) [    x:collection1] o.a.s.u.RandomMergePolicy RandomMergePolicy wrapping class org.apache.lucene.index.TieredMergePolicy: [TieredMergePolicy: maxMergeAtOnce=47, maxMergeAtOnceExplicit=38, maxMergedSegmentMB=60.1640625, floorSegmentMB=0.5302734375, forceMergeDeletesPctAllowed=24.45929691037071, segmentsPerTier=45.0, maxCFSSegmentSizeMB=8.796093022207999E12, noCFSRatio=0.11546351187345039
   [junit4]   2> 9017 INFO  (coreLoadExecutor-6-thread-1) [    x:collection1] o.a.s.c.SolrDeletionPolicy SolrDeletionPolicy.onCommit: commits: num=1
   [junit4]   2> 	commit{dir=MockDirectoryWrapper(RAMDirectory@64819270 lockFactory=org.apache.lucene.store.SingleInstanceLockFactory@59fec5f5),segFN=segments_1,generation=1}
   [junit4]   2> 9018 INFO  (coreLoadExecutor-6-thread-1) [    x:collection1] o.a.s.c.SolrDeletionPolicy newest commit generation = 1
   [junit4]   2> 9034 INFO  (OldIndexDirectoryCleanupThreadForCore-collection1) [    x:collection1] o.a.s.c.SolrCore Looking for old index directories to cleanup for core collection1 in /x1/jenkins/jenkins-slave/workspace/Lucene-Solr-Tests-master/solr/build/solr-core/test/J1/temp/solr.update.SoftAutoCommitTest_BAE64CA36CFAE2E-001/init-core-data-001/
   [junit4]   2> 9363 INFO  (coreLoadExecutor-6-thread-1) [    x:collection1] o.a.s.u.p.UpdateRequestProcessorChain creating updateRequestProcessorChain "dedupe"
   [junit4]   2> 9379 INFO  (coreLoadExecutor-6-thread-1) [    x:collection1] o.a.s.u.p.UpdateRequestProcessorChain inserting DistributedUpdateProcessorFactory into updateRequestProcessorChain "dedupe"
   [junit4]   2> 9382 INFO  (coreLoadExecutor-6-thread-1) [    x:collection1] o.a.s.u.p.UpdateRequestProcessorChain creating updateRequestProcessorChain "dedupe-allfields"
   [junit4]   2> 9383 INFO  (coreLoadExecutor-6-thread-1) [    x:collection1] o.a.s.u.p.UpdateRequestProcessorChain inserting DistributedUpdateProcessorFactory into updateRequestProcessorChain "dedupe-allfields"
   [junit4]   2> 9384 INFO  (coreLoadExecutor-6-thread-1) [    x:collection1] o.a.s.u.p.UpdateRequestProcessorChain creating updateRequestProcessorChain "stored_sig"
   [junit4]   2> 9385 INFO  (coreLoadExecutor-6-thread-1) [    x:collection1] o.a.s.u.p.UpdateRequestProcessorChain inserting DistributedUpdateProcessorFactory into updateRequestProcessorChain "stored_sig"
   [junit4]   2> 9393 INFO  (coreLoadExecutor-6-thread-1) [    x:collection1] o.a.s.u.p.UpdateRequestProcessorChain creating updateRequestProcessorChain "uniq-fields"
   [junit4]   2> 9398 INFO  (coreLoadExecutor-6-thread-1) [    x:collection1] o.a.s.u.p.UpdateRequestProcessorChain inserting DistributedUpdateProcessorFactory into updateRequestProcessorChain "uniq-fields"
   [junit4]   2> 9398 INFO  (coreLoadExecutor-6-thread-1) [    x:collection1] o.a.s.u.p.UpdateRequestProcessorChain creating updateRequestProcessorChain "distrib-dup-test-chain-explicit"
   [junit4]   2> 9421 INFO  (coreLoadExecutor-6-thread-1) [    x:collection1] o.a.s.u.p.UpdateRequestProcessorChain creating updateRequestProcessorChain "distrib-dup-test-chain-implicit"
   [junit4]   2> 9434 INFO  (coreLoadExecutor-6-thread-1) [    x:collection1] o.a.s.u.p.UpdateRequestProcessorChain inserting DistributedUpdateProcessorFactory into updateRequestProcessorChain "distrib-dup-test-chain-implicit"
   [junit4]   2> 9434 INFO  (coreLoadExecutor-6-thread-1) [    x:collection1] o.a.s.c.SolrCore no updateRequestProcessorChain defined as default, creating implicit default
   [junit4]   2> 9603 INFO  (coreLoadExecutor-6-thread-1) [    x:collection1] o.a.s.h.l.XMLLoader xsltCacheLifetimeSeconds=60
   [junit4]   2> 9617 INFO  (coreLoadExecutor-6-thread-1) [    x:collection1] o.a.s.h.l.XMLLoader xsltCacheLifetimeSeconds=60
   [junit4]   2> 9626 INFO  (coreLoadExecutor-6-thread-1) [    x:collection1] o.a.s.h.l.XMLLoader xsltCacheLifetimeSeconds=60
   [junit4]   2> 9628 INFO  (coreLoadExecutor-6-thread-1) [    x:collection1] o.a.s.h.l.XMLLoader xsltCacheLifetimeSeconds=60
   [junit4]   2> 10401 INFO  (coreLoadExecutor-6-thread-1) [    x:collection1] o.a.s.c.PluginBag requestHandler : 'lazy' created with startup=lazy 
   [junit4]   2> 10436 INFO  (coreLoadExecutor-6-thread-1) [    x:collection1] o.a.s.c.RequestHandlers Registered paths: /admin/mbeans,standard,spellCheckCompRH,lazy,/update/json/docs,/admin/luke,/export,spellCheckWithWordbreak_Direct,tvrh,/get,/admin/properties,/update/json,mltrh,/admin/threads,/search-facet-def,/update/csv,/sql,/graph,/search-facet-invariants,/admin/segments,spellCheckCompRH1,/mlt,/admin/system,/replication,dismax,defaults,/config,/stream,/schema,/admin/plugins,/admin/logging,spellCheckWithWordbreak,mock,/admin/ping,/update,/admin/file,/terms,spellCheckCompRH_Direct,/debug/dump
   [junit4]   2> 10436 INFO  (coreLoadExecutor-6-thread-1) [    x:collection1] o.a.s.c.SolrCore Using default statsCache cache: org.apache.solr.search.stats.LocalStatsCache
   [junit4]   2> 10487 INFO  (coreLoadExecutor-6-thread-1) [    x:collection1] o.a.s.u.UpdateHandler Using UpdateLog implementation: org.apache.solr.update.UpdateLog
   [junit4]   2> 10488 INFO  (coreLoadExecutor-6-thread-1) [    x:collection1] o.a.s.u.UpdateLog Initializing UpdateLog: dataDir= defaultSyncLevel=FLUSH numRecordsToKeep=100 maxNumLogsToKeep=10 numVersionBuckets=65536
   [junit4]   2> 10511 INFO  (coreLoadExecutor-6-thread-1) [    x:collection1] o.a.s.u.CommitTracker Hard AutoCommit: disabled
   [junit4]   2> 10511 INFO  (coreLoadExecutor-6-thread-1) [    x:collection1] o.a.s.u.CommitTracker Soft AutoCommit: disabled
   [junit4]   2> 10519 INFO  (coreLoadExecutor-6-thread-1) [    x:collection1] o.a.s.u.RandomMergePolicy RandomMergePolicy wrapping class org.apache.lucene.index.LogDocMergePolicy: [LogDocMergePolicy: minMergeSize=1000, mergeFactor=26, maxMergeSize=9223372036854775807, maxMergeSizeForForcedMerge=9223372036854775807, calibrateSizeByDeletes=false, maxMergeDocs=2147483647, maxCFSSegmentSizeMB=8.796093022207999E12, noCFSRatio=1.0]
   [junit4]   2> 10524 INFO  (coreLoadExecutor-6-thread-1) [    x:collection1] o.a.s.c.SolrDeletionPolicy SolrDeletionPolicy.onInit: commits: num=1
   [junit4]   2> 	commit{dir=MockDirectoryWrapper(RAMDirectory@64819270 lockFactory=org.apache.lucene.store.SingleInstanceLockFactory@59fec5f5),segFN=segments_1,generation=1}
   [junit4]   2> 10524 INFO  (coreLoadExecutor-6-thread-1) [    x:collection1] o.a.s.c.SolrDeletionPolicy newest commit generation = 1
   [junit4]   2> 10581 INFO  (coreLoadExecutor-6-thread-1) [    x:collection1] o.a.s.s.SolrIndexSearcher Opening [Searcher@2c6b8b0b[collection1] main]
   [junit4]   2> 10622 INFO  (coreLoadExecutor-6-thread-1) [    x:collection1] o.a.s.r.RestManager Initializing RestManager with initArgs: {storageIO=org.apache.solr.rest.ManagedResourceStorage$InMemoryStorageIO}
   [junit4]   2> 10671 INFO  (coreLoadExecutor-6-thread-1) [    x:collection1] o.a.s.r.ManagedResourceStorage Reading _rest_managed.json using InMemoryStorage
   [junit4]   2> 10672 INFO  (coreLoadExecutor-6-thread-1) [    x:collection1] o.a.s.r.RestManager Initializing 0 registered ManagedResources
   [junit4]   2> 10718 INFO  (coreLoadExecutor-6-thread-1) [    x:collection1] o.a.s.h.c.SpellCheckComponent Initializing spell checkers
   [junit4]   2> 11121 INFO  (coreLoadExecutor-6-thread-1) [    x:collection1] o.a.s.s.DirectSolrSpellChecker init: {name=direct,classname=DirectSolrSpellChecker,field=lowerfilt,minQueryLength=3}
   [junit4]   2> 11803 INFO  (coreLoadExecutor-6-thread-1) [    x:collection1] o.a.s.h.ReplicationHandler Commits will be reserved for  10000
   [junit4]   2> 11845 INFO  (searcherExecutor-7-thread-1-processing-x:collection1) [    x:collection1] o.a.s.h.c.SpellCheckComponent Loading spell index for spellchecker: default
   [junit4]   2> 11854 INFO  (searcherExecutor-7-thread-1-processing-x:collection1) [    x:collection1] o.a.s.h.c.SpellCheckComponent Loading spell index for spellchecker: direct
   [junit4]   2> 11854 INFO  (coreLoadExecutor-6-thread-1) [    x:collection1] o.a.s.u.UpdateLog Looking up max value of version field to seed version buckets
   [junit4]   2> 11854 INFO  (searcherExecutor-7-thread-1-processing-x:collection1) [    x:collection1] o.a.s.h.c.SpellCheckComponent Loading spell index for spellchecker: wordbreak
   [junit4]   2> 11866 INFO  (searcherExecutor-7-thread-1-processing-x:collection1) [    x:collection1] o.a.s.h.c.SpellCheckComponent Loading spell index for spellchecker: multipleFields
   [junit4]   2> 11867 INFO  (searcherExecutor-7-thread-1-processing-x:collection1) [    x:collection1] o.a.s.h.c.SpellCheckComponent Loading spell index for spellchecker: jarowinkler
   [junit4]   2> 11868 INFO  (coreLoadExecutor-6-thread-1) [    x:collection1] o.a.s.u.VersionInfo Refreshing highest value of _version_ for 65536 version buckets from index
   [junit4]   2> 11868 INFO  (coreLoadExecutor-6-thread-1) [    x:collection1] o.a.s.u.VersionInfo No terms found for _version_, cannot seed version bucket highest value from index
   [junit4]   2> 11868 INFO  (coreLoadExecutor-6-thread-1) [    x:collection1] o.a.s.u.UpdateLog Could not find max version in index or recent updates, using new clock 1545925667335438336
   [junit4]   2> 11870 INFO  (searcherExecutor-7-thread-1-processing-x:collection1) [    x:collection1] o.a.s.h.c.SpellCheckComponent Loading spell index for spellchecker: external
   [junit4]   2> 11871 INFO  (searcherExecutor-7-thread-1-processing-x:collection1) [    x:collection1] o.a.s.h.c.SpellCheckComponent Loading spell index for spellchecker: freq
   [junit4]   2> 11872 INFO  (searcherExecutor-7-thread-1-processing-x:collection1) [    x:collection1] o.a.s.h.c.SpellCheckComponent Loading spell index for spellchecker: fqcn
   [junit4]   2> 11873 INFO  (searcherExecutor-7-thread-1-processing-x:collection1) [    x:collection1] o.a.s.h.c.SpellCheckComponent Loading spell index for spellchecker: perDict
   [junit4]   2> 11874 INFO  (searcherExecutor-7-thread-1-processing-x:collection1) [    x:collection1] o.a.s.c.SolrCore [collection1] Registered new searcher Searcher@2c6b8b0b[collection1] main{ExitableDirectoryReader(UninvertingDirectoryReader())}
   [junit4]   2> 11897 INFO  (coreLoadExecutor-6-thread-1) [    x:collection1] o.a.s.u.UpdateLog Took 29.0ms to seed version buckets with highest version 1545925667335438336
   [junit4]   2> 11902 INFO  (coreLoadExecutor-6-thread-1) [    x:collection1] o.a.s.c.CoreContainer registering core: collection1
   [junit4]   2> 11907 INFO  (SUITE-SoftAutoCommitTest-seed#[BAE64CA36CFAE2E]-worker) [    ] o.a.s.SolrTestCaseJ4 ####initCore end
   [junit4]   2> 11931 INFO  (TEST-SoftAutoCommitTest.testSoftAndHardCommitMaxTimeMixedAdds-seed#[BAE64CA36CFAE2E]) [    ] o.a.s.SolrTestCaseJ4 ###Starting testSoftAndHardCommitMaxTimeMixedAdds
   [junit4]   2> 11934 INFO  (TEST-SoftAutoCommitTest.testSoftAndHardCommitMaxTimeMixedAdds-seed#[BAE64CA36CFAE2E]) [    ] o.a.s.c.SolrResourceLoader new SolrResourceLoader for directory: '/x1/jenkins/jenkins-slave/workspace/Lucene-Solr-Tests-master/solr/core/src/test-files/solr/collection1'
   [junit4]   2> 11934 INFO  (TEST-SoftAutoCommitTest.testSoftAndHardCommitMaxTimeMixedAdds-seed#[BAE64CA36CFAE2E]) [    ] o.a.s.c.SolrResourceLoader JNDI not configured for solr (NoInitialContextEx)
   [junit4]   2> 11934 INFO  (TEST-SoftAutoCommitTest.testSoftAndHardCommitMaxTimeMixedAdds-seed#[BAE64CA36CFAE2E]) [    ] o.a.s.c.SolrResourceLoader using system property solr.solr.home: /x1/jenkins/jenkins-slave/workspace/Lucene-Solr-Tests-master/solr/core/src/test-files/solr
   [junit4]   2> 11937 INFO  (TEST-SoftAutoCommitTest.testSoftAndHardCommitMaxTimeMixedAdds-seed#[BAE64CA36CFAE2E]) [    ] o.a.s.c.SolrResourceLoader Adding 'file:/x1/jenkins/jenkins-slave/workspace/Lucene-Solr-Tests-master/solr/core/src/test-files/solr/collection1/lib/classes/' to classloader
   [junit4]   2> 11937 INFO  (TEST-SoftAutoCommitTest.testSoftAndHardCommitMaxTimeMixedAdds-seed#[BAE64CA36CFAE2E]) [    ] o.a.s.c.SolrResourceLoader Adding 'file:/x1/jenkins/jenkins-slave/workspace/Lucene-Solr-Tests-master/solr/core/src/test-files/solr/collection1/lib/README' to classloader
   [junit4]   2> 12070 INFO  (TEST-SoftAutoCommitTest.testSoftAndHardCommitMaxTimeMixedAdds-seed#[BAE64CA36CFAE2E]) [    ] o.a.s.c.SolrConfig current version of requestparams : -1
   [junit4]   2> 12108 INFO  (TEST-SoftAutoCommitTest.testSoftAndHardCommitMaxTimeMixedAdds-seed#[BAE64CA36CFAE2E]) [    ] o.a.s.c.SolrConfig Using Lucene MatchVersion: 7.0.0
   [junit4]   2> 12197 INFO  (TEST-SoftAutoCommitTest.testSoftAndHardCommitMaxTimeMixedAdds-seed#[BAE64CA36CFAE2E]) [    ] o.a.s.c.SolrConfig Loaded SolrConfig: solrconfig.xml
   [junit4]   2> 12285 INFO  (TEST-SoftAutoCommitTest.testSoftAndHardCommitMaxTimeMixedAdds-seed#[BAE64CA36CFAE2E]) [    ] o.a.s.s.IndexSchema [collection1] Schema name=test
   [junit4]   2> 12811 INFO  (TEST-SoftAutoCommitTest.testSoftAndHardCommitMaxTimeMixedAdds-seed#[BAE64CA36CFAE2E]) [    ] o.a.s.s.OpenExchangeRatesOrgProvider Initialized with rates=open-exchange-rates.json, refreshInterval=1440.
   [junit4]   2> 12847 INFO  (TEST-SoftAutoCommitTest.testSoftAndHardCommitMaxTimeMixedAdds-seed#[BAE64CA36CFAE2E]) [    ] o.a.s.s.IndexSchema default search field in schema is text
   [junit4]   2> 12849 INFO  (TEST-SoftAutoCommitTest.testSoftAndHardCommitMaxTimeMixedAdds-seed#[BAE64CA36CFAE2E]) [    ] o.a.s.s.IndexSchema unique key field: id
   [junit4]   2> 12949 INFO  (TEST-SoftAutoCommitTest.testSoftAndHardCommitMaxTimeMixedAdds-seed#[BAE64CA36CFAE2E]) [    ] o.a.s.s.FileExchangeRateProvider Reloading exchange rates from file currency.xml
   [junit4]   2> 12972 INFO  (TEST-SoftAutoCommitTest.testSoftAndHardCommitMaxTimeMixedAdds-seed#[BAE64CA36CFAE2E]) [    ] o.a.s.s.FileExchangeRateProvider Reloading exchange rates from file currency.xml
   [junit4]   2> 12995 INFO  (TEST-SoftAutoCommitTest.testSoftAndHardCommitMaxTimeMixedAdds-seed#[BAE64CA36CFAE2E]) [    ] o.a.s.s.OpenExchangeRatesOrgProvider Reloading exchange rates from open-exchange-rates.json
   [junit4]   2> 12996 INFO  (TEST-SoftAutoCommitTest.testSoftAndHardCommitMaxTimeMixedAdds-seed#[BAE64CA36CFAE2E]) [    ] o.a.s.s.OpenExchangeRatesOrgProvider Reloading exchange rates from open-exchange-rates.json
   [junit4]   2> 13010 INFO  (TEST-SoftAutoCommitTest.testSoftAndHardCommitMaxTimeMixedAdds-seed#[BAE64CA36CFAE2E]) [    ] o.a.s.c.ConfigSetProperties Did not find ConfigSet properties, assuming default properties: Can't find resource 'configsetprops.json' in classpath or '/x1/jenkins/jenkins-slave/workspace/Lucene-Solr-Tests-master/solr/core/src/test-files/solr/collection1'
   [junit4]   2> 13022 INFO  (TEST-SoftAutoCommitTest.testSoftAndHardCommitMaxTimeMixedAdds-seed#[BAE64CA36CFAE2E]) [    ] o.a.s.c.CoreContainer Reloading SolrCore 'collection1' using configuration from instancedir /x1/jenkins/jenkins-slave/workspace/Lucene-Solr-Tests-master/solr/core/src/test-files/solr/collection1
   [junit4]   2> 13032 INFO  (TEST-SoftAutoCommitTest.testSoftAndHardCommitMaxTimeMixedAdds-seed#[BAE64CA36CFAE2E]) [    x:collection1] o.a.s.c.SolrCore [[collection1] ] Opening new SolrCore at [/x1/jenkins/jenkins-slave/workspace/Lucene-Solr-Tests-master/solr/core/src/test-files/solr/collection1], dataDir=[/x1/jenkins/jenkins-slave/workspace/Lucene-Solr-Tests-master/solr/build/solr-core/test/J1/temp/solr.update.SoftAutoCommitTest_BAE64CA36CFAE2E-001/init-core-data-001/]
   [junit4]   2> 13034 INFO  (TEST-SoftAutoCommitTest.testSoftAndHardCommitMaxTimeMixedAdds-seed#[BAE64CA36CFAE2E]) [    x:collection1] o.a.s.c.JmxMonitoredMap No JMX servers found, not exposing Solr information with JMX.
   [junit4]   2> 13034 INFO  (TEST-SoftAutoCommitTest.testSoftAndHardCommitMaxTimeMixedAdds-seed#[BAE64CA36CFAE2E]) [    x:collection1] o.a.s.c.s.SolrSnapshotMetaDataManager Loading from snapshot metadata file...
   [junit4]   2> 13043 INFO  (TEST-SoftAutoCommitTest.testSoftAndHardCommitMaxTimeMixedAdds-seed#[BAE64CA36CFAE2E]) [    x:collection1] o.a.s.c.SolrCore New index directory detected: old=null new=/x1/jenkins/jenkins-slave/workspace/Lucene-Solr-Tests-master/solr/build/solr-core/test/J1/temp/solr.update.SoftAutoCommitTest_BAE64CA36CFAE2E-001/init-core-data-001/index/
   [junit4]   2> 13071 INFO  (OldIndexDirectoryCleanupThreadForCore-collection1) [    x:collection1] o.a.s.c.SolrCore Looking for old index directories to cleanup for core collection1 in /x1/jenkins/jenkins-slave/workspace/Lucene-Solr-Tests-master/solr/build/solr-core/test/J1/temp/solr.update.SoftAutoCommitTest_BAE64CA36CFAE2E-001/init-core-data-001/
   [junit4]   2> 13050 INFO  (TEST-SoftAutoCommitTest.testSoftAndHardCommitMaxTimeMixedAdds-seed#[BAE64CA36CFAE2E]) [    x:collection1] o.a.s.u.p.UpdateRequestProcessorChain creating updateRequestProcessorChain "dedupe"
   [junit4]   2> 13074 INFO  (TEST-SoftAutoCommitTest.testSoftAndHardCommitMaxTimeMixedAdds-seed#[BAE64CA36CFAE2E]) [    x:collection1] o.a.s.u.p.UpdateRequestProcessorChain inserting DistributedUpdateProcessorFactory into updateRequestProcessorChain "dedupe"
   [junit4]   2> 13075 INFO  (TEST-SoftAutoCommitTest.testSoftAndHardCommitMaxTimeMixedAdds-seed#[BAE64CA36CFAE2E]) [    x:collection1] o.a.s.u.p.UpdateRequestProcessorChain creating updateRequestProcessorChain "dedupe-allfields"
   [junit4]   2> 13075 INFO  (TEST-SoftAutoCommitTest.testSoftAndHardCommitMaxTimeMixedAdds-seed#[BAE64CA36CFAE2E]) [    x:collection1] o.a.s.u.p.UpdateRequestProcessorChain inserting DistributedUpdateProcessorFactory into updateRequestProcessorChain "dedupe-allfields"
   [junit4]   2> 13075 INFO  (TEST-SoftAutoCommitTest.testSoftAndHardCommitMaxTimeMixedAdds-seed#[BAE64CA36CFAE2E]) [    x:collection1] o.a.s.u.p.UpdateRequestProcessorChain creating updateRequestProcessorChain "stored_sig"
   [junit4]   2> 13078 INFO  (TEST-SoftAutoCommitTest.testSoftAndHardCommitMaxTimeMixedAdds-seed#[BAE64CA36CFAE2E]) [    x:collection1] o.a.s.u.p.UpdateRequestProcessorChain inserting DistributedUpdateProcessorFactory into updateRequestProcessorChain "stored_sig"
   [junit4]   2> 13078 INFO  (TEST-SoftAutoCommitTest.testSoftAndHardCommitMaxTimeMixedAdds-seed#[BAE64CA36CFAE2E]) [    x:collection1] o.a.s.u.p.UpdateRequestProcessorChain creating updateRequestProcessorChain "uniq-fields"
   [junit4]   2> 13078 INFO  (TEST-SoftAutoCommitTest.testSoftAndHardCommitMaxTimeMixedAdds-seed#[BAE64CA36CFAE2E]) [    x:collection1] o.a.s.u.p.UpdateRequestProcessorChain inserting DistributedUpdateProcessorFactory into updateRequestProcessorChain "uniq-fields"
   [junit4]   2> 13079 INFO  (TEST-SoftAutoCommitTest.testSoftAndHardCommitMaxTimeMixedAdds-seed#[BAE64CA36CFAE2E]) [    x:collection1] o.a.s.u.p.UpdateRequestProcessorChain creating updateRequestProcessorChain "distrib-dup-test-chain-explicit"
   [junit4]   2> 13079 INFO  (TEST-SoftAutoCommitTest.testSoftAndHardCommitMaxTimeMixedAdds-seed#[BAE64CA36CFAE2E]) [    x:collection1] o.a.s.u.p.UpdateRequestProcessorChain creating updateRequestProcessorChain "distrib-dup-test-chain-implicit"
   [junit4]   2> 13083 INFO  (TEST-SoftAutoCommitTest.testSoftAndHardCommitMaxTimeMixedAdds-seed#[BAE64CA36CFAE2E]) [    x:collection1] o.a.s.u.p.UpdateRequestProcessorChain inserting DistributedUpdateProcessorFactory into updateRequestProcessorChain "distrib-dup-test-chain-implicit"
   [junit4]   2> 13083 INFO  (TEST-SoftAutoCommitTest.testSoftAndHardCommitMaxTimeMixedAdds-seed#[BAE64CA36CFAE2E]) [    x:collection1] o.a.s.c.SolrCore no updateRequestProcessorChain defined as default, creating implicit default
   [junit4]   2> 13098 INFO  (TEST-SoftAutoCommitTest.testSoftAndHardCommitMaxTimeMixedAdds-seed#[BAE64CA36CFAE2E]) [    x:collection1] o.a.s.h.l.XMLLoader xsltCacheLifetimeSeconds=60
   [junit4]   2> 13111 INFO  (TEST-SoftAutoCommitTest.testSoftAndHardCommitMaxTimeMixedAdds-seed#[BAE64CA36CFAE2E]) [    x:collection1] o.a.s.h.l.XMLLoader xsltCacheLifetimeSeconds=60
   [junit4]   2> 13113 INFO  (TEST-SoftAutoCommitTest.testSoftAndHardCommitMaxTimeMixedAdds-seed#[BAE64CA36CFAE2E]) [    x:collection1] o.a.s.h.l.XMLLoader xsltCacheLifetimeSeconds=60
   [junit4]   2> 13119 INFO  (TEST-SoftAutoCommitTest.testSoftAndHardCommitMaxTimeMixedAdds-seed#[BAE64CA36CFAE2E]) [    x:collection1] o.a.s.h.l.XMLLoader xsltCacheLifetimeSeconds=60
   [junit4]   2> 13144 INFO  (TEST-SoftAutoCommitTest.testSoftAndHardCommitMaxTimeMixedAdds-seed#[BAE64CA36CFAE2E]) [    x:collection1] o.a.s.c.PluginBag requestHandler : 'lazy' created with startup=lazy 
   [junit4]   2> 13174 INFO  (TEST-SoftAutoCommitTest.testSoftAndHardCommitMaxTimeMixedAdds-seed#[BAE64CA36CFAE2E]) [    x:collection1] o.a.s.c.RequestHandlers Registered paths: /admin/mbeans,standard,spellCheckCompRH,lazy,/update/json/docs,/admin/luke,/export,spellCheckWithWordbreak_Direct,tvrh,/get,/admin/properties,/update/json,mltrh,/admin/threads,/search-facet-def,/update/csv,/sql,/graph,/search-facet-invariants,/admin/segments,spellCheckCompRH1,/mlt,/admin/system,/replication,dismax,defaults,/config,/stream,/schema,/admin/plugins,/admin/logging,spellCheckWithWordbreak,mock,/admin/ping,/update,/admin/file,/terms,spellCheckCompRH_Direct,/debug/dump
   [junit4]   2> 13174 INFO  (TEST-SoftAutoCommitTest.testSoftAndHardCommitMaxTimeMixedAdds-seed#[BAE64CA36CFAE2E]) [    x:collection1] o.a.s.c.SolrCore Using default statsCache cache: org.apache.solr.search.stats.LocalStatsCache
   [junit4]   2> 13176 INFO  (TEST-SoftAutoCommitTest.testSoftAndHardCommitMaxTimeMixedAdds-seed#[BAE64CA36CFAE2E]) [    x:collection1] o.a.s.u.CommitTracker Hard AutoCommit: disabled
   [junit4]   2> 13178 INFO  (TEST-SoftAutoCommitTest.testSoftAndHardCommitMaxTimeMixedAdds-seed#[BAE64CA36CFAE2E]) [    x:collection1] o.a.s.u.CommitTracker Soft AutoCommit: disabled
   [junit4]   2> 13194 INFO  (TEST-SoftAutoCommitTest.testSoftAndHardCommitMaxTimeMixedAdds-seed#[BAE64CA36CFAE2E]) [    x:collection1] o.a.s.s.SolrIndexSearcher Opening [Searcher@7198b309[collection1] main]
   [junit4]   2> 13195 INFO  (TEST-SoftAutoCommitTest.testSoftAndHardCommitMaxTimeMixedAdds-seed#[BAE64CA36CFAE2E]) [    x:collection1] o.a.s.r.RestManager Initializing RestManager with initArgs: {storageIO=org.apache.solr.rest.ManagedResourceStorage$InMemoryStorageIO}
   [junit4]   2> 13196 INFO  (TEST-SoftAutoCommitTest.testSoftAndHardCommitMaxTimeMixedAdds-seed#[BAE64CA36CFAE2E]) [    x:collection1] o.a.s.r.ManagedResourceStorage Reading _rest_managed.json using InMemoryStorage
   [junit4]   2> 13196 INFO  (TEST-SoftAutoCommitTest.testSoftAndHardCommitMaxTimeMixedAdds-seed#[BAE64CA36CFAE2E]) [    x:collection1] o.a.s.r.RestManager Initializing 0 registered ManagedResources
   [junit4]   2> 13196 INFO  (TEST-SoftAutoCommitTest.testSoftAndHardCommitMaxTimeMixedAdds-seed#[BAE64CA36CFAE2E]) [    x:collection1] o.a.s.h.c.SpellCheckComponent Initializing spell checkers
   [junit4]   2> 13206 INFO  (TEST-SoftAutoCommitTest.testSoftAndHardCommitMaxTimeMixedAdds-seed#[BAE64CA36CFAE2E]) [    x:collection1] o.a.s.s.DirectSolrSpellChecker init: {name=direct,classname=DirectSolrSpellChecker,field=lowerfilt,minQueryLength=3}
   [junit4]   2> 13235 INFO  (TEST-SoftAutoCommitTest.testSoftAndHardCommitMaxTimeMixedAdds-seed#[BAE64CA36CFAE2E]) [    x:collection1] o.a.s.h.ReplicationHandler Commits will be reserved for  10000
   [junit4]   2> 13235 INFO  (searcherExecutor-12-thread-1-processing-x:collection1) [    x:collection1] o.a.s.h.c.SpellCheckComponent Loading spell index for spellchecker: default
   [junit4]   2> 13236 INFO  (searcherExecutor-12-thread-1-processing-x:collection1) [    x:collection1] o.a.s.h.c.SpellCheckComponent Loading spell index for spellchecker: direct
   [junit4]   2> 13236 INFO  (searcherExecutor-12-thread-1-processing-x:collection1) [    x:collection1] o.a.s.h.c.SpellCheckComponent Loading spell index for spellchecker: wordbreak
   [junit4]   2> 13236 INFO  (searcherExecutor-12-thread-1-processing-x:collection1) [    x:collection1] o.a.s.h.c.SpellCheckComponent Loading spell index for spellchecker: multipleFields
   [junit4]   2> 13236 INFO  (searcherExecutor-12-thread-1-processing-x:collection1) [    x:collection1] o.a.s.h.c.SpellCheckComponent Loading spell index for spellchecker: jarowinkler
   [junit4]   2> 13237 INFO  (searcherExecutor-12-thread-1-processing-x:collection1) [    x:collection1] o.a.s.h.c.SpellCheckComponent Loading spell index for spellchecker: external
   [junit4]   2> 13237 INFO  (searcherExecutor-12-thread-1-processing-x:collection1) [    x:collection1] o.a.s.h.c.SpellCheckComponent Loading spell index for spellchecker: freq
   [junit4]   2> 13242 INFO  (searcherExecutor-12-thread-1-processing-x:collection1) [    x:collection1] o.a.s.h.c.SpellCheckComponent Loading spell index for spellchecker: fqcn
   [junit4]   2> 13245 INFO  (TEST-SoftAutoCommitTest.testSoftAndHardCommitMaxTimeMixedAdds-seed#[BAE64CA36CFAE2E]) [    x:collection1] o.a.s.u.UpdateLog Looking up max value of version field to seed version buckets
   [junit4]   2> 13245 INFO  (searcherExecutor-12-thread-1-processing-x:collection1) [    x:collection1] o.a.s.h.c.SpellCheckComponent Loading spell index for spellchecker: perDict
   [junit4]   2> 13245 INFO  (searcherExecutor-12-thread-1-processing-x:collection1) [    x:collection1] o.a.s.c.SolrCore [collection1] Registered new searcher Searcher@7198b309[collection1] main{ExitableDirectoryReader(UninvertingDirectoryReader())}
   [junit4]   2> 13246 INFO  (TEST-SoftAutoCommitTest.testSoftAndHardCommitMaxTimeMixedAdds-seed#[BAE64CA36CFAE2E]) [    x:collection1] o.a.s.u.VersionInfo Refreshing highest value of _version_ for 65536 version buckets from index
   [junit4]   2> 13246 INFO  (TEST-SoftAutoCommitTest.testSoftAndHardCommitMaxTimeMixedAdds-seed#[BAE64CA36CFAE2E]) [    x:collection1] o.a.s.u.VersionInfo No terms found for _version_, cannot seed version bucket highest value from index
   [junit4]   2> 13246 INFO  (TEST-SoftAutoCommitTest.testSoftAndHardCommitMaxTimeMixedAdds-seed#[BAE64CA36CFAE2E]) [    x:collection1] o.a.s.u.UpdateLog Could not find max version in index or recent updates, using new clock 1545925668780376064
   [junit4]   2> 13249 INFO  (TEST-SoftAutoCommitTest.testSoftAndHardCommitMaxTimeMixedAdds-seed#[BAE64CA36CFAE2E]) [    x:collection1] o.a.s.u.UpdateLog Took 4.0ms to seed version buckets with highest version 1545925668780376064
   [junit4]   2> 13254 INFO  (TEST-SoftAutoCommitTest.testSoftAndHardCommitMaxTimeMixedAdds-seed#[BAE64CA36CFAE2E]) [    x:collection1] o.a.s.u.DefaultSolrCoreState Closing old IndexWriter... core=collection1
   [junit4]   2> 13258 INFO  (TEST-SoftAutoCommitTest.testSoftAndHardCommitMaxTimeMixedAdds-seed#[BAE64CA36CFAE2E]) [    x:collection1] o.a.s.u.RandomMergePolicy RandomMergePolicy wrapping class org.apache.lucene.index.LogByteSizeMergePolicy: [LogByteSizeMergePolicy: minMergeSize=1677721, mergeFactor=44, maxMergeSize=2147483648, maxMergeSizeForForcedMerge=9223372036854775807, calibrateSizeByDeletes=false, maxMergeDocs=2147483647, maxCFSSegmentSizeMB=8.796093022207999E12, noCFSRatio=0.0]
   [junit4]   2> 13269 INFO  (TEST-SoftAutoCommitTest.testSoftAndHardCommitMaxTimeMixedAdds-seed#[BAE64CA36CFAE2E]) [    x:collection1] o.a.s.c.SolrDeletionPolicy SolrDeletionPolicy.onInit: commits: num=1
   [junit4]   2> 	commit{dir=MockDirectoryWrapper(RAMDirectory@64819270 lockFactory=org.apache.lucene.store.SingleInstanceLockFactory@59fec5f5),segFN=segments_1,generation=1}
   [junit4]   2> 13270 INFO  (TEST-SoftAutoCommitTest.testSoftAndHardCommitMaxTimeMixedAdds-seed#[BAE64CA36CFAE2E]) [    x:collection1] o.a.s.c.SolrDeletionPolicy newest commit generation = 1
   [junit4]   2> 13270 INFO  (TEST-SoftAutoCommitTest.testSoftAndHardCommitMaxTimeMixedAdds-seed#[BAE64CA36CFAE2E]) [    x:collection1] o.a.s.u.DefaultSolrCoreState New IndexWriter is ready to be used.
   [junit4]   2> 13272 INFO  (TEST-SoftAutoCommitTest.testSoftAndHardCommitMaxTimeMixedAdds-seed#[BAE64CA36CFAE2E]) [    x:collection1] o.a.s.s.SolrIndexSearcher Opening [Searcher@7ac89b8c[collection1] main]
   [junit4]   2> 13282 INFO  (searcherExecutor-12-thread-1-processing-x:collection1) [    x:collection1] o.a.s.c.SolrCore [collection1] Registered new searcher Searcher@7ac89b8c[collection1] main{ExitableDirectoryReader(UninvertingDirectoryReader())}
   [junit4]   2> 13283 INFO  (TEST-SoftAutoCommitTest.testSoftAndHardCommitMaxTimeMixedAdds-seed#[BAE64CA36CFAE2E]) [    x:collection1] o.a.s.c.CoreContainer replacing core: collection1
   [junit4]   2> 13283 INFO  (TEST-SoftAutoCommitTest.testSoftAndHardCommitMaxTimeMixedAdds-seed#[BAE64CA36CFAE2E]) [    x:collection1] o.a.s.c.SolrCore [collection1]  CLOSING SolrCore org.apache.solr.core.SolrCore@19fb443
   [junit4]   2> 13285 INFO  (TEST-SoftAutoCommitTest.testSoftAndHardCommitMaxTimeMixedAdds-seed#[BAE64CA36CFAE2E]) [    x:collection1] o.a.s.u.DirectUpdateHandler2 closing DirectUpdateHandler2{commits=0,autocommits=0,soft autocommits=0,optimizes=0,rollbacks=0,expungeDeletes=0,docsPending=0,adds=0,deletesById=0,deletesByQuery=0,errors=0,cumulative_adds=0,cumulative_deletesById=0,cumulative_deletesByQuery=0,cumulative_errors=0,transaction_logs_total_size=0,transaction_logs_total_number=0}
   [junit4]   2> 13286 INFO  (TEST-SoftAutoCommitTest.testSoftAndHardCommitMaxTimeMixedAdds-seed#[BAE64CA36CFAE2E]) [    x:collection1] o.a.s.c.SolrCore [collection1] Closing main searcher on request.
   [junit4]   2> 14029 INFO  (TEST-SoftAutoCommitTest.testSoftAndHardCommitMaxTimeMixedAdds-seed#[BAE64CA36CFAE2E]) [    x:collection1] o.a.s.u.p.LogUpdateProcessorFactory [collection1]  webapp=null path=null params={}{add=[529 (1545925669322489856)]} 0 730
   [junit4]   2> 14549 INFO  (commitScheduler-15-thread-1) [    x:collection1] o.a.s.u.DirectUpdateHandler2 start commit{,optimize=false,openSearcher=true,waitSearcher=true,expungeDeletes=false,softCommit=true,prepareCommit=false}
   [junit4]   2> 15075 INFO  (TEST-SoftAutoCommitTest.testSoftAndHardCommitMaxTimeMixedAdds-seed#[BAE64CA36CFAE2E]) [    x:collection1] o.a.s.SolrTestCaseJ4 ###Ending testSoftAndHardCommitMaxTimeMixedAdds
   [junit4]   2> NOTE: reproduce with: ant test  -Dtestcase=SoftAutoCommitTest -Dtests.method=testSoftAndHardCommitMaxTimeMixedAdds -Dtests.seed=BAE64CA36CFAE2E -Dtests.multiplier=2 -Dtests.slow=true -Dtests.locale=de-LU -Dtests.timezone=Canada/Atlantic -Dtests.asserts=true -Dtests.file.encoding=ISO-8859-1
   [junit4] FAILURE 3.18s J1 | SoftAutoCommitTest.testSoftAndHardCommitMaxTimeMixedAdds <<<
   [junit4]    > Throwable #1: java.lang.AssertionError: soft529 wasn't fast enough
   [junit4]    > 	at __randomizedtesting.SeedInfo.seed([BAE64CA36CFAE2E:5A7A9D4A87BC9E89]:0)
   [junit4]    > 	at org.apache.solr.update.SoftAutoCommitTest.testSoftAndHardCommitMaxTimeMixedAdds(SoftAutoCommitTest.java:111)
   [junit4]    > 	at java.lang.Thread.run(Thread.java:745)
   [junit4]   2> 15119 INFO  (TEST-SoftAutoCommitTest.testSoftAndHardCommitMaxTimeRapidAdds-seed#[BAE64CA36CFAE2E]) [    x:collection1] o.a.s.SolrTestCaseJ4 ###Starting testSoftAndHardCommitMaxTimeRapidAdds
   [junit4]   2> 15119 INFO  (TEST-SoftAutoCommitTest.testSoftAndHardCommitMaxTimeRapidAdds-seed#[BAE64CA36CFAE2E]) [    x:collection1] o.a.s.c.SolrResourceLoader new SolrResourceLoader for directory: '/x1/jenkins/jenkins-slave/workspace/Lucene-Solr-Tests-master/solr/core/src/test-files/solr/collection1'
   [junit4]   2> 15120 INFO  (TEST-SoftAutoCommitTest.testSoftAndHardCommitMaxTimeRapidAdds-seed#[BAE64CA36CFAE2E]) [    x:collection1] o.a.s.c.SolrResourceLoader JNDI not configured for solr (NoInitialContextEx)
   [junit4]   2> 15120 INFO  (TEST-SoftAutoCommitTest.testSoftAndHardCommitMaxTimeRapidAdds-seed#[BAE64CA36CFAE2E]) [    x:collection1] o.a.s.c.SolrResourceLoader using system property solr.solr.home: /x1/jenkins/jenkins-slave/workspace/Lucene-Solr-Tests-master/solr/core/src/test-files/solr
   [junit4]   2> 15121 INFO  (TEST-SoftAutoCommitTest.testSoftAndHardCommitMaxTimeRapidAdds-seed#[BAE64CA36CFAE2E]) [    x:collection1] o.a.s.c.SolrResourceLoader Adding 'file:/x1/jenkins/jenkins-slave/workspace/Lucene-Solr-Tests-master/solr/core/src/test-files/solr/collection1/lib/classes/' to classloader
   [junit4]   2> 15121 INFO  (TEST-SoftAutoCommitTest.testSoftAndHardCommitMaxTimeRapidAdds-seed#[BAE64CA36CFAE2E]) [    x:collection1] o.a.s.c.SolrResourceLoader Adding 'file:/x1/jenkins/jenkins-slave/workspace/Lucene-Solr-Tests-master/solr/core/src/test-files/solr/collection1/lib/README' to classloader
   [junit4]   2> 15216 INFO  (commitScheduler-15-thread-1) [    x:collection1] o.a.s.s.SolrIndexSearcher Opening [Searcher@6e61e86a[collection1] main]
   [junit4]   2> 15217 INFO  (searcherExecutor-12-thread-1-processing-x:collection1) [    x:collection1] o.a.s.c.SolrCore [collection1] Registered new searcher Searcher@6e61e86a[collection1] main{ExitableDirectoryReader(UninvertingDirectoryReader(Uninverting(_0(7.0.0):c1)))}
   [junit4]   2> 15238 INFO  (commitScheduler-14-thread-1) [    x:collection1] o.a.s.u.DirectUpdateHandler2 start commit{,optimize=false,openSearcher=true,waitSearcher=true,expungeDeletes=false,softCommit=false,prepareCommit=false}
   [junit4]   2> 15238 INFO  (commitScheduler-14-thread-1) [    x:collection1] o.a.s.u.SolrIndexWriter Calling setCommitData with IW:org.apache.solr.update.SolrIndexWriter@c16ce43
   [junit4]   2> 15252 INFO  (commitScheduler-15-thread-1) [    x:collection1] o.a.s.u.DirectUpdateHandler2 end_commit_flush
   [junit4]   2> 15253 INFO  (commitScheduler-14-thread-1) [    x:collection1] o.a.s.c.SolrDeletionPolicy SolrDeletionPolicy.onCommit: commits: num=2
   [junit4]   2> 	commit{dir=MockDirectoryWrapper(RAMDirectory@64819270 lockFactory=org.apache.lucene.store.SingleInstanceLockFactory@59fec5f5),segFN=segments_1,generation=1}
   [junit4]   2> 	commit{dir=MockDirectoryWrapper(RAMDirectory@64819270 lockFactory=org.apache.lucene.store.SingleInstanceLockFactory@59fec5f5),segFN=segments_2,generation=2}
   [junit4]   2> 15255 INFO  (commitScheduler-14-thread-1) [    x:collection1] o.a.s.c.SolrDeletionPolicy newest commit generation = 2
   [junit4]   2> 15260 INFO  (commitScheduler-14-thread-1) [    x:collection1] o.a.s.s.SolrIndexSearcher Opening [Searcher@4e97f85e[collection1] main]
   [junit4]   2> 15261 INFO  (searcherExecutor-12-thread-1-processing-x:collection1) [    x:collection1] o.a.s.c.SolrCore [collection1] Registered new searcher Searcher@4e97f85e[collection1] main{ExitableDirectoryReader(UninvertingDirectoryReader(Uninverting(_0(7.0.0):c1)))}
   [junit4]   2> 15278 INFO  (commitScheduler-14-thread-1) [    x:collection1] o.a.s.u.DirectUpdateHandler2 end_commit_flush
   [junit4]   2> 15302 INFO  (TEST-SoftAutoCommitTest.testSoftAndHardCommitMaxTimeRapidAdds-seed#[BAE64CA36CFAE2E]) [    x:collection1] o.a.s.c.SolrConfig current version of requestparams : -1
   [junit4]   2> 15357 INFO  (TEST-SoftAutoCommitTest.testSoftAndHardCommitMaxTimeRapidAdds-seed#[BAE64CA36CFAE2E]) [    x:collection1] o.a.s.c.SolrConfig Using Lucene MatchVersion: 7.0.0
   [junit4]   2> 15465 INFO  (TEST-SoftAutoCommitTest.testSoftAndHardCommitMaxTimeRapidAdds-seed#[BAE64CA36CFAE2E]) [    x:collection1] o.a.s.c.SolrConfig Loaded SolrConfig: solrconfig.xml
   [junit4]   2> 15535 INFO  (TEST-SoftAutoCommitTest.testSoftAndHardCommitMaxTimeRapidAdds-seed#[BAE64CA36CFAE2E]) [    x:collection1] o.a.s.s.IndexSchema [collection1] Schema name=test
   [junit4]   2> 16051 INFO  (TEST-SoftAutoCommitTest.testSoftAndHardCommitMaxTimeRapidAdds-seed#[BAE64CA36CFAE2E]) [    x:collection1] o.a.s.s.OpenExchangeRatesOrgProvider Initialized with rates=open-exchange-rates.json, refreshInterval=1440.
   [junit4]   2> 16074 INFO  (TEST-SoftAutoCommitTest.testSoftAndHardCommitMaxTimeRapidAdds-seed#[BAE64CA36CFAE2E]) [    x:collection1] o.a.s.s.IndexSchema default search field in schema is text
   [junit4]   2> 16075 INFO  (TEST-SoftAutoCommitTest.testSoftAndHardCommitMaxTimeRapidAdds-seed#[BAE64CA36CFAE2E]) [    x:collection1] o.a.s.s.IndexSchema unique key field: id
   [junit4]   2> 16121 INFO  (TEST-SoftAutoCommitTest.testSoftAndHardCommitMaxTimeRapidAdds-seed#[BAE64CA36CFAE2E]) [    x:collection1] o.a.s.s.FileExchangeRateProvider Reloading exchange rates from file currency.xml
   [junit4]   2> 16139 INFO  (TEST-SoftAutoCommitTest.testSoftAndHardCommitMaxTimeRapidAdds-seed#[BAE64CA36CFAE2E]) [    x:collection1] o.a.s.s.FileExchangeRateProvider Reloading exchange rates from file currency.xml
   [junit4]   2> 16141 INFO  (TEST-SoftAutoCommitTest.testSoftAndHardCommitMaxTimeRapidAdds-seed#[BAE64CA36CFAE2E]) [    x:collection1] o.a.s.s.OpenExchangeRatesOrgProvider Reloading exchange rates from open-exchange-rates.json
   [junit4]   2> 16142 INFO  (TEST-SoftAutoCommitTest.testSoftAndHardCommitMaxTimeRapidAdds-seed#[BAE64CA36CFAE2E]) [    x:collection1] o.a.s.s.OpenExchangeRatesOrgProvider Reloading exchange rates from open-exchange-rates.json
   [junit4]   2> 16165 INFO  (TEST-SoftAutoCommitTest.testSoftAndHardCommitMaxTimeRapidAdds-seed#[BAE64CA36CFAE2E]) [    x:collection1] o.a.s.c.ConfigSetProperties Did not find ConfigSet properties, assuming default properties: Can't find resource 'configsetprops.json' in classpath or '/x1/jenkins/jenkins-slave/workspace/Lucene-Solr-Tests-master/solr/core/src/test-files/solr/collection1'
   [junit4]   2> 16165 INFO  (TEST-SoftAutoCommitTest.testSoftAndHardCommitMaxTimeRapidAdds-seed#[BAE64CA36CFAE2E]) [    x:collection1] o.a.s.c.CoreContainer Reloading SolrCore 'collection1' using configuration from instancedir /x1/jenkins/jenkins-slave/workspace/Lucene-Solr-Tests-master/solr/core/src/test-files/solr/collection1
   [junit4]   2> 16174 INFO  (TEST-SoftAutoCommitTest.testSoftAndHardCommitMaxTimeRapidAdds-seed#[BAE64CA36CFAE2E]) [    x:collection1] o.a.s.c.SolrCore [[collection1] ] Opening new SolrCore at [/x1/jenkins/jenkins-slave/workspace/Lucene-Solr-Tests-master/solr/core/src/test-files/solr/collection1], dataDir=[/x1/jenkins/jenkins-slave/workspace/Lucene-Solr-Tests-master/solr/build/solr-core/test/J1/temp/solr.update.SoftAutoCommitTest_BAE64CA36CFAE2E-001/init-core-data-001/]
   [junit4]   2> 16174 INFO  (TEST-SoftAutoCommitTest.testSoftAndHardCommitMaxTimeRapidAdds-seed#[BAE64CA36CFAE2E]) [    x:collection1] o.a.s.c.JmxMonitoredMap No JMX servers found, not exposing Solr information with JMX.
   [junit4]   2> 16174 INFO  (TEST-SoftAutoCommitTest.testSoftAndHardCommitMaxTimeRapidAdds-seed#[BAE64CA36CFAE2E]) [    x:collection1] o.a.s.c.s.SolrSnapshotMetaDataManager Loading from snapshot metadata file...
   [junit4]   2> 16178 INFO  (TEST-SoftAutoCommitTest.testSoftAndHardCommitMaxTimeRapidAdds-seed#[BAE64CA36CFAE2E]) [    x:collection1] o.a.s.c.SolrCore New index directory detected: old=null new=/x1/jenkins/jenkins-slave/workspace/Lucene-Solr-Tests-master/solr/build/solr-core/test/J1/temp/solr.update.SoftAutoCommitTest_BAE64CA36CFAE2E-001/init-core-data-001/index/
   [junit4]   2> 16184 INFO  (TEST-SoftAutoCommitTest.testSoftAndHardCommitMaxTimeRapidAdds-seed#[BAE64CA36CFAE2E]) [    x:collection1] o.a.s.u.p.UpdateRequestProcessorChain creating updateRequestProcessorChain "dedupe"
   [junit4]   2> 16185 INFO  (TEST-SoftAutoCommitTest.testSoftAndHardCommitMaxTimeRapidAdds-seed#[BAE64CA36CFAE2E]) [    x:collection1] o.a.s.u.p.UpdateRequestProcessorChain inserting DistributedUpdateProcessorFactory into updateRequestProcessorChain "dedupe"
   [junit4]   2> 16185 INFO  (TEST-SoftAutoCommitTest.testSoftAndHardCommitMaxTimeRapidAdds-seed#[BAE64CA36CFAE2E]) [    x:collection1] o.a.s.u.p.UpdateRequestProcessorChain creating updateRequestProcessorChain "dedupe-allfields"
   [junit4]   2> 16185 INFO  (TEST-SoftAutoCommitTest.testSoftAndHardCommitMaxTimeRapidAdds-seed#[BAE64CA36CFAE2E]) [    x:collection1] o.a.s.u.p.UpdateRequestProcessorChain inserting DistributedUpdateProcessorFactory into updateRequestProcessorChain "dedupe-allfields"
   [junit4]   2> 16185 INFO  (TEST-SoftAutoCommitTest.testSoftAndHardCommitMaxTimeRapidAdds-seed#[BAE64CA36CFAE2E]) [    x:collection1] o.a.s.u.p.UpdateRequestProcessorChain creating updateRequestProcessorChain "stored_sig"
   [junit4]   2> 16185 INFO  (TEST-SoftAutoCommitTest.testSoftAndHardCommitMaxTimeRapidAdds-seed#[BAE64CA36CFAE2E]) [    x:collection1] o.a.s.u.p.UpdateRequestProcessorChain inserting DistributedUpdateProcessorFactory into updateRequestProcessorChain "stored_sig"
   [junit4]   2> 16186 INFO  (TEST-SoftAutoCommitTest.testSoftAndHardCommitMaxTimeRapidAdds-seed#[BAE64CA36CFAE2E]) [    x:collection1] o.a.s.u.p.UpdateRequestProcessorChain creating updateRequestProcessorChain "uniq-fields"
   [junit4]   2> 16186 INFO  (TEST-SoftAutoCommitTest.testSoftAndHardCommitMaxTimeRapidAdds-seed#[BAE64CA36CFAE2E]) [    x:collection1] o.a.s.u.p.UpdateRequestProcessorChain inserting DistributedUpdateProcessorFactory into updateRequestProcessorChain "uniq-fields"
   [junit4]   2> 16187 INFO  (TEST-SoftAutoCommitTest.testSoftAndHardCommitMaxTimeRapidAdds-seed#[BAE64CA36CFAE2E]) [    x:collection1] o.a.s.u.p.UpdateRequestProcessorChain creating updateRequestProcessorChain "distrib-dup-test-chain-explicit"
   [junit4]   2> 16187 INFO  (TEST-SoftAutoCommitTest.testSoftAndHardCommitMaxTimeRapidAdds-seed#[BAE64CA36CFAE2E]) [    x:collection1] o.a.s.u.p.UpdateRequestProcessorChain creating updateRequestProcessorChain "distrib-dup-test-chain-implicit"
   [junit4]   2> 16187 INFO  (TEST-SoftAutoCommitTest.testSoftAndHardCommitMaxTimeRapidAdds-seed#[BAE64CA36CFAE2E]) [    x:collection1] o.a.s.u.p.UpdateRequestProcessorChain inserting DistributedUpdateProcessorFactory into updateRequestProcessorChain "distrib-dup-test-chain-implicit"
   [junit4]   2> 16187 INFO  (TEST-SoftAutoCommitTest.testSoftAndHardCommitMaxTimeRapidAdds-seed#[BAE64CA36CFAE2E]) [    x:collection1] o.a.s.c.SolrCore no updateRequestProcessorChain defined as default, creating implicit default
   [junit4]   2> 16190 INFO  (TEST-SoftAutoCommitTest.testSoftAndHardCommitMaxTimeRapidAdds-seed#[BAE64CA36CFAE2E]) [    x:collection1] o.a.s.h.l.XMLLoader xsltCacheLifetimeSeconds=60
   [junit4]   2> 16187 INFO  (OldIndexDirectoryCleanupThreadForCore-collection1) [    x:collection1] o.a.s.c.SolrCore Looking for old index directories to cleanup for core collection1 in /x1/jenkins/jenkins-slave/workspace/Lucene-Solr-Tests-master/solr/build/solr-core/test/J1/temp/solr.update.SoftAutoCommitTest_BAE64CA36CFAE2E-001/init-core-data-001/
   [junit4]   2> 16193 INFO  (TEST-SoftAutoCommitTest.testSoftAndHardCommitMaxTimeRapidAdds-seed#[BAE64CA36CFAE2E]) [    x:collection1] o.a.s.h.l.XMLLoader xsltCacheLifetimeSeconds=60
   [junit4]   2> 16194 INFO  (TEST-SoftAutoCommitTest.testSoftAndHardCommitMaxTimeRapidAdds-seed#[BAE64CA36CFAE2E]) [    x:collection1] o.a.s.h.l.XMLLoader xsltCacheLifetimeSeconds=60
   [junit4]   2> 16207 INFO  (TEST-SoftAutoCommitTest.testSoftAndHardCommitMaxTimeRapidAdds-seed#[BAE64CA36CFAE2E]) [    x:collection1] o.a.s.h.l.XMLLoader xsltCacheLifetimeSeconds=60
   [junit4]   2> 16212 INFO  (TEST-SoftAutoCommitTest.testSoftAndHardCommitMaxTimeRapidAdds-seed#[BAE64CA36CFAE2E]) [    x:collection1] o.a.s.c.PluginBag requestHandler : 'lazy' created with startup=lazy 
   [junit4]   2> 16213 INFO  (TEST-SoftAutoCommitTest.testSoftAndHardCommitMaxTimeRapidAdds-seed#[BAE64CA36CFAE2E]) [    x:collection1] o.a.s.c.RequestHandlers Registered paths: /admin/mbeans,standard,spellCheckCompRH,lazy,/update/json/docs,/admin/luke,/export,spellCheckWithWordbreak_Direct,tvrh,/get,/admin/properties,/update/json,mltrh,/admin/threads,/search-facet-def,/update/csv,/sql,/graph,/search-facet-invariants,/admin/segments,spellCheckCompRH1,/mlt,/admin/system,/replication,dismax,defaults,/config,/stream,/schema,/admin/plugins,/admin/logging,spellCheckWithWordbreak,mock,/admin/ping,/update,/admin/file,/terms,spellCheckCompRH_Direct,/debug/dump
   [junit4]   2> 16225 INFO  (TEST-SoftAutoCommitTest.testSoftAndHardCommitMaxTimeRapidAdds-seed#[BAE64CA36CFAE2E]) [    x:collection1] o.a.s.c.SolrCore Using default statsCache cache: org.apache.solr.search.stats.LocalStatsCache
   [junit4]   2> 16225 INFO  (TEST-SoftAutoCommitTest.testSoftAndHardCommitMaxTimeRapidAdds-seed#[BAE64CA36CFAE2E]) [    x:collection1] o.a.s.u.CommitTracker Hard AutoCommit: disabled
   [junit4]   2> 16225 INFO  (TEST-SoftAutoCommitTest.testSoftAndHardCommitMaxTimeRapidAdds-seed#[BAE64CA36CFAE2E]) [    x:collection1] o.a.s.u.CommitTracker Soft AutoCommit: disabled
   [junit4]   2> 16226 INFO  (TEST-SoftAutoCommitTest.testSoftAndHardCommitMaxTimeRapidAdds-seed#[BAE64CA36CFAE2E]) [    x:collection1] o.a.s.s.SolrIndexSearcher Opening [Searcher@5becde25[collection1] main]
   [junit4]   2> 16227 INFO  (TEST-SoftAutoCommitTest.testSoftAndHardCommitMaxTimeRapidAdds-seed#[BAE64CA36CFAE2E]) [    x:collection1] o.a.s.r.RestManager Initializing RestManager with initArgs: {storageIO=org.apache.solr.rest.ManagedResourceStorage$InMemoryStorageIO}
   [junit4]   2> 16227 INFO  (TEST-SoftAutoCommitTest.testSoftAndHardCommitMaxTimeRapidAdds-seed#[BAE64CA36CFAE2E]) [    x:collection1] o.a.s.r.ManagedResourceStorage Reading _rest_managed.json using InMemoryStorage
   [junit4]   2> 16227 INFO  (TEST-SoftAutoCommitTest.testSoftAndHardCommitMaxTimeRapidAdds-seed#[BAE64CA36CFAE2E]) [    x:collection1] o.a.s.r.RestManager Initializing 0 registered ManagedResources
   [junit4]   2> 16228 INFO  (TEST-SoftAutoCommitTest.testSoftAndHardCommitMaxTimeRapidAdds-seed#[BAE64CA36CFAE2E]) [    x:collection1] o.a.s.h.c.SpellCheckComponent Initializing spell checkers
   [junit4]   2> 16229 INFO  (TEST-SoftAutoCommitTest.testSoftAndHardCommitMaxTimeRapidAdds-seed#[BAE64CA36CFAE2E]) [    x:collection1] o.a.s.s.DirectSolrSpellChecker init: {name=direct,classname=DirectSolrSpellChecker,field=lowerfilt,minQueryLength=3}
   [junit4]   2> 16246 INFO  (TEST-SoftAutoCommitTest.testSoftAndHardCommitMaxTimeRapidAdds-seed#[BAE64CA36CFAE2E]) [    x:collection1] o.a.s.h.ReplicationHandler Commits will be reserved for  10000
   [junit4]   2> 16246 INFO  (searcherExecutor-16-thread-1-processing-x:collection1) [    x:collection1] o.a.s.h.c.SpellCheckComponent Loading spell index for spellchecker: default
   [junit4]   2> 16250 INFO  (searcherExecutor-16-thread-1-processing-x:collection1) [    x:collection1] o.a.s.h.c.SpellCheckComponent Loading spell index for spellchecker: direct
   [junit4]   2> 16251 INFO  (searcherExecutor-16-thread-1-processing-x:collection1) [    x:collection1] o.a.s.h.c.SpellCheckComponent Loading spell index for spellchecker: wordbreak
   [junit4]   2> 16251 INFO  (searcherExecutor-16-thread-1-processing-x:collection1) [    x:collection1] o.a.s.h.c.SpellCheckComponent Loading spell index for spellchecker: multipleFields
   [junit4]   2> 16251 INFO  (searcherExecutor-16-thread-1-processing-x:collection1) [    x:collection1] o.a.s.h.c.SpellCheckComponent Loading spell index for spellchecker: jarowinkler
   [junit4]   2> 16252 INFO  (TEST-SoftAutoCommitTest.testSoftAndHardCommitMaxTimeRapidAdds-seed#[BAE64CA36CFAE2E]) [    x:collection1] o.a.s.u.UpdateLog Looking up max value of version field to seed version buckets
   [junit4]   2> 16254 INFO  (searcherExecutor-16-thread-1-processing-x:collection1) [    x:collection1] o.a.s.h.c.SpellCheckComponent Loading spell index for spellchecker: external
   [junit4]   2> 16254 INFO  (searcherExecutor-16-thread-1-processing-x:collection1) [    x:collection1] o.a.s.h.c.SpellCheckComponent Loading spell index for spellchecker: freq
   [junit4]   2> 16255 INFO  (searcherExecutor-16-thread-1-processing-x:collection1) [    x:collection1] o.a.s.h.c.SpellCheckComponent Loading spell index for spellchecker: fqcn
   [junit4]   2> 16255 INFO  (searcherExecutor-16-thread-1-processing-x:collection1) [    x:collection1] o.a.s.h.c.SpellCheckComponent Loading spell index for spellchecker: perDict
   [junit4]   2> 16255 INFO  (searcherExecutor-16-thread-1-processing-x:collection1) [    x:collection1] o.a.s.c.SolrCore [collection1] Registered new searcher Searcher@5becde25[collection1] main{ExitableDirectoryReader(UninvertingDirectoryReader(Uninverting(_0(7.0.0):c1)))}
   [junit4]   2> 16256 INFO  (TEST-SoftAutoCommitTest.testSoftAndHardCommitMaxTimeRapidAdds-seed#[BAE64CA36CFAE2E]) [    x:collection1] o.a.s.u.VersionInfo Refreshing highest value of _version_ for 65536 version buckets from index
   [junit4]   2> 16276 INFO  (TEST-SoftAutoCommitTest.testSoftAndHardCommitMaxTimeRapidAdds-seed#[BAE64CA36CFAE2E]) [    x:collection1] o.a.s.u.VersionInfo Found MAX value 1545925669322489856 from Terms for _version_ in index
   [junit4]   2> 16277 INFO  (TEST-SoftAutoCommitTest.testSoftAndHardCommitMaxTimeRapidAdds-seed#[BAE64CA36CFAE2E]) [    x:collection1] o.a.s.u.UpdateLog Took 24.0ms to seed version buckets with highest version 1545925669322489856
   [junit4]   2> 16277 INFO  (TEST-SoftAutoCommitTest.testSoftAndHardCommitMaxTimeRapidAdds-seed#[BAE64CA36CFAE2E]) [    x:collection1] o.a.s.u.DefaultSolrCoreState Closing old IndexWriter... core=collection1
   [junit4]   2> 16278 INFO  (TEST-SoftAutoCommitTest.testSoftAndHardCommitMaxTimeRapidAdds-seed#[BAE64CA36CFAE2E]) [    x:collection1] o.a.s.u.RandomMergePolicy RandomMergePolicy wrapping class org.apache.lucene.index.TieredMergePolicy: [TieredMergePolicy: maxMergeAtOnce=35, maxMergeAtOnceExplicit=39, maxMergedSegmentMB=44.625, floorSegmentMB=0.9140625, forceMergeDeletesPctAllowed=21.748448598164032, segmentsPerTier=26.0, maxCFSSegmentSizeMB=8.796093022207999E12, noCFSRatio=0.6238990158782791
   [junit4]   2> 16292 INFO  (TEST-SoftAutoCommitTest.testSoftAndHardCommitMaxTimeRapidAdds-seed#[BAE64CA36CFAE2E]) [    x:collection1] o.a.s.c.SolrDeletionPolicy SolrDeletionPolicy.onInit: commits: num=1
   [junit4]   2> 	commit{dir=MockDirectoryWrapper(RAMDirectory@64819270 lockFactory=org.apache.lucene.store.SingleInstanceLockFactory@59fec5f5),segFN=segments_2,generation=2}
   [junit4]   2> 16292 INFO  (TEST-SoftAutoCommitTest.testSoftAndHardCommitMaxTimeRapidAdds-seed#[BAE64CA36CFAE2E]) [    x:collection1] o.a.s.c.SolrDeletionPolicy newest commit generation = 2
   [junit4]   2> 16292 INFO  (TEST-SoftAutoCommitTest.testSoftAndHardCommitMaxTimeRapidAdds-seed#[BAE64CA36CFAE2E]) [    x:collection1] o.a.s.u.DefaultSolrCoreState New IndexWriter is ready to be used.
   [junit4]   2> 16297 INFO  (TEST-SoftAutoCommitTest.testSoftAndHardCommitMaxTimeRapidAdds-seed#[BAE64CA36CFAE2E]) [    x:collection1] o.a.s.s.SolrIndexSearcher Opening [Searcher@530c68d3[collection1] main]
   [junit4]   2> 16297 INFO  (TEST-SoftAutoCommitTest.testSoftAndHardCommitMaxTimeRapidAdds-seed#[BAE64CA36CFAE2E]) [    x:collection1] o.a.s.c.CoreContainer replacing core: collection1
   [junit4]   2> 16297 INFO  (TEST-SoftAutoCommitTest.testSoftAndHardCommitMaxTimeRapidAdds-seed#[BAE64CA36CFAE2E]) [    x:collection1] o.a.s.c.SolrCore [collection1]  CLOSING SolrCore org.apache.solr.core.SolrCore@1066ec32
   [junit4]   2> 16298 INFO  (TEST-SoftAutoCommitTest.testSoftAndHardCommitMaxTimeRapidAdds-seed#[BAE64CA36CFAE2E]) [    x:collection1] o.a.s.u.DirectUpdateHandler2 closing DirectUpdateHandler2{commits=2,autocommit maxTime=1200ms,autocommits=1,soft autocommit maxTime=500ms,soft autocommits=1,optimizes=0,rollbacks=0,expungeDeletes=0,docsPending=0,adds=0,deletesById=0,deletesByQuery=0,errors=0,cumulative_adds=1,cumulative_deletesById=0,cumulative_deletesByQuery=0,cumulative_errors=0,transaction_logs_total_size=143,transaction_logs_total_number=1}
   [junit4]   2> 16298 INFO  (searcherExecutor-16-thread-1-processing-x:collection1) [    x:collection1] o.a.s.c.SolrCore [collection1] Registered new searcher Searcher@530c68d3[collection1] main{ExitableDirectoryReader(UninvertingDirectoryReader(Uninverting(_0(7.0.0):c1)))}
   [junit4]   2> 16310 INFO  (TEST-SoftAutoCommitTest.testSoftAndHardCommitMaxTimeRapidAdds-seed#[BAE64CA36CFAE2E]) [    x:collection1] o.a.s.c.SolrCore [collection1] Closing main searcher on request.
   [junit4]   2> 16325 INFO  (TEST-SoftAutoCommitTest.testSoftAndHardCommitMaxTimeRapidAdds-seed#[BAE64CA36CFAE2E]) [    x:collection1] o.a.s.u.p.LogUpdateProcessorFactory [collection1]  webapp=null path=null params={}{add=[5000 (1545925671995310080)]} 0 14
   [junit4]   2> 16328 INFO  (TEST-SoftAutoCommitTest.testSoftAndHardCommitMaxTimeRapidAdds-seed#[BAE64CA36CFAE2E]) [    x:collection1] o.a.s.u.p.LogUpdateProcessorFactory [collection1]  webapp=null path=null params={}{add=[5001 (1545925672011038720)]} 0 1
   [junit4]   2> 16330 INFO  (TEST-SoftAutoCommitTest.testSoftAndHardCommitMaxTimeRapidAdds-seed#[BAE64CA36CFAE2E]) [    x:collection1] o.a.s.u.p.LogUpdateProcessorFactory [collection1]  webapp=null path=null params={}{add=[5002 (1545925672013135872)]} 0 1
   [junit4]   2> 16332 INFO  (TEST-SoftAutoCommitTest.testSoftAndHardCommitMaxTimeRapidAdds-seed#[BAE64CA36CFAE2E]) [    x:collection1] o.a.s.u.p.LogUpdateProcessorFactory [collection1]  webapp=null path=null params={}{add=[5003 (1545925672015233024)]} 0 1
   [junit4]   2> 16334 INFO  (TEST-SoftAutoCommitTest.testSoftAndHardCommitMaxTimeRapidAdds-seed#[BAE64CA36CFAE2E]) [    x:collection1] o.a.s.u.p.LogUpdateProcessorFactory [collection1]  webapp=null path=null params={}{add=[5004 (1545925672017330176)]} 0 1
   [junit4]   2> 16334 INFO  (TEST-SoftAutoCommitTest.testSoftAndHardCommitMaxTimeRapidAdds-seed#[BAE64CA36CFAE2E]) [    x:collection1] o.a.s.SolrTestCaseJ4 ###Ending testSoftAndHardCommitMaxTimeRapidAdds
   [junit4]   2> 16337 INFO  (TEST-SoftAutoCommitTest.testSoftAndHardCommitMaxTimeDelete-seed#[BAE64CA36CFAE2E]) [    x:collection1] o.a.s.SolrTestCaseJ4 ###Starting testSoftAndHardCommitMaxTimeDelete
   [junit4]   2> 16338 INFO  (TEST-SoftAutoCommitTest.testSoftAndHardCommitMaxTimeDelete-seed#[BAE64CA36CFAE2E]) [    x:collection1] o.a.s.c.SolrResourceLoader new SolrResourceLoader for directory: '/x1/jenkins/jenkins-slave/workspace/Lucene-Solr-Tests-master/solr/core/src/test-files/solr/collection1'
   [junit4]   2> 16338 INFO  (TEST-SoftAutoCommitTest.testSoftAndHardCommitMaxTimeDelete-seed#[BAE64CA36CFAE2E]) [    x:collection1] o.a.s.c.SolrResourceLoader JNDI not configured for solr (NoInitialContextEx)
   [junit4]   2> 16338 INFO  (TEST-SoftAutoCommitTest.testSoftAndHardCommitMaxTimeDelete-seed#[BAE64CA36CFAE2E]) [    x:collection1] o.a.s.c.SolrResourceLoader using system property solr.solr.home: /x1/jenkins/jenkins-slave/workspace/Lucene-Solr-Tests-master/solr/core/src/test-files/solr
   [junit4]   2> 16338 INFO  (TEST-SoftAutoCommitTest.testSoftAndHardCommitMaxTimeDelete-seed#[BAE64CA36CFAE2E]) [    x:collection1] o.a.s.c.SolrResourceLoader Adding 'file:/x1/jenkins/jenkins-slave/workspace/Lucene-Solr-Tests-master/solr/core/src/test-files/solr/collection1/lib/classes/' to classloader
   [junit4]   2> 16338 INFO  (TEST-SoftAutoCommitTest.testSoftAndHardCommitMaxTimeDelete-seed#[BAE64CA36CFAE2E]) [    x:collection1] o.a.s.c.SolrResourceLoader Adding 'file:/x1/jenkins/jenkins-slave/workspace/Lucene-Solr-Tests-master/solr/core/src/test-files/solr/collection1/lib/README' to classloader
   [junit4]   2> 16396 INFO  (TEST-SoftAutoCommitTest.testSoftAndHardCommitMaxTimeDelete-seed#[BAE64CA36CFAE2E]) [    x:collection1] o.a.s.c.SolrConfig current version of requestparams : -1
   [junit4]   2> 16567 INFO  (TEST-SoftAutoCommitTest.testSoftAndHardCommitMaxTimeDelete-seed#[BAE64CA36CFAE2E]) [    x:collection1] o.a.s.c.SolrConfig Using Lucene MatchVersion: 7.0.0
   [junit4]   2> 16596 INFO  (TEST-SoftAutoCommitTest.testSoftAndHardCommitMaxTimeDelete-seed#[BAE64CA36CFAE2E]) [    x:collection1] o.a.s.c.SolrConfig Loaded SolrConfig: solrconfig.xml
   [junit4]   2> 16618 INFO  (TEST-SoftAutoCommitTest.testSoftAndHardCommitMaxTimeDelete-seed#[BAE64CA36CFAE2E]) [    x:collection1] o.a.s.s.IndexSchema [collection1] Schema name=test
   [junit4]   2> 16813 INFO  (TEST-SoftAutoCommitTest.testSoftAndHardCommitMaxTimeDelete-seed#[BAE64CA36CFAE2E]) [    x:collection1] o.a.s.s.OpenExchangeRatesOrgProvider Initialized with rates=open-exchange-rates.json, refreshInterval=1440.
   [junit4]   2> 16832 INFO  (commitScheduler-19-thread-1) [    x:collection1] o.a.s.u.DirectUpdateHandler2 start commit{,optimize=false,openSearcher=true,waitSearcher=true,expungeDeletes=false,softCommit=true,prepareCommit=false}
   [junit4]   2> 16854 INFO  (TEST-SoftAutoCommitTest.testSoftAndHardCommitMaxTimeDelete-seed#[BAE64CA36CFAE2E]) [    x:collection1] o.a.s.s.IndexSchema default search field in schema is text
   [junit4]   2> 16855 INFO  (TEST-SoftAutoCommitTest.testSoftAndHardCommitMaxTimeDelete-seed#[BAE64CA36CFAE2E]) [    x:collection1] o.a.s.s.IndexSchema unique key field: id
   [junit4]   2> 16928 INFO  (TEST-SoftAutoCommitTest.testSoftAndHardCommitMaxTimeDelete-seed#[BAE64CA36CFAE2E]) [    x:collection1] o.a.s.s.FileExchangeRateProvider Reloading exchange rates from file currency.xml
   [junit4]   2> 17008 INFO  (TEST-SoftAutoCommitTest.testSoftAndHardCommitMaxTimeDelete-seed#[BAE64CA36CFAE2E]) [    x:collection1] o.a.s.s.FileExchangeRateProvider Reloading exchange rates from file currency.xml
   [junit4]   2> 17043 INFO  (TEST-SoftAutoCommitTest.testSoftAndHardCommitMaxTimeDelete-seed#[BAE64CA36CFAE2E]) [    x:collection1] o.a.s.s.OpenExchangeRatesOrgProvider Reloading exchange rates from open-exchange-rates.json
   [junit4]   2> 17043 INFO  (TEST-SoftAutoCommitTest.testSoftAndHardCommitMaxTimeDelete-seed#[BAE64CA36CFAE2E]) [    x:collection1] o.a.s.s.OpenExchangeRatesOrgProvider Reloading exchange rates from open-exchange-rates.json
   [junit4]   2> 17045 INFO  (TEST-SoftAutoCommitTest.testSoftAndHardCommitMaxTimeDelete-seed#[BAE64CA36CFAE2E]) [    x:collection1] o.a.s.c.ConfigSetProperties Did not find ConfigSet properties, assuming default properties: Can't find resource 'configsetprops.json' in classpath or '/x1/jenkins/jenkins-slave/workspace/Lucene-Solr-Tests-master/solr/core/src/test-files/solr/collection1'
   [junit4]   2> 17045 INFO  (TEST-SoftAutoCommitTest.testSoftAndHardCommitMaxTimeDelete-seed#[BAE64CA36CFAE2E]) [    x:collection1] o.a.s.c.CoreContainer Reloading SolrCore 'collection1' using configuration from instancedir /x1/jenkins/jenkins-slave/workspace/Lucene-Solr-Tests-master/solr/core/src/test-files/solr/collection1
   [junit4]   2> 17046 INFO  (TEST-SoftAutoCommitTest.testSoftAndHardCommitMaxTimeDelete-seed#[BAE64CA36CFAE2E]) [    x:collection1] o.a.s.c.SolrCore [[collection1] ] Opening new SolrCore at [/x1/jenkins/jenkins-slave/workspace/Lucene-Solr-Tests-master/solr/core/src/test-files/solr/collection1], dataDir=[/x1/jenkins/jenkins-slave/workspace/Lucene-Solr-Tests-master/solr/build/solr-core/test/J1/temp/solr.update.SoftAutoCommitTest_BAE64CA36CFAE2E-001/init-core-data-001/]
   [junit4]   2> 17046 INFO  (TEST-SoftAutoCommitTest.testSoftAndHardCommitMaxTimeDelete-seed#[BAE64CA36CFAE2E]) [    x:collection1] o.a.s.c.JmxMonitoredMap No JMX servers found, not exposing Solr information with JMX.
   [junit4]   2> 17046 INFO  (TEST-SoftAutoCommitTest.testSoftAndHardCommitMaxTimeDelete-seed#[BAE64CA36CFAE2E]) [    x:collection1] o.a.s.c.s.SolrSnapshotMetaDataManager Loading from snapshot metadata file...
   [junit4]   2> 17047 INFO  (TEST-SoftAutoCommitTest.testSoftAndHardCommitMaxTimeDelete-seed#[BAE64CA36CFAE2E]) [    x:collection1] o.a.s.c.SolrCore New index directory detected: old=null new=/x1/jenkins/jenkins-slave/workspace/Lucene-Solr-Tests-master/solr/build/solr-core/test/J1/temp/solr.update.SoftAutoCommitTest_BAE64CA36CFAE2E-001/init-core-data-001/index/
   [junit4]   2> 17060 INFO  (TEST-SoftAutoCommitTest.testSoftAndHardCommitMaxTimeDelete-seed#[BAE64CA36CFAE2E]) [    x:collection1] o.a.s.u.p.UpdateRequestProcessorChain creating updateRequestProcessorChain "dedupe"
   [junit4]   2> 17060 INFO  (TEST-SoftAutoCommitTest.testSoftAndHardCommitMaxTimeDelete-seed#[BAE64CA36CFAE2E]) [    x:collection1] o.a.s.u.p.UpdateRequestProcessorChain inserting DistributedUpdateProcessorFactory into updateRequestProcessorChain "dedupe"
   [junit4]   2> 17061 INFO  (TEST-SoftAutoCommitTest.testSoftAndHardCommitMaxTimeDelete-seed#[BAE64CA36CFAE2E]) [    x:collection1] o.a.s.u.p.UpdateRequestProcessorChain creating updateRequestProcessorChain "dedupe-allfields"
   [junit4]   2> 17061 INFO  (TEST-SoftAutoCommitTest.testSoftAndHardCommitMaxTimeDelete-seed#[BAE64CA36CFAE2E]) [    x:collection1] o.a.s.u.p.UpdateRequestProcessorChain inserting DistributedUpdateProcessorFactory into updateRequestProcessorChain "dedupe-allfields"
   [junit4]   2> 17061 INFO  (TEST-SoftAutoCommitTest.testSoftAndHardCommitMaxTimeDelete-seed#[BAE64CA36CFAE2E]) [    x:collection1] o.a.s.u.p.UpdateRequestProcessorChain creating updateRequestProcessorChain "stored_sig"
   [junit4]   2> 17061 INFO  (TEST-SoftAutoCommitTest.testSoftAndHardCommitMaxTimeDelete-seed#[BAE64CA36CFAE2E]) [    x:collection1] o.a.s.u.p.UpdateRequestProcessorChain inserting DistributedUpdateProcessorFactory into updateRequestProcessorChain "stored_sig"
   [junit4]   2> 17061 INFO  (TEST-SoftAutoCommitTest.testSoftAndHardCommitMaxTimeDelete-seed#[BAE64CA36CFAE2E]) [    x:collection1] o.a.s.u.p.UpdateRequestProcessorChain creating updateRequestProcessorChain "uniq-fields"
   [junit4]   2> 17061 INFO  (TEST-SoftAutoCommitTest.testSoftAndHardCommitMaxTimeDelete-seed#[BAE64CA36CFAE2E]) [    x:collection1] o.a.s.u.p.UpdateRequestProcessorChain inserting DistributedUpdateProcessorFactory into updateRequestProcessorChain "uniq-fields"
   [junit4]   2> 17062 INFO  (TEST-SoftAutoCommitTest.testSoftAndHardCommitMaxTimeDelete-seed#[BAE64CA36CFAE2E]) [    x:collection1] o.a.s.u.p.UpdateRequestProcessorChain creating updateRequestProcessorChain "distrib-dup-test-chain-explicit"
   [junit4]   2> 17062 INFO  (TEST-SoftAutoCommitTest.testSoftAndHardCommitMaxTimeDelete-seed#[BAE64CA36CFAE2E]) [    x:collection1] o.a.s.u.p.UpdateRequestProcessorChain creating updateRequestProcessorChain "distrib-dup-test-chain-implicit"
   [junit4]   2> 17063 INFO  (TEST-SoftAutoCommitTest.testSoftAndHardCommitMaxTimeDelete-seed#[BAE64CA36CFAE2E]) [    x:collection1] o.a.s.u.p.UpdateRequestProcessorChain inserting DistributedUpdateProcessorFactory into updateRequestProcessorChain "distrib-dup-test-chain-implicit"
   [junit4]   2> 17063 INFO  (TEST-SoftAutoCommitTest.testSoftAndHardCommitMaxTimeDelete-seed#[BAE64CA36CFAE2E]) [    x:collection1] o.a.s.c.SolrCore no updateRequestProcessorChain defined as default, creating implicit default
   [junit4]   2> 17065 INFO  (TEST-SoftAutoCommitTest.testSoftAndHardCommitMaxTimeDelete-seed#[BAE64CA36CFAE2E]) [    x:collection1] o.a.s.h.l.XMLLoader xsltCacheLifetimeSeconds=60
   [junit4]   2> 17066 INFO  (TEST-SoftAutoCommitTest.testSoftAndHardCommitMaxTimeDelete-seed#[BAE64CA36CFAE2E]) [    x:collection1] o.a.s.h.l.XMLLoader xsltCacheLifetimeSeconds=60
   [junit4]   2> 17075 INFO  (TEST-SoftAutoCommitTest.testSoftAndHardCommitMaxTimeDelete-seed#[BAE64CA36CFAE2E]) [    x:collection1] o.a.s.h.l.XMLLoader xsltCacheLifetimeSeconds=60
   [junit4]   2> 17077 INFO  (TEST-SoftAutoCommitTest.testSoftAndHardCommitMaxTimeDelete-seed#[BAE64CA36CFAE2E]) [    x:collection1] o.a.s.h.l.XMLLoader xsltCacheLifetimeSeconds=60
   [junit4]   2> 17079 INFO  (TEST-SoftAutoCommitTest.testSoftAndHardCommitMaxTimeDelete-seed#[BAE64CA36CFAE2E]) [    x:collection1] o.a.s.c.PluginBag requestHandler : 'lazy' created with startup=lazy 
   [junit4]   2> 17080 INFO  (TEST-SoftAutoCommitTest.testSoftAndHardCommitMaxTimeDelete-seed#[BAE64CA36CFAE2E]) [    x:collection1] o.a.s.c.RequestHandlers Registered paths: /admin/mbeans,standard,spellCheckCompRH,lazy,/update/json/docs,/admin/luke,/export,spellCheckWithWordbreak_Direct,tvrh,/get,/admin/properties,/update/json,mltrh,/admin/threads,/search-facet-def,/update/csv,/sql,/graph,/search-facet-invariants,/admin/segments,spellCheckCompRH1,/mlt,/admin/system,/replication,dismax,defaults,/config,/stream,/schema,/admin/plugins,/admin/logging,spellCheckWithWordbreak,mock,/admin/ping,/update,/admin/file,/terms,spellCheckCompRH_Direct,/debug/dump
   [junit4]   2> 17080 INFO  (TEST-SoftAutoCommitTest.testSoftAndHardCommitMaxTimeDelete-seed#[BAE64CA36CFAE2E]) [    x:collection1] o.a.s.c.SolrCore Using default statsCache cache: org.apache.solr.search.stats.LocalStatsCache
   [junit4]   2> 17086 INFO  (OldIndexDirectoryCleanupThreadForCore-collection1) [    x:collection1] o.a.s.c.SolrCore Looking for old index directories to cleanup for core collection1 in /x1/jenkins/jenkins-slave/workspace/Lucene-Solr-Tests-master/solr/build/solr-core/test/J1/temp/solr.update.SoftAutoCommitTest_BAE64CA36CFAE2E-001/init-core-data-001/
   [junit4]   2> 17095 INFO  (commitScheduler-19-thread-1) [    x:collection1] o.a.s.s.SolrIndexSearcher Opening [Searcher@39aca617[collection1] main]
   [junit4]   2> 17106 INFO  (commitScheduler-19-thread-1) [    x:collection1] o.a.s.u.DirectUpdateHandler2 end_commit_flush
   [junit4]   2> 17107 INFO  (TEST-SoftAutoCommitTest.testSoftAndHardCommitMaxTimeDelete-seed#[BAE64CA36CFAE2E]) [    x:collection1] o.a.s.u.CommitTracker Hard AutoCommit: disabled
   [junit4]   2> 17107 INFO  (TEST-SoftAutoCommitTest.testSoftAndHardCommitMaxTimeDelete-seed#[BAE64CA36CFAE2E]) [    x:collection1] o.a.s.u.CommitTracker Soft AutoCommit: disabled
   [junit4]   2> 17107 INFO  (searcherExecutor-16-thread-1-processing-x:collection1) [    x:collection1] o.a.s.c.SolrCore [collection1] Registered new searcher Searcher@39aca617[collection1] main{ExitableDirectoryReader(UninvertingDirectoryReader(Uninverting(_0(7.0.0):c1) Uninverting(_1(7.0.0):c5)))}
   [junit4]   2> 17114 INFO  (TEST-SoftAutoCommitTest.testSoftAndHardCommitMaxTimeDelete-seed#[BAE64CA36CFAE2E]) [    x:collection1] o.a.s.s.SolrIndexSearcher Opening [Searcher@29d5657f[collection1] main]
   [junit4]   2> 17115 INFO  (TEST-SoftAutoCommitTest.testSoftAndHardCommitMaxTimeDelete-seed#[BAE64CA36CFAE2E]) [    x:collection1] o.a.s.r.RestManager Initializing RestManager with initArgs: {storageIO=org.apache.solr.rest.ManagedResourceStorage$InMemoryStorageIO}
   [junit4]   2> 17115 INFO  (TEST-SoftAutoCommitTest.testSoftAndHardCommitMaxTimeDelete-seed#[BAE64CA36CFAE2E]) [    x:collection1] o.a.s.r.ManagedResourceStorage Reading _rest_managed.json using InMemoryStorage
   [junit4]   2> 17116 INFO  (TEST-SoftAutoCommitTest.testSoftAndHardCommitMaxTimeDelete-seed#[BAE64CA36CFAE2E]) [    x:collection1] o.a.s.r.RestManager Initializing 0 registered ManagedResources
   [junit4]   2> 17116 INFO  (TEST-SoftAutoCommitTest.testSoftAndHardCommitMaxTimeDelete-seed#[BAE64CA36CFAE2E]) [    x:collection1] o.a.s.h.c.SpellCheckComponent Initializing spell checkers
   [junit4]   2> 17126 INFO  (TEST-SoftAutoCommitTest.testSoftAndHardCommitMaxTimeDelete-seed#[BAE64CA36CFAE2E]) [    x:collection1] o.a.s.s.DirectSolrSpellChecker init: {name=direct,classname=DirectSolrSpellChecker,field=lowerfilt,minQueryLength=3}
   [junit4]   2> 17134 INFO  (TEST-SoftAutoCommitTest.testSoftAndHardCommitMaxTimeDelete-seed#[BAE64CA36CFAE2E]) [    x:collection1] o.a.s.h.ReplicationHandler Commits will be reserved for  10000
   [junit4]   2> 17134 INFO  (TEST-SoftAutoCommitTest.testSoftAndHardCommitMaxTimeDelete-seed#[BAE64CA36CFAE2E]) [    x:collection1] o.a.s.u.UpdateLog Looking up max value of version field to seed version buckets
   [junit4]   2> 17135 INFO  (TEST-SoftAutoCommitTest.testSoftAndHardCommitMaxTimeDelete-seed#[BAE64CA36CFAE2E]) [    x:collection1] o.a.s.u.VersionInfo Refreshing highest value of _version_ for 65536 version buckets from index
   [junit4]   2> 17138 INFO  (searcherExecutor-20-thread-1-processing-x:collection1) [    x:collection1] o.a.s.h.c.SpellCheckComponent Loading spell index for spellchecker: default
   [junit4]   2> 17140 INFO  (searcherExecutor-20-thread-1-processing-x:collection1) [    x:collection1] o.a.s.h.c.SpellCheckComponent Loading spell index for spellchecker: direct
   [junit4]   2> 17140 INFO  (searcherExecutor-20-thread-1-processing-x:collection1) [    x:collection1] o.a.s.h.c.SpellCheckComponent Loading spell index for spellchecker: wordbreak
   [junit4]   2> 17140 INFO  (searcherExecutor-20-thread-1-processing-x:collection1) [    x:collection1] o.a.s.h.c.SpellCheckComponent Loading spell index for spellchecker: multipleFields
   [junit4]   2> 17141 INFO  (searcherExecutor-20-thread-1-processing-x:collection1) [    x:collection1] o.a.s.h.c.SpellCheckComponent Loading spell index for spellchecker: jarowinkler
   [junit4]   2> 17141 INFO  (searcherExecutor-20-thread-1-processing-x:collection1) [    x:collection1] o.a.s.h.c.SpellCheckComponent Loading spell index for spellchecker: external
   [junit4]   2> 17146 INFO  (searcherExecutor-20-thread-1-processing-x:collection1) [    x:collection1] o.a.s.h.c.SpellCheckComponent Loading spell index for spellchecker: freq
   [junit4]   2> 17146 INFO  (searcherExecutor-20-thread-1-processing-x:collection1) [    x:collection1] o.a.s.h.c.SpellCheckComponent Loading spell index for spellchecker: fqcn
   [junit4]   2> 17147 INFO  (searcherExecutor-20-thread-1-processing-x:collection1) [    x:collection1] o.a.s.h.c.SpellCheckComponent Loading spell index for spellchecker: perDict
   [junit4]   2> 17147 INFO  (searcherExecutor-20-thread-1-processing-x:collection1) [    x:collection1] o.a.s.c.SolrCore [collection1] Registered new searcher Searcher@29d5657f[collection1] main{ExitableDirectoryReader(UninvertingDirectoryReader(Uninverting(_0(7.0.0):c1) Uninverting(_1(7.0.0):c5)))}
   [junit4]   2> 17189 INFO  (TEST-SoftAutoCommitTest.testSoftAndHardCommitMaxTimeDelete-seed#[BAE64CA36CFAE2E]) [    x:collection1] o.a.s.u.VersionInfo Found MAX value 1545925672017330176 from Terms for _version_ in index
   [junit4]   2> 17193 INFO  (TEST-SoftAutoCommitTest.testSoftAndHardCommitMaxTimeDelete-seed#[BAE64CA36CFAE2E]) [    x:collection1] o.a.s.u.UpdateLog Took 55.0ms to seed version buckets with highest version 1545925672017330176
   [junit4]   2> 17194 INFO  (TEST-SoftAutoCommitTest.testSoftAndHardCommitMaxTimeDelete-seed#[BAE64CA36CFAE2E]) [    x:collection1] o.a.s.u.DefaultSolrCoreState Closing old IndexWriter... core=collection1
   [junit4]   2> 17195 INFO  (TEST-SoftAutoCommitTest.testSoftAndHardCommitMaxTimeDelete-seed#[BAE64CA36CFAE2E]) [    x:collection1] o.a.s.c.SolrDeletionPolicy SolrDeletionPolicy.onCommit: commits: num=2
   [junit4]   2> 	commit{dir=MockDirectoryWrapper(RAMDirectory@64819270 lockFactory=org.apache.lucene.store.SingleInstanceLockFactory@59fec5f5),segFN=segments_2,generation=2}
   [junit4]   2> 	commit{dir=MockDirectoryWrapper(RAMDirectory@64819270 lockFactory=org.apache.lucene.store.SingleInstanceLockFactory@59fec5f5),segFN=segments_3,generation=3}
   [junit4]   2> 17195 INFO  (TEST-SoftAutoCommitTest.testSoftAndHardCommitMaxTimeDelete-seed#[BAE64CA36CFAE2E]) [    x:collection1] o.a.s.c.SolrDeletionPolicy newest commit generation = 3
   [junit4]   2> 17196 INFO  (TEST-SoftAutoCommitTest.testSoftAndHardCommitMaxTimeDelete-seed#[BAE64CA36CFAE2E]) [    x:collection1] o.a.s.u.RandomMergePolicy RandomMergePolicy wrapping class org.apache.lucene.index.LogDocMergePolicy: [LogDocMergePolicy: minMergeSize=1000, mergeFactor=15, maxMergeSize=9223372036854775807, maxMergeSizeForForcedMerge=9223372036854775807, calibrateSizeByDeletes=true, maxMergeDocs=2147483647, maxCFSSegmentSizeMB=8.796093022207999E12, noCFSRatio=0.7095050226973431]
   [junit4]   2> 17203 INFO  (TEST-SoftAutoCommitTest.testSoft

[...truncated too long message...]

 INFO  (coreCloseExecutor-24-thread-1-processing-x:collection1) [    x:collection1] o.a.s.c.CachingDirectoryFactory Closing directory: /x1/jenkins/jenkins-slave/workspace/Lucene-Solr-Tests-master/solr/build/solr-core/test/J1/temp/solr.update.SoftAutoCommitTest_BAE64CA36CFAE2E-001/init-core-data-001/snapshot_metadata
   [junit4]   2> 20662 INFO  (coreCloseExecutor-24-thread-1-processing-x:collection1) [    x:collection1] o.a.s.c.CachingDirectoryFactory looking to close /x1/jenkins/jenkins-slave/workspace/Lucene-Solr-Tests-master/solr/build/solr-core/test/J1/temp/solr.update.SoftAutoCommitTest_BAE64CA36CFAE2E-001/init-core-data-001/index [CachedDir<<refCount=0;path=/x1/jenkins/jenkins-slave/workspace/Lucene-Solr-Tests-master/solr/build/solr-core/test/J1/temp/solr.update.SoftAutoCommitTest_BAE64CA36CFAE2E-001/init-core-data-001/index;done=false>>]
   [junit4]   2> 20662 INFO  (coreCloseExecutor-24-thread-1-processing-x:collection1) [    x:collection1] o.a.s.c.CachingDirectoryFactory Closing directory, CoreContainer#isShutdown=true
   [junit4]   2> 20662 INFO  (coreCloseExecutor-24-thread-1-processing-x:collection1) [    x:collection1] o.a.s.c.CachingDirectoryFactory Closing directory: /x1/jenkins/jenkins-slave/workspace/Lucene-Solr-Tests-master/solr/build/solr-core/test/J1/temp/solr.update.SoftAutoCommitTest_BAE64CA36CFAE2E-001/init-core-data-001/index
   [junit4]   2> 20662 INFO  (coreCloseExecutor-24-thread-1-processing-x:collection1) [    x:collection1] o.a.s.c.CachingDirectoryFactory looking to close /x1/jenkins/jenkins-slave/workspace/Lucene-Solr-Tests-master/solr/build/solr-core/test/J1/temp/solr.update.SoftAutoCommitTest_BAE64CA36CFAE2E-001/init-core-data-001 [CachedDir<<refCount=0;path=/x1/jenkins/jenkins-slave/workspace/Lucene-Solr-Tests-master/solr/build/solr-core/test/J1/temp/solr.update.SoftAutoCommitTest_BAE64CA36CFAE2E-001/init-core-data-001;done=false>>]
   [junit4]   2> 20662 INFO  (coreCloseExecutor-24-thread-1-processing-x:collection1) [    x:collection1] o.a.s.c.CachingDirectoryFactory Closing directory, CoreContainer#isShutdown=true
   [junit4]   2> 20662 INFO  (coreCloseExecutor-24-thread-1-processing-x:collection1) [    x:collection1] o.a.s.c.CachingDirectoryFactory Closing directory: /x1/jenkins/jenkins-slave/workspace/Lucene-Solr-Tests-master/solr/build/solr-core/test/J1/temp/solr.update.SoftAutoCommitTest_BAE64CA36CFAE2E-001/init-core-data-001
   [junit4]   2> NOTE: leaving temporary files on disk at: /x1/jenkins/jenkins-slave/workspace/Lucene-Solr-Tests-master/solr/build/solr-core/test/J1/temp/solr.update.SoftAutoCommitTest_BAE64CA36CFAE2E-001
   [junit4]   2> NOTE: test params are: codec=Asserting(Lucene62): {range_facet_l_dv=PostingsFormat(name=MockRandom), _version_=PostingsFormat(name=LuceneVarGapFixedInterval), multiDefault=PostingsFormat(name=LuceneVarGapDocFreqInterval), subject=PostingsFormat(name=LuceneVarGapDocFreqInterval), intDefault=PostingsFormat(name=LuceneVarGapFixedInterval), id=PostingsFormat(name=MockRandom), range_facet_i_dv=PostingsFormat(name=LuceneVarGapDocFreqInterval), text=TestBloomFilteredLucenePostings(BloomFilteringPostingsFormat(Lucene50(blocksize=128))), range_facet_l=PostingsFormat(name=LuceneVarGapDocFreqInterval), timestamp=PostingsFormat(name=LuceneVarGapDocFreqInterval)}, docValues:{range_facet_l_dv=DocValuesFormat(name=Lucene54), range_facet_i_dv=DocValuesFormat(name=Memory), timestamp=DocValuesFormat(name=Memory)}, maxPointsInLeafNode=1869, maxMBSortInHeap=7.70936305289002, sim=ClassicSimilarity, locale=de-LU, timezone=Canada/Atlantic
   [junit4]   2> NOTE: Linux 3.13.0-85-generic amd64/Oracle Corporation 1.8.0_102 (64-bit)/cpus=4,threads=1,free=190486632,total=263716864
   [junit4]   2> NOTE: All tests run in this JVM: [SoftAutoCommitTest]
   [junit4] Completed [2/631 (1!)] on J1 in 26.21s, 3 tests, 1 failure <<< FAILURES!

[...truncated 1552 lines...]
   [junit4] Suite: org.apache.solr.cloud.TestSolrCloudWithKerberosAlt
   [junit4]   2> 2886845 WARN  (TEST-TestSolrCloudWithKerberosAlt.testBasics-seed#[BAE64CA36CFAE2E]) [    ] o.a.d.s.c.DefaultDirectoryService You didn't change the admin password of directory service instance 'DefaultKrbServer'.  Please update the admin password as soon as possible to prevent a possible security breach.
   [junit4]   2> NOTE: reproduce with: ant test  -Dtestcase=TestSolrCloudWithKerberosAlt -Dtests.method=testBasics -Dtests.seed=BAE64CA36CFAE2E -Dtests.multiplier=2 -Dtests.slow=true -Dtests.locale=fr-LU -Dtests.timezone=ROK -Dtests.asserts=true -Dtests.file.encoding=ISO-8859-1
   [junit4] ERROR   12.5s J0 | TestSolrCloudWithKerberosAlt.testBasics <<<
   [junit4]    > Throwable #1: java.net.BindException: Address already in use
   [junit4]    > 	at __randomizedtesting.SeedInfo.seed([BAE64CA36CFAE2E:3676CAE60E21F05E]:0)
   [junit4]    > 	at sun.nio.ch.Net.bind0(Native Method)
   [junit4]    > 	at sun.nio.ch.Net.bind(Net.java:433)
   [junit4]    > 	at sun.nio.ch.Net.bind(Net.java:425)
   [junit4]    > 	at sun.nio.ch.ServerSocketChannelImpl.bind(ServerSocketChannelImpl.java:223)
   [junit4]    > 	at sun.nio.ch.ServerSocketAdaptor.bind(ServerSocketAdaptor.java:74)
   [junit4]    > 	at org.apache.mina.transport.socket.nio.NioSocketAcceptor.open(NioSocketAcceptor.java:252)
   [junit4]    > 	at org.apache.mina.transport.socket.nio.NioSocketAcceptor.open(NioSocketAcceptor.java:49)
   [junit4]    > 	at org.apache.mina.core.polling.AbstractPollingIoAcceptor.registerHandles(AbstractPollingIoAcceptor.java:525)
   [junit4]    > 	at org.apache.mina.core.polling.AbstractPollingIoAcceptor.access$200(AbstractPollingIoAcceptor.java:67)
   [junit4]    > 	at org.apache.mina.core.polling.AbstractPollingIoAcceptor$Acceptor.run(AbstractPollingIoAcceptor.java:409)
   [junit4]    > 	at org.apache.mina.util.NamePreservingRunnable.run(NamePreservingRunnable.java:65)
   [junit4]    > 	at java.util.concurrent.ThreadPoolExecutor.runWorker(ThreadPoolExecutor.java:1142)
   [junit4]    > 	at java.util.concurrent.ThreadPoolExecutor$Worker.run(ThreadPoolExecutor.java:617)
   [junit4]    > 	at java.lang.Thread.run(Thread.java:745)
   [junit4]   2> NOTE: leaving temporary files on disk at: /x1/jenkins/jenkins-slave/workspace/Lucene-Solr-Tests-master/solr/build/solr-core/test/J0/temp/solr.cloud.TestSolrCloudWithKerberosAlt_BAE64CA36CFAE2E-001
   [junit4]   2> NOTE: test params are: codec=Asserting(Lucene62): {}, docValues:{}, maxPointsInLeafNode=1329, maxMBSortInHeap=6.909043849440261, sim=ClassicSimilarity, locale=fr-LU, timezone=ROK
   [junit4]   2> NOTE: Linux 3.13.0-85-generic amd64/Oracle Corporation 1.8.0_102 (64-bit)/cpus=4,threads=1,free=111632032,total=521142272
   [junit4]   2> NOTE: All tests run in this JVM: [DeleteInactiveReplicaTest, TestAtomicUpdateErrorCases, DistributedSpellCheckComponentTest, TestRealTimeGet, SynonymTokenizerTest, TestSortByMinMaxFunction, ChaosMonkeyNothingIsSafeTest, BasicZkTest, TestRangeQuery, TestCrossCoreJoin, ResponseHeaderTest, NotRequiredUniqueKeyTest, BasicDistributedZkTest, CursorPagingTest, DistributedSuggestComponentTest, AsyncCallRequestStatusResponseTest, TestRemoteStreaming, TestCloudPseudoReturnFields, TestScoreJoinQPNoScore, UniqFieldsUpdateProcessorFactoryTest, ConnectionManagerTest, TestJmxIntegration, AlternateDirectoryTest, RemoteQueryErrorTest, TestLegacyNumericRangeQueryBuilder, TestRestManager, CdcrBootstrapTest, TestLocalFSCloudBackupRestore, TestSubQueryTransformerDistrib, FastVectorHighlighterTest, TestSolrFieldCacheMBean, TestMacroExpander, NumericFieldsTest, ReturnFieldsTest, DocExpirationUpdateProcessorFactoryTest, RequiredFieldsTest, TestRandomFaceting, TestSSLRandomization, TestJoin, TestComponentsName, TestHdfsCloudBackupRestore, OutputWriterTest, TestSolrCloudWithDelegationTokens, PreAnalyzedUpdateProcessorTest, DistributedFacetPivotWhiteBoxTest, RankQueryTest, TestFastLRUCache, TestUseDocValuesAsStored, DistributedQueueTest, TestDynamicFieldResource, LeaderInitiatedRecoveryOnShardRestartTest, CacheHeaderTest, TestFieldCacheVsDocValues, DateFieldTest, TestNRTOpen, BasicAuthIntegrationTest, HdfsTlogReplayBufferedWhileIndexingTest, SmileWriterTest, SolrRequestParserTest, TestDistribDocBasedVersion, TestSolr4Spatial, TestBackupRepositoryFactory, TestBlendedInfixSuggestions, HighlighterConfigTest, RestartWhileUpdatingTest, TestRandomFlRTGCloud, CachingDirectoryFactoryTest, ExplicitHLLTest, WrapperMergePolicyFactoryTest, TestRawTransformer, SolrCoreTest, HdfsNNFailoverTest, OverseerTaskQueueTest, QueryEqualityTest, CurrencyFieldOpenExchangeTest, CollectionStateFormat2Test, OverseerModifyCollectionTest, TestPHPSerializedResponseWriter, DistribCursorPagingTest, TestReplicationHandler, CdcrRequestHandlerTest, CollectionsAPISolrJTest, TestBadConfig, DefaultValueUpdateProcessorTest, SpatialRPTFieldTypeTest, TestReplicaProperties, TestRandomDVFaceting, TestFunctionQuery, AnalyticsQueryTest, TestDocumentBuilder, TestSimpleQParserPlugin, TestHighFrequencyDictionaryFactory, SolrCloudExampleTest, UUIDUpdateProcessorFallbackTest, TestJsonFacets, StandardRequestHandlerTest, TestSchemaResource, TestRandomCollapseQParserPlugin, ActionThrottleTest, TestExpandComponent, VMParamsZkACLAndCredentialsProvidersTest, PolyFieldTest, TestPseudoReturnFields, StatelessScriptUpdateProcessorFactoryTest, TestSurroundQueryParser, DirectSolrSpellCheckerTest, PrimitiveFieldTypeTest, FileBasedSpellCheckerTest, TestValueSourceCache, FieldAnalysisRequestHandlerTest, RegexBoostProcessorTest, IndexSchemaTest, MBeansHandlerTest, JsonLoaderTest, CSVRequestHandlerTest, TestLFUCache, ConcurrentDeleteAndCreateCollectionTest, ConfigSetsAPITest, DeleteNodeTest, DeleteShardTest, DistribJoinFromCollectionTest, ForceLeaderTest, MigrateRouteKeyTest, OverseerStatusTest, PeerSyncReplicationTest, TestCloudDeleteByQuery, TestCollectionAPI, TestMiniSolrCloudCluster, TestRequestStatusCollectionAPI, TestSolrCloudWithKerberosAlt]
   [junit4] Completed [481/631 (2!)] on J0 in 12.50s, 1 test, 1 error <<< FAILURES!

[...truncated 60690 lines...]



Mime
View raw message