lucene-dev mailing list archives

Site index · List index
Message view « Date » · « Thread »
Top « Date » · « Thread »
From Policeman Jenkins Server <jenk...@thetaphi.de>
Subject [JENKINS] Lucene-Solr-master-Linux (32bit/jdk1.8.0_102) - Build # 17806 - Unstable!
Date Mon, 12 Sep 2016 12:53:37 GMT
Build: http://jenkins.thetaphi.de/job/Lucene-Solr-master-Linux/17806/
Java: 32bit/jdk1.8.0_102 -client -XX:+UseConcMarkSweepGC

1 tests failed.
FAILED:  org.apache.solr.util.TestSolrCLIRunExample.testInteractiveSolrCloudExample

Error Message:
Expected 10 to be found in the testCloudExamplePrompt collection but only found 9

Stack Trace:
java.lang.AssertionError: Expected 10 to be found in the testCloudExamplePrompt collection but only found 9
	at __randomizedtesting.SeedInfo.seed([35386553C80D07AC:EE498599FF78C2CA]:0)
	at org.junit.Assert.fail(Assert.java:93)
	at org.apache.solr.util.TestSolrCLIRunExample.testInteractiveSolrCloudExample(TestSolrCLIRunExample.java:457)
	at sun.reflect.NativeMethodAccessorImpl.invoke0(Native Method)
	at sun.reflect.NativeMethodAccessorImpl.invoke(NativeMethodAccessorImpl.java:62)
	at sun.reflect.DelegatingMethodAccessorImpl.invoke(DelegatingMethodAccessorImpl.java:43)
	at java.lang.reflect.Method.invoke(Method.java:498)
	at com.carrotsearch.randomizedtesting.RandomizedRunner.invoke(RandomizedRunner.java:1764)
	at com.carrotsearch.randomizedtesting.RandomizedRunner$8.evaluate(RandomizedRunner.java:871)
	at com.carrotsearch.randomizedtesting.RandomizedRunner$9.evaluate(RandomizedRunner.java:907)
	at com.carrotsearch.randomizedtesting.RandomizedRunner$10.evaluate(RandomizedRunner.java:921)
	at com.carrotsearch.randomizedtesting.rules.SystemPropertiesRestoreRule$1.evaluate(SystemPropertiesRestoreRule.java:57)
	at org.apache.lucene.util.TestRuleSetupTeardownChained$1.evaluate(TestRuleSetupTeardownChained.java:49)
	at org.apache.lucene.util.AbstractBeforeAfterRule$1.evaluate(AbstractBeforeAfterRule.java:45)
	at org.apache.lucene.util.TestRuleThreadAndTestName$1.evaluate(TestRuleThreadAndTestName.java:48)
	at org.apache.lucene.util.TestRuleIgnoreAfterMaxFailures$1.evaluate(TestRuleIgnoreAfterMaxFailures.java:64)
	at org.apache.lucene.util.TestRuleMarkFailure$1.evaluate(TestRuleMarkFailure.java:47)
	at com.carrotsearch.randomizedtesting.rules.StatementAdapter.evaluate(StatementAdapter.java:36)
	at com.carrotsearch.randomizedtesting.ThreadLeakControl$StatementRunner.run(ThreadLeakControl.java:367)
	at com.carrotsearch.randomizedtesting.ThreadLeakControl.forkTimeoutingTask(ThreadLeakControl.java:809)
	at com.carrotsearch.randomizedtesting.ThreadLeakControl$3.evaluate(ThreadLeakControl.java:460)
	at com.carrotsearch.randomizedtesting.RandomizedRunner.runSingleTest(RandomizedRunner.java:880)
	at com.carrotsearch.randomizedtesting.RandomizedRunner$5.evaluate(RandomizedRunner.java:781)
	at com.carrotsearch.randomizedtesting.RandomizedRunner$6.evaluate(RandomizedRunner.java:816)
	at com.carrotsearch.randomizedtesting.RandomizedRunner$7.evaluate(RandomizedRunner.java:827)
	at com.carrotsearch.randomizedtesting.rules.StatementAdapter.evaluate(StatementAdapter.java:36)
	at com.carrotsearch.randomizedtesting.rules.SystemPropertiesRestoreRule$1.evaluate(SystemPropertiesRestoreRule.java:57)
	at org.apache.lucene.util.AbstractBeforeAfterRule$1.evaluate(AbstractBeforeAfterRule.java:45)
	at com.carrotsearch.randomizedtesting.rules.StatementAdapter.evaluate(StatementAdapter.java:36)
	at org.apache.lucene.util.TestRuleStoreClassName$1.evaluate(TestRuleStoreClassName.java:41)
	at com.carrotsearch.randomizedtesting.rules.NoShadowingOrOverridesOnMethodsRule$1.evaluate(NoShadowingOrOverridesOnMethodsRule.java:40)
	at com.carrotsearch.randomizedtesting.rules.NoShadowingOrOverridesOnMethodsRule$1.evaluate(NoShadowingOrOverridesOnMethodsRule.java:40)
	at com.carrotsearch.randomizedtesting.rules.StatementAdapter.evaluate(StatementAdapter.java:36)
	at com.carrotsearch.randomizedtesting.rules.StatementAdapter.evaluate(StatementAdapter.java:36)
	at com.carrotsearch.randomizedtesting.rules.StatementAdapter.evaluate(StatementAdapter.java:36)
	at org.apache.lucene.util.TestRuleAssertionsRequired$1.evaluate(TestRuleAssertionsRequired.java:53)
	at org.apache.lucene.util.TestRuleMarkFailure$1.evaluate(TestRuleMarkFailure.java:47)
	at org.apache.lucene.util.TestRuleIgnoreAfterMaxFailures$1.evaluate(TestRuleIgnoreAfterMaxFailures.java:64)
	at org.apache.lucene.util.TestRuleIgnoreTestSuites$1.evaluate(TestRuleIgnoreTestSuites.java:54)
	at com.carrotsearch.randomizedtesting.rules.StatementAdapter.evaluate(StatementAdapter.java:36)
	at com.carrotsearch.randomizedtesting.ThreadLeakControl$StatementRunner.run(ThreadLeakControl.java:367)
	at java.lang.Thread.run(Thread.java:745)




Build Log:
[...truncated 11255 lines...]
   [junit4] Suite: org.apache.solr.util.TestSolrCLIRunExample
   [junit4]   2> Creating dataDir: /home/jenkins/workspace/Lucene-Solr-master-Linux/solr/build/solr-core/test/J1/temp/solr.util.TestSolrCLIRunExample_35386553C80D07AC-001/init-core-data-001
   [junit4]   2> 1100176 INFO  (SUITE-TestSolrCLIRunExample-seed#[35386553C80D07AC]-worker) [    ] o.a.s.SolrTestCaseJ4 Randomized ssl (false) and clientAuth (false) via: @org.apache.solr.SolrTestCaseJ4$SuppressSSL(bugUrl=https://issues.apache.org/jira/browse/SOLR-5776)
   [junit4]   2> 1100177 INFO  (TEST-TestSolrCLIRunExample.testInteractiveSolrCloudExample-seed#[35386553C80D07AC]) [    ] o.a.s.SolrTestCaseJ4 ###Starting testInteractiveSolrCloudExample
   [junit4]   2> 1100216 INFO  (TEST-TestSolrCLIRunExample.testInteractiveSolrCloudExample-seed#[35386553C80D07AC]) [    ] o.a.s.c.ZkTestServer STARTING ZK TEST SERVER
   [junit4]   2> 1100216 INFO  (Thread-1613) [    ] o.a.s.c.ZkTestServer client port:0.0.0.0/0.0.0.0:0
   [junit4]   2> 1100216 INFO  (Thread-1613) [    ] o.a.s.c.ZkTestServer Starting server
   [junit4]   2> 1100316 INFO  (TEST-TestSolrCLIRunExample.testInteractiveSolrCloudExample-seed#[35386553C80D07AC]) [    ] o.a.s.c.ZkTestServer start zk server on port:43955
   [junit4]   2> 1100316 INFO  (TEST-TestSolrCLIRunExample.testInteractiveSolrCloudExample-seed#[35386553C80D07AC]) [    ] o.a.s.c.c.SolrZkClient Using default ZkCredentialsProvider
   [junit4]   2> 1100317 INFO  (TEST-TestSolrCLIRunExample.testInteractiveSolrCloudExample-seed#[35386553C80D07AC]) [    ] o.a.s.c.c.ConnectionManager Waiting for client to connect to ZooKeeper
   [junit4]   2> 1100318 INFO  (zkCallback-20953-thread-1) [    ] o.a.s.c.c.ConnectionManager Watcher org.apache.solr.common.cloud.ConnectionManager@1ee3270 name:ZooKeeperConnection Watcher:127.0.0.1:43955 got event WatchedEvent state:SyncConnected type:None path:null path:null type:None
   [junit4]   2> 1100318 INFO  (TEST-TestSolrCLIRunExample.testInteractiveSolrCloudExample-seed#[35386553C80D07AC]) [    ] o.a.s.c.c.ConnectionManager Client is connected to ZooKeeper
   [junit4]   2> 1100318 INFO  (TEST-TestSolrCLIRunExample.testInteractiveSolrCloudExample-seed#[35386553C80D07AC]) [    ] o.a.s.c.c.SolrZkClient Using default ZkACLProvider
   [junit4]   2> 1100318 INFO  (TEST-TestSolrCLIRunExample.testInteractiveSolrCloudExample-seed#[35386553C80D07AC]) [    ] o.a.s.c.c.SolrZkClient makePath: /solr/solr.xml
   [junit4]   2> 1100321 INFO  (jetty-launcher-20952-thread-1) [    ] o.e.j.s.Server jetty-9.3.8.v20160314
   [junit4]   2> 1100321 INFO  (jetty-launcher-20952-thread-1) [    ] o.e.j.s.h.ContextHandler Started o.e.j.s.ServletContextHandler@1ca34aa{/solr,null,AVAILABLE}
   [junit4]   2> 1100322 INFO  (jetty-launcher-20952-thread-1) [    ] o.e.j.s.ServerConnector Started ServerConnector@550896{HTTP/1.1,[http/1.1]}{127.0.0.1:45751}
   [junit4]   2> 1100322 INFO  (jetty-launcher-20952-thread-1) [    ] o.e.j.s.Server Started @1102087ms
   [junit4]   2> 1100322 INFO  (jetty-launcher-20952-thread-1) [    ] o.a.s.c.s.e.JettySolrRunner Jetty properties: {hostContext=/solr, hostPort=45751}
   [junit4]   2> 1100322 INFO  (jetty-launcher-20952-thread-1) [    ] o.a.s.s.SolrDispatchFilter SolrDispatchFilter.init(): sun.misc.Launcher$AppClassLoader@1d16e93
   [junit4]   2> 1100322 INFO  (jetty-launcher-20952-thread-1) [    ] o.a.s.c.SolrResourceLoader new SolrResourceLoader for directory: '/home/jenkins/workspace/Lucene-Solr-master-Linux/solr/build/solr-core/test/J1/temp/solr.util.TestSolrCLIRunExample_35386553C80D07AC-001/tempDir-002/node1'
   [junit4]   2> 1100322 INFO  (jetty-launcher-20952-thread-1) [    ] o.a.s.c.SolrResourceLoader JNDI not configured for solr (NoInitialContextEx)
   [junit4]   2> 1100322 INFO  (jetty-launcher-20952-thread-1) [    ] o.a.s.c.SolrResourceLoader solr home defaulted to 'solr/' (could not find system property or JNDI)
   [junit4]   2> 1100322 INFO  (jetty-launcher-20952-thread-1) [    ] o.a.s.c.c.SolrZkClient Using default ZkCredentialsProvider
   [junit4]   2> 1100323 INFO  (jetty-launcher-20952-thread-1) [    ] o.a.s.c.c.ConnectionManager Waiting for client to connect to ZooKeeper
   [junit4]   2> 1100323 INFO  (zkCallback-20954-thread-1) [    ] o.a.s.c.c.ConnectionManager Watcher org.apache.solr.common.cloud.ConnectionManager@7b7947 name:ZooKeeperConnection Watcher:127.0.0.1:43955/solr got event WatchedEvent state:SyncConnected type:None path:null path:null type:None
   [junit4]   2> 1100323 INFO  (jetty-launcher-20952-thread-1) [    ] o.a.s.c.c.ConnectionManager Client is connected to ZooKeeper
   [junit4]   2> 1100323 INFO  (jetty-launcher-20952-thread-1) [    ] o.a.s.c.c.SolrZkClient Using default ZkACLProvider
   [junit4]   2> 1100323 INFO  (jetty-launcher-20952-thread-1) [    ] o.a.s.s.SolrDispatchFilter solr.xml found in ZooKeeper. Loading...
   [junit4]   2> 1100332 INFO  (jetty-launcher-20952-thread-1) [    ] o.a.s.c.CorePropertiesLocator Config-defined core root directory: /home/jenkins/workspace/Lucene-Solr-master-Linux/solr/build/solr-core/test/J1/temp/solr.util.TestSolrCLIRunExample_35386553C80D07AC-001/tempDir-002/node1
   [junit4]   2> 1100332 INFO  (jetty-launcher-20952-thread-1) [    ] o.a.s.c.CoreContainer New CoreContainer 24847382
   [junit4]   2> 1100332 INFO  (jetty-launcher-20952-thread-1) [    ] o.a.s.c.CoreContainer Loading cores into CoreContainer [instanceDir=/home/jenkins/workspace/Lucene-Solr-master-Linux/solr/build/solr-core/test/J1/temp/solr.util.TestSolrCLIRunExample_35386553C80D07AC-001/tempDir-002/node1]
   [junit4]   2> 1100332 WARN  (jetty-launcher-20952-thread-1) [    ] o.a.s.c.CoreContainer Couldn't add files from /home/jenkins/workspace/Lucene-Solr-master-Linux/solr/build/solr-core/test/J1/temp/solr.util.TestSolrCLIRunExample_35386553C80D07AC-001/tempDir-002/node1/lib to classpath: /home/jenkins/workspace/Lucene-Solr-master-Linux/solr/build/solr-core/test/J1/temp/solr.util.TestSolrCLIRunExample_35386553C80D07AC-001/tempDir-002/node1/lib
   [junit4]   2> 1100332 INFO  (jetty-launcher-20952-thread-1) [    ] o.a.s.h.c.HttpShardHandlerFactory created with socketTimeout : 600000,connTimeout : 60000,maxConnectionsPerHost : 20,maxConnections : 10000,corePoolSize : 0,maximumPoolSize : 2147483647,maxThreadIdleTime : 5,sizeOfQueue : -1,fairnessPolicy : false,
   [junit4]   2> 1100334 INFO  (jetty-launcher-20952-thread-1) [    ] o.a.s.u.UpdateShardHandler Created UpdateShardHandler HTTP client with params: socketTimeout=600000&connTimeout=60000&maxConnections=100000&maxConnectionsPerHost=100000
   [junit4]   2> 1100335 INFO  (jetty-launcher-20952-thread-1) [    ] o.a.s.l.LogWatcher SLF4J impl is org.slf4j.impl.Log4jLoggerFactory
   [junit4]   2> 1100335 INFO  (jetty-launcher-20952-thread-1) [    ] o.a.s.l.LogWatcher Registering Log Listener [Log4j (org.slf4j.impl.Log4jLoggerFactory)]
   [junit4]   2> 1100335 INFO  (jetty-launcher-20952-thread-1) [    ] o.a.s.c.ZkContainer Zookeeper client=127.0.0.1:43955/solr
   [junit4]   2> 1100335 INFO  (jetty-launcher-20952-thread-1) [    ] o.a.s.c.ZkController zkHost includes chroot
   [junit4]   2> 1100335 INFO  (jetty-launcher-20952-thread-1) [    ] o.a.s.c.c.SolrZkClient Using default ZkCredentialsProvider
   [junit4]   2> 1100335 INFO  (jetty-launcher-20952-thread-1) [    ] o.a.s.c.c.ConnectionManager Waiting for client to connect to ZooKeeper
   [junit4]   2> 1100335 INFO  (zkCallback-20957-thread-1) [    ] o.a.s.c.c.ConnectionManager Watcher org.apache.solr.common.cloud.ConnectionManager@13ef05d name:ZooKeeperConnection Watcher:127.0.0.1:43955 got event WatchedEvent state:SyncConnected type:None path:null path:null type:None
   [junit4]   2> 1100336 INFO  (jetty-launcher-20952-thread-1) [    ] o.a.s.c.c.ConnectionManager Client is connected to ZooKeeper
   [junit4]   2> 1100337 INFO  (jetty-launcher-20952-thread-1) [    ] o.a.s.c.c.SolrZkClient Using default ZkACLProvider
   [junit4]   2> 1100338 INFO  (jetty-launcher-20952-thread-1) [n:localhost:45751_solr    ] o.a.s.c.ZkController Added new OnReconnect listener org.apache.solr.cloud.ZkController$$Lambda$73/21434111@1d3e920
   [junit4]   2> 1100338 INFO  (jetty-launcher-20952-thread-1) [n:localhost:45751_solr    ] o.a.s.c.c.ConnectionManager Waiting for client to connect to ZooKeeper
   [junit4]   2> 1100338 INFO  (zkCallback-20958-thread-1-processing-n:localhost:45751_solr) [n:localhost:45751_solr    ] o.a.s.c.c.ConnectionManager Watcher org.apache.solr.common.cloud.ConnectionManager@15d660 name:ZooKeeperConnection Watcher:127.0.0.1:43955/solr got event WatchedEvent state:SyncConnected type:None path:null path:null type:None
   [junit4]   2> 1100339 INFO  (jetty-launcher-20952-thread-1) [n:localhost:45751_solr    ] o.a.s.c.c.ConnectionManager Client is connected to ZooKeeper
   [junit4]   2> 1100339 INFO  (jetty-launcher-20952-thread-1) [n:localhost:45751_solr    ] o.a.s.c.c.SolrZkClient makePath: /overseer/queue
   [junit4]   2> 1100340 INFO  (jetty-launcher-20952-thread-1) [n:localhost:45751_solr    ] o.a.s.c.c.SolrZkClient makePath: /overseer/collection-queue-work
   [junit4]   2> 1100341 INFO  (jetty-launcher-20952-thread-1) [n:localhost:45751_solr    ] o.a.s.c.c.SolrZkClient makePath: /overseer/collection-map-running
   [junit4]   2> 1100342 INFO  (jetty-launcher-20952-thread-1) [n:localhost:45751_solr    ] o.a.s.c.c.SolrZkClient makePath: /overseer/collection-map-completed
   [junit4]   2> 1100343 INFO  (jetty-launcher-20952-thread-1) [n:localhost:45751_solr    ] o.a.s.c.c.SolrZkClient makePath: /overseer/collection-map-failure
   [junit4]   2> 1100344 INFO  (jetty-launcher-20952-thread-1) [n:localhost:45751_solr    ] o.a.s.c.c.SolrZkClient makePath: /live_nodes
   [junit4]   2> 1100344 INFO  (jetty-launcher-20952-thread-1) [n:localhost:45751_solr    ] o.a.s.c.c.SolrZkClient makePath: /collections
   [junit4]   2> 1100344 INFO  (jetty-launcher-20952-thread-1) [n:localhost:45751_solr    ] o.a.s.c.c.SolrZkClient makePath: /aliases.json
   [junit4]   2> 1100345 INFO  (jetty-launcher-20952-thread-1) [n:localhost:45751_solr    ] o.a.s.c.c.SolrZkClient makePath: /clusterstate.json
   [junit4]   2> 1100345 INFO  (jetty-launcher-20952-thread-1) [n:localhost:45751_solr    ] o.a.s.c.c.SolrZkClient makePath: /security.json
   [junit4]   2> 1100346 INFO  (jetty-launcher-20952-thread-1) [n:localhost:45751_solr    ] o.a.s.c.c.ZkStateReader Updating cluster state from ZooKeeper... 
   [junit4]   2> 1100346 INFO  (jetty-launcher-20952-thread-1) [n:localhost:45751_solr    ] o.a.s.c.c.ZkStateReader Loaded empty cluster properties
   [junit4]   2> 1100346 INFO  (jetty-launcher-20952-thread-1) [n:localhost:45751_solr    ] o.a.s.c.c.ZkStateReader Updated live nodes from ZooKeeper... (0) -> (0)
   [junit4]   2> 1100347 INFO  (jetty-launcher-20952-thread-1) [n:localhost:45751_solr    ] o.a.s.c.c.SolrZkClient makePath: /overseer_elect
   [junit4]   2> 1100347 INFO  (jetty-launcher-20952-thread-1) [n:localhost:45751_solr    ] o.a.s.c.c.SolrZkClient makePath: /overseer_elect/election
   [junit4]   2> 1100348 INFO  (jetty-launcher-20952-thread-1) [n:localhost:45751_solr    ] o.a.s.c.Overseer Overseer (id=null) closing
   [junit4]   2> 1100349 INFO  (jetty-launcher-20952-thread-1) [n:localhost:45751_solr    ] o.a.s.c.LeaderElector Joined leadership election with path: /overseer_elect/election/96579266092269571-localhost:45751_solr-n_0000000000
   [junit4]   2> 1100349 INFO  (jetty-launcher-20952-thread-1) [n:localhost:45751_solr    ] o.a.s.c.OverseerElectionContext I am going to be the leader localhost:45751_solr
   [junit4]   2> 1100349 INFO  (jetty-launcher-20952-thread-1) [n:localhost:45751_solr    ] o.a.s.c.c.SolrZkClient makePath: /overseer_elect/leader
   [junit4]   2> 1100349 INFO  (jetty-launcher-20952-thread-1) [n:localhost:45751_solr    ] o.a.s.c.Overseer Overseer (id=96579266092269571-localhost:45751_solr-n_0000000000) starting
   [junit4]   2> 1100350 INFO  (jetty-launcher-20952-thread-1) [n:localhost:45751_solr    ] o.a.s.c.c.SolrZkClient makePath: /overseer/queue-work
   [junit4]   2> 1100352 INFO  (jetty-launcher-20952-thread-1) [n:localhost:45751_solr    ] o.a.s.c.OverseerAutoReplicaFailoverThread Starting OverseerAutoReplicaFailoverThread autoReplicaFailoverWorkLoopDelay=10000 autoReplicaFailoverWaitAfterExpiration=30000 autoReplicaFailoverBadNodeExpiration=60000
   [junit4]   2> 1100352 INFO  (OverseerCollectionConfigSetProcessor-96579266092269571-localhost:45751_solr-n_0000000000) [n:localhost:45751_solr    ] o.a.s.c.OverseerTaskProcessor Process current queue of overseer operations
   [junit4]   2> 1100353 INFO  (jetty-launcher-20952-thread-1) [n:localhost:45751_solr    ] o.a.s.c.ZkController Register node as live in ZooKeeper:/live_nodes/localhost:45751_solr
   [junit4]   2> 1100353 INFO  (OverseerStateUpdate-96579266092269571-localhost:45751_solr-n_0000000000) [n:localhost:45751_solr    ] o.a.s.c.Overseer Starting to work on the main queue
   [junit4]   2> 1100353 INFO  (jetty-launcher-20952-thread-1) [n:localhost:45751_solr    ] o.a.s.c.c.SolrZkClient makePath: /live_nodes/localhost:45751_solr
   [junit4]   2> 1100353 INFO  (OverseerStateUpdate-96579266092269571-localhost:45751_solr-n_0000000000) [n:localhost:45751_solr    ] o.a.s.c.c.ZkStateReader Updated live nodes from ZooKeeper... (0) -> (0)
   [junit4]   2> 1100354 INFO  (zkCallback-20958-thread-1-processing-n:localhost:45751_solr) [n:localhost:45751_solr    ] o.a.s.c.c.ZkStateReader A live node change: [WatchedEvent state:SyncConnected type:NodeChildrenChanged path:/live_nodes], has occurred - updating... (live nodes size: [0])
   [junit4]   2> 1100354 INFO  (zkCallback-20958-thread-1-processing-n:localhost:45751_solr) [n:localhost:45751_solr    ] o.a.s.c.c.ZkStateReader Updated live nodes from ZooKeeper... (0) -> (1)
   [junit4]   2> 1100395 INFO  (jetty-launcher-20952-thread-1) [n:localhost:45751_solr    ] o.a.s.c.CoreContainer Security conf doesn't exist. Skipping setup for authorization module.
   [junit4]   2> 1100395 INFO  (jetty-launcher-20952-thread-1) [n:localhost:45751_solr    ] o.a.s.c.CoreContainer No authentication plugin used.
   [junit4]   2> 1100396 INFO  (jetty-launcher-20952-thread-1) [n:localhost:45751_solr    ] o.a.s.c.CorePropertiesLocator Looking for core definitions underneath /home/jenkins/workspace/Lucene-Solr-master-Linux/solr/build/solr-core/test/J1/temp/solr.util.TestSolrCLIRunExample_35386553C80D07AC-001/tempDir-002/node1
   [junit4]   2> 1100396 INFO  (jetty-launcher-20952-thread-1) [n:localhost:45751_solr    ] o.a.s.c.CorePropertiesLocator Found 0 core definitions
   [junit4]   2> 1100397 INFO  (jetty-launcher-20952-thread-1) [n:localhost:45751_solr    ] o.a.s.s.SolrDispatchFilter user.dir=/home/jenkins/workspace/Lucene-Solr-master-Linux/solr/build/solr-core/test/J1
   [junit4]   2> 1100397 INFO  (jetty-launcher-20952-thread-1) [n:localhost:45751_solr    ] o.a.s.s.SolrDispatchFilter SolrDispatchFilter.init() done
   [junit4]   2> 1100397 INFO  (TEST-TestSolrCLIRunExample.testInteractiveSolrCloudExample-seed#[35386553C80D07AC]) [    ] o.a.s.c.c.SolrZkClient Using default ZkCredentialsProvider
   [junit4]   2> 1100397 INFO  (TEST-TestSolrCLIRunExample.testInteractiveSolrCloudExample-seed#[35386553C80D07AC]) [    ] o.a.s.c.c.ConnectionManager Waiting for client to connect to ZooKeeper
   [junit4]   2> 1100398 INFO  (zkCallback-20960-thread-1) [    ] o.a.s.c.c.ConnectionManager Watcher org.apache.solr.common.cloud.ConnectionManager@a11413 name:ZooKeeperConnection Watcher:127.0.0.1:43955 got event WatchedEvent state:SyncConnected type:None path:null path:null type:None
   [junit4]   2> 1100398 INFO  (TEST-TestSolrCLIRunExample.testInteractiveSolrCloudExample-seed#[35386553C80D07AC]) [    ] o.a.s.c.c.ConnectionManager Client is connected to ZooKeeper
   [junit4]   2> 1100399 INFO  (TEST-TestSolrCLIRunExample.testInteractiveSolrCloudExample-seed#[35386553C80D07AC]) [    ] o.a.s.c.c.SolrZkClient Using default ZkACLProvider
   [junit4]   2> 1100421 INFO  (qtp23129046-79023) [n:localhost:45751_solr    ] o.a.s.s.HttpSolrCall [admin] webapp=null path=/admin/info/system params={wt=json} status=0 QTime=15
   [junit4]   2> 1100426 INFO  (qtp23129046-79024) [n:localhost:45751_solr    ] o.a.s.h.a.CollectionsHandler Invoked Collection Action :clusterstatus with params action=CLUSTERSTATUS&wt=json and sendToOCPQueue=true
   [junit4]   2> 1100426 INFO  (qtp23129046-79024) [n:localhost:45751_solr    ] o.a.s.s.HttpSolrCall [admin] webapp=null path=/admin/collections params={action=CLUSTERSTATUS&wt=json} status=0 QTime=0
   [junit4]   2> 1100428 INFO  (TEST-TestSolrCLIRunExample.testInteractiveSolrCloudExample-seed#[35386553C80D07AC]) [    ] o.a.s.c.c.SolrZkClient Using default ZkCredentialsProvider
   [junit4]   2> 1100428 INFO  (TEST-TestSolrCLIRunExample.testInteractiveSolrCloudExample-seed#[35386553C80D07AC]) [    ] o.a.s.c.c.ConnectionManager Waiting for client to connect to ZooKeeper
   [junit4]   2> 1100429 INFO  (zkCallback-20964-thread-1) [    ] o.a.s.c.c.ConnectionManager Watcher org.apache.solr.common.cloud.ConnectionManager@998b61 name:ZooKeeperConnection Watcher:127.0.0.1:43955/solr got event WatchedEvent state:SyncConnected type:None path:null path:null type:None
   [junit4]   2> 1100429 INFO  (TEST-TestSolrCLIRunExample.testInteractiveSolrCloudExample-seed#[35386553C80D07AC]) [    ] o.a.s.c.c.ConnectionManager Client is connected to ZooKeeper
   [junit4]   2> 1100429 INFO  (TEST-TestSolrCLIRunExample.testInteractiveSolrCloudExample-seed#[35386553C80D07AC]) [    ] o.a.s.c.c.SolrZkClient Using default ZkACLProvider
   [junit4]   2> 1100430 INFO  (TEST-TestSolrCLIRunExample.testInteractiveSolrCloudExample-seed#[35386553C80D07AC]) [    ] o.a.s.c.c.ZkStateReader Updating cluster state from ZooKeeper... 
   [junit4]   2> 1100430 INFO  (TEST-TestSolrCLIRunExample.testInteractiveSolrCloudExample-seed#[35386553C80D07AC]) [    ] o.a.s.c.c.ZkStateReader Loaded empty cluster properties
   [junit4]   2> 1100430 INFO  (TEST-TestSolrCLIRunExample.testInteractiveSolrCloudExample-seed#[35386553C80D07AC]) [    ] o.a.s.c.c.ZkStateReader Updated live nodes from ZooKeeper... (0) -> (1)
   [junit4]   2> 1100434 INFO  (qtp23129046-79024) [n:localhost:45751_solr    ] o.a.s.h.a.CollectionsHandler Invoked Collection Action :list with params action=list&wt=json and sendToOCPQueue=true
   [junit4]   2> 1100434 INFO  (qtp23129046-79024) [n:localhost:45751_solr    ] o.a.s.s.HttpSolrCall [admin] webapp=null path=/admin/collections params={action=list&wt=json} status=0 QTime=0
   [junit4]   2> 1100442 INFO  (qtp23129046-79024) [n:localhost:45751_solr    ] o.a.s.s.HttpSolrCall [admin] webapp=null path=/admin/info/system params={wt=json} status=0 QTime=4
   [junit4]   2> 1100447 INFO  (qtp23129046-79025) [n:localhost:45751_solr    ] o.a.s.h.a.CollectionsHandler Invoked Collection Action :clusterstatus with params action=CLUSTERSTATUS&wt=json and sendToOCPQueue=true
   [junit4]   2> 1100447 INFO  (qtp23129046-79025) [n:localhost:45751_solr    ] o.a.s.s.HttpSolrCall [admin] webapp=null path=/admin/collections params={action=CLUSTERSTATUS&wt=json} status=0 QTime=0
   [junit4]   2> 1100449 INFO  (TEST-TestSolrCLIRunExample.testInteractiveSolrCloudExample-seed#[35386553C80D07AC]) [    ] o.a.s.c.c.SolrZkClient Using default ZkCredentialsProvider
   [junit4]   2> 1100450 INFO  (TEST-TestSolrCLIRunExample.testInteractiveSolrCloudExample-seed#[35386553C80D07AC]) [    ] o.a.s.c.c.ConnectionManager Waiting for client to connect to ZooKeeper
   [junit4]   2> 1100450 INFO  (zkCallback-20967-thread-1) [    ] o.a.s.c.c.ConnectionManager Watcher org.apache.solr.common.cloud.ConnectionManager@90d18d name:ZooKeeperConnection Watcher:127.0.0.1:43955/solr got event WatchedEvent state:SyncConnected type:None path:null path:null type:None
   [junit4]   2> 1100450 INFO  (TEST-TestSolrCLIRunExample.testInteractiveSolrCloudExample-seed#[35386553C80D07AC]) [    ] o.a.s.c.c.ConnectionManager Client is connected to ZooKeeper
   [junit4]   2> 1100451 INFO  (TEST-TestSolrCLIRunExample.testInteractiveSolrCloudExample-seed#[35386553C80D07AC]) [    ] o.a.s.c.c.SolrZkClient Using default ZkACLProvider
   [junit4]   2> 1100451 INFO  (TEST-TestSolrCLIRunExample.testInteractiveSolrCloudExample-seed#[35386553C80D07AC]) [    ] o.a.s.c.c.ZkStateReader Updating cluster state from ZooKeeper... 
   [junit4]   2> 1100451 INFO  (TEST-TestSolrCLIRunExample.testInteractiveSolrCloudExample-seed#[35386553C80D07AC]) [    ] o.a.s.c.c.ZkStateReader Loaded empty cluster properties
   [junit4]   2> 1100451 INFO  (TEST-TestSolrCLIRunExample.testInteractiveSolrCloudExample-seed#[35386553C80D07AC]) [    ] o.a.s.c.c.ZkStateReader Updated live nodes from ZooKeeper... (0) -> (1)
   [junit4]   2> 1100453 INFO  (TEST-TestSolrCLIRunExample.testInteractiveSolrCloudExample-seed#[35386553C80D07AC]) [    ] o.a.s.c.c.SolrZkClient makePath: /configs/testCloudExamplePrompt/protwords.txt
   [junit4]   2> 1100454 INFO  (TEST-TestSolrCLIRunExample.testInteractiveSolrCloudExample-seed#[35386553C80D07AC]) [    ] o.a.s.c.c.SolrZkClient makePath: /configs/testCloudExamplePrompt/solrconfig.xml
   [junit4]   2> 1100455 INFO  (TEST-TestSolrCLIRunExample.testInteractiveSolrCloudExample-seed#[35386553C80D07AC]) [    ] o.a.s.c.c.SolrZkClient makePath: /configs/testCloudExamplePrompt/stopwords.txt
   [junit4]   2> 1100456 INFO  (TEST-TestSolrCLIRunExample.testInteractiveSolrCloudExample-seed#[35386553C80D07AC]) [    ] o.a.s.c.c.SolrZkClient makePath: /configs/testCloudExamplePrompt/lang/stopwords_ar.txt
   [junit4]   2> 1100457 INFO  (TEST-TestSolrCLIRunExample.testInteractiveSolrCloudExample-seed#[35386553C80D07AC]) [    ] o.a.s.c.c.SolrZkClient makePath: /configs/testCloudExamplePrompt/lang/stopwords_el.txt
   [junit4]   2> 1100458 INFO  (TEST-TestSolrCLIRunExample.testInteractiveSolrCloudExample-seed#[35386553C80D07AC]) [    ] o.a.s.c.c.SolrZkClient makePath: /configs/testCloudExamplePrompt/lang/stopwords_ja.txt
   [junit4]   2> 1100458 INFO  (TEST-TestSolrCLIRunExample.testInteractiveSolrCloudExample-seed#[35386553C80D07AC]) [    ] o.a.s.c.c.SolrZkClient makePath: /configs/testCloudExamplePrompt/lang/stopwords_gl.txt
   [junit4]   2> 1100459 INFO  (TEST-TestSolrCLIRunExample.testInteractiveSolrCloudExample-seed#[35386553C80D07AC]) [    ] o.a.s.c.c.SolrZkClient makePath: /configs/testCloudExamplePrompt/lang/contractions_fr.txt
   [junit4]   2> 1100460 INFO  (TEST-TestSolrCLIRunExample.testInteractiveSolrCloudExample-seed#[35386553C80D07AC]) [    ] o.a.s.c.c.SolrZkClient makePath: /configs/testCloudExamplePrompt/lang/stopwords_fr.txt
   [junit4]   2> 1100461 INFO  (TEST-TestSolrCLIRunExample.testInteractiveSolrCloudExample-seed#[35386553C80D07AC]) [    ] o.a.s.c.c.SolrZkClient makePath: /configs/testCloudExamplePrompt/lang/stopwords_nl.txt
   [junit4]   2> 1100462 INFO  (TEST-TestSolrCLIRunExample.testInteractiveSolrCloudExample-seed#[35386553C80D07AC]) [    ] o.a.s.c.c.SolrZkClient makePath: /configs/testCloudExamplePrompt/lang/stopwords_cz.txt
   [junit4]   2> 1100463 INFO  (TEST-TestSolrCLIRunExample.testInteractiveSolrCloudExample-seed#[35386553C80D07AC]) [    ] o.a.s.c.c.SolrZkClient makePath: /configs/testCloudExamplePrompt/lang/stopwords_ca.txt
   [junit4]   2> 1100464 INFO  (TEST-TestSolrCLIRunExample.testInteractiveSolrCloudExample-seed#[35386553C80D07AC]) [    ] o.a.s.c.c.SolrZkClient makePath: /configs/testCloudExamplePrompt/lang/stopwords_de.txt
   [junit4]   2> 1100464 INFO  (TEST-TestSolrCLIRunExample.testInteractiveSolrCloudExample-seed#[35386553C80D07AC]) [    ] o.a.s.c.c.SolrZkClient makePath: /configs/testCloudExamplePrompt/lang/contractions_ga.txt
   [junit4]   2> 1100465 INFO  (TEST-TestSolrCLIRunExample.testInteractiveSolrCloudExample-seed#[35386553C80D07AC]) [    ] o.a.s.c.c.SolrZkClient makePath: /configs/testCloudExamplePrompt/lang/stopwords_da.txt
   [junit4]   2> 1100466 INFO  (TEST-TestSolrCLIRunExample.testInteractiveSolrCloudExample-seed#[35386553C80D07AC]) [    ] o.a.s.c.c.SolrZkClient makePath: /configs/testCloudExamplePrompt/lang/stopwords_no.txt
   [junit4]   2> 1100467 INFO  (TEST-TestSolrCLIRunExample.testInteractiveSolrCloudExample-seed#[35386553C80D07AC]) [    ] o.a.s.c.c.SolrZkClient makePath: /configs/testCloudExamplePrompt/lang/stopwords_es.txt
   [junit4]   2> 1100468 INFO  (TEST-TestSolrCLIRunExample.testInteractiveSolrCloudExample-seed#[35386553C80D07AC]) [    ] o.a.s.c.c.SolrZkClient makePath: /configs/testCloudExamplePrompt/lang/stopwords_sv.txt
   [junit4]   2> 1100470 INFO  (TEST-TestSolrCLIRunExample.testInteractiveSolrCloudExample-seed#[35386553C80D07AC]) [    ] o.a.s.c.c.SolrZkClient makePath: /configs/testCloudExamplePrompt/lang/stopwords_fi.txt
   [junit4]   2> 1100470 INFO  (TEST-TestSolrCLIRunExample.testInteractiveSolrCloudExample-seed#[35386553C80D07AC]) [    ] o.a.s.c.c.SolrZkClient makePath: /configs/testCloudExamplePrompt/lang/stopwords_hu.txt
   [junit4]   2> 1100471 INFO  (TEST-TestSolrCLIRunExample.testInteractiveSolrCloudExample-seed#[35386553C80D07AC]) [    ] o.a.s.c.c.SolrZkClient makePath: /configs/testCloudExamplePrompt/lang/stopwords_bg.txt
   [junit4]   2> 1100472 INFO  (TEST-TestSolrCLIRunExample.testInteractiveSolrCloudExample-seed#[35386553C80D07AC]) [    ] o.a.s.c.c.SolrZkClient makePath: /configs/testCloudExamplePrompt/lang/stopwords_fa.txt
   [junit4]   2> 1100473 INFO  (TEST-TestSolrCLIRunExample.testInteractiveSolrCloudExample-seed#[35386553C80D07AC]) [    ] o.a.s.c.c.SolrZkClient makePath: /configs/testCloudExamplePrompt/lang/contractions_it.txt
   [junit4]   2> 1100473 INFO  (TEST-TestSolrCLIRunExample.testInteractiveSolrCloudExample-seed#[35386553C80D07AC]) [    ] o.a.s.c.c.SolrZkClient makePath: /configs/testCloudExamplePrompt/lang/stopwords_eu.txt
   [junit4]   2> 1100474 INFO  (TEST-TestSolrCLIRunExample.testInteractiveSolrCloudExample-seed#[35386553C80D07AC]) [    ] o.a.s.c.c.SolrZkClient makePath: /configs/testCloudExamplePrompt/lang/stopwords_ro.txt
   [junit4]   2> 1100475 INFO  (TEST-TestSolrCLIRunExample.testInteractiveSolrCloudExample-seed#[35386553C80D07AC]) [    ] o.a.s.c.c.SolrZkClient makePath: /configs/testCloudExamplePrompt/lang/stopwords_ga.txt
   [junit4]   2> 1100475 INFO  (TEST-TestSolrCLIRunExample.testInteractiveSolrCloudExample-seed#[35386553C80D07AC]) [    ] o.a.s.c.c.SolrZkClient makePath: /configs/testCloudExamplePrompt/lang/stemdict_nl.txt
   [junit4]   2> 1100476 INFO  (TEST-TestSolrCLIRunExample.testInteractiveSolrCloudExample-seed#[35386553C80D07AC]) [    ] o.a.s.c.c.SolrZkClient makePath: /configs/testCloudExamplePrompt/lang/stopwords_hy.txt
   [junit4]   2> 1100476 INFO  (TEST-TestSolrCLIRunExample.testInteractiveSolrCloudExample-seed#[35386553C80D07AC]) [    ] o.a.s.c.c.SolrZkClient makePath: /configs/testCloudExamplePrompt/lang/contractions_ca.txt
   [junit4]   2> 1100477 INFO  (TEST-TestSolrCLIRunExample.testInteractiveSolrCloudExample-seed#[35386553C80D07AC]) [    ] o.a.s.c.c.SolrZkClient makePath: /configs/testCloudExamplePrompt/lang/stoptags_ja.txt
   [junit4]   2> 1100478 INFO  (TEST-TestSolrCLIRunExample.testInteractiveSolrCloudExample-seed#[35386553C80D07AC]) [    ] o.a.s.c.c.SolrZkClient makePath: /configs/testCloudExamplePrompt/lang/stopwords_lv.txt
   [junit4]   2> 1100479 INFO  (TEST-TestSolrCLIRunExample.testInteractiveSolrCloudExample-seed#[35386553C80D07AC]) [    ] o.a.s.c.c.SolrZkClient makePath: /configs/testCloudExamplePrompt/lang/userdict_ja.txt
   [junit4]   2> 1100479 INFO  (TEST-TestSolrCLIRunExample.testInteractiveSolrCloudExample-seed#[35386553C80D07AC]) [    ] o.a.s.c.c.SolrZkClient makePath: /configs/testCloudExamplePrompt/lang/stopwords_tr.txt
   [junit4]   2> 1100481 INFO  (TEST-TestSolrCLIRunExample.testInteractiveSolrCloudExample-seed#[35386553C80D07AC]) [    ] o.a.s.c.c.SolrZkClient makePath: /configs/testCloudExamplePrompt/lang/stopwords_it.txt
   [junit4]   2> 1100481 INFO  (TEST-TestSolrCLIRunExample.testInteractiveSolrCloudExample-seed#[35386553C80D07AC]) [    ] o.a.s.c.c.SolrZkClient makePath: /configs/testCloudExamplePrompt/lang/stopwords_ru.txt
   [junit4]   2> 1100482 INFO  (TEST-TestSolrCLIRunExample.testInteractiveSolrCloudExample-seed#[35386553C80D07AC]) [    ] o.a.s.c.c.SolrZkClient makePath: /configs/testCloudExamplePrompt/lang/stopwords_th.txt
   [junit4]   2> 1100483 INFO  (TEST-TestSolrCLIRunExample.testInteractiveSolrCloudExample-seed#[35386553C80D07AC]) [    ] o.a.s.c.c.SolrZkClient makePath: /configs/testCloudExamplePrompt/lang/hyphenations_ga.txt
   [junit4]   2> 1100484 INFO  (TEST-TestSolrCLIRunExample.testInteractiveSolrCloudExample-seed#[35386553C80D07AC]) [    ] o.a.s.c.c.SolrZkClient makePath: /configs/testCloudExamplePrompt/lang/stopwords_en.txt
   [junit4]   2> 1100484 INFO  (TEST-TestSolrCLIRunExample.testInteractiveSolrCloudExample-seed#[35386553C80D07AC]) [    ] o.a.s.c.c.SolrZkClient makePath: /configs/testCloudExamplePrompt/lang/stopwords_hi.txt
   [junit4]   2> 1100485 INFO  (TEST-TestSolrCLIRunExample.testInteractiveSolrCloudExample-seed#[35386553C80D07AC]) [    ] o.a.s.c.c.SolrZkClient makePath: /configs/testCloudExamplePrompt/lang/stopwords_pt.txt
   [junit4]   2> 1100486 INFO  (TEST-TestSolrCLIRunExample.testInteractiveSolrCloudExample-seed#[35386553C80D07AC]) [    ] o.a.s.c.c.SolrZkClient makePath: /configs/testCloudExamplePrompt/lang/stopwords_id.txt
   [junit4]   2> 1100487 INFO  (TEST-TestSolrCLIRunExample.testInteractiveSolrCloudExample-seed#[35386553C80D07AC]) [    ] o.a.s.c.c.SolrZkClient makePath: /configs/testCloudExamplePrompt/synonyms.txt
   [junit4]   2> 1100487 INFO  (TEST-TestSolrCLIRunExample.testInteractiveSolrCloudExample-seed#[35386553C80D07AC]) [    ] o.a.s.c.c.SolrZkClient makePath: /configs/testCloudExamplePrompt/elevate.xml
   [junit4]   2> 1100488 INFO  (TEST-TestSolrCLIRunExample.testInteractiveSolrCloudExample-seed#[35386553C80D07AC]) [    ] o.a.s.c.c.SolrZkClient makePath: /configs/testCloudExamplePrompt/currency.xml
   [junit4]   2> 1100489 INFO  (TEST-TestSolrCLIRunExample.testInteractiveSolrCloudExample-seed#[35386553C80D07AC]) [    ] o.a.s.c.c.SolrZkClient makePath: /configs/testCloudExamplePrompt/params.json
   [junit4]   2> 1100490 INFO  (TEST-TestSolrCLIRunExample.testInteractiveSolrCloudExample-seed#[35386553C80D07AC]) [    ] o.a.s.c.c.SolrZkClient makePath: /configs/testCloudExamplePrompt/managed-schema
   [junit4]   2> 1100493 INFO  (qtp23129046-79025) [n:localhost:45751_solr    ] o.a.s.h.a.CollectionsHandler Invoked Collection Action :list with params action=list&wt=json and sendToOCPQueue=true
   [junit4]   2> 1100493 INFO  (qtp23129046-79025) [n:localhost:45751_solr    ] o.a.s.s.HttpSolrCall [admin] webapp=null path=/admin/collections params={action=list&wt=json} status=0 QTime=0
   [junit4]   2> 1100496 INFO  (qtp23129046-79025) [n:localhost:45751_solr    ] o.a.s.h.a.CollectionsHandler Invoked Collection Action :create with params replicationFactor=2&maxShardsPerNode=4&collection.configName=testCloudExamplePrompt&name=testCloudExamplePrompt&action=CREATE&numShards=2&wt=json and sendToOCPQueue=true
   [junit4]   2> 1100497 INFO  (OverseerCollectionConfigSetProcessor-96579266092269571-localhost:45751_solr-n_0000000000) [n:localhost:45751_solr    ] o.a.s.c.OverseerTaskProcessor Overseer Collection Message Handler: Get the message id:/overseer/collection-queue-work/qn-0000000000 message:{
   [junit4]   2>   "name":"testCloudExamplePrompt",
   [junit4]   2>   "fromApi":"true",
   [junit4]   2>   "replicationFactor":"2",
   [junit4]   2>   "collection.configName":"testCloudExamplePrompt",
   [junit4]   2>   "numShards":"2",
   [junit4]   2>   "maxShardsPerNode":"4",
   [junit4]   2>   "stateFormat":"2",
   [junit4]   2>   "operation":"create"}
   [junit4]   2> 1100498 INFO  (OverseerThreadFactory-6408-thread-1-processing-n:localhost:45751_solr) [n:localhost:45751_solr    ] o.a.s.c.OverseerCollectionMessageHandler OverseerCollectionMessageHandler.processMessage : create , {
   [junit4]   2>   "name":"testCloudExamplePrompt",
   [junit4]   2>   "fromApi":"true",
   [junit4]   2>   "replicationFactor":"2",
   [junit4]   2>   "collection.configName":"testCloudExamplePrompt",
   [junit4]   2>   "numShards":"2",
   [junit4]   2>   "maxShardsPerNode":"4",
   [junit4]   2>   "stateFormat":"2",
   [junit4]   2>   "operation":"create"}
   [junit4]   2> 1100498 INFO  (OverseerThreadFactory-6408-thread-1-processing-n:localhost:45751_solr) [n:localhost:45751_solr    ] o.a.s.c.CreateCollectionCmd Create collection testCloudExamplePrompt
   [junit4]   2> 1100498 WARN  (OverseerThreadFactory-6408-thread-1-processing-n:localhost:45751_solr) [n:localhost:45751_solr    ] o.a.s.c.CreateCollectionCmd Specified replicationFactor of 2 on collection testCloudExamplePrompt is higher than or equal to the number of Solr instances currently live or live and part of your createNodeSet(1). It's unusual to run two replica of the same slice on the same Solr-instance.
   [junit4]   2> 1100498 INFO  (OverseerThreadFactory-6408-thread-1-processing-n:localhost:45751_solr) [n:localhost:45751_solr    ] o.a.s.c.OverseerCollectionMessageHandler creating collections conf node /collections/testCloudExamplePrompt 
   [junit4]   2> 1100498 INFO  (OverseerThreadFactory-6408-thread-1-processing-n:localhost:45751_solr) [n:localhost:45751_solr    ] o.a.s.c.c.SolrZkClient makePath: /collections/testCloudExamplePrompt
   [junit4]   2> 1100499 INFO  (zkCallback-20958-thread-1-processing-n:localhost:45751_solr) [n:localhost:45751_solr    ] o.a.s.c.c.ZkStateReader A collections change: [WatchedEvent state:SyncConnected type:NodeChildrenChanged path:/collections], has occurred - updating...
   [junit4]   2> 1100499 INFO  (zkCallback-20967-thread-1) [    ] o.a.s.c.c.ZkStateReader A collections change: [WatchedEvent state:SyncConnected type:NodeChildrenChanged path:/collections], has occurred - updating...
   [junit4]   2> 1100500 INFO  (OverseerStateUpdate-96579266092269571-localhost:45751_solr-n_0000000000) [n:localhost:45751_solr    ] o.a.s.c.Overseer processMessage: queueSize: 1, message = {
   [junit4]   2>   "name":"testCloudExamplePrompt",
   [junit4]   2>   "fromApi":"true",
   [junit4]   2>   "replicationFactor":"2",
   [junit4]   2>   "collection.configName":"testCloudExamplePrompt",
   [junit4]   2>   "numShards":"2",
   [junit4]   2>   "maxShardsPerNode":"4",
   [junit4]   2>   "stateFormat":"2",
   [junit4]   2>   "operation":"create"} current state version: 0
   [junit4]   2> 1100500 INFO  (OverseerStateUpdate-96579266092269571-localhost:45751_solr-n_0000000000) [n:localhost:45751_solr    ] o.a.s.c.o.ClusterStateMutator building a new cName: testCloudExamplePrompt
   [junit4]   2> 1100501 INFO  (OverseerStateUpdate-96579266092269571-localhost:45751_solr-n_0000000000) [n:localhost:45751_solr    ] o.a.s.c.o.ZkStateWriter going to create_collection /collections/testCloudExamplePrompt/state.json
   [junit4]   2> 1100601 INFO  (OverseerThreadFactory-6408-thread-1-processing-n:localhost:45751_solr) [n:localhost:45751_solr    ] o.a.s.c.CreateCollectionCmd Creating SolrCores for new collection testCloudExamplePrompt, shardNames [shard1, shard2] , replicationFactor : 2
   [junit4]   2> 1100601 INFO  (OverseerThreadFactory-6408-thread-1-processing-n:localhost:45751_solr) [n:localhost:45751_solr    ] o.a.s.c.CreateCollectionCmd Creating core testCloudExamplePrompt_shard2_replica1 as part of shard shard2 of collection testCloudExamplePrompt on localhost:45751_solr
   [junit4]   2> 1100601 INFO  (OverseerThreadFactory-6408-thread-1-processing-n:localhost:45751_solr) [n:localhost:45751_solr    ] o.a.s.c.CreateCollectionCmd Creating core testCloudExamplePrompt_shard1_replica2 as part of shard shard1 of collection testCloudExamplePrompt on localhost:45751_solr
   [junit4]   2> 1100601 INFO  (OverseerThreadFactory-6408-thread-1-processing-n:localhost:45751_solr) [n:localhost:45751_solr    ] o.a.s.c.CreateCollectionCmd Creating core testCloudExamplePrompt_shard1_replica1 as part of shard shard1 of collection testCloudExamplePrompt on localhost:45751_solr
   [junit4]   2> 1100601 INFO  (OverseerThreadFactory-6408-thread-1-processing-n:localhost:45751_solr) [n:localhost:45751_solr    ] o.a.s.c.CreateCollectionCmd Creating core testCloudExamplePrompt_shard2_replica2 as part of shard shard2 of collection testCloudExamplePrompt on localhost:45751_solr
   [junit4]   2> 1100603 INFO  (qtp23129046-79019) [n:localhost:45751_solr    ] o.a.s.h.a.CoreAdminOperation core create command qt=/admin/cores&collection.configName=testCloudExamplePrompt&name=testCloudExamplePrompt_shard2_replica1&action=CREATE&numShards=2&collection=testCloudExamplePrompt&shard=shard2&wt=javabin&version=2
   [junit4]   2> 1100603 INFO  (qtp23129046-79020) [n:localhost:45751_solr    ] o.a.s.h.a.CoreAdminOperation core create command qt=/admin/cores&collection.configName=testCloudExamplePrompt&name=testCloudExamplePrompt_shard1_replica1&action=CREATE&numShards=2&collection=testCloudExamplePrompt&shard=shard1&wt=javabin&version=2
   [junit4]   2> 1100603 INFO  (qtp23129046-79021) [n:localhost:45751_solr    ] o.a.s.h.a.CoreAdminOperation core create command qt=/admin/cores&collection.configName=testCloudExamplePrompt&name=testCloudExamplePrompt_shard2_replica2&action=CREATE&numShards=2&collection=testCloudExamplePrompt&shard=shard2&wt=javabin&version=2
   [junit4]   2> 1100603 INFO  (qtp23129046-79024) [n:localhost:45751_solr    ] o.a.s.h.a.CoreAdminOperation core create command qt=/admin/cores&collection.configName=testCloudExamplePrompt&name=testCloudExamplePrompt_shard1_replica2&action=CREATE&numShards=2&collection=testCloudExamplePrompt&shard=shard1&wt=javabin&version=2
   [junit4]   2> 1100603 INFO  (qtp23129046-79021) [n:localhost:45751_solr    ] o.a.s.c.CoreDescriptor Created CoreDescriptor: {name=testCloudExamplePrompt_shard2_replica2, collection.configName=testCloudExamplePrompt, config=solrconfig.xml, transient=false, schema=schema.xml, loadOnStartup=true, configSetProperties=configsetprops.json, collection=testCloudExamplePrompt, numShards=2, dataDir=data/, shard=shard2}
   [junit4]   2> 1100603 INFO  (qtp23129046-79019) [n:localhost:45751_solr    ] o.a.s.c.CoreDescriptor Created CoreDescriptor: {name=testCloudExamplePrompt_shard2_replica1, collection.configName=testCloudExamplePrompt, config=solrconfig.xml, transient=false, schema=schema.xml, loadOnStartup=true, configSetProperties=configsetprops.json, collection=testCloudExamplePrompt, numShards=2, dataDir=data/, shard=shard2}
   [junit4]   2> 1100603 INFO  (qtp23129046-79020) [n:localhost:45751_solr    ] o.a.s.c.CoreDescriptor Created CoreDescriptor: {name=testCloudExamplePrompt_shard1_replica1, collection.configName=testCloudExamplePrompt, config=solrconfig.xml, transient=false, schema=schema.xml, loadOnStartup=true, configSetProperties=configsetprops.json, collection=testCloudExamplePrompt, numShards=2, dataDir=data/, shard=shard1}
   [junit4]   2> 1100603 INFO  (qtp23129046-79024) [n:localhost:45751_solr    ] o.a.s.c.CoreDescriptor Created CoreDescriptor: {name=testCloudExamplePrompt_shard1_replica2, collection.configName=testCloudExamplePrompt, config=solrconfig.xml, transient=false, schema=schema.xml, loadOnStartup=true, configSetProperties=configsetprops.json, collection=testCloudExamplePrompt, numShards=2, dataDir=data/, shard=shard1}
   [junit4]   2> 1100604 INFO  (qtp23129046-79021) [n:localhost:45751_solr c:testCloudExamplePrompt s:shard2  x:testCloudExamplePrompt_shard2_replica2] o.a.s.c.ZkController publishing state=down
   [junit4]   2> 1100604 INFO  (qtp23129046-79019) [n:localhost:45751_solr c:testCloudExamplePrompt s:shard2  x:testCloudExamplePrompt_shard2_replica1] o.a.s.c.ZkController publishing state=down
   [junit4]   2> 1100604 INFO  (qtp23129046-79020) [n:localhost:45751_solr c:testCloudExamplePrompt s:shard1  x:testCloudExamplePrompt_shard1_replica1] o.a.s.c.ZkController publishing state=down
   [junit4]   2> 1100604 INFO  (qtp23129046-79024) [n:localhost:45751_solr c:testCloudExamplePrompt s:shard1  x:testCloudExamplePrompt_shard1_replica2] o.a.s.c.ZkController publishing state=down
   [junit4]   2> 1100605 INFO  (qtp23129046-79021) [n:localhost:45751_solr c:testCloudExamplePrompt s:shard2  x:testCloudExamplePrompt_shard2_replica2] o.a.s.c.ZkController Registering watch for collection testCloudExamplePrompt
   [junit4]   2> 1100605 INFO  (qtp23129046-79019) [n:localhost:45751_solr c:testCloudExamplePrompt s:shard2  x:testCloudExamplePrompt_shard2_replica1] o.a.s.c.ZkController Registering watch for collection testCloudExamplePrompt
   [junit4]   2> 1100605 INFO  (qtp23129046-79020) [n:localhost:45751_solr c:testCloudExamplePrompt s:shard1  x:testCloudExamplePrompt_shard1_replica1] o.a.s.c.ZkController Registering watch for collection testCloudExamplePrompt
   [junit4]   2> 1100605 INFO  (qtp23129046-79024) [n:localhost:45751_solr c:testCloudExamplePrompt s:shard1  x:testCloudExamplePrompt_shard1_replica2] o.a.s.c.ZkController Registering watch for collection testCloudExamplePrompt
   [junit4]   2> 1100605 INFO  (OverseerStateUpdate-96579266092269571-localhost:45751_solr-n_0000000000) [n:localhost:45751_solr    ] o.a.s.c.Overseer processMessage: queueSize: 4, message = {
   [junit4]   2>   "core":"testCloudExamplePrompt_shard2_replica2",
   [junit4]   2>   "roles":null,
   [junit4]   2>   "base_url":"http://localhost:45751/solr",
   [junit4]   2>   "node_name":"localhost:45751_solr",
   [junit4]   2>   "numShards":"2",
   [junit4]   2>   "state":"down",
   [junit4]   2>   "shard":"shard2",
   [junit4]   2>   "collection":"testCloudExamplePrompt",
   [junit4]   2>   "operation":"state"} current state version: 0
   [junit4]   2> 1100605 INFO  (qtp23129046-79021) [n:localhost:45751_solr c:testCloudExamplePrompt s:shard2  x:testCloudExamplePrompt_shard2_replica2] o.a.s.c.c.ZkStateReader Add data for [testCloudExamplePrompt] ver [0]
   [junit4]   2> 1100605 INFO  (qtp23129046-79024) [n:localhost:45751_solr c:testCloudExamplePrompt s:shard1  x:testCloudExamplePrompt_shard1_replica2] o.a.s.c.ZkController look for our core node name
   [junit4]   2> 1100605 INFO  (qtp23129046-79020) [n:localhost:45751_solr c:testCloudExamplePrompt s:shard1  x:testCloudExamplePrompt_shard1_replica1] o.a.s.c.ZkController look for our core node name
   [junit4]   2> 1100605 INFO  (qtp23129046-79019) [n:localhost:45751_solr c:testCloudExamplePrompt s:shard2  x:testCloudExamplePrompt_shard2_replica1] o.a.s.c.ZkController look for our core node name
   [junit4]   2> 1100606 INFO  (qtp23129046-79021) [n:localhost:45751_solr c:testCloudExamplePrompt s:shard2  x:testCloudExamplePrompt_shard2_replica2] o.a.s.c.ZkController look for our core node name
   [junit4]   2> 1100605 INFO  (OverseerStateUpdate-96579266092269571-localhost:45751_solr-n_0000000000) [n:localhost:45751_solr    ] o.a.s.c.o.ReplicaMutator Update state numShards=2 message={
   [junit4]   2>   "core":"testCloudExamplePrompt_shard2_replica2",
   [junit4]   2>   "roles":null,
   [junit4]   2>   "base_url":"http://localhost:45751/solr",
   [junit4]   2>   "node_name":"localhost:45751_solr",
   [junit4]   2>   "numShards":"2",
   [junit4]   2>   "state":"down",
   [junit4]   2>   "shard":"shard2",
   [junit4]   2>   "collection":"testCloudExamplePrompt",
   [junit4]   2>   "operation":"state"}
   [junit4]   2> 1100607 INFO  (OverseerStateUpdate-96579266092269571-localhost:45751_solr-n_0000000000) [n:localhost:45751_solr    ] o.a.s.c.Overseer processMessage: queueSize: 3, message = {
   [junit4]   2>   "core":"testCloudExamplePrompt_shard2_replica1",
   [junit4]   2>   "roles":null,
   [junit4]   2>   "base_url":"http://localhost:45751/solr",
   [junit4]   2>   "node_name":"localhost:45751_solr",
   [junit4]   2>   "numShards":"2",
   [junit4]   2>   "state":"down",
   [junit4]   2>   "shard":"shard2",
   [junit4]   2>   "collection":"testCloudExamplePrompt",
   [junit4]   2>   "operation":"state"} current state version: 0
   [junit4]   2> 1100607 INFO  (OverseerStateUpdate-96579266092269571-localhost:45751_solr-n_0000000000) [n:localhost:45751_solr    ] o.a.s.c.o.ReplicaMutator Update state numShards=2 message={
   [junit4]   2>   "core":"testCloudExamplePrompt_shard2_replica1",
   [junit4]   2>   "roles":null,
   [junit4]   2>   "base_url":"http://localhost:45751/solr",
   [junit4]   2>   "node_name":"localhost:45751_solr",
   [junit4]   2>   "numShards":"2",
   [junit4]   2>   "state":"down",
   [junit4]   2>   "shard":"shard2",
   [junit4]   2>   "collection":"testCloudExamplePrompt",
   [junit4]   2>   "operation":"state"}
   [junit4]   2> 1100608 INFO  (OverseerStateUpdate-96579266092269571-localhost:45751_solr-n_0000000000) [n:localhost:45751_solr    ] o.a.s.c.Overseer processMessage: queueSize: 2, message = {
   [junit4]   2>   "core":"testCloudExamplePrompt_shard1_replica1",
   [junit4]   2>   "roles":null,
   [junit4]   2>   "base_url":"http://localhost:45751/solr",
   [junit4]   2>   "node_name":"localhost:45751_solr",
   [junit4]   2>   "numShards":"2",
   [junit4]   2>   "state":"down",
   [junit4]   2>   "shard":"shard1",
   [junit4]   2>   "collection":"testCloudExamplePrompt",
   [junit4]   2>   "operation":"state"} current state version: 0
   [junit4]   2> 1100608 INFO  (OverseerStateUpdate-96579266092269571-localhost:45751_solr-n_0000000000) [n:localhost:45751_solr    ] o.a.s.c.o.ReplicaMutator Update state numShards=2 message={
   [junit4]   2>   "core":"testCloudExamplePrompt_shard1_replica1",
   [junit4]   2>   "roles":null,
   [junit4]   2>   "base_url":"http://localhost:45751/solr",
   [junit4]   2>   "node_name":"localhost:45751_solr",
   [junit4]   2>   "numShards":"2",
   [junit4]   2>   "state":"down",
   [junit4]   2>   "shard":"shard1",
   [junit4]   2>   "collection":"testCloudExamplePrompt",
   [junit4]   2>   "operation":"state"}
   [junit4]   2> 1100609 INFO  (OverseerStateUpdate-96579266092269571-localhost:45751_solr-n_0000000000) [n:localhost:45751_solr    ] o.a.s.c.Overseer processMessage: queueSize: 1, message = {
   [junit4]   2>   "core":"testCloudExamplePrompt_shard1_replica2",
   [junit4]   2>   "roles":null,
   [junit4]   2>   "base_url":"http://localhost:45751/solr",
   [junit4]   2>   "node_name":"localhost:45751_solr",
   [junit4]   2>   "numShards":"2",
   [junit4]   2>   "state":"down",
   [junit4]   2>   "shard":"shard1",
   [junit4]   2>   "collection":"testCloudExamplePrompt",
   [junit4]   2>   "operation":"state"} current state version: 0
   [junit4]   2> 1100609 INFO  (OverseerStateUpdate-96579266092269571-localhost:45751_solr-n_0000000000) [n:localhost:45751_solr    ] o.a.s.c.o.ReplicaMutator Update state numShards=2 message={
   [junit4]   2>   "core":"testCloudExamplePrompt_shard1_replica2",
   [junit4]   2>   "roles":null,
   [junit4]   2>   "base_url":"http://localhost:45751/solr",
   [junit4]   2>   "node_name":"localhost:45751_solr",
   [junit4]   2>   "numShards":"2",
   [junit4]   2>   "state":"down",
   [junit4]   2>   "shard":"shard1",
   [junit4]   2>   "collection":"testCloudExamplePrompt",
   [junit4]   2>   "operation":"state"}
   [junit4]   2> 1100711 INFO  (OverseerStateUpdate-96579266092269571-localhost:45751_solr-n_0000000000) [n:localhost:45751_solr    ] o.a.s.c.o.ZkStateWriter going to update_collection /collections/testCloudExamplePrompt/state.json version: 0
   [junit4]   2> 1100711 INFO  (zkCallback-20958-thread-1-processing-n:localhost:45751_solr) [n:localhost:45751_solr    ] o.a.s.c.c.ZkStateReader A cluster state change: [WatchedEvent state:SyncConnected type:NodeDataChanged path:/collections/testCloudExamplePrompt/state.json] for collection [testCloudExamplePrompt] has occurred - updating... (live nodes size: [1])
   [junit4]   2> 1100711 INFO  (zkCallback-20958-thread-1-processing-n:localhost:45751_solr) [n:localhost:45751_solr    ] o.a.s.c.c.ZkStateReader Updating data for [testCloudExamplePrompt] from [0] to [1]
   [junit4]   2> 1101606 INFO  (qtp23129046-79024) [n:localhost:45751_solr c:testCloudExamplePrompt s:shard1  x:testCloudExamplePrompt_shard1_replica2] o.a.s.c.ZkController waiting to find shard id in clusterstate for testCloudExamplePrompt_shard1_replica2
   [junit4]   2> 1101606 INFO  (qtp23129046-79020) [n:localhost:45751_solr c:testCloudExamplePrompt s:shard1  x:testCloudExamplePrompt_shard1_replica1] o.a.s.c.ZkController waiting to find shard id in clusterstate for testCloudExamplePrompt_shard1_replica1
   [junit4]   2> 1101606 INFO  (qtp23129046-79021) [n:localhost:45751_solr c:testCloudExamplePrompt s:shard2  x:testCloudExamplePrompt_shard2_replica2] o.a.s.c.ZkController waiting to find shard id in clusterstate for testCloudExamplePrompt_shard2_replica2
   [junit4]   2> 1101606 INFO  (qtp23129046-79020) [n:localhost:45751_solr c:testCloudExamplePrompt s:shard1  x:testCloudExamplePrompt_shard1_replica1] o.a.s.c.ZkController Check for collection zkNode:testCloudExamplePrompt
   [junit4]   2> 1101606 INFO  (qtp23129046-79021) [n:localhost:45751_solr c:testCloudExamplePrompt s:shard2  x:testCloudExamplePrompt_shard2_replica2] o.a.s.c.ZkController Check for collection zkNode:testCloudExamplePrompt
   [junit4]   2> 1101606 INFO  (qtp23129046-79019) [n:localhost:45751_solr c:testCloudExamplePrompt s:shard2  x:testCloudExamplePrompt_shard2_replica1] o.a.s.c.ZkController waiting to find shard id in clusterstate for testCloudExamplePrompt_shard2_replica1
   [junit4]   2> 1101606 INFO  (qtp23129046-79024) [n:localhost:45751_solr c:testCloudExamplePrompt s:shard1  x:testCloudExamplePrompt_shard1_replica2] o.a.s.c.ZkController Check for collection zkNode:testCloudExamplePrompt
   [junit4]   2> 1101606 INFO  (qtp23129046-79019) [n:localhost:45751_solr c:testCloudExamplePrompt s:shard2  x:testCloudExamplePrompt_shard2_replica1] o.a.s.c.ZkController Check for collection zkNode:testCloudExamplePrompt
   [junit4]   2> 1101606 INFO  (qtp23129046-79020) [n:localhost:45751_solr c:testCloudExamplePrompt s:shard1  x:testCloudExamplePrompt_shard1_replica1] o.a.s.c.ZkController Collection zkNode exists
   [junit4]   2> 1101606 INFO  (qtp23129046-79020) [n:localhost:45751_solr c:testCloudExamplePrompt s:shard1  x:testCloudExamplePrompt_shard1_replica1] o.a.s.c.c.ZkStateReader Load collection config from: [/collections/testCloudExamplePrompt]
   [junit4]   2> 1101606 INFO  (qtp23129046-79021) [n:localhost:45751_solr c:testCloudExamplePrompt s:shard2  x:testCloudExamplePrompt_shard2_replica2] o.a.s.c.ZkController Collection zkNode exists
   [junit4]   2> 1101606 INFO  (qtp23129046-79024) [n:localhost:45751_solr c:testCloudExamplePrompt s:shard1  x:testCloudExamplePrompt_shard1_replica2] o.a.s.c.ZkController Collection zkNode exists
   [junit4]   2> 1101606 INFO  (qtp23129046-79019) [n:localhost:45751_solr c:testCloudExamplePrompt s:shard2  x:testCloudExamplePrompt_shard2_replica1] o.a.s.c.ZkController Collection zkNode exists
   [junit4]   2> 1101606 INFO  (qtp23129046-79024) [n:localhost:45751_solr c:testCloudExamplePrompt s:shard1  x:testCloudExamplePrompt_shard1_replica2] o.a.s.c.c.ZkStateReader Load collection config from: [/collections/testCloudExamplePrompt]
   [junit4]   2> 1101606 INFO  (qtp23129046-79019) [n:localhost:45751_solr c:testCloudExamplePrompt s:shard2  x:testCloudExamplePrompt_shard2_replica1] o.a.s.c.c.ZkStateReader Load collection config from: [/collections/testCloudExamplePrompt]
   [junit4]   2> 1101606 INFO  (qtp23129046-79021) [n:localhost:45751_solr c:testCloudExamplePrompt s:shard2  x:testCloudExamplePrompt_shard2_replica2] o.a.s.c.c.ZkStateReader Load collection config from: [/collections/testCloudExamplePrompt]
   [junit4]   2> 1101607 INFO  (qtp23129046-79020) [n:localhost:45751_solr c:testCloudExamplePrompt s:shard1  x:testCloudExamplePrompt_shard1_replica1] o.a.s.c.c.ZkStateReader path=[/collections/testCloudExamplePrompt] [configName]=[testCloudExamplePrompt] specified config exists in ZooKeeper
   [junit4]   2> 1101607 INFO  (qtp23129046-79020) [n:localhost:45751_solr c:testCloudExamplePrompt s:shard1  x:testCloudExamplePrompt_shard1_replica1] o.a.s.c.SolrResourceLoader new SolrResourceLoader for directory: '/home/jenkins/workspace/Lucene-Solr-master-Linux/solr/build/solr-core/test/J1/temp/solr.util.TestSolrCLIRunExample_35386553C80D07AC-001/tempDir-002/node1/testCloudExamplePrompt_shard1_replica1'
   [junit4]   2> 1101607 INFO  (qtp23129046-79024) [n:localhost:45751_solr c:testCloudExamplePrompt s:shard1  x:testCloudExamplePrompt_shard1_replica2] o.a.s.c.c.ZkStateReader path=[/collections/testCloudExamplePrompt] [configName]=[testCloudExamplePrompt] specified config exists in ZooKeeper
   [junit4]   2> 1101607 INFO  (qtp23129046-79020) [n:localhost:45751_solr c:testCloudExamplePrompt s:shard1  x:testCloudExamplePrompt_shard1_replica1] o.a.s.c.SolrResourceLoader JNDI not configured for solr (NoInitialContextEx)
   [junit4]   2> 1101607 INFO  (qtp23129046-79021) [n:localhost:45751_solr c:testCloudExamplePrompt s:shard2  x:testCloudExamplePrompt_shard2_replica2] o.a.s.c.c.ZkStateReader path=[/collections/testCloudExamplePrompt] [configName]=[testCloudExamplePrompt] specified config exists in ZooKeeper
   [junit4]   2> 1101607 INFO  (qtp23129046-79020) [n:localhost:45751_solr c:testCloudExamplePrompt s:shard1  x:testCloudExamplePrompt_shard1_replica1] o.a.s.c.SolrResourceLoader solr home defaulted to 'solr/' (could not find system property or JNDI)
   [junit4]   2> 1101607 INFO  (qtp23129046-79019) [n:localhost:45751_solr c:testCloudExamplePrompt s:shard2  x:testCloudExamplePrompt_shard2_replica1] o.a.s.c.c.ZkStateReader path=[/collections/testCloudExamplePrompt] [configName]=[testCloudExamplePrompt] specified config exists in ZooKeeper
   [junit4]   2> 1101607 INFO  (qtp23129046-79024) [n:localhost:45751_solr c:testCloudExamplePrompt s:shard1  x:testCloudExamplePrompt_shard1_replica2] o.a.s.c.SolrResourceLoader new SolrResourceLoader for directory: '/home/jenkins/workspace/Lucene-Solr-master-Linux/solr/build/solr-core/test/J1/temp/solr.util.TestSolrCLIRunExample_35386553C80D07AC-001/tempDir-002/node1/testCloudExamplePrompt_shard1_replica2'
   [junit4]   2> 1101607 INFO  (qtp23129046-79019) [n:localhost:45751_solr c:testCloudExamplePrompt s:shard2  x:testCloudExamplePrompt_shard2_replica1] o.a.s.c.SolrResourceLoader new SolrResourceLoader for directory: '/home/jenkins/workspace/Lucene-Solr-master-Linux/solr/build/solr-core/test/J1/temp/solr.util.TestSolrCLIRunExample_35386553C80D07AC-001/tempDir-002/node1/testCloudExamplePrompt_shard2_replica1'
   [junit4]   2> 1101607 INFO  (qtp23129046-79021) [n:localhost:45751_solr c:testCloudExamplePrompt s:shard2  x:testCloudExamplePrompt_shard2_replica2] o.a.s.c.SolrResourceLoader new SolrResourceLoader for directory: '/home/jenkins/workspace/Lucene-Solr-master-Linux/solr/build/solr-core/test/J1/temp/solr.util.TestSolrCLIRunExample_35386553C80D07AC-001/tempDir-002/node1/testCloudExamplePrompt_shard2_replica2'
   [junit4]   2> 1101607 INFO  (qtp23129046-79024) [n:localhost:45751_solr c:testCloudExamplePrompt s:shard1  x:testCloudExamplePrompt_shard1_replica2] o.a.s.c.SolrResourceLoader JNDI not configured for solr (NoInitialContextEx)
   [junit4]   2> 1101607 INFO  (qtp23129046-79019) [n:localhost:45751_solr c:testCloudExamplePrompt s:shard2  x:testCloudExamplePrompt_shard2_replica1] o.a.s.c.SolrResourceLoader JNDI not configured for solr (NoInitialContextEx)
   [junit4]   2> 1101607 INFO  (qtp23129046-79024) [n:localhost:45751_solr c:testCloudExamplePrompt s:shard1  x:testCloudExamplePrompt_shard1_replica2] o.a.s.c.SolrResourceLoader solr home defaulted to 'solr/' (could not find system property or JNDI)
   [junit4]   2> 1101607 INFO  (qtp23129046-79021) [n:localhost:45751_solr c:testCloudExamplePrompt s:shard2  x:testCloudExamplePrompt_shard2_replica2] o.a.s.c.SolrResourceLoader JNDI not configured for solr (NoInitialContextEx)
   [junit4]   2> 1101607 INFO  (qtp23129046-79019) [n:localhost:45751_solr c:testCloudExamplePrompt s:shard2  x:testCloudExamplePrompt_shard2_replica1] o.a.s.c.SolrResourceLoader solr home defaulted to 'solr/' (could not find system property or JNDI)
   [junit4]   2> 1101607 INFO  (qtp23129046-79021) [n:localhost:45751_solr c:testCloudExamplePrompt s:shard2  x:testCloudExamplePrompt_shard2_replica2] o.a.s.c.SolrResourceLoader solr home defaulted to 'solr/' (could not find system property or JNDI)
   [junit4]   2> 1101609 INFO  (qtp23129046-79020) [n:localhost:45751_solr c:testCloudExamplePrompt s:shard1  x:testCloudExamplePrompt_shard1_replica1] o.a.s.c.Config loaded config solrconfig.xml with version 0 
   [junit4]   2> 1101609 INFO  (qtp23129046-79019) [n:localhost:45751_solr c:testCloudExamplePrompt s:shard2  x:testCloudExamplePrompt_shard2_replica1] o.a.s.c.Config loaded config solrconfig.xml with version 0 
   [junit4]   2> 1101609 INFO  (qtp23129046-79024) [n:localhost:45751_solr c:testCloudExamplePrompt s:shard1  x:testCloudExamplePrompt_shard1_replica2] o.a.s.c.Config loaded config solrconfig.xml with version 0 
   [junit4]   2> 1101609 INFO  (qtp23129046-79021) [n:localhost:45751_solr c:testCloudExamplePrompt s:shard2  x:testCloudExamplePrompt_shard2_replica2] o.a.s.c.Config loaded config solrconfig.xml with version 0 
   [junit4]   2> 1101631 INFO  (qtp23129046-79019) [n:localhost:45751_solr c:testCloudExamplePrompt s:shard2  x:testCloudExamplePrompt_shard2_replica1] o.a.s.c.RequestParams conf resource params.json loaded . version : 0 
   [junit4]   2> 1101631 INFO  (qtp23129046-79020) [n:localhost:45751_solr c:testCloudExamplePrompt s:shard1  x:testCloudExamplePrompt_shard1_replica1] o.a.s.c.RequestParams conf resource params.json loaded . version : 0 
   [junit4]   2> 1101632 INFO  (qtp23129046-79020) [n:localhost:45751_solr c:testCloudExamplePrompt s:shard1  x:testCloudExamplePrompt_shard1_replica1] o.a.s.c.RequestParams request params refreshed to version 0
   [junit4]   2> 1101632 INFO  (qtp23129046-79019) [n:localhost:45751_solr c:testCloudExamplePrompt s:shard2  x:testCloudExamplePrompt_shard2_replica1] o.a.s.c.RequestParams request params refreshed to version 0
   [junit4]   2> 1101632 INFO  (qtp23129046-79020) [n:localhost:45751_solr c:testCloudExamplePrompt s:shard1  x:testCloudExamplePrompt_shard1_replica1] o.a.s.c.SolrConfig current version of requestparams : 0
   [junit4]   2> 1101633 INFO  (qtp23129046-79019) [n:localhost:45751_solr c:testCloudExamplePrompt s:shard2  x:testCloudExamplePrompt_shard2_replica1] o.a.s.c.SolrConfig current version of requestparams : 0
   [junit4]   2> 1101634 INFO  (qtp23129046-79019) [n:localhost:45751_solr c:testCloudExamplePrompt s:shard2  x:testCloudExamplePrompt_shard2_replica1] o.a.s.c.SolrConfig Adding specified lib dirs to ClassLoader
   [junit4]   2> 1101634 INFO  (qtp23129046-79020) [n:localhost:45751_solr c:testCloudExamplePrompt s:shard1  x:testCloudExamplePrompt_shard1_replica1] o.a.s.c.SolrConfig Adding specified lib dirs to ClassLoader
   [junit4]   2> 1101635 WARN  (qtp23129046-79019) [n:localhost:45751_solr c:testCloudExamplePrompt s:shard2  x:testCloudExamplePrompt_shard2_replica1] o.a.s.c.SolrConfig Couldn't add files from /home/jenkins/workspace/Lucene-Solr-master-Linux/solr/build/solr-core/test/J1/temp/solr.util.TestSolrCLIRunExample_35386553C80D07AC-001/tempDir-002/node1/testCloudExamplePrompt_shard2_replica1/../../../../contrib/extraction/lib filtered by .*\.jar to classpath: /home/jenkins/workspace/Lucene-Solr-master-Linux/solr/build/solr-core/test/J1/temp/solr.util.TestSolrCLIRunExample_35386553C80D07AC-001/tempDir-002/node1/testCloudExamplePrompt_shard2_replica1/../../../../contrib/extraction/lib
   [junit4]   2> 1101635 WARN  (qtp23129046-79020) [n:localhost:45751_solr c:testCloudExamplePrompt s:shard1  x:testCloudExamplePrompt_shard1_replica1] o.a.s.c.SolrConfig Couldn't add files from /home/jenkins/workspace/Lucene-Solr-master-Linux/solr/build/solr-core/test/J1/temp/solr.util.TestSolrCLIRunExample_35386553C80D07AC-001/tempDir-002/node1/testCloudExamplePrompt_shard1_replica1/../../../../contrib/extraction/lib filtered by .*\.jar to classpath: /home/jenkins/workspace/Lucene-Solr-master-Linux/solr/build/solr-core/test/J1/temp/solr.util.TestSolrCLIRunExample_35386553C80D07AC-001/tempDir-002/node1/testCloudExamplePrompt_shard1_replica1/../../../../contrib/extraction/lib
   [junit4]   2> 1101635 WARN  (qtp23129046-79019) [n:localhost:45751_solr c:testCloudExamplePrompt s:shard2  x:testCloudExamplePrompt_shard2_replica1] o.a.s.c.SolrConfig Couldn't add files from /home/jenkins/workspace/Lucene-Solr-master-Linux/solr/build/solr-core/test/J1/temp/solr.util.TestSolrCLIRunExample_35386553C80D07AC-001/tempDir-002/node1/testCloudExamplePrompt_shard2_replica1/../../../../dist filtered by solr-cell-\d.*\.jar to classpath: /home/jenkins/workspace/Lucene-Solr-master-Linux/solr/build/solr-core/test/J1/temp/solr.util.TestSolrCLIRunExample_35386553C80D07AC-001/tempDir-002/node1/testCloudExamplePrompt_shard2_replica1/../../../../dist
   [junit4]   2> 1101636 WARN  (qtp23129046-79020) [n:localhost:45751_solr c:testCloudExamplePrompt s:shard1  x:testCloudExamplePrompt_shard1_replica1] o.a.s.c.SolrConfig Couldn't add files from /home/jenkins/workspace/Lucene-Solr-master-Linux/solr/build/solr-core/test/J1/temp/solr.util.TestSolrCLIRunExample_35386553C80D07AC-001/tempDir-002/node1/testCloudExamplePrompt_shard1_replica1/../../../../dist filtered by solr-cell-\d.*\.jar to classpath: /home/jenkins/workspace/Lucene-Solr-master-Linux/solr/build/solr-core/test/J1/temp/solr.util.TestSolrCLIRunExample_35386553C80D07AC-001/tempDir-002/node1/testCloudExamplePrompt_shard1_replica1/../../../../dist
   [junit4]   2> 1101636 WARN  (qtp23129046-79019) [n:localhost:45751_solr c:testCloudExamplePrompt s:shard2  x:testCloudExamplePrompt_shard2_replica1] o.a.s.c.SolrConfig Couldn't add files from /home/jenkins/workspace/Lucene-Solr-master-Linux/solr/build/solr-core/test/J1/temp/solr.util.TestSolrCLIRunExample_35386553C80D07AC-001/tempDir-002/node1/testCloudExamplePrompt_shard2_replica1/../../../../contrib/clustering/lib filtered by .*\.jar to classpath: /home/jenkins/workspace/Lucene-Solr-master-Linux/solr/build/solr-core/test/J1/temp/solr.util.TestSolrCLIRunExample_35386553C80D07AC-001/tempDir-002/node1/testCloudExamplePrompt_shard2_replica1/../../../../contrib/clustering/lib
   [junit4]   2> 1101636 WARN  (qtp23129046-79019) [n:localhost:45751_solr c:testCloudExamplePrompt s:shard2  x:testCloudExamplePrompt_shard2_replica1] o.a.s.c.SolrConfig Couldn't add files from /home/jenkins/workspace/Lucene-Solr-master-Linux/solr/build/solr-core/test/J1/temp/solr.util.TestSolrCLIRunExample_35386553C80D07AC-001/tempDir-002/node1/testCloudExamplePrompt_shard2_replica1/../../../../dist filtered by solr-clustering-\d.*\.jar to classpath: /home/jenkins/workspace/Lucene-Solr-master-Linux/solr/build/solr-core/test/J1/temp/solr.util.TestSolrCLIRunExample_35386553C80D07AC-001/tempDir-002/node1/testCloudExamplePrompt_shard2_replica1/../../../../dist
   [junit4]   2> 1101636 WARN  (qtp23129046-79020) [n:localhost:45751_solr c:testCloudExamplePrompt s:shard1  x:testCloudExamplePrompt_shard1_replica1] o.a.s.c.SolrConfig Couldn't add files from /home/jenkins/workspace/Lucene-Solr-master-Linux/solr/build/solr-core/test/J1/temp/solr.util.TestSolrCLIRunExample_35386553C80D07AC-001/tempDir-002/node1/testCloudExamplePrompt_shard1_replica1/../../../../contrib/clustering/lib filtered by .*\.jar to classpath: /home/jenkins/workspace/Lucene-Solr-master-Linux/solr/build/solr-core/test/J1/temp/solr.util.TestSolrCLIRunExample_35386553C80D07AC-001/tempDir-002/node1/testCloudExamplePrompt_shard1_replica1/../../../../contrib/clustering/lib
   [junit4]   2> 1101636 WARN  (qtp23129046-79019) [n:localhost:45751_solr c:testCloudExamplePrompt s:shard2  x:testCloudExamplePrompt_shard2_replica1] o.a.s.c.SolrConfig Couldn't add files from /home/jenkins/workspace/Lucene-Solr-master-Linux/solr/build/solr-core/test/J1/temp/solr.util.TestSolrCLIRunExample_35386553C80D07AC-001/tempDir-002/node1/testCloudExamplePrompt_shard2_replica1/../../../../contrib/langid/lib filtered by .*\.jar to classpath: /home/jenkins/workspace/Lucene-Solr-master-Linux/solr/build/solr-core/test/J1/temp/solr.util.TestSolrCLIRunExample_35386553C80D07AC-001/tempDir-002/node1/testCloudExamplePrompt_shard2_replica1/../../../../contrib/langid/lib
   [junit4]   2> 1101636 WARN  (qtp23129046-79020) [n:localhost:45751_solr c:testCloudExamplePrompt s:shard1  x:testCloudExamplePrompt_shard1_replica1] o.a.s.c.SolrConfig Couldn't add files from /home/jenkins/workspace/Lucene-Solr-master-Linux/solr/build/solr-core/test/J1/temp/solr.util.TestSolrCLIRunExample_35386553C80D07AC-001/tempDir-002/node1/testCloudExamplePrompt_shard1_replica1/../../../../dist filtered by solr-clustering-\d.*\.jar to classpath: /home/jenkins/workspace/Lucene-Solr-master-Linux/solr/build/solr-core/test/J1/temp/solr.util.TestSolrCLIRunExample_35386553C80D07AC-001/tempDir-002/node1/testCloudExamplePrompt_shard1_replica1/../../../../dist
   [junit4]   2> 1101636 WARN  (qtp23129046-79019) [n:localhost:45751_solr c:testCloudExamplePrompt s:shard2  x:testCloudExamplePrompt_shard2_replica1] o.a.s.c.SolrConfig Couldn't add files from /home/jenkins/workspace/Lucene-Solr-master-Linux/solr/build/solr-core/test/J1/temp/solr.util.TestSolrCLIRunExample_35386553C80D07AC-001/tempDir-002/node1/testCloudExamplePrompt_shard2_replica1/../../../../dist filtered by solr-langid-\d.*\.jar to classpath: /home/jenkins/workspace/Lucene-Solr-master-Linux/solr/build/solr-core/test/J1/temp/solr.util.TestSolrCLIRunExample_35386553C80D07AC-001/tempDir-002/node1/testCloudExamplePrompt_shard2_replica1/../../../../dist
   [junit4]   2> 1101637 WARN  (qtp23129046-79020) [n:localhost:45751_solr c:testCloudExamplePrompt s:shard1  x:testCloudExamplePrompt_shard1_replica1] o.a.s.c.SolrConfig Couldn't add files from /home/jenkins/workspace/Lucene-Solr-master-Linux/solr/build/solr-core/test/J1/temp/solr.util.TestSolrCLIRunExample_35386553C80D07AC-001/tempDir-002/node1/testCloudExamplePrompt_shard1_replica1/../../../../contrib/langid/lib filtered by .*\.jar to classpath: /home/jenkins/workspace/Lucene-Solr-master-Linux/solr/build/solr-core/test/J1/temp/solr.util.TestSolrCLIRunExample_35386553C80D07AC-001/tempDir-002/node1/testCloudExamplePrompt_shard1_replica1/../../../../contrib/langid/lib
   [junit4]   2> 1101637 WARN  (qtp23129046-79019) [n:localhost:45751_solr c:testCloudExamplePrompt s:shard2  x:testCloudExamplePrompt_shard2_replica1] o.a.s.c.SolrConfig Couldn't add files from /home/jenkins/workspace/Lucene-Solr-master-Linux/solr/build/solr-core/test/J1/temp/solr.util.TestSolrCLIRunExample_35386553C80D07AC-001/tempDir-002/node1/testCloudExamplePrompt_shard2_replica1/../../../../contrib/velocity/lib filtered by .*\.jar to classpath: /home/jenkins/workspace/Lucene-Solr-master-Linux/solr/build/solr-core/test/J1/temp/solr.util.TestSolrCLIRunExample_35386553C80D07AC-001/tempDir-002/node1/testCloudExamplePrompt_shard2_replica1/../../../../contrib/velocity/lib
   [junit4]   2> 1101637 WARN  (qtp23129046-79020) [n:localhost:45751_solr c:testCloudExamplePrompt s:shard1  x:testCloudExamplePrompt_shard1_replica1] o.a.s.c.SolrConfig Couldn't add files from /home/jenkins/workspace/Lucene-Solr-master-Linux/solr/build/solr-core/test/J1/temp/solr.util.TestSolrCLIRunExample_35386553C80D07AC-001/tempDir-002/node1/testCloudExamplePrompt_shard1_replica1/../../../../dist filtered by solr-langid-\d.*\.jar to classpath: /home/jenkins/workspace/Lucene-Solr-master-Linux/solr/build/solr-core/test/J1/temp/solr.util.TestSolrCLIRunExample_35386553C80D07AC-001/tempDir-002/node1/testCloudExamplePrompt_shard1_replica1/../../../../dist
   [junit4]   2> 1101637 WARN  (qtp23129046-79019) [n:localhost:45751_solr c:testCloudExamplePrompt s:shard2  x:testCloudExamplePrompt_shard2_replica1] o.a.s.c.SolrConfig Couldn't add files from /home/jenkins/workspace/Lucene-Solr-master-Linux/solr/build/solr-core/test/J1/temp/solr.util.TestSolrCLIRunExample_35386553C80D07AC-001/tempDir-002/node1/testCloudExamplePrompt_shard2_replica1/../../../../dist filtered by solr-velocity-\d.*\.jar to classpath: /home/jenkins/workspace/Lucene-Solr-master-Linux/solr/build/solr-core/test/J1/temp/solr.util.TestSolrCLIRunExample_35386553C80D07AC-001/tempDir-002/node1/testCloudExamplePrompt_shard2_replica1/../../../../dist
   [junit4]   2> 1101637 WARN  (qtp23129046-79020) [n:localhost:45751_solr c:testCloudExamplePrompt s:shard1  x:testCloudExamplePrompt_shard1_replica1] o.a.s.c.SolrConfig Couldn't add files from /home/jenkins/workspace/Lucene-Solr-master-Linux/solr/build/solr-core/test/J1/temp/solr.util.TestSolrCLIRunExample_35386553C80D07AC-001/tempDir-002/node1/testCloudExamplePrompt_shard1_replica1/../../../../contrib/velocity/lib filtered by .*\.jar to classpath: /home/jenkins/workspace/Lucene-Solr-master-Linux/solr/build/solr-core/test/J1/temp/solr.util.TestSolrCLIRunExample_35386553C80D07AC-001/tempDir-002/node1/testCloudExamplePrompt_shard1_replica1/../../../../contrib/velocity/lib
   [junit4]   2> 1101637 WARN  (qtp23129046-79020) [n:localhost:45751_solr c:testCloudExamplePrompt s:shard1  x:testCloudExamplePrompt_shard1_replica1] o.a.s.c.SolrConfig Couldn't add files from /home/jenkins/workspace/Lucene-Solr-master-Linux/solr/build/solr-core/test/J1/temp/solr.util.TestSolrCLIRunExample_35386553C80D07AC-001/tempDir-002/node1/testCloudExamplePrompt_shard1_replica1/../../../../dist filtered by solr-velocity-\d.*\.jar to classpath: /home/jenkins/workspace/Lucene-Solr-master-Linux/solr/build/solr-core/test/J1/temp/solr.util.TestSolrCLIRunExample_35386553C80D07AC-001/tempDir-002/node1/testCloudExamplePrompt_shard1_replica1/../../../../dist
   [junit4]   2> 1101639 INFO  (qtp23129046-79024) [n:localhost:45751_solr c:testCloudExamplePrompt s:shard1  x:testCloudExamplePrompt_shard1_replica2] o.a.s.c.RequestParams conf resource params.json loaded . version : 0 
   [junit4]   2> 1101639 INFO  (qtp23129046-79021) [n:localhost:45751_solr c:testCloudExamplePrompt s:shard2  x:testCloudExamplePrompt_shard2_replica2] o.a.s.c.RequestParams conf resource params.json loaded . version : 0 
   [junit4]   2> 1101639 INFO  (qtp23129046-79024) [n:localhost:45751_solr c:testCloudExamplePrompt s:shard1  x:testCloudExamplePrompt_shard1_replica2] o.a.s.c.RequestParams request params refreshed to version 0
   [junit4]   2> 1101639 INFO  (qtp23129046-79021) [n:localhost:45751_solr c:testCloudExamplePrompt s:shard2  x:testCloudExamplePrompt_shard2_replica2] o.a.s.c.RequestParams request params refreshed to version 0
   [junit4]   2> 1101639 INFO  (qtp23129046-79024) [n:localhost:45751_solr c:testCloudExamplePrompt s:shard1  x:testCloudExamplePrompt_shard1_replica2] o.a.s.c.SolrConfig current version of requestparams : 0
   [junit4]   2> 1101639 INFO  (qtp23129046-79021) [n:localhost:45751_solr c:testCloudExamplePrompt s:shard2  x:testCloudExamplePrompt_shard2_replica2] o.a.s.c.SolrConfig current version of requestparams : 0
   [junit4]   2> 1101640 INFO  (qtp23129046-79024) [n:localhost:45751_solr c:testCloudExamplePrompt s:shard1  x:testCloudExamplePrompt_shard1_replica2] o.a.s.c.SolrConfig Adding specified lib dirs to ClassLoader
   [junit4]   2> 1101640 INFO  (qtp23129046-79021) [n:localhost:45751_solr c:testCloudExamplePrompt s:shard2  x:testCloudExamplePrompt_shard2_replica2] o.a.s.c.SolrConfig Adding specified lib dirs to ClassLoader
   [junit4]   2> 1101641 WARN  (qtp23129046-79024) [n:localhost:45751_solr c:testCloudExamplePrompt s:shard1  x:testCloudExamplePrompt_shard1_replica2] o.a.s.c.SolrConfig Couldn't add files from /home/jenkins/workspace/Lucene-Solr-master-Linux/solr/build/solr-core/test/J1/temp/solr.util.TestSolrCLIRunExample_35386553C80D07AC-001/tempDir-002/node1/testCloudExamplePrompt_shard1_replica2/../../../../contrib/extraction/lib filtered by .*\.jar to classpath: /home/jenkins/workspace/Lucene-Solr-master-Linux/solr/build/solr-core/test/J1/temp/solr.util.TestSolrCLIRunExample_35386553C80D07AC-001/tempDir-002/node1/testCloudExamplePrompt_shard1_replica2/../../../../contrib/extraction/lib
   [junit4]   2> 1101641 WARN  (qtp23129046-79021) [n:localhost:45751_solr c:testCloudExamplePrompt s:shard2  x:testCloudExamplePrompt_shard2_replica2] o.a.s.c.SolrConfig Couldn't add files from /home/jenkins/workspace/Lucene-Solr-master-Linux/solr/build/solr-core/test/J1/temp/solr.util.TestSolrCLIRunExample_35386553C80D07AC-001/tempDir-002/node1/testCloudExamplePrompt_shard2_replica2/../../../../contrib/extraction/lib filtered by .*\.jar to classpath: /home/jenkins/workspace/Lucene-Solr-master-Linux/solr/build/solr-core/test/J1/temp/solr.util.TestSolrCLIRunExample_35386553C80D07AC-001/tempDir-002/node1/testCloudExamplePrompt_shard2_replica2/../../../../contrib/extraction/lib
   [junit4]   2> 1101641 WARN  (qtp23129046-79024) [n:localhost:45751_solr c:testCloudExamplePrompt s:shard1  x:testCloudExamplePrompt_shard1_replica2] o.a.s.c.SolrConfig Couldn't add files from /home/jenkins/workspace/Lucene-Solr-master-Linux/solr/build/solr-core/test/J1/temp/solr.util.TestSolrCLIRunExample_35386553C80D07AC-001/tempDir-002/node1/testCloudExamplePrompt_shard1_replica2/../../../../dist filtered by solr-cell-\d.*\.jar to classpath: /home/jenkins/workspace/Lucene-Solr-master-Linux/solr/build/solr-core/test/J1/temp/solr.util.TestSolrCLIRunExample_35386553C80D07AC-001/tempDir-002/node1/testCloudExamplePrompt_shard1_replica2/../../../../dist
   [junit4]   2> 1101641 WARN  (qtp23129046-79021) [n:localhost:45751_solr c:testCloudExamplePrompt s:shard2  x:testCloudExamplePrompt_shard2_replica2] o.a.s.c.SolrConfig Couldn't add files from /home/jenkins/workspace/Lucene-Solr-master-Linux/solr/build/solr-core/test/J1/temp/solr.util.TestSolrCLIRunExample_35386553C80D07AC-001/tempDir-002/node1/testCloudExamplePrompt_shard2_replica2/../../../../dist filtered by solr-cell-\d.*\.jar to classpath: /home/jenkins/workspace/Lucene-Solr-master-Linux/solr/build/solr-core/test/J1/temp/solr.util.TestSolrCLIRunExample_35386553C80D07AC-001/tempDir-002/node1/testCloudExamplePrompt_shard2_replica2/../../../../dist
   [junit4]   2> 1101642 WARN  (qtp23129046-79024) [n:localhost:45751_solr c:testCloudExamplePrompt s:shard1  x:testCloudExamplePrompt_shard1_replica2] o.a.s.c.SolrConfig Couldn't add files from /home/jenkins/workspace/Lucene-Solr-master-Linux/solr/build/solr-core/test/J1/temp/solr.util.TestSolrCLIRunExample_35386553C80D07AC-001/tempDir-002/node1/testCloudExamplePrompt_shard1_replica2/../../../../contrib/clustering/lib filtered by .*\.jar to classpath: /home/jenkins/workspace/Lucene-Solr-master-Linux/solr/build/solr-core/test/J1/temp/solr.util.TestSolrCLIRunExample_35386553C80D07AC-001/tempDir-002/node1/testCloudExamplePrompt_shard1_replica2/../../../../contrib/clustering/lib
   [junit4]   2> 1101642 WARN  (qtp23129046-79021) [n:localhost:45751_solr c:testCloudExamplePrompt s:shard2  x:testCloudExamplePrompt_shard2_replica2] o.a.s.c.SolrConfig Couldn't add files from /home/jenkins/workspace/Lucene-Solr-master-Linux/solr/build/solr-core/test/J1/temp/solr.util.TestSolrCLIRunExample_35386553C80D07AC-001/tempDir-002/node1/testCloudExamplePrompt_shard2_replica2/../../../../contrib/clustering/lib filtered by .*\.jar to classpath: /home/jenkins/workspace/Lucene-Solr-master-Linux/solr/build/solr-core/test/J1/temp/solr.util.TestSolrCLIRunExample_35386553C80D07AC-001/tempDir-002/node1/testCloudExamplePrompt_shard2_replica2/../../../../contrib/clustering/lib
   [junit4]   2> 1101642 WARN  (qtp23129046-79024) [n:localhost:45751_solr c:testCloudExamplePrompt s:shard1  x:testCloudExamplePrompt_shard1_replica2] o.a.s.c.SolrConfig Couldn't add files from /home/jenkins/workspace/Lucene-Solr-master-Linux/solr/build/solr-core/test/J1/temp/solr.util.TestSolrCLIRunExample_35386553C80D07AC-001/tempDir-002/node1/testCloudExamplePrompt_shard1_replica2/../../../../dist filtered by solr-clustering-\d.*\.jar to classpath: /home/jenkins/workspace/Lucene-Solr-master-Linux/solr/build/solr-core/test/J1/temp/solr.util.TestSolrCLIRunExample_35386553C80D07AC-001/tempDir-002/node1/testCloudExamplePrompt_shard1_replica2/../../../../dist
   [junit4]   2> 1101642 WARN  (qtp23129046-79021) [n:localhost:45751_solr c:testCloudExamplePrompt s:shard2  x:testCloudExamplePrompt_shard2_replica2] o.a.s.c.SolrConfig Couldn't add files from /home/jenkins/workspace/Lucene-Solr-master-Linux/solr/build/solr-core/test/J1/temp/solr.util.TestSolrCLIRunExample_35386553C80D07AC-001/tempDir-002/node1/testCloudExamplePrompt_shard2_replica2/../../../../dist filtered by solr-clustering-\d.*\.jar to classpath: /home/jenkins/workspace/Lucene-Solr-master-Linux/solr/build/solr-core/test/J1/temp/solr.util.TestSolrCLIRunExample_35386553C80D07AC-001/tempDir-002/node1/testCloudExamplePrompt_shard2_replica2/../../../../dist
   [junit4]   2> 1101642 WARN  (qtp23129046-79024) [n:localhost:45751_solr c:testCloudExamplePrompt s:shard1  x:testCloudExamplePrompt_shard1_replica2] o.a.s.c.SolrConfig Couldn't add files from /home/jenkins/workspace/Lucene-Solr-master-Linux/solr/build/solr-core/test/J1/temp/solr.util.TestSolrCLIRunExample_35386553C80D07AC-001/tempDir-002/node1/testCloudExamplePrompt_shard1_replica2/../../../../contrib/langid/lib filtered by .*\.jar to classpath: /home/jenkins/workspace/Lucene-Solr-master-Linux/solr/build/solr-core/test/J1/temp/solr.util.TestSolrCLIRunExample_35386553C80D07AC-001/tempDir-002/node1/testCloudExamplePrompt_shard1_replica2/../../../../contrib/langid/lib
   [junit4]   2> 1101642 WARN  (qtp23129046-79021) [n:localhost:45751_solr c:testCloudExamplePrompt s:shard2  x:testCloudExamplePrompt_shard2_replica2] o.a.s.c.SolrConfig Couldn't add files from /home/jenkins/workspace/Lucene-Solr-master-Linux/solr/build/solr-core/test/J1/temp/solr.util.TestSolrCLIRunExample_35386553C80D07AC-001/tempDir-002/node1/testCloudExamplePrompt_shard2_replica2/../../../../contrib/langid/lib filtered by .*\.jar to classpath: /home/jenkins/workspace/Lucene-Solr-master-Linux/solr/build/solr-core/test/J1/temp/solr.util.TestSolrCLIRunExample_35386553C80D07AC-001/tempDir-002/node1/testCloudExamplePrompt_shard2_replica2/../../../../contrib/langid/lib
   [junit4]   2> 1101643 WARN  (qtp23129046-79024) [n:localhost:45751_solr c:testCloudExamplePrompt s:shard1  x:testCloudExamplePrompt_shard1_replica2] o.a.s.c.SolrConfig Couldn't add files from /home/jenkins/workspace/Lucene-Solr-master-Linux/solr/build/solr-core/test/J1/temp/solr.util.TestSolrCLIRunExample_35386553C80D07AC-001/tempDir-002/node1/testCloudExamplePrompt_shard1_replica2/../../../../dist filtered by solr-langid-\d.*\.jar to classpath: /home/jenkins/workspace/Lucene-Solr-master-Linux/solr/build/solr-core/test/J1/temp/solr.util.TestSolrCLIRunExample_35386553C80D07AC-001/tempDir-002/node1/testCloudExamplePrompt_shard1_replica2/../../../../dist
   [junit4]   2> 1101643 WARN  (qtp23129046-79021) [n:localhost:45751_solr c:testCloudExamplePrompt s:shard2  x:testCloudExamplePrompt_shard2_replica2] o.a.s.c.SolrConfig Couldn't add files from /home/jenkins/workspace/Lucene-Solr-master-Linux/solr/build/solr-core/test/J1/temp/solr.util.TestSolrCLIRunExample_35386553C80D07AC-001/tempDir-002/node1/testCloudExamplePrompt_shard2_replica2/../../../../dist filtered by solr-langid-\d.*\.jar to classpath: /home/jenkins/workspace/Lucene-Solr-master-Linux/solr/build/solr-core/test/J1/temp/solr.util.TestSolrCLIRunExample_35386553C80D07AC-001/tempDir-002/node1/testCloudExamplePrompt_shard2_replica2/../../../../dist
   [junit4]   2> 1101643 WARN  (qtp23129046-79024) [n:localhost:45751_solr c:testCloudExamplePrompt s:shard1  x:testCloudExamplePrompt_shard1_replica2] o.a.s.c.SolrConfig Couldn't add files from /home/jenkins/workspace/Lucene-Solr-master-Linux/solr/build/solr-core/test/J1/temp/solr.util.TestSolrCLIRunExample_35386553C80D07AC-001/tempDir-002/node1/testCloudExamplePrompt_shard1_replica2/../../../../contrib/velocity/lib filtered by .*\.jar to classpath: /home/jenkins/workspace/Lucene-Solr-master-Linux/solr/build/solr-core/test/J1/temp/solr.util.TestSolrCLIRunExample_35386553C80D07AC-001/tempDir-002/node1/testCloudExamplePrompt_shard1_replica2/../../../../contrib/velocity/lib
   [junit4]   2> 1101643 WARN  (qtp23129046-79021) [n:localhost:45751_solr c:testCloudExamplePrompt s:shard2  x:testCloudExamplePrompt_shard2_replica2] o.a.s.c.SolrConfig Couldn't add files from /home/jenkins/workspace/Lucene-Solr-master-Linux/solr/build/solr-core/test/J1/temp/solr.util.TestSolrCLIRunExample_35386553C80D07AC-001/tempDir-002/node1/testCloudExamplePrompt_shard2_replica2/../../../../contrib/velocity/lib filtered by .*\.jar to classpath: /home/jenkins/workspace/Lucene-Solr-master-Linux/solr/build/solr-core/test/J1/temp/solr.util.TestSolrCLIRunExample_35386553C80D07AC-001/tempDir-002/node1/testCloudExamplePrompt_shard2_replica2/../../../../contrib/velocity/lib
   [junit4]   2> 1101643 WARN  (qtp23129046-79024) [n:localhost:45751_solr c:testCloudExamplePrompt s:shard1  x:testCloudExamplePrompt_shard1_replica2] o.a.s.c.SolrConfig Couldn't add files from /home/jenkins/workspace/Lucene-Solr-master-Linux/solr/build/solr-core/test/J1/temp/solr.util.TestSolrCLIRunExample_35386553C80D07AC-001/tempDir-002/node1/testCloudExamplePrompt_shard1_replica2/../../../../dist filtered by solr-velocity-\d.*\.jar to classpath: /home/jenkins/workspace/Lucene-Solr-master-Linux/solr/build/solr-core/test/J1/temp/solr.util.TestSolrCLIRunExample_35386553C80D07AC-001/tempDir-002/node1/testCloudExamplePrompt_shard1_replica2/../../../../dist
   [junit4]   2> 1101643 WARN  (qtp23129046-79021) [n:localhost:45751_solr c:testCloudExamplePrompt s:shard2  x:testCloudExamplePrompt_shard2_replica2] o.a.s.c.SolrConfig Couldn't add files from /home/jenkins/workspace/Lucene-Solr-master-Linux/solr/build/solr-core/test/J1/temp/solr.util.TestSolrCLIRunExample_35386553C80D07AC-001/tempDir-002/node1/testCloudExamplePrompt_shard2_replica2/../../../../dist filtered by solr-velocity-\d.*\.jar to classpath: /home/jenkins/workspace/Lucene-Solr-master-Linux/solr/build/solr-core/test/J1/temp/solr.util.TestSolrCLIRunExample_35386553C80D07AC-001/tempDir-002/node1/testCloudExamplePrompt_shard2_replica2/../../../../dist
   [junit4]   2> 1101658 INFO  (qtp23129046-79019) [n:localhost:45751_solr c:testCloudExamplePrompt s:shard2  x:testCloudExamplePrompt_shard2_replica1] o.a.s.c.SolrConfig Using Lucene MatchVersion: 7.0.0
   [junit4]   2> 1101659 INFO  (qtp23129046-79020) [n:localhost:45751_solr c:testCloudExamplePrompt s:shard1  x:testCloudExamplePrompt_shard1_replica1] o.a.s.c.SolrConfig Using Lucene MatchVersion: 7.0.0
   [junit4]   2> 1101672 INFO  (qtp23129046-79021) [n:localhost:45751_solr c:testCloudExamplePrompt s:shard2  x:testCloudExamplePrompt_shard2_replica2] o.a.s.c.SolrConfig Using Lucene MatchVersion: 7.0.0
   [junit4]   2> 1101672 INFO  (qtp23129046-79024) [n:localhost:45751_solr c:testCloudExamplePrompt s:shard1  x:testCloudExamplePrompt_shard1_replica2] o.a.s.c.SolrConfig Using Lucene MatchVersion: 7.0.0
   [junit4]   2> 1101689 INFO  (qtp23129046-79019) [n:localhost:45751_solr c:testCloudExamplePrompt s:shard2  x:testCloudExamplePrompt_shard2_replica1] o.a.s.c.SolrConfig Loaded SolrConfig: solrconfig.xml
   [junit4]   2> 1101690 INFO  (qtp23129046-79020) [n:localhost:45751_solr c:testCloudExamplePrompt s:shard1  x:testCloudExamplePrompt_shard1_replica1] o.a.s.c.SolrConfig Loaded SolrConfig: solrconfig.xml
   [junit4]   2> 1101703 INFO  (qtp23129046-79019) [n:localhost:45751_solr c:testCloudExamplePrompt s:shard2  x:testCloudExamplePrompt_shard2_replica1] o.a.s.s.IndexSchema [testCloudExamplePrompt_shard2_replica1] Schema name=example-data-driven-schema
   [junit4]   2> 1101703 INFO  (qtp23129046-79020) [n:localhost:45751_solr c:testCloudExamplePrompt s:shard1  x:testCloudExamplePrompt_shard1_replica1] o.a.s.s.IndexSchema [testCloudExamplePrompt_shard1_replica1] Schema name=example-data-driven-schema
   [junit4]   2> 1101713 INFO  (qtp23129046-79024) [n:localhost:45751_solr c:testCloudExamplePrompt s:shard1  x:testCloudExamplePrompt_shard1_replica2] o.a.s.c.SolrConfig Loaded SolrConfig: solrconfig.xml
   [junit4]   2> 1101713 INFO  (qtp23129046-79021) [n:localhost:45751_solr c:testCloudExamplePrompt s:shard2  x:testCloudExamplePrompt_shard2_replica2] o.a.s.c.SolrConfig Loaded SolrConfig: solrconfig.xml
   [junit4]   2> 1101725 INFO  (qtp23129046-79021) [n:localhost:45751_solr c:testCloudExamplePrompt s:shard2  x:testCloudExamplePrompt_shard2_replica2] o.a.s.s.IndexSchema [testCloudExamplePrompt_shard2_replica2] Schema name=example-data-driven-schema
   [junit4]   2> 1101726 INFO  (qtp23129046-79024) [n:localhost:45751_solr c:testCloudExamplePrompt s:shard1  x:testCloudExamplePrompt_shard1_replica2] o.a.s.s.IndexSchema [testCloudExamplePrompt_shard1_replica2] Schema name=example-data-driven-schema
   [junit4]   2> 1101910 INFO  (qtp23129046-79024) [n:localhost:45751_solr c:testCloudExamplePrompt s:shard1  x:testCloudExamplePrompt_shard1_replica2] o.a.s.s.IndexSchema unique key field: id
   [junit4]   2> 1101910 INFO  (qtp23129046-79021) [n:localhost:45751_solr c:testCloudExamplePrompt s:shard2  x:testCloudExamplePrompt_shard2_replica2] o.a.s.s.IndexSchema unique key field: id
   [junit4]   2> 1101911 INFO  (qtp23129046-79020) [n:localhost:45751_solr c:testCloudExamplePrompt s:shard1  x:testCloudExamplePrompt_shard1_replica1] o.a.s.s.IndexSchema unique key field: id
   [junit4]   2> 1101929 INFO  (qtp23129046-79019) [n:localhost:45751_solr c:testCloudExamplePrompt s:shard2  x:testCloudExamplePrompt_shard2_replica1] o.a.s.s.IndexSchema unique key field: id
   

[...truncated too long message...]

LIRunExample_35386553C80D07AC-001/tempDir-003/schemaless/solr/gettingstarted/conf/elevate.xml
   [junit4]   2> 1117260 INFO  (qtp32718707-79212) [    x:gettingstarted] o.a.s.h.ReplicationHandler Commits will be reserved for  10000
   [junit4]   2> 1117261 INFO  (searcherExecutor-6460-thread-1-processing-x:gettingstarted) [    x:gettingstarted] o.a.s.c.QuerySenderListener QuerySenderListener sending requests to Searcher@12e35a3[gettingstarted] main{ExitableDirectoryReader(UninvertingDirectoryReader())}
   [junit4]   2> 1117261 INFO  (searcherExecutor-6460-thread-1-processing-x:gettingstarted) [    x:gettingstarted] o.a.s.c.QuerySenderListener QuerySenderListener done.
   [junit4]   2> 1117261 INFO  (searcherExecutor-6460-thread-1-processing-x:gettingstarted) [    x:gettingstarted] o.a.s.h.c.SpellCheckComponent Loading spell index for spellchecker: default
   [junit4]   2> 1117263 INFO  (searcherExecutor-6460-thread-1-processing-x:gettingstarted) [    x:gettingstarted] o.a.s.c.SolrCore [gettingstarted] Registered new searcher Searcher@12e35a3[gettingstarted] main{ExitableDirectoryReader(UninvertingDirectoryReader())}
   [junit4]   2> 1117263 INFO  (qtp32718707-79212) [    x:gettingstarted] o.a.s.u.UpdateLog Looking up max value of version field to seed version buckets
   [junit4]   2> 1117263 INFO  (qtp32718707-79212) [    x:gettingstarted] o.a.s.u.VersionInfo Refreshing highest value of _version_ for 65536 version buckets from index
   [junit4]   2> 1117263 INFO  (qtp32718707-79212) [    x:gettingstarted] o.a.s.u.UpdateLog Could not find max version in index or recent updates, using new clock 1545268275350339584
   [junit4]   2> 1117265 INFO  (qtp32718707-79212) [    x:gettingstarted] o.a.s.u.UpdateLog Took 1.0ms to seed version buckets with highest version 1545268275350339584
   [junit4]   2> 1117265 INFO  (qtp32718707-79212) [    x:gettingstarted] o.a.s.c.CoreContainer registering core: gettingstarted
   [junit4]   2> 1117266 INFO  (qtp32718707-79212) [    x:gettingstarted] o.a.s.s.HttpSolrCall [admin] webapp=null path=/admin/cores params={name=gettingstarted&action=CREATE&instanceDir=gettingstarted&wt=json} status=0 QTime=311
   [junit4]   2> 1117267 INFO  (TEST-TestSolrCLIRunExample.testSchemalessExample-seed#[35386553C80D07AC]) [    ] o.e.j.s.ServerConnector Stopped ServerConnector@1df50d8{HTTP/1.1,[http/1.1]}{127.0.0.1:44055}
   [junit4]   2> 1117267 INFO  (TEST-TestSolrCLIRunExample.testSchemalessExample-seed#[35386553C80D07AC]) [    ] o.a.s.c.CoreContainer Shutting down CoreContainer instance=26801673
   [junit4]   2> 1117269 INFO  (coreCloseExecutor-6465-thread-1) [    x:gettingstarted] o.a.s.c.SolrCore [gettingstarted]  CLOSING SolrCore org.apache.solr.core.SolrCore@15329eb
   [junit4]   2> 1117269 INFO  (coreCloseExecutor-6465-thread-1) [    x:gettingstarted] o.a.s.u.DirectUpdateHandler2 closing DirectUpdateHandler2{commits=0,autocommit maxTime=15000ms,autocommits=0,soft autocommits=0,optimizes=0,rollbacks=0,expungeDeletes=0,docsPending=0,adds=0,deletesById=0,deletesByQuery=0,errors=0,cumulative_adds=0,cumulative_deletesById=0,cumulative_deletesByQuery=0,cumulative_errors=0,transaction_logs_total_size=0,transaction_logs_total_number=0}
   [junit4]   2> 1117269 INFO  (coreCloseExecutor-6465-thread-1) [    x:gettingstarted] o.a.s.u.SolrCoreState Closing SolrCoreState
   [junit4]   2> 1117269 INFO  (coreCloseExecutor-6465-thread-1) [    x:gettingstarted] o.a.s.u.DefaultSolrCoreState SolrCoreState ref count has reached 0 - closing IndexWriter
   [junit4]   2> 1117269 INFO  (coreCloseExecutor-6465-thread-1) [    x:gettingstarted] o.a.s.u.DefaultSolrCoreState closing IndexWriter with IndexWriterCloser
   [junit4]   2> 1117270 INFO  (coreCloseExecutor-6465-thread-1) [    x:gettingstarted] o.a.s.c.SolrCore [gettingstarted] Closing main searcher on request.
   [junit4]   2> 1117288 INFO  (coreCloseExecutor-6465-thread-1) [    x:gettingstarted] o.a.s.c.CachingDirectoryFactory Closing MockDirectoryFactory - 3 directories currently being tracked
   [junit4]   2> 1117288 INFO  (coreCloseExecutor-6465-thread-1) [    x:gettingstarted] o.a.s.c.CachingDirectoryFactory looking to close /home/jenkins/workspace/Lucene-Solr-master-Linux/solr/build/solr-core/test/J1/temp/solr.util.TestSolrCLIRunExample_35386553C80D07AC-001/tempDir-003/schemaless/solr/gettingstarted/data/snapshot_metadata [CachedDir<<refCount=0;path=/home/jenkins/workspace/Lucene-Solr-master-Linux/solr/build/solr-core/test/J1/temp/solr.util.TestSolrCLIRunExample_35386553C80D07AC-001/tempDir-003/schemaless/solr/gettingstarted/data/snapshot_metadata;done=false>>]
   [junit4]   2> 1117288 INFO  (coreCloseExecutor-6465-thread-1) [    x:gettingstarted] o.a.s.c.CachingDirectoryFactory Closing directory, CoreContainer#isShutdown=true
   [junit4]   2> 1117288 INFO  (coreCloseExecutor-6465-thread-1) [    x:gettingstarted] o.a.s.c.CachingDirectoryFactory Closing directory: /home/jenkins/workspace/Lucene-Solr-master-Linux/solr/build/solr-core/test/J1/temp/solr.util.TestSolrCLIRunExample_35386553C80D07AC-001/tempDir-003/schemaless/solr/gettingstarted/data/snapshot_metadata
   [junit4]   2> 1117289 INFO  (coreCloseExecutor-6465-thread-1) [    x:gettingstarted] o.a.s.c.CachingDirectoryFactory looking to close /home/jenkins/workspace/Lucene-Solr-master-Linux/solr/build/solr-core/test/J1/temp/solr.util.TestSolrCLIRunExample_35386553C80D07AC-001/tempDir-003/schemaless/solr/gettingstarted/data/index [CachedDir<<refCount=0;path=/home/jenkins/workspace/Lucene-Solr-master-Linux/solr/build/solr-core/test/J1/temp/solr.util.TestSolrCLIRunExample_35386553C80D07AC-001/tempDir-003/schemaless/solr/gettingstarted/data/index;done=false>>]
   [junit4]   2> 1117289 INFO  (coreCloseExecutor-6465-thread-1) [    x:gettingstarted] o.a.s.c.CachingDirectoryFactory Closing directory, CoreContainer#isShutdown=true
   [junit4]   2> 1117289 INFO  (coreCloseExecutor-6465-thread-1) [    x:gettingstarted] o.a.s.c.CachingDirectoryFactory Closing directory: /home/jenkins/workspace/Lucene-Solr-master-Linux/solr/build/solr-core/test/J1/temp/solr.util.TestSolrCLIRunExample_35386553C80D07AC-001/tempDir-003/schemaless/solr/gettingstarted/data/index
   [junit4]   2> 1117289 INFO  (coreCloseExecutor-6465-thread-1) [    x:gettingstarted] o.a.s.c.CachingDirectoryFactory looking to close /home/jenkins/workspace/Lucene-Solr-master-Linux/solr/build/solr-core/test/J1/temp/solr.util.TestSolrCLIRunExample_35386553C80D07AC-001/tempDir-003/schemaless/solr/gettingstarted/data [CachedDir<<refCount=0;path=/home/jenkins/workspace/Lucene-Solr-master-Linux/solr/build/solr-core/test/J1/temp/solr.util.TestSolrCLIRunExample_35386553C80D07AC-001/tempDir-003/schemaless/solr/gettingstarted/data;done=false>>]
   [junit4]   2> 1117289 INFO  (coreCloseExecutor-6465-thread-1) [    x:gettingstarted] o.a.s.c.CachingDirectoryFactory Closing directory, CoreContainer#isShutdown=true
   [junit4]   2> 1117289 INFO  (coreCloseExecutor-6465-thread-1) [    x:gettingstarted] o.a.s.c.CachingDirectoryFactory Closing directory: /home/jenkins/workspace/Lucene-Solr-master-Linux/solr/build/solr-core/test/J1/temp/solr.util.TestSolrCLIRunExample_35386553C80D07AC-001/tempDir-003/schemaless/solr/gettingstarted/data
   [junit4]   2> 1117289 INFO  (TEST-TestSolrCLIRunExample.testSchemalessExample-seed#[35386553C80D07AC]) [    ] o.e.j.s.h.ContextHandler Stopped o.e.j.s.ServletContextHandler@1531a72{/solr,null,UNAVAILABLE}
   [junit4]   2> 1117290 INFO  (TEST-TestSolrCLIRunExample.testSchemalessExample-seed#[35386553C80D07AC]) [    ] o.a.s.u.TestSolrCLIRunExample Stopped standalone Solr instance running on port 44055
   [junit4]   2> 1117290 INFO  (TEST-TestSolrCLIRunExample.testSchemalessExample-seed#[35386553C80D07AC]) [    ] o.a.s.SolrTestCaseJ4 ###Ending testSchemalessExample
   [junit4]   2> 1117291 INFO  (SUITE-TestSolrCLIRunExample-seed#[35386553C80D07AC]-worker) [    ] o.a.s.SolrTestCaseJ4 ###deleteCore
   [junit4]   2> NOTE: leaving temporary files on disk at: /home/jenkins/workspace/Lucene-Solr-master-Linux/solr/build/solr-core/test/J1/temp/solr.util.TestSolrCLIRunExample_35386553C80D07AC-001
   [junit4]   2> NOTE: test params are: codec=Asserting(Lucene62), sim=RandomSimilarity(queryNorm=false): {}, locale=zh, timezone=America/Glace_Bay
   [junit4]   2> NOTE: Linux 4.4.0-36-generic i386/Oracle Corporation 1.8.0_102 (32-bit)/cpus=12,threads=1,free=280399712,total=518979584
   [junit4]   2> NOTE: All tests run in this JVM: [DistributedTermsComponentTest, ReplaceNodeTest, TestQueryTypes, TestCloudInspectUtil, ShardSplitTest, LeaderFailoverAfterPartitionTest, TestQuerySenderListener, TestCursorMarkWithoutUniqueKey, TestReloadAndDeleteDocs, AsyncMigrateRouteKeyTest, SampleTest, TestFieldTypeResource, SortByFunctionTest, TestSubQueryTransformer, DistributedFacetPivotSmallAdvancedTest, TestStressVersions, HighlighterMaxOffsetTest, TestBulkSchemaAPI, CollectionTooManyReplicasTest, ConjunctionSolrSpellCheckerTest, TestMacros, BasicFunctionalityTest, TestPartialUpdateDeduplication, ZkControllerTest, TestRTGBase, RAMDirectoryFactoryTest, TestSolrDynamicMBean, SpatialFilterTest, TestCollectionAPI, TestCloudSchemaless, OverriddenZkACLAndCredentialsProvidersTest, VersionInfoTest, ZkSolrClientTest, TestDistributedGrouping, DistributedIntervalFacetingTest, TestSolrIndexConfig, PKIAuthenticationIntegrationTest, SearchHandlerTest, TestManagedSchemaAPI, CSVRequestHandlerTest, HdfsRecoverLeaseTest, FileUtilsTest, TestSurroundQueryParser, TestFieldCacheWithThreads, WordBreakSolrSpellCheckerTest, SuggestComponentTest, SuggesterFSTTest, TestConfigSets, ClusterStateUpdateTest, MoreLikeThisHandlerTest, TestStandardQParsers, TestDefaultStatsCache, DocumentBuilderTest, TestSystemIdResolver, ConvertedLegacyTest, TestNamedUpdateProcessors, CoreSorterTest, TestConfigSetsAPIZkFailure, TestInfoStreamLogging, TestStressLiveNodes, TestSolrCLIRunExample]
   [junit4] Completed [236/631 (1!)] on J1 in 17.14s, 3 tests, 1 failure, 1 skipped <<< FAILURES!

[...truncated 53830 lines...]


Mime
View raw message