lucene-dev mailing list archives

Site index · List index
Message view « Date » · « Thread »
Top « Date » · « Thread »
From Policeman Jenkins Server <jenk...@thetaphi.de>
Subject [JENKINS] Lucene-Solr-master-Linux (32bit/jdk1.8.0_102) - Build # 17856 - Unstable!
Date Tue, 20 Sep 2016 07:22:52 GMT
Build: http://jenkins.thetaphi.de/job/Lucene-Solr-master-Linux/17856/
Java: 32bit/jdk1.8.0_102 -client -XX:+UseParallelGC

3 tests failed.
FAILED:  junit.framework.TestSuite.org.apache.solr.cloud.CollectionsAPIDistributedZkTest

Error Message:
6 threads leaked from SUITE scope at org.apache.solr.cloud.CollectionsAPIDistributedZkTest:     1) Thread[id=5150, name=zkCallback-883-thread-3, state=TIMED_WAITING, group=TGRP-CollectionsAPIDistributedZkTest]         at sun.misc.Unsafe.park(Native Method)         at java.util.concurrent.locks.LockSupport.parkNanos(LockSupport.java:215)         at java.util.concurrent.SynchronousQueue$TransferStack.awaitFulfill(SynchronousQueue.java:460)         at java.util.concurrent.SynchronousQueue$TransferStack.transfer(SynchronousQueue.java:362)         at java.util.concurrent.SynchronousQueue.poll(SynchronousQueue.java:941)         at java.util.concurrent.ThreadPoolExecutor.getTask(ThreadPoolExecutor.java:1066)         at java.util.concurrent.ThreadPoolExecutor.runWorker(ThreadPoolExecutor.java:1127)         at java.util.concurrent.ThreadPoolExecutor$Worker.run(ThreadPoolExecutor.java:617)         at java.lang.Thread.run(Thread.java:745)    2) Thread[id=5065, name=Connection evictor, state=TIMED_WAITING, group=TGRP-CollectionsAPIDistributedZkTest]         at java.lang.Thread.sleep(Native Method)         at org.apache.http.impl.client.IdleConnectionEvictor$1.run(IdleConnectionEvictor.java:66)         at java.lang.Thread.run(Thread.java:745)    3) Thread[id=5067, name=TEST-CollectionsAPIDistributedZkTest.test-seed#[BA85BFFFDFAE11C5]-EventThread, state=WAITING, group=TGRP-CollectionsAPIDistributedZkTest]         at sun.misc.Unsafe.park(Native Method)         at java.util.concurrent.locks.LockSupport.park(LockSupport.java:175)         at java.util.concurrent.locks.AbstractQueuedSynchronizer$ConditionObject.await(AbstractQueuedSynchronizer.java:2039)         at java.util.concurrent.LinkedBlockingQueue.take(LinkedBlockingQueue.java:442)         at org.apache.zookeeper.ClientCnxn$EventThread.run(ClientCnxn.java:494)    4) Thread[id=5066, name=TEST-CollectionsAPIDistributedZkTest.test-seed#[BA85BFFFDFAE11C5]-SendThread(127.0.0.1:33942), state=TIMED_WAITING, group=TGRP-CollectionsAPIDistributedZkTest]         at java.lang.Thread.sleep(Native Method)         at org.apache.zookeeper.client.StaticHostProvider.next(StaticHostProvider.java:101)         at org.apache.zookeeper.ClientCnxn$SendThread.startConnect(ClientCnxn.java:940)         at org.apache.zookeeper.ClientCnxn$SendThread.run(ClientCnxn.java:1003)    5) Thread[id=5068, name=zkCallback-883-thread-1, state=TIMED_WAITING, group=TGRP-CollectionsAPIDistributedZkTest]         at sun.misc.Unsafe.park(Native Method)         at java.util.concurrent.locks.LockSupport.parkNanos(LockSupport.java:215)         at java.util.concurrent.SynchronousQueue$TransferStack.awaitFulfill(SynchronousQueue.java:460)         at java.util.concurrent.SynchronousQueue$TransferStack.transfer(SynchronousQueue.java:362)         at java.util.concurrent.SynchronousQueue.poll(SynchronousQueue.java:941)         at java.util.concurrent.ThreadPoolExecutor.getTask(ThreadPoolExecutor.java:1066)         at java.util.concurrent.ThreadPoolExecutor.runWorker(ThreadPoolExecutor.java:1127)         at java.util.concurrent.ThreadPoolExecutor$Worker.run(ThreadPoolExecutor.java:617)         at java.lang.Thread.run(Thread.java:745)    6) Thread[id=5148, name=zkCallback-883-thread-2, state=TIMED_WAITING, group=TGRP-CollectionsAPIDistributedZkTest]         at sun.misc.Unsafe.park(Native Method)         at java.util.concurrent.locks.LockSupport.parkNanos(LockSupport.java:215)         at java.util.concurrent.SynchronousQueue$TransferStack.awaitFulfill(SynchronousQueue.java:460)         at java.util.concurrent.SynchronousQueue$TransferStack.transfer(SynchronousQueue.java:362)         at java.util.concurrent.SynchronousQueue.poll(SynchronousQueue.java:941)         at java.util.concurrent.ThreadPoolExecutor.getTask(ThreadPoolExecutor.java:1066)         at java.util.concurrent.ThreadPoolExecutor.runWorker(ThreadPoolExecutor.java:1127)         at java.util.concurrent.ThreadPoolExecutor$Worker.run(ThreadPoolExecutor.java:617)         at java.lang.Thread.run(Thread.java:745)

Stack Trace:
com.carrotsearch.randomizedtesting.ThreadLeakError: 6 threads leaked from SUITE scope at org.apache.solr.cloud.CollectionsAPIDistributedZkTest: 
   1) Thread[id=5150, name=zkCallback-883-thread-3, state=TIMED_WAITING, group=TGRP-CollectionsAPIDistributedZkTest]
        at sun.misc.Unsafe.park(Native Method)
        at java.util.concurrent.locks.LockSupport.parkNanos(LockSupport.java:215)
        at java.util.concurrent.SynchronousQueue$TransferStack.awaitFulfill(SynchronousQueue.java:460)
        at java.util.concurrent.SynchronousQueue$TransferStack.transfer(SynchronousQueue.java:362)
        at java.util.concurrent.SynchronousQueue.poll(SynchronousQueue.java:941)
        at java.util.concurrent.ThreadPoolExecutor.getTask(ThreadPoolExecutor.java:1066)
        at java.util.concurrent.ThreadPoolExecutor.runWorker(ThreadPoolExecutor.java:1127)
        at java.util.concurrent.ThreadPoolExecutor$Worker.run(ThreadPoolExecutor.java:617)
        at java.lang.Thread.run(Thread.java:745)
   2) Thread[id=5065, name=Connection evictor, state=TIMED_WAITING, group=TGRP-CollectionsAPIDistributedZkTest]
        at java.lang.Thread.sleep(Native Method)
        at org.apache.http.impl.client.IdleConnectionEvictor$1.run(IdleConnectionEvictor.java:66)
        at java.lang.Thread.run(Thread.java:745)
   3) Thread[id=5067, name=TEST-CollectionsAPIDistributedZkTest.test-seed#[BA85BFFFDFAE11C5]-EventThread, state=WAITING, group=TGRP-CollectionsAPIDistributedZkTest]
        at sun.misc.Unsafe.park(Native Method)
        at java.util.concurrent.locks.LockSupport.park(LockSupport.java:175)
        at java.util.concurrent.locks.AbstractQueuedSynchronizer$ConditionObject.await(AbstractQueuedSynchronizer.java:2039)
        at java.util.concurrent.LinkedBlockingQueue.take(LinkedBlockingQueue.java:442)
        at org.apache.zookeeper.ClientCnxn$EventThread.run(ClientCnxn.java:494)
   4) Thread[id=5066, name=TEST-CollectionsAPIDistributedZkTest.test-seed#[BA85BFFFDFAE11C5]-SendThread(127.0.0.1:33942), state=TIMED_WAITING, group=TGRP-CollectionsAPIDistributedZkTest]
        at java.lang.Thread.sleep(Native Method)
        at org.apache.zookeeper.client.StaticHostProvider.next(StaticHostProvider.java:101)
        at org.apache.zookeeper.ClientCnxn$SendThread.startConnect(ClientCnxn.java:940)
        at org.apache.zookeeper.ClientCnxn$SendThread.run(ClientCnxn.java:1003)
   5) Thread[id=5068, name=zkCallback-883-thread-1, state=TIMED_WAITING, group=TGRP-CollectionsAPIDistributedZkTest]
        at sun.misc.Unsafe.park(Native Method)
        at java.util.concurrent.locks.LockSupport.parkNanos(LockSupport.java:215)
        at java.util.concurrent.SynchronousQueue$TransferStack.awaitFulfill(SynchronousQueue.java:460)
        at java.util.concurrent.SynchronousQueue$TransferStack.transfer(SynchronousQueue.java:362)
        at java.util.concurrent.SynchronousQueue.poll(SynchronousQueue.java:941)
        at java.util.concurrent.ThreadPoolExecutor.getTask(ThreadPoolExecutor.java:1066)
        at java.util.concurrent.ThreadPoolExecutor.runWorker(ThreadPoolExecutor.java:1127)
        at java.util.concurrent.ThreadPoolExecutor$Worker.run(ThreadPoolExecutor.java:617)
        at java.lang.Thread.run(Thread.java:745)
   6) Thread[id=5148, name=zkCallback-883-thread-2, state=TIMED_WAITING, group=TGRP-CollectionsAPIDistributedZkTest]
        at sun.misc.Unsafe.park(Native Method)
        at java.util.concurrent.locks.LockSupport.parkNanos(LockSupport.java:215)
        at java.util.concurrent.SynchronousQueue$TransferStack.awaitFulfill(SynchronousQueue.java:460)
        at java.util.concurrent.SynchronousQueue$TransferStack.transfer(SynchronousQueue.java:362)
        at java.util.concurrent.SynchronousQueue.poll(SynchronousQueue.java:941)
        at java.util.concurrent.ThreadPoolExecutor.getTask(ThreadPoolExecutor.java:1066)
        at java.util.concurrent.ThreadPoolExecutor.runWorker(ThreadPoolExecutor.java:1127)
        at java.util.concurrent.ThreadPoolExecutor$Worker.run(ThreadPoolExecutor.java:617)
        at java.lang.Thread.run(Thread.java:745)
	at __randomizedtesting.SeedInfo.seed([BA85BFFFDFAE11C5]:0)


FAILED:  junit.framework.TestSuite.org.apache.solr.cloud.CollectionsAPIDistributedZkTest

Error Message:
There are still zombie threads that couldn't be terminated:    1) Thread[id=5150, name=zkCallback-883-thread-3, state=TIMED_WAITING, group=TGRP-CollectionsAPIDistributedZkTest]         at sun.misc.Unsafe.park(Native Method)         at java.util.concurrent.locks.LockSupport.parkNanos(LockSupport.java:215)         at java.util.concurrent.SynchronousQueue$TransferStack.awaitFulfill(SynchronousQueue.java:460)         at java.util.concurrent.SynchronousQueue$TransferStack.transfer(SynchronousQueue.java:362)         at java.util.concurrent.SynchronousQueue.poll(SynchronousQueue.java:941)         at java.util.concurrent.ThreadPoolExecutor.getTask(ThreadPoolExecutor.java:1066)         at java.util.concurrent.ThreadPoolExecutor.runWorker(ThreadPoolExecutor.java:1127)         at java.util.concurrent.ThreadPoolExecutor$Worker.run(ThreadPoolExecutor.java:617)         at java.lang.Thread.run(Thread.java:745)    2) Thread[id=5066, name=TEST-CollectionsAPIDistributedZkTest.test-seed#[BA85BFFFDFAE11C5]-SendThread(127.0.0.1:33942), state=TIMED_WAITING, group=TGRP-CollectionsAPIDistributedZkTest]         at java.lang.Thread.sleep(Native Method)         at org.apache.zookeeper.ClientCnxn$SendThread.run(ClientCnxn.java:994)    3) Thread[id=5068, name=zkCallback-883-thread-1, state=TIMED_WAITING, group=TGRP-CollectionsAPIDistributedZkTest]         at sun.misc.Unsafe.park(Native Method)         at java.util.concurrent.locks.LockSupport.parkNanos(LockSupport.java:215)         at java.util.concurrent.SynchronousQueue$TransferStack.awaitFulfill(SynchronousQueue.java:460)         at java.util.concurrent.SynchronousQueue$TransferStack.transfer(SynchronousQueue.java:362)         at java.util.concurrent.SynchronousQueue.poll(SynchronousQueue.java:941)         at java.util.concurrent.ThreadPoolExecutor.getTask(ThreadPoolExecutor.java:1066)         at java.util.concurrent.ThreadPoolExecutor.runWorker(ThreadPoolExecutor.java:1127)         at java.util.concurrent.ThreadPoolExecutor$Worker.run(ThreadPoolExecutor.java:617)         at java.lang.Thread.run(Thread.java:745)    4) Thread[id=5148, name=zkCallback-883-thread-2, state=TIMED_WAITING, group=TGRP-CollectionsAPIDistributedZkTest]         at sun.misc.Unsafe.park(Native Method)         at java.util.concurrent.locks.LockSupport.parkNanos(LockSupport.java:215)         at java.util.concurrent.SynchronousQueue$TransferStack.awaitFulfill(SynchronousQueue.java:460)         at java.util.concurrent.SynchronousQueue$TransferStack.transfer(SynchronousQueue.java:362)         at java.util.concurrent.SynchronousQueue.poll(SynchronousQueue.java:941)         at java.util.concurrent.ThreadPoolExecutor.getTask(ThreadPoolExecutor.java:1066)         at java.util.concurrent.ThreadPoolExecutor.runWorker(ThreadPoolExecutor.java:1127)         at java.util.concurrent.ThreadPoolExecutor$Worker.run(ThreadPoolExecutor.java:617)         at java.lang.Thread.run(Thread.java:745)

Stack Trace:
com.carrotsearch.randomizedtesting.ThreadLeakError: There are still zombie threads that couldn't be terminated:
   1) Thread[id=5150, name=zkCallback-883-thread-3, state=TIMED_WAITING, group=TGRP-CollectionsAPIDistributedZkTest]
        at sun.misc.Unsafe.park(Native Method)
        at java.util.concurrent.locks.LockSupport.parkNanos(LockSupport.java:215)
        at java.util.concurrent.SynchronousQueue$TransferStack.awaitFulfill(SynchronousQueue.java:460)
        at java.util.concurrent.SynchronousQueue$TransferStack.transfer(SynchronousQueue.java:362)
        at java.util.concurrent.SynchronousQueue.poll(SynchronousQueue.java:941)
        at java.util.concurrent.ThreadPoolExecutor.getTask(ThreadPoolExecutor.java:1066)
        at java.util.concurrent.ThreadPoolExecutor.runWorker(ThreadPoolExecutor.java:1127)
        at java.util.concurrent.ThreadPoolExecutor$Worker.run(ThreadPoolExecutor.java:617)
        at java.lang.Thread.run(Thread.java:745)
   2) Thread[id=5066, name=TEST-CollectionsAPIDistributedZkTest.test-seed#[BA85BFFFDFAE11C5]-SendThread(127.0.0.1:33942), state=TIMED_WAITING, group=TGRP-CollectionsAPIDistributedZkTest]
        at java.lang.Thread.sleep(Native Method)
        at org.apache.zookeeper.ClientCnxn$SendThread.run(ClientCnxn.java:994)
   3) Thread[id=5068, name=zkCallback-883-thread-1, state=TIMED_WAITING, group=TGRP-CollectionsAPIDistributedZkTest]
        at sun.misc.Unsafe.park(Native Method)
        at java.util.concurrent.locks.LockSupport.parkNanos(LockSupport.java:215)
        at java.util.concurrent.SynchronousQueue$TransferStack.awaitFulfill(SynchronousQueue.java:460)
        at java.util.concurrent.SynchronousQueue$TransferStack.transfer(SynchronousQueue.java:362)
        at java.util.concurrent.SynchronousQueue.poll(SynchronousQueue.java:941)
        at java.util.concurrent.ThreadPoolExecutor.getTask(ThreadPoolExecutor.java:1066)
        at java.util.concurrent.ThreadPoolExecutor.runWorker(ThreadPoolExecutor.java:1127)
        at java.util.concurrent.ThreadPoolExecutor$Worker.run(ThreadPoolExecutor.java:617)
        at java.lang.Thread.run(Thread.java:745)
   4) Thread[id=5148, name=zkCallback-883-thread-2, state=TIMED_WAITING, group=TGRP-CollectionsAPIDistributedZkTest]
        at sun.misc.Unsafe.park(Native Method)
        at java.util.concurrent.locks.LockSupport.parkNanos(LockSupport.java:215)
        at java.util.concurrent.SynchronousQueue$TransferStack.awaitFulfill(SynchronousQueue.java:460)
        at java.util.concurrent.SynchronousQueue$TransferStack.transfer(SynchronousQueue.java:362)
        at java.util.concurrent.SynchronousQueue.poll(SynchronousQueue.java:941)
        at java.util.concurrent.ThreadPoolExecutor.getTask(ThreadPoolExecutor.java:1066)
        at java.util.concurrent.ThreadPoolExecutor.runWorker(ThreadPoolExecutor.java:1127)
        at java.util.concurrent.ThreadPoolExecutor$Worker.run(ThreadPoolExecutor.java:617)
        at java.lang.Thread.run(Thread.java:745)
	at __randomizedtesting.SeedInfo.seed([BA85BFFFDFAE11C5]:0)


FAILED:  org.apache.solr.cloud.CollectionsAPIDistributedZkTest.test

Error Message:
Timeout occured while waiting response from server at: https://127.0.0.1:46390/nt_z/j

Stack Trace:
org.apache.solr.client.solrj.SolrServerException: Timeout occured while waiting response from server at: https://127.0.0.1:46390/nt_z/j
	at __randomizedtesting.SeedInfo.seed([BA85BFFFDFAE11C5:32D1802571527C3D]:0)
	at org.apache.solr.client.solrj.impl.HttpSolrClient.executeMethod(HttpSolrClient.java:619)
	at org.apache.solr.client.solrj.impl.HttpSolrClient.request(HttpSolrClient.java:261)
	at org.apache.solr.client.solrj.impl.HttpSolrClient.request(HttpSolrClient.java:250)
	at org.apache.solr.client.solrj.SolrClient.request(SolrClient.java:1219)
	at org.apache.solr.cloud.CollectionsAPIDistributedZkTest.makeRequest(CollectionsAPIDistributedZkTest.java:400)
	at org.apache.solr.cloud.CollectionsAPIDistributedZkTest.testCollectionsAPI(CollectionsAPIDistributedZkTest.java:898)
	at org.apache.solr.cloud.CollectionsAPIDistributedZkTest.test(CollectionsAPIDistributedZkTest.java:178)
	at sun.reflect.NativeMethodAccessorImpl.invoke0(Native Method)
	at sun.reflect.NativeMethodAccessorImpl.invoke(NativeMethodAccessorImpl.java:62)
	at sun.reflect.DelegatingMethodAccessorImpl.invoke(DelegatingMethodAccessorImpl.java:43)
	at java.lang.reflect.Method.invoke(Method.java:498)
	at com.carrotsearch.randomizedtesting.RandomizedRunner.invoke(RandomizedRunner.java:1764)
	at com.carrotsearch.randomizedtesting.RandomizedRunner$8.evaluate(RandomizedRunner.java:871)
	at com.carrotsearch.randomizedtesting.RandomizedRunner$9.evaluate(RandomizedRunner.java:907)
	at com.carrotsearch.randomizedtesting.RandomizedRunner$10.evaluate(RandomizedRunner.java:921)
	at org.apache.solr.BaseDistributedSearchTestCase$ShardsRepeatRule$ShardsFixedStatement.callStatement(BaseDistributedSearchTestCase.java:985)
	at org.apache.solr.BaseDistributedSearchTestCase$ShardsRepeatRule$ShardsStatement.evaluate(BaseDistributedSearchTestCase.java:960)
	at com.carrotsearch.randomizedtesting.rules.SystemPropertiesRestoreRule$1.evaluate(SystemPropertiesRestoreRule.java:57)
	at org.apache.lucene.util.TestRuleSetupTeardownChained$1.evaluate(TestRuleSetupTeardownChained.java:49)
	at org.apache.lucene.util.AbstractBeforeAfterRule$1.evaluate(AbstractBeforeAfterRule.java:45)
	at org.apache.lucene.util.TestRuleThreadAndTestName$1.evaluate(TestRuleThreadAndTestName.java:48)
	at org.apache.lucene.util.TestRuleIgnoreAfterMaxFailures$1.evaluate(TestRuleIgnoreAfterMaxFailures.java:64)
	at org.apache.lucene.util.TestRuleMarkFailure$1.evaluate(TestRuleMarkFailure.java:47)
	at com.carrotsearch.randomizedtesting.rules.StatementAdapter.evaluate(StatementAdapter.java:36)
	at com.carrotsearch.randomizedtesting.ThreadLeakControl$StatementRunner.run(ThreadLeakControl.java:367)
	at com.carrotsearch.randomizedtesting.ThreadLeakControl.forkTimeoutingTask(ThreadLeakControl.java:809)
	at com.carrotsearch.randomizedtesting.ThreadLeakControl$3.evaluate(ThreadLeakControl.java:460)
	at com.carrotsearch.randomizedtesting.RandomizedRunner.runSingleTest(RandomizedRunner.java:880)
	at com.carrotsearch.randomizedtesting.RandomizedRunner$5.evaluate(RandomizedRunner.java:781)
	at com.carrotsearch.randomizedtesting.RandomizedRunner$6.evaluate(RandomizedRunner.java:816)
	at com.carrotsearch.randomizedtesting.RandomizedRunner$7.evaluate(RandomizedRunner.java:827)
	at com.carrotsearch.randomizedtesting.rules.StatementAdapter.evaluate(StatementAdapter.java:36)
	at com.carrotsearch.randomizedtesting.rules.SystemPropertiesRestoreRule$1.evaluate(SystemPropertiesRestoreRule.java:57)
	at org.apache.lucene.util.AbstractBeforeAfterRule$1.evaluate(AbstractBeforeAfterRule.java:45)
	at com.carrotsearch.randomizedtesting.rules.StatementAdapter.evaluate(StatementAdapter.java:36)
	at org.apache.lucene.util.TestRuleStoreClassName$1.evaluate(TestRuleStoreClassName.java:41)
	at com.carrotsearch.randomizedtesting.rules.NoShadowingOrOverridesOnMethodsRule$1.evaluate(NoShadowingOrOverridesOnMethodsRule.java:40)
	at com.carrotsearch.randomizedtesting.rules.NoShadowingOrOverridesOnMethodsRule$1.evaluate(NoShadowingOrOverridesOnMethodsRule.java:40)
	at com.carrotsearch.randomizedtesting.rules.StatementAdapter.evaluate(StatementAdapter.java:36)
	at com.carrotsearch.randomizedtesting.rules.StatementAdapter.evaluate(StatementAdapter.java:36)
	at com.carrotsearch.randomizedtesting.rules.StatementAdapter.evaluate(StatementAdapter.java:36)
	at org.apache.lucene.util.TestRuleAssertionsRequired$1.evaluate(TestRuleAssertionsRequired.java:53)
	at org.apache.lucene.util.TestRuleMarkFailure$1.evaluate(TestRuleMarkFailure.java:47)
	at org.apache.lucene.util.TestRuleIgnoreAfterMaxFailures$1.evaluate(TestRuleIgnoreAfterMaxFailures.java:64)
	at org.apache.lucene.util.TestRuleIgnoreTestSuites$1.evaluate(TestRuleIgnoreTestSuites.java:54)
	at com.carrotsearch.randomizedtesting.rules.StatementAdapter.evaluate(StatementAdapter.java:36)
	at com.carrotsearch.randomizedtesting.ThreadLeakControl$StatementRunner.run(ThreadLeakControl.java:367)
	at java.lang.Thread.run(Thread.java:745)
Caused by: java.net.SocketTimeoutException: Read timed out
	at java.net.SocketInputStream.socketRead0(Native Method)
	at java.net.SocketInputStream.socketRead(SocketInputStream.java:116)
	at java.net.SocketInputStream.read(SocketInputStream.java:170)
	at java.net.SocketInputStream.read(SocketInputStream.java:141)
	at sun.security.ssl.InputRecord.readFully(InputRecord.java:465)
	at sun.security.ssl.InputRecord.read(InputRecord.java:503)
	at sun.security.ssl.SSLSocketImpl.readRecord(SSLSocketImpl.java:973)
	at sun.security.ssl.SSLSocketImpl.readDataRecord(SSLSocketImpl.java:930)
	at sun.security.ssl.AppInputStream.read(AppInputStream.java:105)
	at org.apache.http.impl.io.SessionInputBufferImpl.streamRead(SessionInputBufferImpl.java:139)
	at org.apache.http.impl.io.SessionInputBufferImpl.fillBuffer(SessionInputBufferImpl.java:155)
	at org.apache.http.impl.io.SessionInputBufferImpl.readLine(SessionInputBufferImpl.java:284)
	at org.apache.http.impl.conn.DefaultHttpResponseParser.parseHead(DefaultHttpResponseParser.java:140)
	at org.apache.http.impl.conn.DefaultHttpResponseParser.parseHead(DefaultHttpResponseParser.java:57)
	at org.apache.http.impl.io.AbstractMessageParser.parse(AbstractMessageParser.java:261)
	at org.apache.http.impl.DefaultBHttpClientConnection.receiveResponseHeader(DefaultBHttpClientConnection.java:165)
	at org.apache.http.impl.conn.CPoolProxy.receiveResponseHeader(CPoolProxy.java:167)
	at org.apache.http.protocol.HttpRequestExecutor.doReceiveResponse(HttpRequestExecutor.java:272)
	at org.apache.http.protocol.HttpRequestExecutor.execute(HttpRequestExecutor.java:124)
	at org.apache.http.impl.execchain.MainClientExec.execute(MainClientExec.java:271)
	at org.apache.http.impl.execchain.ProtocolExec.execute(ProtocolExec.java:184)
	at org.apache.http.impl.execchain.RetryExec.execute(RetryExec.java:88)
	at org.apache.http.impl.execchain.RedirectExec.execute(RedirectExec.java:110)
	at org.apache.http.impl.client.InternalHttpClient.doExecute(InternalHttpClient.java:184)
	at org.apache.http.impl.client.CloseableHttpClient.execute(CloseableHttpClient.java:82)
	at org.apache.http.impl.client.CloseableHttpClient.execute(CloseableHttpClient.java:55)
	at org.apache.solr.client.solrj.impl.HttpSolrClient.executeMethod(HttpSolrClient.java:513)
	... 47 more




Build Log:
[...truncated 11179 lines...]
   [junit4] Suite: org.apache.solr.cloud.CollectionsAPIDistributedZkTest
   [junit4]   2> Creating dataDir: /home/jenkins/workspace/Lucene-Solr-master-Linux/solr/build/solr-core/test/J1/temp/solr.cloud.CollectionsAPIDistributedZkTest_BA85BFFFDFAE11C5-001/init-core-data-001
   [junit4]   2> 551328 INFO  (SUITE-CollectionsAPIDistributedZkTest-seed#[BA85BFFFDFAE11C5]-worker) [    ] o.a.s.SolrTestCaseJ4 Randomized ssl (true) and clientAuth (true) via: @org.apache.solr.util.RandomizeSSL(reason=, ssl=NaN, value=NaN, clientAuth=NaN)
   [junit4]   2> 551330 INFO  (SUITE-CollectionsAPIDistributedZkTest-seed#[BA85BFFFDFAE11C5]-worker) [    ] o.a.s.BaseDistributedSearchTestCase Setting hostContext system property: /nt_z/j
   [junit4]   2> 551332 INFO  (TEST-CollectionsAPIDistributedZkTest.test-seed#[BA85BFFFDFAE11C5]) [    ] o.a.s.c.ZkTestServer STARTING ZK TEST SERVER
   [junit4]   2> 551332 INFO  (Thread-1069) [    ] o.a.s.c.ZkTestServer client port:0.0.0.0/0.0.0.0:0
   [junit4]   2> 551332 INFO  (Thread-1069) [    ] o.a.s.c.ZkTestServer Starting server
   [junit4]   2> 551432 INFO  (TEST-CollectionsAPIDistributedZkTest.test-seed#[BA85BFFFDFAE11C5]) [    ] o.a.s.c.ZkTestServer start zk server on port:33942
   [junit4]   2> 551432 INFO  (TEST-CollectionsAPIDistributedZkTest.test-seed#[BA85BFFFDFAE11C5]) [    ] o.a.s.c.c.SolrZkClient Using default ZkCredentialsProvider
   [junit4]   2> 551433 INFO  (TEST-CollectionsAPIDistributedZkTest.test-seed#[BA85BFFFDFAE11C5]) [    ] o.a.s.c.c.ConnectionManager Waiting for client to connect to ZooKeeper
   [junit4]   2> 551435 INFO  (zkCallback-837-thread-1) [    ] o.a.s.c.c.ConnectionManager Watcher org.apache.solr.common.cloud.ConnectionManager@c82193 name:ZooKeeperConnection Watcher:127.0.0.1:33942 got event WatchedEvent state:SyncConnected type:None path:null path:null type:None
   [junit4]   2> 551435 INFO  (TEST-CollectionsAPIDistributedZkTest.test-seed#[BA85BFFFDFAE11C5]) [    ] o.a.s.c.c.ConnectionManager Client is connected to ZooKeeper
   [junit4]   2> 551435 INFO  (TEST-CollectionsAPIDistributedZkTest.test-seed#[BA85BFFFDFAE11C5]) [    ] o.a.s.c.c.SolrZkClient Using default ZkACLProvider
   [junit4]   2> 551435 INFO  (TEST-CollectionsAPIDistributedZkTest.test-seed#[BA85BFFFDFAE11C5]) [    ] o.a.s.c.c.SolrZkClient makePath: /solr
   [junit4]   2> 551436 INFO  (TEST-CollectionsAPIDistributedZkTest.test-seed#[BA85BFFFDFAE11C5]) [    ] o.a.s.c.c.SolrZkClient Using default ZkCredentialsProvider
   [junit4]   2> 551437 INFO  (TEST-CollectionsAPIDistributedZkTest.test-seed#[BA85BFFFDFAE11C5]) [    ] o.a.s.c.c.ConnectionManager Waiting for client to connect to ZooKeeper
   [junit4]   2> 551438 INFO  (zkCallback-838-thread-1) [    ] o.a.s.c.c.ConnectionManager Watcher org.apache.solr.common.cloud.ConnectionManager@ba89eb name:ZooKeeperConnection Watcher:127.0.0.1:33942/solr got event WatchedEvent state:SyncConnected type:None path:null path:null type:None
   [junit4]   2> 551438 INFO  (TEST-CollectionsAPIDistributedZkTest.test-seed#[BA85BFFFDFAE11C5]) [    ] o.a.s.c.c.ConnectionManager Client is connected to ZooKeeper
   [junit4]   2> 551438 INFO  (TEST-CollectionsAPIDistributedZkTest.test-seed#[BA85BFFFDFAE11C5]) [    ] o.a.s.c.c.SolrZkClient Using default ZkACLProvider
   [junit4]   2> 551439 INFO  (TEST-CollectionsAPIDistributedZkTest.test-seed#[BA85BFFFDFAE11C5]) [    ] o.a.s.c.c.SolrZkClient makePath: /collections/collection1
   [junit4]   2> 551439 INFO  (TEST-CollectionsAPIDistributedZkTest.test-seed#[BA85BFFFDFAE11C5]) [    ] o.a.s.c.c.SolrZkClient makePath: /collections/collection1/shards
   [junit4]   2> 551440 INFO  (TEST-CollectionsAPIDistributedZkTest.test-seed#[BA85BFFFDFAE11C5]) [    ] o.a.s.c.c.SolrZkClient makePath: /collections/control_collection
   [junit4]   2> 551441 INFO  (TEST-CollectionsAPIDistributedZkTest.test-seed#[BA85BFFFDFAE11C5]) [    ] o.a.s.c.c.SolrZkClient makePath: /collections/control_collection/shards
   [junit4]   2> 551441 INFO  (TEST-CollectionsAPIDistributedZkTest.test-seed#[BA85BFFFDFAE11C5]) [    ] o.a.s.c.AbstractZkTestCase put /home/jenkins/workspace/Lucene-Solr-master-Linux/solr/core/src/test-files/solr/collection1/conf/solrconfig-tlog.xml to /configs/conf1/solrconfig.xml
   [junit4]   2> 551442 INFO  (TEST-CollectionsAPIDistributedZkTest.test-seed#[BA85BFFFDFAE11C5]) [    ] o.a.s.c.c.SolrZkClient makePath: /configs/conf1/solrconfig.xml
   [junit4]   2> 551443 INFO  (TEST-CollectionsAPIDistributedZkTest.test-seed#[BA85BFFFDFAE11C5]) [    ] o.a.s.c.AbstractZkTestCase put /home/jenkins/workspace/Lucene-Solr-master-Linux/solr/core/src/test-files/solr/collection1/conf/schema.xml to /configs/conf1/schema.xml
   [junit4]   2> 551443 INFO  (TEST-CollectionsAPIDistributedZkTest.test-seed#[BA85BFFFDFAE11C5]) [    ] o.a.s.c.c.SolrZkClient makePath: /configs/conf1/schema.xml
   [junit4]   2> 551444 INFO  (TEST-CollectionsAPIDistributedZkTest.test-seed#[BA85BFFFDFAE11C5]) [    ] o.a.s.c.AbstractZkTestCase put /home/jenkins/workspace/Lucene-Solr-master-Linux/solr/core/src/test-files/solr/collection1/conf/solrconfig.snippet.randomindexconfig.xml to /configs/conf1/solrconfig.snippet.randomindexconfig.xml
   [junit4]   2> 551444 INFO  (TEST-CollectionsAPIDistributedZkTest.test-seed#[BA85BFFFDFAE11C5]) [    ] o.a.s.c.c.SolrZkClient makePath: /configs/conf1/solrconfig.snippet.randomindexconfig.xml
   [junit4]   2> 551446 INFO  (TEST-CollectionsAPIDistributedZkTest.test-seed#[BA85BFFFDFAE11C5]) [    ] o.a.s.c.AbstractZkTestCase put /home/jenkins/workspace/Lucene-Solr-master-Linux/solr/core/src/test-files/solr/collection1/conf/stopwords.txt to /configs/conf1/stopwords.txt
   [junit4]   2> 551446 INFO  (TEST-CollectionsAPIDistributedZkTest.test-seed#[BA85BFFFDFAE11C5]) [    ] o.a.s.c.c.SolrZkClient makePath: /configs/conf1/stopwords.txt
   [junit4]   2> 551447 INFO  (TEST-CollectionsAPIDistributedZkTest.test-seed#[BA85BFFFDFAE11C5]) [    ] o.a.s.c.AbstractZkTestCase put /home/jenkins/workspace/Lucene-Solr-master-Linux/solr/core/src/test-files/solr/collection1/conf/protwords.txt to /configs/conf1/protwords.txt
   [junit4]   2> 551447 INFO  (TEST-CollectionsAPIDistributedZkTest.test-seed#[BA85BFFFDFAE11C5]) [    ] o.a.s.c.c.SolrZkClient makePath: /configs/conf1/protwords.txt
   [junit4]   2> 551450 INFO  (TEST-CollectionsAPIDistributedZkTest.test-seed#[BA85BFFFDFAE11C5]) [    ] o.a.s.c.AbstractZkTestCase put /home/jenkins/workspace/Lucene-Solr-master-Linux/solr/core/src/test-files/solr/collection1/conf/currency.xml to /configs/conf1/currency.xml
   [junit4]   2> 551450 INFO  (TEST-CollectionsAPIDistributedZkTest.test-seed#[BA85BFFFDFAE11C5]) [    ] o.a.s.c.c.SolrZkClient makePath: /configs/conf1/currency.xml
   [junit4]   2> 551451 INFO  (TEST-CollectionsAPIDistributedZkTest.test-seed#[BA85BFFFDFAE11C5]) [    ] o.a.s.c.AbstractZkTestCase put /home/jenkins/workspace/Lucene-Solr-master-Linux/solr/core/src/test-files/solr/collection1/conf/enumsConfig.xml to /configs/conf1/enumsConfig.xml
   [junit4]   2> 551451 INFO  (TEST-CollectionsAPIDistributedZkTest.test-seed#[BA85BFFFDFAE11C5]) [    ] o.a.s.c.c.SolrZkClient makePath: /configs/conf1/enumsConfig.xml
   [junit4]   2> 551452 INFO  (TEST-CollectionsAPIDistributedZkTest.test-seed#[BA85BFFFDFAE11C5]) [    ] o.a.s.c.AbstractZkTestCase put /home/jenkins/workspace/Lucene-Solr-master-Linux/solr/core/src/test-files/solr/collection1/conf/open-exchange-rates.json to /configs/conf1/open-exchange-rates.json
   [junit4]   2> 551452 INFO  (TEST-CollectionsAPIDistributedZkTest.test-seed#[BA85BFFFDFAE11C5]) [    ] o.a.s.c.c.SolrZkClient makePath: /configs/conf1/open-exchange-rates.json
   [junit4]   2> 551453 INFO  (TEST-CollectionsAPIDistributedZkTest.test-seed#[BA85BFFFDFAE11C5]) [    ] o.a.s.c.AbstractZkTestCase put /home/jenkins/workspace/Lucene-Solr-master-Linux/solr/core/src/test-files/solr/collection1/conf/mapping-ISOLatin1Accent.txt to /configs/conf1/mapping-ISOLatin1Accent.txt
   [junit4]   2> 551453 INFO  (TEST-CollectionsAPIDistributedZkTest.test-seed#[BA85BFFFDFAE11C5]) [    ] o.a.s.c.c.SolrZkClient makePath: /configs/conf1/mapping-ISOLatin1Accent.txt
   [junit4]   2> 551454 INFO  (TEST-CollectionsAPIDistributedZkTest.test-seed#[BA85BFFFDFAE11C5]) [    ] o.a.s.c.AbstractZkTestCase put /home/jenkins/workspace/Lucene-Solr-master-Linux/solr/core/src/test-files/solr/collection1/conf/old_synonyms.txt to /configs/conf1/old_synonyms.txt
   [junit4]   2> 551454 INFO  (TEST-CollectionsAPIDistributedZkTest.test-seed#[BA85BFFFDFAE11C5]) [    ] o.a.s.c.c.SolrZkClient makePath: /configs/conf1/old_synonyms.txt
   [junit4]   2> 551454 INFO  (TEST-CollectionsAPIDistributedZkTest.test-seed#[BA85BFFFDFAE11C5]) [    ] o.a.s.c.AbstractZkTestCase put /home/jenkins/workspace/Lucene-Solr-master-Linux/solr/core/src/test-files/solr/collection1/conf/synonyms.txt to /configs/conf1/synonyms.txt
   [junit4]   2> 551455 INFO  (TEST-CollectionsAPIDistributedZkTest.test-seed#[BA85BFFFDFAE11C5]) [    ] o.a.s.c.c.SolrZkClient makePath: /configs/conf1/synonyms.txt
   [junit4]   2> 551456 INFO  (TEST-CollectionsAPIDistributedZkTest.test-seed#[BA85BFFFDFAE11C5]) [    ] o.a.s.c.c.SolrZkClient Using default ZkCredentialsProvider
   [junit4]   2> 551456 INFO  (TEST-CollectionsAPIDistributedZkTest.test-seed#[BA85BFFFDFAE11C5]) [    ] o.a.s.c.c.ConnectionManager Waiting for client to connect to ZooKeeper
   [junit4]   2> 551457 INFO  (zkCallback-840-thread-1) [    ] o.a.s.c.c.ConnectionManager Watcher org.apache.solr.common.cloud.ConnectionManager@1be94f0 name:ZooKeeperConnection Watcher:127.0.0.1:33942/solr got event WatchedEvent state:SyncConnected type:None path:null path:null type:None
   [junit4]   2> 551457 INFO  (TEST-CollectionsAPIDistributedZkTest.test-seed#[BA85BFFFDFAE11C5]) [    ] o.a.s.c.c.ConnectionManager Client is connected to ZooKeeper
   [junit4]   2> 551458 INFO  (TEST-CollectionsAPIDistributedZkTest.test-seed#[BA85BFFFDFAE11C5]) [    ] o.a.s.c.c.SolrZkClient Using default ZkACLProvider
   [junit4]   2> 551536 INFO  (TEST-CollectionsAPIDistributedZkTest.test-seed#[BA85BFFFDFAE11C5]) [    ] o.a.s.SolrTestCaseJ4 Writing core.properties file to /home/jenkins/workspace/Lucene-Solr-master-Linux/solr/build/solr-core/test/J1/temp/solr.cloud.CollectionsAPIDistributedZkTest_BA85BFFFDFAE11C5-001/control-001/cores/collection1
   [junit4]   2> 551538 INFO  (TEST-CollectionsAPIDistributedZkTest.test-seed#[BA85BFFFDFAE11C5]) [    ] o.e.j.s.Server jetty-9.3.8.v20160314
   [junit4]   2> 551539 INFO  (TEST-CollectionsAPIDistributedZkTest.test-seed#[BA85BFFFDFAE11C5]) [    ] o.e.j.s.h.ContextHandler Started o.e.j.s.ServletContextHandler@729766{/nt_z/j,null,AVAILABLE}
   [junit4]   2> 551543 INFO  (TEST-CollectionsAPIDistributedZkTest.test-seed#[BA85BFFFDFAE11C5]) [    ] o.e.j.s.ServerConnector Started ServerConnector@1b6d7ed{SSL,[ssl, http/1.1]}{127.0.0.1:39690}
   [junit4]   2> 551543 INFO  (TEST-CollectionsAPIDistributedZkTest.test-seed#[BA85BFFFDFAE11C5]) [    ] o.e.j.s.Server Started @553008ms
   [junit4]   2> 551543 INFO  (TEST-CollectionsAPIDistributedZkTest.test-seed#[BA85BFFFDFAE11C5]) [    ] o.a.s.c.s.e.JettySolrRunner Jetty properties: {solr.data.dir=/home/jenkins/workspace/Lucene-Solr-master-Linux/solr/build/solr-core/test/J1/temp/solr.cloud.CollectionsAPIDistributedZkTest_BA85BFFFDFAE11C5-001/tempDir-001/control/data, hostContext=/nt_z/j, hostPort=39690, coreRootDirectory=/home/jenkins/workspace/Lucene-Solr-master-Linux/solr/build/solr-core/test/J1/../../../../../../../../../home/jenkins/workspace/Lucene-Solr-master-Linux/solr/build/solr-core/test/J1/temp/solr.cloud.CollectionsAPIDistributedZkTest_BA85BFFFDFAE11C5-001/control-001/cores}
   [junit4]   2> 551543 INFO  (TEST-CollectionsAPIDistributedZkTest.test-seed#[BA85BFFFDFAE11C5]) [    ] o.a.s.s.SolrDispatchFilter SolrDispatchFilter.init(): sun.misc.Launcher$AppClassLoader@1d16e93
   [junit4]   2> 551544 INFO  (TEST-CollectionsAPIDistributedZkTest.test-seed#[BA85BFFFDFAE11C5]) [    ] o.a.s.c.SolrResourceLoader new SolrResourceLoader for directory: '/home/jenkins/workspace/Lucene-Solr-master-Linux/solr/build/solr-core/test/J1/temp/solr.cloud.CollectionsAPIDistributedZkTest_BA85BFFFDFAE11C5-001/control-001'
   [junit4]   2> 551544 INFO  (TEST-CollectionsAPIDistributedZkTest.test-seed#[BA85BFFFDFAE11C5]) [    ] o.a.s.c.SolrResourceLoader JNDI not configured for solr (NoInitialContextEx)
   [junit4]   2> 551544 INFO  (TEST-CollectionsAPIDistributedZkTest.test-seed#[BA85BFFFDFAE11C5]) [    ] o.a.s.c.SolrResourceLoader solr home defaulted to 'solr/' (could not find system property or JNDI)
   [junit4]   2> 551544 INFO  (TEST-CollectionsAPIDistributedZkTest.test-seed#[BA85BFFFDFAE11C5]) [    ] o.a.s.c.c.SolrZkClient Using default ZkCredentialsProvider
   [junit4]   2> 551545 INFO  (TEST-CollectionsAPIDistributedZkTest.test-seed#[BA85BFFFDFAE11C5]) [    ] o.a.s.c.c.ConnectionManager Waiting for client to connect to ZooKeeper
   [junit4]   2> 551545 INFO  (zkCallback-841-thread-1) [    ] o.a.s.c.c.ConnectionManager Watcher org.apache.solr.common.cloud.ConnectionManager@1604d27 name:ZooKeeperConnection Watcher:127.0.0.1:33942/solr got event WatchedEvent state:SyncConnected type:None path:null path:null type:None
   [junit4]   2> 551545 INFO  (TEST-CollectionsAPIDistributedZkTest.test-seed#[BA85BFFFDFAE11C5]) [    ] o.a.s.c.c.ConnectionManager Client is connected to ZooKeeper
   [junit4]   2> 551546 INFO  (TEST-CollectionsAPIDistributedZkTest.test-seed#[BA85BFFFDFAE11C5]) [    ] o.a.s.c.c.SolrZkClient Using default ZkACLProvider
   [junit4]   2> 551546 INFO  (TEST-CollectionsAPIDistributedZkTest.test-seed#[BA85BFFFDFAE11C5]) [    ] o.a.s.s.SolrDispatchFilter Loading solr.xml from SolrHome (not found in ZooKeeper)
   [junit4]   2> 551546 INFO  (TEST-CollectionsAPIDistributedZkTest.test-seed#[BA85BFFFDFAE11C5]) [    ] o.a.s.c.SolrXmlConfig Loading container configuration from /home/jenkins/workspace/Lucene-Solr-master-Linux/solr/build/solr-core/test/J1/temp/solr.cloud.CollectionsAPIDistributedZkTest_BA85BFFFDFAE11C5-001/control-001/solr.xml
   [junit4]   2> 551891 INFO  (TEST-CollectionsAPIDistributedZkTest.test-seed#[BA85BFFFDFAE11C5]) [    ] o.a.s.c.CorePropertiesLocator Config-defined core root directory: /home/jenkins/workspace/Lucene-Solr-master-Linux/solr/build/solr-core/test/J1/../../../../../../../../../home/jenkins/workspace/Lucene-Solr-master-Linux/solr/build/solr-core/test/J1/temp/solr.cloud.CollectionsAPIDistributedZkTest_BA85BFFFDFAE11C5-001/control-001/cores
   [junit4]   2> 551891 INFO  (TEST-CollectionsAPIDistributedZkTest.test-seed#[BA85BFFFDFAE11C5]) [    ] o.a.s.c.CoreContainer New CoreContainer 5710569
   [junit4]   2> 551891 INFO  (TEST-CollectionsAPIDistributedZkTest.test-seed#[BA85BFFFDFAE11C5]) [    ] o.a.s.c.CoreContainer Loading cores into CoreContainer [instanceDir=/home/jenkins/workspace/Lucene-Solr-master-Linux/solr/build/solr-core/test/J1/temp/solr.cloud.CollectionsAPIDistributedZkTest_BA85BFFFDFAE11C5-001/control-001]
   [junit4]   2> 551891 WARN  (TEST-CollectionsAPIDistributedZkTest.test-seed#[BA85BFFFDFAE11C5]) [    ] o.a.s.c.CoreContainer Couldn't add files from /home/jenkins/workspace/Lucene-Solr-master-Linux/solr/build/solr-core/test/J1/temp/solr.cloud.CollectionsAPIDistributedZkTest_BA85BFFFDFAE11C5-001/control-001/lib to classpath: /home/jenkins/workspace/Lucene-Solr-master-Linux/solr/build/solr-core/test/J1/temp/solr.cloud.CollectionsAPIDistributedZkTest_BA85BFFFDFAE11C5-001/control-001/lib
   [junit4]   2> 551892 INFO  (TEST-CollectionsAPIDistributedZkTest.test-seed#[BA85BFFFDFAE11C5]) [    ] o.a.s.h.c.HttpShardHandlerFactory created with socketTimeout : 90000,urlScheme : ,connTimeout : 15000,maxConnectionsPerHost : 20,maxConnections : 10000,corePoolSize : 0,maximumPoolSize : 2147483647,maxThreadIdleTime : 5,sizeOfQueue : -1,fairnessPolicy : false,
   [junit4]   2> 551895 INFO  (TEST-CollectionsAPIDistributedZkTest.test-seed#[BA85BFFFDFAE11C5]) [    ] o.a.s.u.UpdateShardHandler Created UpdateShardHandler HTTP client with params: socketTimeout=340000&connTimeout=45000&maxConnections=100000&maxConnectionsPerHost=100000
   [junit4]   2> 551895 INFO  (TEST-CollectionsAPIDistributedZkTest.test-seed#[BA85BFFFDFAE11C5]) [    ] o.a.s.l.LogWatcher SLF4J impl is org.slf4j.impl.Log4jLoggerFactory
   [junit4]   2> 551895 INFO  (TEST-CollectionsAPIDistributedZkTest.test-seed#[BA85BFFFDFAE11C5]) [    ] o.a.s.l.LogWatcher Registering Log Listener [Log4j (org.slf4j.impl.Log4jLoggerFactory)]
   [junit4]   2> 551895 INFO  (TEST-CollectionsAPIDistributedZkTest.test-seed#[BA85BFFFDFAE11C5]) [    ] o.a.s.c.ZkContainer Zookeeper client=127.0.0.1:33942/solr
   [junit4]   2> 551895 INFO  (TEST-CollectionsAPIDistributedZkTest.test-seed#[BA85BFFFDFAE11C5]) [    ] o.a.s.c.ZkController zkHost includes chroot
   [junit4]   2> 551896 INFO  (TEST-CollectionsAPIDistributedZkTest.test-seed#[BA85BFFFDFAE11C5]) [    ] o.a.s.c.c.SolrZkClient Using default ZkCredentialsProvider
   [junit4]   2> 551896 INFO  (TEST-CollectionsAPIDistributedZkTest.test-seed#[BA85BFFFDFAE11C5]) [    ] o.a.s.c.c.ConnectionManager Waiting for client to connect to ZooKeeper
   [junit4]   2> 551898 INFO  (zkCallback-844-thread-1) [    ] o.a.s.c.c.ConnectionManager Watcher org.apache.solr.common.cloud.ConnectionManager@15cbfb8 name:ZooKeeperConnection Watcher:127.0.0.1:33942 got event WatchedEvent state:SyncConnected type:None path:null path:null type:None
   [junit4]   2> 551899 INFO  (TEST-CollectionsAPIDistributedZkTest.test-seed#[BA85BFFFDFAE11C5]) [    ] o.a.s.c.c.ConnectionManager Client is connected to ZooKeeper
   [junit4]   2> 551899 INFO  (TEST-CollectionsAPIDistributedZkTest.test-seed#[BA85BFFFDFAE11C5]) [    ] o.a.s.c.c.SolrZkClient Using default ZkACLProvider
   [junit4]   2> 551900 INFO  (TEST-CollectionsAPIDistributedZkTest.test-seed#[BA85BFFFDFAE11C5]) [n:127.0.0.1:39690_nt_z%2Fj    ] o.a.s.c.ZkController Added new OnReconnect listener org.apache.solr.cloud.ZkController$$Lambda$65/3547750@14baa41
   [junit4]   2> 551900 INFO  (TEST-CollectionsAPIDistributedZkTest.test-seed#[BA85BFFFDFAE11C5]) [n:127.0.0.1:39690_nt_z%2Fj    ] o.a.s.c.c.ConnectionManager Waiting for client to connect to ZooKeeper
   [junit4]   2> 551901 INFO  (zkCallback-845-thread-1-processing-n:127.0.0.1:39690_nt_z%2Fj) [n:127.0.0.1:39690_nt_z%2Fj    ] o.a.s.c.c.ConnectionManager Watcher org.apache.solr.common.cloud.ConnectionManager@11063c8 name:ZooKeeperConnection Watcher:127.0.0.1:33942/solr got event WatchedEvent state:SyncConnected type:None path:null path:null type:None
   [junit4]   2> 551901 INFO  (TEST-CollectionsAPIDistributedZkTest.test-seed#[BA85BFFFDFAE11C5]) [n:127.0.0.1:39690_nt_z%2Fj    ] o.a.s.c.c.ConnectionManager Client is connected to ZooKeeper
   [junit4]   2> 551902 INFO  (TEST-CollectionsAPIDistributedZkTest.test-seed#[BA85BFFFDFAE11C5]) [n:127.0.0.1:39690_nt_z%2Fj    ] o.a.s.c.c.SolrZkClient makePath: /overseer/queue
   [junit4]   2> 551903 INFO  (TEST-CollectionsAPIDistributedZkTest.test-seed#[BA85BFFFDFAE11C5]) [n:127.0.0.1:39690_nt_z%2Fj    ] o.a.s.c.c.SolrZkClient makePath: /overseer/collection-queue-work
   [junit4]   2> 551904 INFO  (TEST-CollectionsAPIDistributedZkTest.test-seed#[BA85BFFFDFAE11C5]) [n:127.0.0.1:39690_nt_z%2Fj    ] o.a.s.c.c.SolrZkClient makePath: /overseer/collection-map-running
   [junit4]   2> 551905 INFO  (TEST-CollectionsAPIDistributedZkTest.test-seed#[BA85BFFFDFAE11C5]) [n:127.0.0.1:39690_nt_z%2Fj    ] o.a.s.c.c.SolrZkClient makePath: /overseer/collection-map-completed
   [junit4]   2> 551906 INFO  (TEST-CollectionsAPIDistributedZkTest.test-seed#[BA85BFFFDFAE11C5]) [n:127.0.0.1:39690_nt_z%2Fj    ] o.a.s.c.c.SolrZkClient makePath: /overseer/collection-map-failure
   [junit4]   2> 551907 INFO  (TEST-CollectionsAPIDistributedZkTest.test-seed#[BA85BFFFDFAE11C5]) [n:127.0.0.1:39690_nt_z%2Fj    ] o.a.s.c.c.SolrZkClient makePath: /live_nodes
   [junit4]   2> 551908 INFO  (TEST-CollectionsAPIDistributedZkTest.test-seed#[BA85BFFFDFAE11C5]) [n:127.0.0.1:39690_nt_z%2Fj    ] o.a.s.c.c.SolrZkClient makePath: /aliases.json
   [junit4]   2> 551908 INFO  (TEST-CollectionsAPIDistributedZkTest.test-seed#[BA85BFFFDFAE11C5]) [n:127.0.0.1:39690_nt_z%2Fj    ] o.a.s.c.c.SolrZkClient makePath: /clusterstate.json
   [junit4]   2> 551908 INFO  (TEST-CollectionsAPIDistributedZkTest.test-seed#[BA85BFFFDFAE11C5]) [n:127.0.0.1:39690_nt_z%2Fj    ] o.a.s.c.c.SolrZkClient makePath: /security.json
   [junit4]   2> 551909 INFO  (TEST-CollectionsAPIDistributedZkTest.test-seed#[BA85BFFFDFAE11C5]) [n:127.0.0.1:39690_nt_z%2Fj    ] o.a.s.c.c.ZkStateReader Updating cluster state from ZooKeeper... 
   [junit4]   2> 551909 INFO  (TEST-CollectionsAPIDistributedZkTest.test-seed#[BA85BFFFDFAE11C5]) [n:127.0.0.1:39690_nt_z%2Fj    ] o.a.s.c.c.ZkStateReader Loaded cluster properties: {urlScheme=https}
   [junit4]   2> 551909 INFO  (TEST-CollectionsAPIDistributedZkTest.test-seed#[BA85BFFFDFAE11C5]) [n:127.0.0.1:39690_nt_z%2Fj    ] o.a.s.c.c.ZkStateReader Updated live nodes from ZooKeeper... (0) -> (0)
   [junit4]   2> 551910 INFO  (TEST-CollectionsAPIDistributedZkTest.test-seed#[BA85BFFFDFAE11C5]) [n:127.0.0.1:39690_nt_z%2Fj    ] o.a.s.c.c.SolrZkClient makePath: /overseer_elect
   [junit4]   2> 551911 INFO  (TEST-CollectionsAPIDistributedZkTest.test-seed#[BA85BFFFDFAE11C5]) [n:127.0.0.1:39690_nt_z%2Fj    ] o.a.s.c.c.SolrZkClient makePath: /overseer_elect/election
   [junit4]   2> 551911 INFO  (TEST-CollectionsAPIDistributedZkTest.test-seed#[BA85BFFFDFAE11C5]) [n:127.0.0.1:39690_nt_z%2Fj    ] o.a.s.c.Overseer Overseer (id=null) closing
   [junit4]   2> 551912 INFO  (TEST-CollectionsAPIDistributedZkTest.test-seed#[BA85BFFFDFAE11C5]) [n:127.0.0.1:39690_nt_z%2Fj    ] o.a.s.c.LeaderElector Joined leadership election with path: /overseer_elect/election/96623334726828037-127.0.0.1:39690_nt_z%2Fj-n_0000000000
   [junit4]   2> 551912 INFO  (TEST-CollectionsAPIDistributedZkTest.test-seed#[BA85BFFFDFAE11C5]) [n:127.0.0.1:39690_nt_z%2Fj    ] o.a.s.c.OverseerElectionContext I am going to be the leader 127.0.0.1:39690_nt_z%2Fj
   [junit4]   2> 551912 INFO  (TEST-CollectionsAPIDistributedZkTest.test-seed#[BA85BFFFDFAE11C5]) [n:127.0.0.1:39690_nt_z%2Fj    ] o.a.s.c.c.SolrZkClient makePath: /overseer_elect/leader
   [junit4]   2> 551912 INFO  (TEST-CollectionsAPIDistributedZkTest.test-seed#[BA85BFFFDFAE11C5]) [n:127.0.0.1:39690_nt_z%2Fj    ] o.a.s.c.Overseer Overseer (id=96623334726828037-127.0.0.1:39690_nt_z%2Fj-n_0000000000) starting
   [junit4]   2> 551914 INFO  (TEST-CollectionsAPIDistributedZkTest.test-seed#[BA85BFFFDFAE11C5]) [n:127.0.0.1:39690_nt_z%2Fj    ] o.a.s.c.c.SolrZkClient makePath: /overseer/queue-work
   [junit4]   2> 551916 INFO  (TEST-CollectionsAPIDistributedZkTest.test-seed#[BA85BFFFDFAE11C5]) [n:127.0.0.1:39690_nt_z%2Fj    ] o.a.s.c.OverseerAutoReplicaFailoverThread Starting OverseerAutoReplicaFailoverThread autoReplicaFailoverWorkLoopDelay=10000 autoReplicaFailoverWaitAfterExpiration=10000 autoReplicaFailoverBadNodeExpiration=60000
   [junit4]   2> 551916 INFO  (OverseerCollectionConfigSetProcessor-96623334726828037-127.0.0.1:39690_nt_z%2Fj-n_0000000000) [n:127.0.0.1:39690_nt_z%2Fj    ] o.a.s.c.OverseerTaskProcessor Process current queue of overseer operations
   [junit4]   2> 551917 INFO  (OverseerStateUpdate-96623334726828037-127.0.0.1:39690_nt_z%2Fj-n_0000000000) [n:127.0.0.1:39690_nt_z%2Fj    ] o.a.s.c.Overseer Starting to work on the main queue
   [junit4]   2> 551917 INFO  (TEST-CollectionsAPIDistributedZkTest.test-seed#[BA85BFFFDFAE11C5]) [n:127.0.0.1:39690_nt_z%2Fj    ] o.a.s.c.ZkController Register node as live in ZooKeeper:/live_nodes/127.0.0.1:39690_nt_z%2Fj
   [junit4]   2> 551917 INFO  (TEST-CollectionsAPIDistributedZkTest.test-seed#[BA85BFFFDFAE11C5]) [n:127.0.0.1:39690_nt_z%2Fj    ] o.a.s.c.c.SolrZkClient makePath: /live_nodes/127.0.0.1:39690_nt_z%2Fj
   [junit4]   2> 551919 INFO  (OverseerStateUpdate-96623334726828037-127.0.0.1:39690_nt_z%2Fj-n_0000000000) [n:127.0.0.1:39690_nt_z%2Fj    ] o.a.s.c.c.ZkStateReader Updated live nodes from ZooKeeper... (0) -> (0)
   [junit4]   2> 551919 INFO  (zkCallback-845-thread-1-processing-n:127.0.0.1:39690_nt_z%2Fj) [n:127.0.0.1:39690_nt_z%2Fj    ] o.a.s.c.c.ZkStateReader A live node change: [WatchedEvent state:SyncConnected type:NodeChildrenChanged path:/live_nodes], has occurred - updating... (live nodes size: [0])
   [junit4]   2> 551919 INFO  (zkCallback-845-thread-1-processing-n:127.0.0.1:39690_nt_z%2Fj) [n:127.0.0.1:39690_nt_z%2Fj    ] o.a.s.c.c.ZkStateReader Updated live nodes from ZooKeeper... (0) -> (1)
   [junit4]   2> 551945 INFO  (TEST-CollectionsAPIDistributedZkTest.test-seed#[BA85BFFFDFAE11C5]) [n:127.0.0.1:39690_nt_z%2Fj    ] o.a.s.c.CoreContainer Security conf doesn't exist. Skipping setup for authorization module.
   [junit4]   2> 551945 INFO  (TEST-CollectionsAPIDistributedZkTest.test-seed#[BA85BFFFDFAE11C5]) [n:127.0.0.1:39690_nt_z%2Fj    ] o.a.s.c.CoreContainer No authentication plugin used.
   [junit4]   2> 551946 INFO  (TEST-CollectionsAPIDistributedZkTest.test-seed#[BA85BFFFDFAE11C5]) [n:127.0.0.1:39690_nt_z%2Fj    ] o.a.s.c.CorePropertiesLocator Looking for core definitions underneath /home/jenkins/workspace/Lucene-Solr-master-Linux/solr/build/solr-core/test/J1/../../../../../../../../../home/jenkins/workspace/Lucene-Solr-master-Linux/solr/build/solr-core/test/J1/temp/solr.cloud.CollectionsAPIDistributedZkTest_BA85BFFFDFAE11C5-001/control-001/cores
   [junit4]   2> 551947 INFO  (TEST-CollectionsAPIDistributedZkTest.test-seed#[BA85BFFFDFAE11C5]) [n:127.0.0.1:39690_nt_z%2Fj    ] o.a.s.c.CoreDescriptor Created CoreDescriptor: {name=collection1, config=solrconfig.xml, transient=false, schema=schema.xml, loadOnStartup=true, configSetProperties=configsetprops.json, collection=control_collection, coreNodeName=, dataDir=data/, shard=}
   [junit4]   2> 551947 INFO  (TEST-CollectionsAPIDistributedZkTest.test-seed#[BA85BFFFDFAE11C5]) [n:127.0.0.1:39690_nt_z%2Fj    ] o.a.s.c.CorePropertiesLocator Found core collection1 in /home/jenkins/workspace/Lucene-Solr-master-Linux/solr/build/solr-core/test/J1/../../../../../../../../../home/jenkins/workspace/Lucene-Solr-master-Linux/solr/build/solr-core/test/J1/temp/solr.cloud.CollectionsAPIDistributedZkTest_BA85BFFFDFAE11C5-001/control-001/cores/collection1
   [junit4]   2> 551947 INFO  (TEST-CollectionsAPIDistributedZkTest.test-seed#[BA85BFFFDFAE11C5]) [n:127.0.0.1:39690_nt_z%2Fj    ] o.a.s.c.CorePropertiesLocator Found 1 core definitions
   [junit4]   2> 551948 INFO  (TEST-CollectionsAPIDistributedZkTest.test-seed#[BA85BFFFDFAE11C5]) [n:127.0.0.1:39690_nt_z%2Fj    ] o.a.s.s.SolrDispatchFilter user.dir=/home/jenkins/workspace/Lucene-Solr-master-Linux/solr/build/solr-core/test/J1
   [junit4]   2> 551948 INFO  (TEST-CollectionsAPIDistributedZkTest.test-seed#[BA85BFFFDFAE11C5]) [n:127.0.0.1:39690_nt_z%2Fj    ] o.a.s.s.SolrDispatchFilter SolrDispatchFilter.init() done
   [junit4]   2> 551948 INFO  (coreLoadExecutor-2220-thread-1-processing-n:127.0.0.1:39690_nt_z%2Fj) [n:127.0.0.1:39690_nt_z%2Fj c:control_collection   x:collection1] o.a.s.c.ZkController publishing state=down
   [junit4]   2> 551948 INFO  (coreLoadExecutor-2220-thread-1-processing-n:127.0.0.1:39690_nt_z%2Fj) [n:127.0.0.1:39690_nt_z%2Fj c:control_collection   x:collection1] o.a.s.c.ZkController numShards not found on descriptor - reading it from system property
   [junit4]   2> 551948 INFO  (coreLoadExecutor-2220-thread-1-processing-n:127.0.0.1:39690_nt_z%2Fj) [n:127.0.0.1:39690_nt_z%2Fj c:control_collection   x:collection1] o.a.s.c.ZkController Collection control_collection not visible yet, but flagging it so a watch is registered when it becomes visible
   [junit4]   2> 551949 INFO  (OverseerStateUpdate-96623334726828037-127.0.0.1:39690_nt_z%2Fj-n_0000000000) [n:127.0.0.1:39690_nt_z%2Fj    ] o.a.s.c.Overseer processMessage: queueSize: 1, message = {
   [junit4]   2>   "core":"collection1",
   [junit4]   2>   "roles":null,
   [junit4]   2>   "base_url":"https://127.0.0.1:39690/nt_z/j",
   [junit4]   2>   "node_name":"127.0.0.1:39690_nt_z%2Fj",
   [junit4]   2>   "numShards":"1",
   [junit4]   2>   "state":"down",
   [junit4]   2>   "shard":null,
   [junit4]   2>   "collection":"control_collection",
   [junit4]   2>   "operation":"state"} current state version: 0
   [junit4]   2> 551949 INFO  (OverseerStateUpdate-96623334726828037-127.0.0.1:39690_nt_z%2Fj-n_0000000000) [n:127.0.0.1:39690_nt_z%2Fj    ] o.a.s.c.o.ReplicaMutator Update state numShards=1 message={
   [junit4]   2>   "core":"collection1",
   [junit4]   2>   "roles":null,
   [junit4]   2>   "base_url":"https://127.0.0.1:39690/nt_z/j",
   [junit4]   2>   "node_name":"127.0.0.1:39690_nt_z%2Fj",
   [junit4]   2>   "numShards":"1",
   [junit4]   2>   "state":"down",
   [junit4]   2>   "shard":null,
   [junit4]   2>   "collection":"control_collection",
   [junit4]   2>   "operation":"state"}
   [junit4]   2> 551949 INFO  (coreLoadExecutor-2220-thread-1-processing-n:127.0.0.1:39690_nt_z%2Fj) [n:127.0.0.1:39690_nt_z%2Fj c:control_collection   x:collection1] o.a.s.c.c.ZkStateReader Deleting data for [control_collection]
   [junit4]   2> 551949 INFO  (OverseerStateUpdate-96623334726828037-127.0.0.1:39690_nt_z%2Fj-n_0000000000) [n:127.0.0.1:39690_nt_z%2Fj    ] o.a.s.c.o.ClusterStateMutator building a new cName: control_collection
   [junit4]   2> 551949 INFO  (OverseerStateUpdate-96623334726828037-127.0.0.1:39690_nt_z%2Fj-n_0000000000) [n:127.0.0.1:39690_nt_z%2Fj    ] o.a.s.c.o.ReplicaMutator Assigning new node to shard shard=shard1
   [junit4]   2> 551950 INFO  (coreLoadExecutor-2220-thread-1-processing-n:127.0.0.1:39690_nt_z%2Fj) [n:127.0.0.1:39690_nt_z%2Fj c:control_collection   x:collection1] o.a.s.c.ZkController look for our core node name
   [junit4]   2> 551950 INFO  (zkCallback-845-thread-1-processing-n:127.0.0.1:39690_nt_z%2Fj) [n:127.0.0.1:39690_nt_z%2Fj    ] o.a.s.c.c.ZkStateReader A cluster state change: [WatchedEvent state:SyncConnected type:NodeDataChanged path:/clusterstate.json], has occurred - updating... (live nodes size: [1])
   [junit4]   2> 552950 INFO  (coreLoadExecutor-2220-thread-1-processing-n:127.0.0.1:39690_nt_z%2Fj) [n:127.0.0.1:39690_nt_z%2Fj c:control_collection   x:collection1] o.a.s.c.ZkController waiting to find shard id in clusterstate for collection1
   [junit4]   2> 552950 INFO  (coreLoadExecutor-2220-thread-1-processing-n:127.0.0.1:39690_nt_z%2Fj) [n:127.0.0.1:39690_nt_z%2Fj c:control_collection   x:collection1] o.a.s.c.ZkController Check for collection zkNode:control_collection
   [junit4]   2> 552950 INFO  (coreLoadExecutor-2220-thread-1-processing-n:127.0.0.1:39690_nt_z%2Fj) [n:127.0.0.1:39690_nt_z%2Fj c:control_collection   x:collection1] o.a.s.c.ZkController Collection zkNode exists
   [junit4]   2> 552951 INFO  (coreLoadExecutor-2220-thread-1-processing-n:127.0.0.1:39690_nt_z%2Fj) [n:127.0.0.1:39690_nt_z%2Fj c:control_collection   x:collection1] o.a.s.c.SolrResourceLoader new SolrResourceLoader for directory: '/home/jenkins/workspace/Lucene-Solr-master-Linux/solr/build/solr-core/test/J1/temp/solr.cloud.CollectionsAPIDistributedZkTest_BA85BFFFDFAE11C5-001/control-001/cores/collection1'
   [junit4]   2> 552951 INFO  (coreLoadExecutor-2220-thread-1-processing-n:127.0.0.1:39690_nt_z%2Fj) [n:127.0.0.1:39690_nt_z%2Fj c:control_collection   x:collection1] o.a.s.c.SolrResourceLoader JNDI not configured for solr (NoInitialContextEx)
   [junit4]   2> 552951 INFO  (coreLoadExecutor-2220-thread-1-processing-n:127.0.0.1:39690_nt_z%2Fj) [n:127.0.0.1:39690_nt_z%2Fj c:control_collection   x:collection1] o.a.s.c.SolrResourceLoader solr home defaulted to 'solr/' (could not find system property or JNDI)
   [junit4]   2> 552952 INFO  (coreLoadExecutor-2220-thread-1-processing-n:127.0.0.1:39690_nt_z%2Fj) [n:127.0.0.1:39690_nt_z%2Fj c:control_collection   x:collection1] o.a.s.c.Config loaded config solrconfig.xml with version 0 
   [junit4]   2> 552962 INFO  (coreLoadExecutor-2220-thread-1-processing-n:127.0.0.1:39690_nt_z%2Fj) [n:127.0.0.1:39690_nt_z%2Fj c:control_collection   x:collection1] o.a.s.c.SolrConfig current version of requestparams : -1
   [junit4]   2> 552972 INFO  (coreLoadExecutor-2220-thread-1-processing-n:127.0.0.1:39690_nt_z%2Fj) [n:127.0.0.1:39690_nt_z%2Fj c:control_collection   x:collection1] o.a.s.c.SolrConfig Using Lucene MatchVersion: 7.0.0
   [junit4]   2> 552986 INFO  (coreLoadExecutor-2220-thread-1-processing-n:127.0.0.1:39690_nt_z%2Fj) [n:127.0.0.1:39690_nt_z%2Fj c:control_collection   x:collection1] o.a.s.c.SolrConfig Loaded SolrConfig: solrconfig.xml
   [junit4]   2> 552999 INFO  (coreLoadExecutor-2220-thread-1-processing-n:127.0.0.1:39690_nt_z%2Fj) [n:127.0.0.1:39690_nt_z%2Fj c:control_collection   x:collection1] o.a.s.s.IndexSchema [collection1] Schema name=test
   [junit4]   2> 553102 INFO  (coreLoadExecutor-2220-thread-1-processing-n:127.0.0.1:39690_nt_z%2Fj) [n:127.0.0.1:39690_nt_z%2Fj c:control_collection   x:collection1] o.a.s.s.OpenExchangeRatesOrgProvider Initialized with rates=open-exchange-rates.json, refreshInterval=1440.
   [junit4]   2> 553109 INFO  (coreLoadExecutor-2220-thread-1-processing-n:127.0.0.1:39690_nt_z%2Fj) [n:127.0.0.1:39690_nt_z%2Fj c:control_collection   x:collection1] o.a.s.s.IndexSchema default search field in schema is text
   [junit4]   2> 553110 INFO  (coreLoadExecutor-2220-thread-1-processing-n:127.0.0.1:39690_nt_z%2Fj) [n:127.0.0.1:39690_nt_z%2Fj c:control_collection   x:collection1] o.a.s.s.IndexSchema unique key field: id
   [junit4]   2> 553121 INFO  (coreLoadExecutor-2220-thread-1-processing-n:127.0.0.1:39690_nt_z%2Fj) [n:127.0.0.1:39690_nt_z%2Fj c:control_collection   x:collection1] o.a.s.s.FileExchangeRateProvider Reloading exchange rates from file currency.xml
   [junit4]   2> 553124 INFO  (coreLoadExecutor-2220-thread-1-processing-n:127.0.0.1:39690_nt_z%2Fj) [n:127.0.0.1:39690_nt_z%2Fj c:control_collection   x:collection1] o.a.s.s.FileExchangeRateProvider Reloading exchange rates from file currency.xml
   [junit4]   2> 553126 INFO  (coreLoadExecutor-2220-thread-1-processing-n:127.0.0.1:39690_nt_z%2Fj) [n:127.0.0.1:39690_nt_z%2Fj c:control_collection   x:collection1] o.a.s.s.OpenExchangeRatesOrgProvider Reloading exchange rates from open-exchange-rates.json
   [junit4]   2> 553126 INFO  (coreLoadExecutor-2220-thread-1-processing-n:127.0.0.1:39690_nt_z%2Fj) [n:127.0.0.1:39690_nt_z%2Fj c:control_collection   x:collection1] o.a.s.s.OpenExchangeRatesOrgProvider Reloading exchange rates from open-exchange-rates.json
   [junit4]   2> 553127 INFO  (coreLoadExecutor-2220-thread-1-processing-n:127.0.0.1:39690_nt_z%2Fj) [n:127.0.0.1:39690_nt_z%2Fj c:control_collection   x:collection1] o.a.s.c.ConfigSetProperties Did not find ConfigSet properties, assuming default properties: Can't find resource 'configsetprops.json' in classpath or '/configs/conf1', cwd=/home/jenkins/workspace/Lucene-Solr-master-Linux/solr/build/solr-core/test/J1
   [junit4]   2> 553127 INFO  (coreLoadExecutor-2220-thread-1-processing-n:127.0.0.1:39690_nt_z%2Fj) [n:127.0.0.1:39690_nt_z%2Fj c:control_collection   x:collection1] o.a.s.c.CoreContainer Creating SolrCore 'collection1' using configuration from collection control_collection
   [junit4]   2> 553127 INFO  (coreLoadExecutor-2220-thread-1-processing-n:127.0.0.1:39690_nt_z%2Fj) [n:127.0.0.1:39690_nt_z%2Fj c:control_collection s:shard1 r:core_node1 x:collection1] o.a.s.c.SolrCore org.apache.solr.core.MockDirectoryFactory
   [junit4]   2> 553128 INFO  (coreLoadExecutor-2220-thread-1-processing-n:127.0.0.1:39690_nt_z%2Fj) [n:127.0.0.1:39690_nt_z%2Fj c:control_collection s:shard1 r:core_node1 x:collection1] o.a.s.c.SolrCore [[collection1] ] Opening new SolrCore at [/home/jenkins/workspace/Lucene-Solr-master-Linux/solr/build/solr-core/test/J1/temp/solr.cloud.CollectionsAPIDistributedZkTest_BA85BFFFDFAE11C5-001/control-001/cores/collection1], dataDir=[/home/jenkins/workspace/Lucene-Solr-master-Linux/solr/build/solr-core/test/J1/../../../../../../../../../home/jenkins/workspace/Lucene-Solr-master-Linux/solr/build/solr-core/test/J1/temp/solr.cloud.CollectionsAPIDistributedZkTest_BA85BFFFDFAE11C5-001/control-001/cores/collection1/data/]
   [junit4]   2> 553128 INFO  (coreLoadExecutor-2220-thread-1-processing-n:127.0.0.1:39690_nt_z%2Fj) [n:127.0.0.1:39690_nt_z%2Fj c:control_collection s:shard1 r:core_node1 x:collection1] o.a.s.c.JmxMonitoredMap JMX monitoring is enabled. Adding Solr mbeans to JMX Server: com.sun.jmx.mbeanserver.JmxMBeanServer@1d5378e
   [junit4]   2> 553128 INFO  (coreLoadExecutor-2220-thread-1-processing-n:127.0.0.1:39690_nt_z%2Fj) [n:127.0.0.1:39690_nt_z%2Fj c:control_collection s:shard1 r:core_node1 x:collection1] o.a.s.c.CachingDirectoryFactory return new directory for /home/jenkins/workspace/Lucene-Solr-master-Linux/solr/build/solr-core/test/J1/../../../../../../../../../home/jenkins/workspace/Lucene-Solr-master-Linux/solr/build/solr-core/test/J1/temp/solr.cloud.CollectionsAPIDistributedZkTest_BA85BFFFDFAE11C5-001/control-001/cores/collection1/data/snapshot_metadata
   [junit4]   2> 553128 INFO  (coreLoadExecutor-2220-thread-1-processing-n:127.0.0.1:39690_nt_z%2Fj) [n:127.0.0.1:39690_nt_z%2Fj c:control_collection s:shard1 r:core_node1 x:collection1] o.a.s.c.s.SolrSnapshotMetaDataManager Loading from snapshot metadata file...
   [junit4]   2> 553129 INFO  (coreLoadExecutor-2220-thread-1-processing-n:127.0.0.1:39690_nt_z%2Fj) [n:127.0.0.1:39690_nt_z%2Fj c:control_collection s:shard1 r:core_node1 x:collection1] o.a.s.c.CachingDirectoryFactory return new directory for /home/jenkins/workspace/Lucene-Solr-master-Linux/solr/build/solr-core/test/J1/../../../../../../../../../home/jenkins/workspace/Lucene-Solr-master-Linux/solr/build/solr-core/test/J1/temp/solr.cloud.CollectionsAPIDistributedZkTest_BA85BFFFDFAE11C5-001/control-001/cores/collection1/data
   [junit4]   2> 553129 INFO  (coreLoadExecutor-2220-thread-1-processing-n:127.0.0.1:39690_nt_z%2Fj) [n:127.0.0.1:39690_nt_z%2Fj c:control_collection s:shard1 r:core_node1 x:collection1] o.a.s.c.SolrCore New index directory detected: old=null new=/home/jenkins/workspace/Lucene-Solr-master-Linux/solr/build/solr-core/test/J1/../../../../../../../../../home/jenkins/workspace/Lucene-Solr-master-Linux/solr/build/solr-core/test/J1/temp/solr.cloud.CollectionsAPIDistributedZkTest_BA85BFFFDFAE11C5-001/control-001/cores/collection1/data/index/
   [junit4]   2> 553129 WARN  (coreLoadExecutor-2220-thread-1-processing-n:127.0.0.1:39690_nt_z%2Fj) [n:127.0.0.1:39690_nt_z%2Fj c:control_collection s:shard1 r:core_node1 x:collection1] o.a.s.c.SolrCore [collection1] Solr index directory '/home/jenkins/workspace/Lucene-Solr-master-Linux/solr/build/solr-core/test/J1/../../../../../../../../../home/jenkins/workspace/Lucene-Solr-master-Linux/solr/build/solr-core/test/J1/temp/solr.cloud.CollectionsAPIDistributedZkTest_BA85BFFFDFAE11C5-001/control-001/cores/collection1/data/index' doesn't exist. Creating new index...
   [junit4]   2> 553129 INFO  (coreLoadExecutor-2220-thread-1-processing-n:127.0.0.1:39690_nt_z%2Fj) [n:127.0.0.1:39690_nt_z%2Fj c:control_collection s:shard1 r:core_node1 x:collection1] o.a.s.c.CachingDirectoryFactory return new directory for /home/jenkins/workspace/Lucene-Solr-master-Linux/solr/build/solr-core/test/J1/../../../../../../../../../home/jenkins/workspace/Lucene-Solr-master-Linux/solr/build/solr-core/test/J1/temp/solr.cloud.CollectionsAPIDistributedZkTest_BA85BFFFDFAE11C5-001/control-001/cores/collection1/data/index
   [junit4]   2> 553129 INFO  (coreLoadExecutor-2220-thread-1-processing-n:127.0.0.1:39690_nt_z%2Fj) [n:127.0.0.1:39690_nt_z%2Fj c:control_collection s:shard1 r:core_node1 x:collection1] o.a.s.u.RandomMergePolicy RandomMergePolicy wrapping class org.apache.lucene.index.TieredMergePolicy: [TieredMergePolicy: maxMergeAtOnce=11, maxMergeAtOnceExplicit=19, maxMergedSegmentMB=93.0224609375, floorSegmentMB=2.193359375, forceMergeDeletesPctAllowed=28.202561774473995, segmentsPerTier=14.0, maxCFSSegmentSizeMB=8.796093022207999E12, noCFSRatio=0.39246245321755824
   [junit4]   2> 553130 INFO  (coreLoadExecutor-2220-thread-1-processing-n:127.0.0.1:39690_nt_z%2Fj) [n:127.0.0.1:39690_nt_z%2Fj c:control_collection s:shard1 r:core_node1 x:collection1] o.a.s.c.SolrDeletionPolicy SolrDeletionPolicy.onCommit: commits: num=1
   [junit4]   2> 	commit{dir=MockDirectoryWrapper(RAMDirectory@1b55fd9 lockFactory=org.apache.lucene.store.SingleInstanceLockFactory@18f7bbe),segFN=segments_1,generation=1}
   [junit4]   2> 553130 INFO  (coreLoadExecutor-2220-thread-1-processing-n:127.0.0.1:39690_nt_z%2Fj) [n:127.0.0.1:39690_nt_z%2Fj c:control_collection s:shard1 r:core_node1 x:collection1] o.a.s.c.SolrDeletionPolicy newest commit generation = 1
   [junit4]   2> 553130 INFO  (OldIndexDirectoryCleanupThreadForCore-collection1) [n:127.0.0.1:39690_nt_z%2Fj c:control_collection s:shard1 r:core_node1 x:collection1] o.a.s.c.SolrCore Looking for old index directories to cleanup for core collection1 in /home/jenkins/workspace/Lucene-Solr-master-Linux/solr/build/solr-core/test/J1/../../../../../../../../../home/jenkins/workspace/Lucene-Solr-master-Linux/solr/build/solr-core/test/J1/temp/solr.cloud.CollectionsAPIDistributedZkTest_BA85BFFFDFAE11C5-001/control-001/cores/collection1/data/
   [junit4]   2> 553130 WARN  (OldIndexDirectoryCleanupThreadForCore-collection1) [n:127.0.0.1:39690_nt_z%2Fj c:control_collection s:shard1 r:core_node1 x:collection1] o.a.s.c.DirectoryFactory /home/jenkins/workspace/Lucene-Solr-master-Linux/solr/build/solr-core/test/J1/../../../../../../../../../home/jenkins/workspace/Lucene-Solr-master-Linux/solr/build/solr-core/test/J1/temp/solr.cloud.CollectionsAPIDistributedZkTest_BA85BFFFDFAE11C5-001/control-001/cores/collection1/data/ does not point to a valid data directory; skipping clean-up of old index directories.
   [junit4]   2> 553134 INFO  (coreLoadExecutor-2220-thread-1-processing-n:127.0.0.1:39690_nt_z%2Fj) [n:127.0.0.1:39690_nt_z%2Fj c:control_collection s:shard1 r:core_node1 x:collection1] o.a.s.u.p.UpdateRequestProcessorChain creating updateRequestProcessorChain "nodistrib"
   [junit4]   2> 553134 INFO  (coreLoadExecutor-2220-thread-1-processing-n:127.0.0.1:39690_nt_z%2Fj) [n:127.0.0.1:39690_nt_z%2Fj c:control_collection s:shard1 r:core_node1 x:collection1] o.a.s.u.p.UpdateRequestProcessorChain creating updateRequestProcessorChain "dedupe"
   [junit4]   2> 553134 INFO  (coreLoadExecutor-2220-thread-1-processing-n:127.0.0.1:39690_nt_z%2Fj) [n:127.0.0.1:39690_nt_z%2Fj c:control_collection s:shard1 r:core_node1 x:collection1] o.a.s.u.p.UpdateRequestProcessorChain inserting DistributedUpdateProcessorFactory into updateRequestProcessorChain "dedupe"
   [junit4]   2> 553134 INFO  (coreLoadExecutor-2220-thread-1-processing-n:127.0.0.1:39690_nt_z%2Fj) [n:127.0.0.1:39690_nt_z%2Fj c:control_collection s:shard1 r:core_node1 x:collection1] o.a.s.u.p.UpdateRequestProcessorChain creating updateRequestProcessorChain "stored_sig"
   [junit4]   2> 553134 INFO  (coreLoadExecutor-2220-thread-1-processing-n:127.0.0.1:39690_nt_z%2Fj) [n:127.0.0.1:39690_nt_z%2Fj c:control_collection s:shard1 r:core_node1 x:collection1] o.a.s.u.p.UpdateRequestProcessorChain inserting DistributedUpdateProcessorFactory into updateRequestProcessorChain "stored_sig"
   [junit4]   2> 553134 INFO  (coreLoadExecutor-2220-thread-1-processing-n:127.0.0.1:39690_nt_z%2Fj) [n:127.0.0.1:39690_nt_z%2Fj c:control_collection s:shard1 r:core_node1 x:collection1] o.a.s.u.p.UpdateRequestProcessorChain creating updateRequestProcessorChain "distrib-dup-test-chain-explicit"
   [junit4]   2> 553134 INFO  (coreLoadExecutor-2220-thread-1-processing-n:127.0.0.1:39690_nt_z%2Fj) [n:127.0.0.1:39690_nt_z%2Fj c:control_collection s:shard1 r:core_node1 x:collection1] o.a.s.u.p.UpdateRequestProcessorChain creating updateRequestProcessorChain "distrib-dup-test-chain-implicit"
   [junit4]   2> 553135 INFO  (coreLoadExecutor-2220-thread-1-processing-n:127.0.0.1:39690_nt_z%2Fj) [n:127.0.0.1:39690_nt_z%2Fj c:control_collection s:shard1 r:core_node1 x:collection1] o.a.s.u.p.UpdateRequestProcessorChain inserting DistributedUpdateProcessorFactory into updateRequestProcessorChain "distrib-dup-test-chain-implicit"
   [junit4]   2> 553135 INFO  (coreLoadExecutor-2220-thread-1-processing-n:127.0.0.1:39690_nt_z%2Fj) [n:127.0.0.1:39690_nt_z%2Fj c:control_collection s:shard1 r:core_node1 x:collection1] o.a.s.c.SolrCore no updateRequestProcessorChain defined as default, creating implicit default
   [junit4]   2> 553135 WARN  (coreLoadExecutor-2220-thread-1-processing-n:127.0.0.1:39690_nt_z%2Fj) [n:127.0.0.1:39690_nt_z%2Fj c:control_collection s:shard1 r:core_node1 x:collection1] o.a.s.c.RequestHandlers INVALID paramSet a in requestHandler {type = requestHandler,name = /dump,class = DumpRequestHandler,args = {defaults={a=A,b=B}}}
   [junit4]   2> 553137 INFO  (coreLoadExecutor-2220-thread-1-processing-n:127.0.0.1:39690_nt_z%2Fj) [n:127.0.0.1:39690_nt_z%2Fj c:control_collection s:shard1 r:core_node1 x:collection1] o.a.s.h.l.XMLLoader xsltCacheLifetimeSeconds=60
   [junit4]   2> 553139 INFO  (coreLoadExecutor-2220-thread-1-processing-n:127.0.0.1:39690_nt_z%2Fj) [n:127.0.0.1:39690_nt_z%2Fj c:control_collection s:shard1 r:core_node1 x:collection1] o.a.s.h.l.XMLLoader xsltCacheLifetimeSeconds=60
   [junit4]   2> 553140 INFO  (coreLoadExecutor-2220-thread-1-processing-n:127.0.0.1:39690_nt_z%2Fj) [n:127.0.0.1:39690_nt_z%2Fj c:control_collection s:shard1 r:core_node1 x:collection1] o.a.s.h.l.XMLLoader xsltCacheLifetimeSeconds=60
   [junit4]   2> 553141 INFO  (coreLoadExecutor-2220-thread-1-processing-n:127.0.0.1:39690_nt_z%2Fj) [n:127.0.0.1:39690_nt_z%2Fj c:control_collection s:shard1 r:core_node1 x:collection1] o.a.s.h.l.XMLLoader xsltCacheLifetimeSeconds=60
   [junit4]   2> 553147 INFO  (coreLoadExecutor-2220-thread-1-processing-n:127.0.0.1:39690_nt_z%2Fj) [n:127.0.0.1:39690_nt_z%2Fj c:control_collection s:shard1 r:core_node1 x:collection1] o.a.s.c.RequestHandlers Registered paths: /admin/mbeans,standard,/update/json/docs,/admin/luke,/export,/get,/admin/properties,/update/json,/admin/threads,/dump,/update/csv,/sql,/graph,/admin/segments,/admin/system,/replication,/config,/stream,/schema,/admin/plugins,/admin/logging,/admin/ping,/update,/admin/file,/terms
   [junit4]   2> 553147 INFO  (coreLoadExecutor-2220-thread-1-processing-n:127.0.0.1:39690_nt_z%2Fj) [n:127.0.0.1:39690_nt_z%2Fj c:control_collection s:shard1 r:core_node1 x:collection1] o.a.s.c.SolrCore Using default statsCache cache: org.apache.solr.search.stats.LocalStatsCache
   [junit4]   2> 553147 INFO  (coreLoadExecutor-2220-thread-1-processing-n:127.0.0.1:39690_nt_z%2Fj) [n:127.0.0.1:39690_nt_z%2Fj c:control_collection s:shard1 r:core_node1 x:collection1] o.a.s.u.UpdateHandler Using UpdateLog implementation: org.apache.solr.update.UpdateLog
   [junit4]   2> 553147 INFO  (coreLoadExecutor-2220-thread-1-processing-n:127.0.0.1:39690_nt_z%2Fj) [n:127.0.0.1:39690_nt_z%2Fj c:control_collection s:shard1 r:core_node1 x:collection1] o.a.s.u.UpdateLog Initializing UpdateLog: dataDir= defaultSyncLevel=FLUSH numRecordsToKeep=100 maxNumLogsToKeep=10 numVersionBuckets=65536
   [junit4]   2> 553149 INFO  (coreLoadExecutor-2220-thread-1-processing-n:127.0.0.1:39690_nt_z%2Fj) [n:127.0.0.1:39690_nt_z%2Fj c:control_collection s:shard1 r:core_node1 x:collection1] o.a.s.u.CommitTracker Hard AutoCommit: disabled
   [junit4]   2> 553149 INFO  (coreLoadExecutor-2220-thread-1-processing-n:127.0.0.1:39690_nt_z%2Fj) [n:127.0.0.1:39690_nt_z%2Fj c:control_collection s:shard1 r:core_node1 x:collection1] o.a.s.u.CommitTracker Soft AutoCommit: disabled
   [junit4]   2> 553149 INFO  (coreLoadExecutor-2220-thread-1-processing-n:127.0.0.1:39690_nt_z%2Fj) [n:127.0.0.1:39690_nt_z%2Fj c:control_collection s:shard1 r:core_node1 x:collection1] o.a.s.u.RandomMergePolicy RandomMergePolicy wrapping class org.apache.lucene.index.LogByteSizeMergePolicy: [LogByteSizeMergePolicy: minMergeSize=1677721, mergeFactor=35, maxMergeSize=2147483648, maxMergeSizeForForcedMerge=9223372036854775807, calibrateSizeByDeletes=true, maxMergeDocs=2147483647, maxCFSSegmentSizeMB=8.796093022207999E12, noCFSRatio=0.8988300657414261]
   [junit4]   2> 553150 INFO  (coreLoadExecutor-2220-thread-1-processing-n:127.0.0.1:39690_nt_z%2Fj) [n:127.0.0.1:39690_nt_z%2Fj c:control_collection s:shard1 r:core_node1 x:collection1] o.a.s.c.SolrDeletionPolicy SolrDeletionPolicy.onInit: commits: num=1
   [junit4]   2> 	commit{dir=MockDirectoryWrapper(RAMDirectory@1b55fd9 lockFactory=org.apache.lucene.store.SingleInstanceLockFactory@18f7bbe),segFN=segments_1,generation=1}
   [junit4]   2> 553150 INFO  (coreLoadExecutor-2220-thread-1-processing-n:127.0.0.1:39690_nt_z%2Fj) [n:127.0.0.1:39690_nt_z%2Fj c:control_collection s:shard1 r:core_node1 x:collection1] o.a.s.c.SolrDeletionPolicy newest commit generation = 1
   [junit4]   2> 553150 INFO  (coreLoadExecutor-2220-thread-1-processing-n:127.0.0.1:39690_nt_z%2Fj) [n:127.0.0.1:39690_nt_z%2Fj c:control_collection s:shard1 r:core_node1 x:collection1] o.a.s.s.SolrIndexSearcher Opening [Searcher@1eb7c1e[collection1] main]
   [junit4]   2> 553151 INFO  (coreLoadExecutor-2220-thread-1-processing-n:127.0.0.1:39690_nt_z%2Fj) [n:127.0.0.1:39690_nt_z%2Fj c:control_collection s:shard1 r:core_node1 x:collection1] o.a.s.r.ManagedResourceStorage Setting up ZooKeeper-based storage for the RestManager with znodeBase: /configs/conf1
   [junit4]   2> 553151 INFO  (coreLoadExecutor-2220-thread-1-processing-n:127.0.0.1:39690_nt_z%2Fj) [n:127.0.0.1:39690_nt_z%2Fj c:control_collection s:shard1 r:core_node1 x:collection1] o.a.s.r.ManagedResourceStorage Configured ZooKeeperStorageIO with znodeBase: /configs/conf1
   [junit4]   2> 553151 INFO  (coreLoadExecutor-2220-thread-1-processing-n:127.0.0.1:39690_nt_z%2Fj) [n:127.0.0.1:39690_nt_z%2Fj c:control_collection s:shard1 r:core_node1 x:collection1] o.a.s.r.RestManager Initializing RestManager with initArgs: {}
   [junit4]   2> 553151 INFO  (coreLoadExecutor-2220-thread-1-processing-n:127.0.0.1:39690_nt_z%2Fj) [n:127.0.0.1:39690_nt_z%2Fj c:control_collection s:shard1 r:core_node1 x:collection1] o.a.s.r.ManagedResourceStorage Reading _rest_managed.json using ZooKeeperStorageIO:path=/configs/conf1
   [junit4]   2> 553151 INFO  (coreLoadExecutor-2220-thread-1-processing-n:127.0.0.1:39690_nt_z%2Fj) [n:127.0.0.1:39690_nt_z%2Fj c:control_collection s:shard1 r:core_node1 x:collection1] o.a.s.r.ManagedResourceStorage No data found for znode /configs/conf1/_rest_managed.json
   [junit4]   2> 553151 INFO  (coreLoadExecutor-2220-thread-1-processing-n:127.0.0.1:39690_nt_z%2Fj) [n:127.0.0.1:39690_nt_z%2Fj c:control_collection s:shard1 r:core_node1 x:collection1] o.a.s.r.ManagedResourceStorage Loaded null at path _rest_managed.json using ZooKeeperStorageIO:path=/configs/conf1
   [junit4]   2> 553151 INFO  (coreLoadExecutor-2220-thread-1-processing-n:127.0.0.1:39690_nt_z%2Fj) [n:127.0.0.1:39690_nt_z%2Fj c:control_collection s:shard1 r:core_node1 x:collection1] o.a.s.r.RestManager Initializing 0 registered ManagedResources
   [junit4]   2> 553151 INFO  (coreLoadExecutor-2220-thread-1-processing-n:127.0.0.1:39690_nt_z%2Fj) [n:127.0.0.1:39690_nt_z%2Fj c:control_collection s:shard1 r:core_node1 x:collection1] o.a.s.h.ReplicationHandler Commits will be reserved for  10000
   [junit4]   2> 553153 INFO  (searcherExecutor-2221-thread-1-processing-n:127.0.0.1:39690_nt_z%2Fj x:collection1 s:shard1 c:control_collection r:core_node1) [n:127.0.0.1:39690_nt_z%2Fj c:control_collection s:shard1 r:core_node1 x:collection1] o.a.s.c.SolrCore [collection1] Registered new searcher Searcher@1eb7c1e[collection1] main{ExitableDirectoryReader(UninvertingDirectoryReader())}
   [junit4]   2> 553153 INFO  (coreLoadExecutor-2220-thread-1-processing-n:127.0.0.1:39690_nt_z%2Fj) [n:127.0.0.1:39690_nt_z%2Fj c:control_collection s:shard1 r:core_node1 x:collection1] o.a.s.u.UpdateLog Looking up max value of version field to seed version buckets
   [junit4]   2> 553153 INFO  (coreLoadExecutor-2220-thread-1-processing-n:127.0.0.1:39690_nt_z%2Fj) [n:127.0.0.1:39690_nt_z%2Fj c:control_collection s:shard1 r:core_node1 x:collection1] o.a.s.u.VersionInfo Refreshing highest value of _version_ for 65536 version buckets from index
   [junit4]   2> 553153 INFO  (coreLoadExecutor-2220-thread-1-processing-n:127.0.0.1:39690_nt_z%2Fj) [n:127.0.0.1:39690_nt_z%2Fj c:control_collection s:shard1 r:core_node1 x:collection1] o.a.s.u.VersionInfo No terms found for _version_, cannot seed version bucket highest value from index
   [junit4]   2> 553153 INFO  (coreLoadExecutor-2220-thread-1-processing-n:127.0.0.1:39690_nt_z%2Fj) [n:127.0.0.1:39690_nt_z%2Fj c:control_collection s:shard1 r:core_node1 x:collection1] o.a.s.u.UpdateLog Could not find max version in index or recent updates, using new clock 1545973357537656832
   [junit4]   2> 553155 INFO  (coreLoadExecutor-2220-thread-1-processing-n:127.0.0.1:39690_nt_z%2Fj) [n:127.0.0.1:39690_nt_z%2Fj c:control_collection s:shard1 r:core_node1 x:collection1] o.a.s.u.UpdateLog Took 2.0ms to seed version buckets with highest version 1545973357537656832
   [junit4]   2> 553155 INFO  (coreLoadExecutor-2220-thread-1-processing-n:127.0.0.1:39690_nt_z%2Fj) [n:127.0.0.1:39690_nt_z%2Fj c:control_collection s:shard1 r:core_node1 x:collection1] o.a.s.c.ZkController watch zkdir /configs/conf1
   [junit4]   2> 553156 INFO  (coreLoadExecutor-2220-thread-1-processing-n:127.0.0.1:39690_nt_z%2Fj) [n:127.0.0.1:39690_nt_z%2Fj c:control_collection s:shard1 r:core_node1 x:collection1] o.a.s.c.CoreContainer registering core: collection1
   [junit4]   2> 553156 INFO  (coreZkRegister-2213-thread-1-processing-n:127.0.0.1:39690_nt_z%2Fj x:collection1 s:shard1 c:control_collection r:core_node1) [n:127.0.0.1:39690_nt_z%2Fj c:control_collection s:shard1 r:core_node1 x:collection1] o.a.s.c.ZkController Register replica - core:collection1 address:https://127.0.0.1:39690/nt_z/j collection:control_collection shard:shard1
   [junit4]   2> 553156 INFO  (coreZkRegister-2213-thread-1-processing-n:127.0.0.1:39690_nt_z%2Fj x:collection1 s:shard1 c:control_collection r:core_node1) [n:127.0.0.1:39690_nt_z%2Fj c:control_collection s:shard1 r:core_node1 x:collection1] o.a.s.c.c.SolrZkClient makePath: /collections/control_collection/leader_elect/shard1/election
   [junit4]   2> 553158 INFO  (coreZkRegister-2213-thread-1-processing-n:127.0.0.1:39690_nt_z%2Fj x:collection1 s:shard1 c:control_collection r:core_node1) [n:127.0.0.1:39690_nt_z%2Fj c:control_collection s:shard1 r:core_node1 x:collection1] o.a.s.c.LeaderElector Joined leadership election with path: /collections/control_collection/leader_elect/shard1/election/96623334726828037-core_node1-n_0000000000
   [junit4]   2> 553159 INFO  (coreZkRegister-2213-thread-1-processing-n:127.0.0.1:39690_nt_z%2Fj x:collection1 s:shard1 c:control_collection r:core_node1) [n:127.0.0.1:39690_nt_z%2Fj c:control_collection s:shard1 r:core_node1 x:collection1] o.a.s.c.ShardLeaderElectionContext Running the leader process for shard=shard1 and weAreReplacement=false and leaderVoteWait=10000
   [junit4]   2> 553159 INFO  (coreZkRegister-2213-thread-1-processing-n:127.0.0.1:39690_nt_z%2Fj x:collection1 s:shard1 c:control_collection r:core_node1) [n:127.0.0.1:39690_nt_z%2Fj c:control_collection s:shard1 r:core_node1 x:collection1] o.a.s.c.ShardLeaderElectionContext Enough replicas found to continue.
   [junit4]   2> 553160 INFO  (coreZkRegister-2213-thread-1-processing-n:127.0.0.1:39690_nt_z%2Fj x:collection1 s:shard1 c:control_collection r:core_node1) [n:127.0.0.1:39690_nt_z%2Fj c:control_collection s:shard1 r:core_node1 x:collection1] o.a.s.c.ShardLeaderElectionContext I may be the new leader - try and sync
   [junit4]   2> 553160 INFO  (coreZkRegister-2213-thread-1-processing-n:127.0.0.1:39690_nt_z%2Fj x:collection1 s:shard1 c:control_collection r:core_node1) [n:127.0.0.1:39690_nt_z%2Fj c:control_collection s:shard1 r:core_node1 x:collection1] o.a.s.c.SyncStrategy Sync replicas to https://127.0.0.1:39690/nt_z/j/collection1/
   [junit4]   2> 553160 INFO  (OverseerStateUpdate-96623334726828037-127.0.0.1:39690_nt_z%2Fj-n_0000000000) [n:127.0.0.1:39690_nt_z%2Fj    ] o.a.s.c.Overseer processMessage: queueSize: 1, message = {
   [junit4]   2>   "operation":"leader",
   [junit4]   2>   "shard":"shard1",
   [junit4]   2>   "collection":"control_collection"} current state version: 1
   [junit4]   2> 553160 INFO  (coreZkRegister-2213-thread-1-processing-n:127.0.0.1:39690_nt_z%2Fj x:collection1 s:shard1 c:control_collection r:core_node1) [n:127.0.0.1:39690_nt_z%2Fj c:control_collection s:shard1 r:core_node1 x:collection1] o.a.s.c.SyncStrategy Sync Success - now sync replicas to me
   [junit4]   2> 553160 INFO  (coreZkRegister-2213-thread-1-processing-n:127.0.0.1:39690_nt_z%2Fj x:collection1 s:shard1 c:control_collection r:core_node1) [n:127.0.0.1:39690_nt_z%2Fj c:control_collection s:shard1 r:core_node1 x:collection1] o.a.s.c.SyncStrategy https://127.0.0.1:39690/nt_z/j/collection1/ has no replicas
   [junit4]   2> 553160 INFO  (coreZkRegister-2213-thread-1-processing-n:127.0.0.1:39690_nt_z%2Fj x:collection1 s:shard1 c:control_collection r:core_node1) [n:127.0.0.1:39690_nt_z%2Fj c:control_collection s:shard1 r:core_node1 x:collection1] o.a.s.c.c.SolrZkClient makePath: /collections/control_collection/leaders/shard1
   [junit4]   2> 553162 INFO  (coreZkRegister-2213-thread-1-processing-n:127.0.0.1:39690_nt_z%2Fj x:collection1 s:shard1 c:control_collection r:core_node1) [n:127.0.0.1:39690_nt_z%2Fj c:control_collection s:shard1 r:core_node1 x:collection1] o.a.s.c.ShardLeaderElectionContextBase Creating leader registration node /collections/control_collection/leaders/shard1/leader after winning as /collections/control_collection/leader_elect/shard1/election/96623334726828037-core_node1-n_0000000000
   [junit4]   2> 553163 INFO  (coreZkRegister-2213-thread-1-processing-n:127.0.0.1:39690_nt_z%2Fj x:collection1 s:shard1 c:control_collection r:core_node1) [n:127.0.0.1:39690_nt_z%2Fj c:control_collection s:shard1 r:core_node1 x:collection1] o.a.s.c.ShardLeaderElectionContext I am the new leader: https://127.0.0.1:39690/nt_z/j/collection1/ shard1
   [junit4]   2> 553163 INFO  (OverseerStateUpdate-96623334726828037-127.0.0.1:39690_nt_z%2Fj-n_0000000000) [n:127.0.0.1:39690_nt_z%2Fj    ] o.a.s.c.Overseer processMessage: queueSize: 1, message = {
   [junit4]   2>   "operation":"leader",
   [junit4]   2>   "shard":"shard1",
   [junit4]   2>   "collection":"control_collection",
   [junit4]   2>   "base_url":"https://127.0.0.1:39690/nt_z/j",
   [junit4]   2>   "core":"collection1",
   [junit4]   2>   "state":"active"} current state version: 1
   [junit4]   2> 553264 INFO  (zkCallback-845-thread-1-processing-n:127.0.0.1:39690_nt_z%2Fj) [n:127.0.0.1:39690_nt_z%2Fj    ] o.a.s.c.c.ZkStateReader A cluster state change: [WatchedEvent state:SyncConnected type:NodeDataChanged path:/clusterstate.json], has occurred - updating... (live nodes size: [1])
   [junit4]   2> 553313 INFO  (coreZkRegister-2213-thread-1-processing-n:127.0.0.1:39690_nt_z%2Fj x:collection1 s:shard1 c:control_collection r:core_node1) [n:127.0.0.1:39690_nt_z%2Fj c:control_collection s:shard1 r:core_node1 x:collection1] o.a.s.c.ZkController We are https://127.0.0.1:39690/nt_z/j/collection1/ and leader is https://127.0.0.1:39690/nt_z/j/collection1/
   [junit4]   2> 553313 INFO  (coreZkRegister-2213-thread-1-processing-n:127.0.0.1:39690_nt_z%2Fj x:collection1 s:shard1 c:control_collection r:core_node1) [n:127.0.0.1:39690_nt_z%2Fj c:control_collection s:shard1 r:core_node1 x:collection1] o.a.s.c.ZkController No LogReplay needed for core=collection1 baseURL=https://127.0.0.1:39690/nt_z/j
   [junit4]   2> 553313 INFO  (coreZkRegister-2213-thread-1-processing-n:127.0.0.1:39690_nt_z%2Fj x:collection1 s:shard1 c:control_collection r:core_node1) [n:127.0.0.1:39690_nt_z%2Fj c:control_collection s:shard1 r:core_node1 x:collection1] o.a.s.c.ZkController I am the leader, no recovery necessary
   [junit4]   2> 553314 INFO  (coreZkRegister-2213-thread-1-processing-n:127.0.0.1:39690_nt_z%2Fj x:collection1 s:shard1 c:control_collection r:core_node1) [n:127.0.0.1:39690_nt_z%2Fj c:control_collection s:shard1 r:core_node1 x:collection1] o.a.s.c.ZkController publishing state=active
   [junit4]   2> 553314 INFO  (coreZkRegister-2213-thread-1-processing-n:127.0.0.1:39690_nt_z%2Fj x:collection1 s:shard1 c:control_collection r:core_node1) [n:127.0.0.1:39690_nt_z%2Fj c:control_collection s:shard1 r:core_node1 x:collection1] o.a.s.c.ZkController numShards not found on descriptor - reading it from system property
   [junit4]   2> 553314 INFO  (coreZkRegister-2213-thread-1-processing-n:127.0.0.1:39690_nt_z%2Fj x:collection1 s:shard1 c:control_collection r:core_node1) [n:127.0.0.1:39690_nt_z%2Fj c:control_collection s:shard1 r:core_node1 x:collection1] o.a.s.c.c.ZkStateReader Checking legacy cluster state for collection control_collection
   [junit4]   2> 553315 INFO  (OverseerStateUpdate-96623334726828037-127.0.0.1:39690_nt_z%2Fj-n_0000000000) [n:127.0.0.1:39690_nt_z%2Fj    ] o.a.s.c.Overseer processMessage: queueSize: 1, message = {
   [junit4]   2>   "core":"collection1",
   [junit4]   2>   "core_node_name":"core_node1",
   [junit4]   2>   "roles":null,
   [junit4]   2>   "base_url":"https://127.0.0.1:39690/nt_z/j",
   [junit4]   2>   "node_name":"127.0.0.1:39690_nt_z%2Fj",
   [junit4]   2>   "numShards":"1",
   [junit4]   2>   "state":"active",
   [junit4]   2>   "shard":"shard1",
   [junit4]   2>   "collection":"control_collection",
   [junit4]   2>   "operation":"state"} current state version: 2
   [junit4]   2> 553315 INFO  (OverseerStateUpdate-96623334726828037-127.0.0.1:39690_nt_z%2Fj-n_0000000000) [n:127.0.0.1:39690_nt_z%2Fj    ] o.a.s.c.o.ReplicaMutator Update state numShards=1 message={
   [junit4]   2>   "core":"collection1",
   [junit4]   2>   "core_node_name":"core_node1",
   [junit4]   2>   "roles":null,
   [junit4]   2>   "base_url":"https://127.0.0.1:39690/nt_z/j",
   [junit4]   2>   "node_name":"127.0.0.1:39690_nt_z%2Fj",
   [junit4]   2>   "numShards":"1",
   [junit4]   2>   "state":"active",
   [junit4]   2>   "shard":"shard1",
   [junit4]   2>   "collection":"control_collection",
   [junit4]   2>   "operation":"state"}
   [junit4]   2> 553416 INFO  (zkCallback-845-thread-1-processing-n:127.0.0.1:39690_nt_z%2Fj) [n:127.0.0.1:39690_nt_z%2Fj    ] o.a.s.c.c.ZkStateReader A cluster state change: [WatchedEvent state:SyncConnected type:NodeDataChanged path:/clusterstate.json], has occurred - updating... (live nodes size: [1])
   [junit4]   2> 553450 INFO  (TEST-CollectionsAPIDistributedZkTest.test-seed#[BA85BFFFDFAE11C5]) [    ] o.a.s.c.c.SolrZkClient Using default ZkCredentialsProvider
   [junit4]   2> 553451 INFO  (TEST-CollectionsAPIDistributedZkTest.test-seed#[BA85BFFFDFAE11C5]) [    ] o.a.s.c.c.ConnectionManager Waiting for client to connect to ZooKeeper
   [junit4]   2> 553452 INFO  (zkCallback-849-thread-1) [    ] o.a.s.c.c.ConnectionManager Watcher org.apache.solr.common.cloud.ConnectionManager@1ac58a4 name:ZooKeeperConnection Watcher:127.0.0.1:33942/solr got event WatchedEvent state:SyncConnected type:None path:null path:null type:None
   [junit4]   2> 553452 INFO  (TEST-CollectionsAPIDistributedZkTest.test-seed#[BA85BFFFDFAE11C5]) [    ] o.a.s.c.c.ConnectionManager Client is connected to ZooKeeper
   [junit4]   2> 553452 INFO  (TEST-CollectionsAPIDistributedZkTest.test-seed#[BA85BFFFDFAE11C5]) [    ] o.a.s.c.c.SolrZkClient Using default ZkACLProvider
   [junit4]   2> 553452 INFO  (TEST-CollectionsAPIDistributedZkTest.test-seed#[BA85BFFFDFAE11C5]) [    ] o.a.s.c.c.ZkStateReader Updating cluster state from ZooKeeper... 
   [junit4]   2> 553452 INFO  (TEST-CollectionsAPIDistributedZkTest.test-seed#[BA85BFFFDFAE11C5]) [    ] o.a.s.c.c.ZkStateReader Loaded cluster properties: {urlScheme=https}
   [junit4]   2> 553452 INFO  (TEST-CollectionsAPIDistributedZkTest.test-seed#[BA85BFFFDFAE11C5]) [    ] o.a.s.c.c.ZkStateReader Updated live nodes from ZooKeeper... (0) -> (1)
   [junit4]   2> 553453 INFO  (TEST-CollectionsAPIDistributedZkTest.test-seed#[BA85BFFFDFAE11C5]) [    ] o.a.s.c.ChaosMonkey monkey: init - expire sessions:false cause connection loss:false
   [junit4]   2> 553527 INFO  (TEST-CollectionsAPIDistributedZkTest.test-seed#[BA85BFFFDFAE11C5]) [    ] o.a.s.SolrTestCaseJ4 Writing core.properties file to /home/jenkins/workspace/Lucene-Solr-master-Linux/solr/build/solr-core/test/J1/temp/solr.cloud.CollectionsAPIDistributedZkTest_BA85BFFFDFAE11C5-001/shard-1-001/cores/collection1
   [junit4]   2> 553528 INFO  (TEST-CollectionsAPIDistributedZkTest.test-seed#[BA85BFFFDFAE11C5]) [    ] o.a.s.c.AbstractFullDistribZkTestBase create jetty 1 in directory /home/jenkins/workspace/Lucene-Solr-master-Linux/solr/build/solr-core/test/J1/temp/solr.cloud.CollectionsAPIDistributedZkTest_BA85BFFFDFAE11C5-001/shard-1-001
   [junit4]   2> 553530 INFO  (TEST-CollectionsAPIDistributedZkTest.test-seed#[BA85BFFFDFAE11C5]) [    ] o.e.j.s.Server jetty-9.3.8.v20160314
   [junit4]   2> 553530 INFO  (TEST-CollectionsAPIDistributedZkTest.test-seed#[BA85BFFFDFAE11C5]) [    ] o.e.j.s.h.ContextHandler Started o.e.j.s.ServletContextHandler@13b6b80{/nt_z/j,null,AVAILABLE}
   [junit4]   2> 553533 INFO  (TEST-CollectionsAPIDistributedZkTest.test-seed#[BA85BFFFDFAE11C5]) [    ] o.e.j.s.ServerConnector Started ServerConnector@15c4434{SSL,[ssl, http/1.1]}{127.0.0.1:46390}
   [junit4]   2> 553533 INFO  (TEST-CollectionsAPIDistributedZkTest.test-seed#[BA85BFFFDFAE11C5]) [    ] o.e.j.s.Server Started @554997ms
   [junit4]   2> 553534 INFO  (TEST-CollectionsAPIDistributedZkTest.test-seed#[BA85BFFFDFAE11C5]) [    ] o.a.s.c.s.e.JettySolrRunner Jetty properties: {solr.data.dir=/home/jenkins/workspace/Lucene-Solr-master-Linux/solr/build/solr-core/test/J1/temp/solr.cloud.CollectionsAPIDistributedZkTest_BA85BFFFDFAE11C5-001/tempDir-001/jetty1, solrconfig=solrconfig.xml, hostContext=/nt_z/j, hostPort=46390, coreRootDirectory=/home/jenkins/workspace/Lucene-Solr-master-Linux/solr/build/solr-core/test/J1/../../../../../../../../../home/jenkins/workspace/Lucene-Solr-master-Linux/solr/build/solr-core/test/J1/temp/solr.cloud.CollectionsAPIDistributedZkTest_BA85BFFFDFAE11C5-001/shard-1-001/cores}
   [junit4]   2> 553534 INFO  (TEST-CollectionsAPIDistributedZkTest.test-seed#[BA85BFFFDFAE11C5]) [    ] o.a.s.s.SolrDispatchFilter SolrDispatchFilter.init(): sun.misc.Launcher$AppClassLoader@1d16e93
   [junit4]   2> 553534 INFO  (TEST-CollectionsAPIDistributedZkTest.test-seed#[BA85BFFFDFAE11C5]) [    ] o.a.s.c.SolrResourceLoader new SolrResourceLoader for directory: '/home/jenkins/workspace/Lucene-Solr-master-Linux/solr/build/solr-core/test/J1/temp/solr.cloud.CollectionsAPIDistributedZkTest_BA85BFFFDFAE11C5-001/shard-1-001'
   [junit4]   2> 553534 INFO  (TEST-CollectionsAPIDistributedZkTest.test-seed#[BA85BFFFDFAE11C5]) [    ] o.a.s.c.SolrResourceLoader JNDI not configured for solr (NoInitialContextEx)
   [junit4]   2> 553534 INFO  (TEST-CollectionsAPIDistributedZkTest.test-seed#[BA85BFFFDFAE11C5]) [    ] o.a.s.c.SolrResourceLoader solr home defaulted to 'solr/' (could not find system property or JNDI)
   [junit4]   2> 553534 INFO  (TEST-CollectionsAPIDistributedZkTest.test-seed#[BA85BFFFDFAE11C5]) [    ] o.a.s.c.c.SolrZkClient Using default ZkCredentialsProvider
   [junit4]   2> 553535 INFO  (TEST-CollectionsAPIDistributedZkTest.test-seed#[BA85BFFFDFAE11C5]) [    ] o.a.s.c.c.ConnectionManager Waiting for client to connect to ZooKeeper
   [junit4]   2> 553535 INFO  (zkCallback-850-thread-1) [    ] o.a.s.c.c.ConnectionManager Watcher org.apache.solr.common.cloud.ConnectionManager@2c1cbc name:ZooKeeperConnection Watcher:127.0.0.1:33942/solr got event WatchedEvent state:SyncConnected type:None path:null path:null type:None
   [junit4]   2> 553535 INFO  (TEST-CollectionsAPIDistributedZkTest.test-seed#[BA85BFFFDFAE11C5]) [    ] o.a.s.c.c.ConnectionManager Client is connected to ZooKeeper
   [junit4]   2> 553536 INFO  (TEST-CollectionsAPIDistributedZkTest.test-seed#[BA85BFFFDFAE11C5]) [    ] o.a.s.c.

[...truncated too long message...]

ResponseWriter, TestSolrCLIRunExample, TestFiltering, ReplaceNodeTest, TestCursorMarkWithoutUniqueKey, TlogReplayBufferedWhileIndexingTest, TestSolrIndexConfig, TestFastOutputStream, VersionInfoTest, MultiTermTest, TestBM25SimilarityFactory, EchoParamsTest, SoftAutoCommitTest, TestFuzzyAnalyzedSuggestions, OverriddenZkACLAndCredentialsProvidersTest, MoreLikeThisHandlerTest, SimpleMLTQParserTest, TermVectorComponentTest, TestMacros, TestSystemIdResolver, TestHashQParserPlugin, CursorMarkTest, TestElisionMultitermQuery, HdfsSyncSliceTest, TestOverriddenPrefixQueryForCustomFieldType, SolrCmdDistributorTest, DistanceFunctionTest, ZkSolrClientTest, AsyncMigrateRouteKeyTest, CoreSorterTest, ClassificationUpdateProcessorFactoryTest, FileUtilsTest, TestDownShardTolerantSearch, TestConfigSets, TestPivotHelperCode, DistributedMLTComponentTest, TestQueryTypes, TestNonDefinedSimilarityFactory, SearchHandlerTest, AliasIntegrationTest, CollectionsAPIDistributedZkTest]
   [junit4]   2> NOTE: reproduce with: ant test  -Dtestcase=CollectionsAPIDistributedZkTest -Dtests.seed=BA85BFFFDFAE11C5 -Dtests.multiplier=3 -Dtests.slow=true -Dtests.locale=en-GB -Dtests.timezone=America/Iqaluit -Dtests.asserts=true -Dtests.file.encoding=UTF-8
   [junit4] ERROR   0.00s J1 | CollectionsAPIDistributedZkTest (suite) <<<
   [junit4]    > Throwable #1: com.carrotsearch.randomizedtesting.ThreadLeakError: 6 threads leaked from SUITE scope at org.apache.solr.cloud.CollectionsAPIDistributedZkTest: 
   [junit4]    >    1) Thread[id=5150, name=zkCallback-883-thread-3, state=TIMED_WAITING, group=TGRP-CollectionsAPIDistributedZkTest]
   [junit4]    >         at sun.misc.Unsafe.park(Native Method)
   [junit4]    >         at java.util.concurrent.locks.LockSupport.parkNanos(LockSupport.java:215)
   [junit4]    >         at java.util.concurrent.SynchronousQueue$TransferStack.awaitFulfill(SynchronousQueue.java:460)
   [junit4]    >         at java.util.concurrent.SynchronousQueue$TransferStack.transfer(SynchronousQueue.java:362)
   [junit4]    >         at java.util.concurrent.SynchronousQueue.poll(SynchronousQueue.java:941)
   [junit4]    >         at java.util.concurrent.ThreadPoolExecutor.getTask(ThreadPoolExecutor.java:1066)
   [junit4]    >         at java.util.concurrent.ThreadPoolExecutor.runWorker(ThreadPoolExecutor.java:1127)
   [junit4]    >         at java.util.concurrent.ThreadPoolExecutor$Worker.run(ThreadPoolExecutor.java:617)
   [junit4]    >         at java.lang.Thread.run(Thread.java:745)
   [junit4]    >    2) Thread[id=5065, name=Connection evictor, state=TIMED_WAITING, group=TGRP-CollectionsAPIDistributedZkTest]
   [junit4]    >         at java.lang.Thread.sleep(Native Method)
   [junit4]    >         at org.apache.http.impl.client.IdleConnectionEvictor$1.run(IdleConnectionEvictor.java:66)
   [junit4]    >         at java.lang.Thread.run(Thread.java:745)
   [junit4]    >    3) Thread[id=5067, name=TEST-CollectionsAPIDistributedZkTest.test-seed#[BA85BFFFDFAE11C5]-EventThread, state=WAITING, group=TGRP-CollectionsAPIDistributedZkTest]
   [junit4]    >         at sun.misc.Unsafe.park(Native Method)
   [junit4]    >         at java.util.concurrent.locks.LockSupport.park(LockSupport.java:175)
   [junit4]    >         at java.util.concurrent.locks.AbstractQueuedSynchronizer$ConditionObject.await(AbstractQueuedSynchronizer.java:2039)
   [junit4]    >         at java.util.concurrent.LinkedBlockingQueue.take(LinkedBlockingQueue.java:442)
   [junit4]    >         at org.apache.zookeeper.ClientCnxn$EventThread.run(ClientCnxn.java:494)
   [junit4]    >    4) Thread[id=5066, name=TEST-CollectionsAPIDistributedZkTest.test-seed#[BA85BFFFDFAE11C5]-SendThread(127.0.0.1:33942), state=TIMED_WAITING, group=TGRP-CollectionsAPIDistributedZkTest]
   [junit4]    >         at java.lang.Thread.sleep(Native Method)
   [junit4]    >         at org.apache.zookeeper.client.StaticHostProvider.next(StaticHostProvider.java:101)
   [junit4]    >         at org.apache.zookeeper.ClientCnxn$SendThread.startConnect(ClientCnxn.java:940)
   [junit4]    >         at org.apache.zookeeper.ClientCnxn$SendThread.run(ClientCnxn.java:1003)
   [junit4]    >    5) Thread[id=5068, name=zkCallback-883-thread-1, state=TIMED_WAITING, group=TGRP-CollectionsAPIDistributedZkTest]
   [junit4]    >         at sun.misc.Unsafe.park(Native Method)
   [junit4]    >         at java.util.concurrent.locks.LockSupport.parkNanos(LockSupport.java:215)
   [junit4]    >         at java.util.concurrent.SynchronousQueue$TransferStack.awaitFulfill(SynchronousQueue.java:460)
   [junit4]    >         at java.util.concurrent.SynchronousQueue$TransferStack.transfer(SynchronousQueue.java:362)
   [junit4]    >         at java.util.concurrent.SynchronousQueue.poll(SynchronousQueue.java:941)
   [junit4]    >         at java.util.concurrent.ThreadPoolExecutor.getTask(ThreadPoolExecutor.java:1066)
   [junit4]    >         at java.util.concurrent.ThreadPoolExecutor.runWorker(ThreadPoolExecutor.java:1127)
   [junit4]    >         at java.util.concurrent.ThreadPoolExecutor$Worker.run(ThreadPoolExecutor.java:617)
   [junit4]    >         at java.lang.Thread.run(Thread.java:745)
   [junit4]    >    6) Thread[id=5148, name=zkCallback-883-thread-2, state=TIMED_WAITING, group=TGRP-CollectionsAPIDistributedZkTest]
   [junit4]    >         at sun.misc.Unsafe.park(Native Method)
   [junit4]    >         at java.util.concurrent.locks.LockSupport.parkNanos(LockSupport.java:215)
   [junit4]    >         at java.util.concurrent.SynchronousQueue$TransferStack.awaitFulfill(SynchronousQueue.java:460)
   [junit4]    >         at java.util.concurrent.SynchronousQueue$TransferStack.transfer(SynchronousQueue.java:362)
   [junit4]    >         at java.util.concurrent.SynchronousQueue.poll(SynchronousQueue.java:941)
   [junit4]    >         at java.util.concurrent.ThreadPoolExecutor.getTask(ThreadPoolExecutor.java:1066)
   [junit4]    >         at java.util.concurrent.ThreadPoolExecutor.runWorker(ThreadPoolExecutor.java:1127)
   [junit4]    >         at java.util.concurrent.ThreadPoolExecutor$Worker.run(ThreadPoolExecutor.java:617)
   [junit4]    >         at java.lang.Thread.run(Thread.java:745)
   [junit4]    > 	at __randomizedtesting.SeedInfo.seed([BA85BFFFDFAE11C5]:0)Throwable #2: com.carrotsearch.randomizedtesting.ThreadLeakError: There are still zombie threads that couldn't be terminated:
   [junit4]    >    1) Thread[id=5150, name=zkCallback-883-thread-3, state=TIMED_WAITING, group=TGRP-CollectionsAPIDistributedZkTest]
   [junit4]    >         at sun.misc.Unsafe.park(Native Method)
   [junit4]    >         at java.util.concurrent.locks.LockSupport.parkNanos(LockSupport.java:215)
   [junit4]    >         at java.util.concurrent.SynchronousQueue$TransferStack.awaitFulfill(SynchronousQueue.java:460)
   [junit4]    >         at java.util.concurrent.SynchronousQueue$TransferStack.transfer(SynchronousQueue.java:362)
   [junit4]    >         at java.util.concurrent.SynchronousQueue.poll(SynchronousQueue.java:941)
   [junit4]    >         at java.util.concurrent.ThreadPoolExecutor.getTask(ThreadPoolExecutor.java:1066)
   [junit4]    >         at java.util.concurrent.ThreadPoolExecutor.runWorker(ThreadPoolExecutor.java:1127)
   [junit4]    >         at java.util.concurrent.ThreadPoolExecutor$Worker.run(ThreadPoolExecutor.java:617)
   [junit4]    >         at java.lang.Thread.run(Thread.java:745)
   [junit4]    >    2) Thread[id=5066, name=TEST-CollectionsAPIDistributedZkTest.test-seed#[BA85BFFFDFAE11C5]-SendThread(127.0.0.1:33942), state=TIMED_WAITING, group=TGRP-CollectionsAPIDistributedZkTest]
   [junit4]    >         at java.lang.Thread.sleep(Native Method)
   [junit4]    >         at org.apache.zookeeper.ClientCnxn$SendThread.run(ClientCnxn.java:994)
   [junit4]    >    3) Thread[id=5068, name=zkCallback-883-thread-1, state=TIMED_WAITING, group=TGRP-CollectionsAPIDistributedZkTest]
   [junit4]    >         at sun.misc.Unsafe.park(Native Method)
   [junit4]    >         at java.util.concurrent.locks.LockSupport.parkNanos(LockSupport.java:215)
   [junit4]    >         at java.util.concurrent.SynchronousQueue$TransferStack.awaitFulfill(SynchronousQueue.java:460)
   [junit4]    >         at java.util.concurrent.SynchronousQueue$TransferStack.transfer(SynchronousQueue.java:362)
   [junit4]    >         at java.util.concurrent.SynchronousQueue.poll(SynchronousQueue.java:941)
   [junit4]    >         at java.util.concurrent.ThreadPoolExecutor.getTask(ThreadPoolExecutor.java:1066)
   [junit4]    >         at java.util.concurrent.ThreadPoolExecutor.runWorker(ThreadPoolExecutor.java:1127)
   [junit4]    >         at java.util.concurrent.ThreadPoolExecutor$Worker.run(ThreadPoolExecutor.java:617)
   [junit4]    >         at java.lang.Thread.run(Thread.java:745)
   [junit4]    >    4) Thread[id=5148, name=zkCallback-883-thread-2, state=TIMED_WAITING, group=TGRP-CollectionsAPIDistributedZkTest]
   [junit4]    >         at sun.misc.Unsafe.park(Native Method)
   [junit4]    >         at java.util.concurrent.locks.LockSupport.parkNanos(LockSupport.java:215)
   [junit4]    >         at java.util.concurrent.SynchronousQueue$TransferStack.awaitFulfill(SynchronousQueue.java:460)
   [junit4]    >         at java.util.concurrent.SynchronousQueue$TransferStack.transfer(SynchronousQueue.java:362)
   [junit4]    >         at java.util.concurrent.SynchronousQueue.poll(SynchronousQueue.java:941)
   [junit4]    >         at java.util.concurrent.ThreadPoolExecutor.getTask(ThreadPoolExecutor.java:1066)
   [junit4]    >         at java.util.concurrent.ThreadPoolExecutor.runWorker(ThreadPoolExecutor.java:1127)
   [junit4]    >         at java.util.concurrent.ThreadPoolExecutor$Worker.run(ThreadPoolExecutor.java:617)
   [junit4]    >         at java.lang.Thread.run(Thread.java:745)
   [junit4]    > 	at __randomizedtesting.SeedInfo.seed([BA85BFFFDFAE11C5]:0)
   [junit4] Completed [213/631 (1!)] on J1 in 103.87s, 1 test, 3 errors <<< FAILURES!

[...truncated 53884 lines...]


Mime
View raw message